Build failed in Jenkins: Maven TLP » maven-scm » SCM-777 #19

classic Classic list List threaded Threaded
3 messages Options
Reply | Threaded
Open this post in threaded view
|

Build failed in Jenkins: Maven TLP » maven-scm » SCM-777 #19

Apache Jenkins Server-2
See https://builds.apache.org/job/maven-box/job/maven-scm/job/SCM-777/19/

Changes:

* H30 is having issues

All tests passed

Build log:
[...truncated 73526 lines...]
[INFO] Working directory: F:\jenkins\jenkins-slave\workspace\maven-box_maven-scm_SCM-777\m\maven-scm-plugin\target\tags
[INFO] Working directory: F:\jenkins\jenkins-slave\workspace\maven-box_maven-scm_SCM-777\m\maven-scm-plugin\target\tags
[INFO] Working directory: F:\jenkins\jenkins-slave\workspace\maven-box_maven-scm_SCM-777\m\maven-scm-plugin\target\tags
[ERROR] Provider message:
[ERROR] The git-clone command failed.
[ERROR] Command output:
[ERROR] Cloning into 'mytag'...
fatal: Remote branch mytag not found in upstream origin
fatal: The remote end hung up unexpectedly

[INFO] Tests run: 1, Failures: 0, Errors: 0, Skipped: 0, Time elapsed: 2.683 s - in org.apache.maven.scm.plugin.UntagMojoTest
[INFO] Running org.apache.maven.scm.plugin.UpdateMojoTest
Test command line: cmd.exe /X /C "svnadmin create repository"
[INFO] Removing target\checkout
[INFO] Executing: cmd.exe /X /C "svn --non-interactive checkout file:///F:/jenkins/jenkins-slave/workspace/maven-box_maven-scm_SCM-777/m/maven-scm-plugin/target/repository/trunk@ F:\jenkins\jenkins-slave\workspace\maven-box_maven-scm_SCM-777\m\maven-scm-plugin\target\checkout"
[INFO] Working directory: F:\jenkins\jenkins-slave\workspace\maven-box_maven-scm_SCM-777\m\maven-scm-plugin\target
[INFO] Executing: cmd.exe /X /C "svn --non-interactive update F:\jenkins\jenkins-slave\workspace\maven-box_maven-scm_SCM-777\m\maven-scm-plugin\target\checkout@"
[INFO] Executing: cmd.exe /X /C "svn --non-interactive update F:\jenkins\jenkins-slave\workspace\maven-box_maven-scm_SCM-777\m\maven-scm-plugin\target\checkout@"
[INFO] Working directory: F:\jenkins\jenkins-slave\workspace\maven-box_maven-scm_SCM-777\m\maven-scm-plugin\target\checkout
[INFO] Working directory: F:\jenkins\jenkins-slave\workspace\maven-box_maven-scm_SCM-777\m\maven-scm-plugin\target\checkout
[INFO] Storing revision in 'scm.revision' project property.
[INFO] Project at revision 8
[INFO] Tests run: 1, Failures: 0, Errors: 0, Skipped: 0, Time elapsed: 6.228 s - in org.apache.maven.scm.plugin.UpdateMojoTest
[INFO] Running org.apache.maven.scm.plugin.ValidateMojoTest
[ERROR] Validation of scm url connection (project.scm.connection) failed :
[ERROR] No such provider installed 'unknwonProvider'.
[ERROR] The invalid scm url connection: 'scm:unknwonProvider:http://svn.apache.org/repos/asf/maven/scm/trunk'.
[INFO] project.scm.connection scm connection string is valid.
[INFO] project.scm.developerConnection scm connection string is valid.
[INFO] Tests run: 3, Failures: 0, Errors: 0, Skipped: 0, Time elapsed: 0.174 s - in org.apache.maven.scm.plugin.ValidateMojoTest
[INFO]
[INFO] Results:
[INFO]
[INFO] Tests run: 23, Failures: 0, Errors: 0, Skipped: 0
[INFO]
[INFO]
[INFO] --- maven-jar-plugin:3.1.0:jar (default-jar) @ maven-scm-plugin ---
[INFO] Building jar: F:\jenkins\jenkins-slave\workspace\maven-box_maven-scm_SCM-777\m\maven-scm-plugin\target\maven-scm-plugin-1.11.2-SNAPSHOT.jar
[INFO]
[INFO] --- maven-plugin-plugin:3.2:addPluginArtifactMetadata (default-addPluginArtifactMetadata) @ maven-scm-plugin ---
[INFO]
[INFO] --- maven-site-plugin:3.7.1:attach-descriptor (attach-descriptor) @ maven-scm-plugin ---
[INFO] Skipping because packaging 'maven-plugin' is not pom.
[INFO]
[INFO] --- maven-invoker-plugin:3.1.0:install (integration-test) @ maven-scm-plugin ---
[INFO] Downloading from central: https://repo.maven.apache.org/maven2/org/apache/maven/shared/maven-invoker/3.0.1/maven-invoker-3.0.1.pom
[INFO] Downloaded from central: https://repo.maven.apache.org/maven2/org/apache/maven/shared/maven-invoker/3.0.1/maven-invoker-3.0.1.pom (4.9 kB at 51 kB/s)
[INFO] Downloading from central: https://repo.maven.apache.org/maven2/org/apache/maven/shared/maven-shared-components/31/maven-shared-components-31.pom
[INFO] Downloaded from central: https://repo.maven.apache.org/maven2/org/apache/maven/shared/maven-shared-components/31/maven-shared-components-31.pom (5.1 kB at 142 kB/s)
[INFO] Downloading from central: https://repo.maven.apache.org/maven2/org/apache/maven/reporting/maven-reporting-impl/2.4/maven-reporting-impl-2.4.pom
[INFO] Downloaded from central: https://repo.maven.apache.org/maven2/org/apache/maven/reporting/maven-reporting-impl/2.4/maven-reporting-impl-2.4.pom (6.1 kB at 189 kB/s)
[INFO] Downloading from central: https://repo.maven.apache.org/maven2/commons-validator/commons-validator/1.4.1/commons-validator-1.4.1.pom
[INFO] Downloaded from central: https://repo.maven.apache.org/maven2/commons-validator/commons-validator/1.4.1/commons-validator-1.4.1.pom (13 kB at 409 kB/s)
[INFO] Downloading from central: https://repo.maven.apache.org/maven2/org/apache/commons/commons-parent/36/commons-parent-36.pom
[INFO] Downloaded from central: https://repo.maven.apache.org/maven2/org/apache/commons/commons-parent/36/commons-parent-36.pom (58 kB at 1.2 MB/s)
[INFO] Downloading from central: https://repo.maven.apache.org/maven2/commons-beanutils/commons-beanutils/1.8.3/commons-beanutils-1.8.3.pom
[INFO] Downloaded from central: https://repo.maven.apache.org/maven2/commons-beanutils/commons-beanutils/1.8.3/commons-beanutils-1.8.3.pom (11 kB at 287 kB/s)
[INFO] Downloading from central: https://repo.maven.apache.org/maven2/org/apache/commons/commons-parent/14/commons-parent-14.pom
[INFO] Downloaded from central: https://repo.maven.apache.org/maven2/org/apache/commons/commons-parent/14/commons-parent-14.pom (31 kB at 682 kB/s)
[INFO] Downloading from central: https://repo.maven.apache.org/maven2/commons-digester/commons-digester/1.8.1/commons-digester-1.8.1.pom
[INFO] Downloaded from central: https://repo.maven.apache.org/maven2/commons-digester/commons-digester/1.8.1/commons-digester-1.8.1.pom (10 kB at 304 kB/s)
[INFO] Downloading from central: https://repo.maven.apache.org/maven2/org/apache/maven/shared/maven-script-interpreter/1.2/maven-script-interpreter-1.2.pom
[INFO] Downloaded from central: https://repo.maven.apache.org/maven2/org/apache/maven/shared/maven-script-interpreter/1.2/maven-script-interpreter-1.2.pom (4.0 kB at 105 kB/s)
[INFO] Downloading from central: https://repo.maven.apache.org/maven2/org/apache/ant/ant/1.8.1/ant-1.8.1.pom
[INFO] Downloaded from central: https://repo.maven.apache.org/maven2/org/apache/ant/ant/1.8.1/ant-1.8.1.pom (8.8 kB at 232 kB/s)
[INFO] Downloading from central: https://repo.maven.apache.org/maven2/org/apache/ant/ant-parent/1.8.1/ant-parent-1.8.1.pom
[INFO] Downloaded from central: https://repo.maven.apache.org/maven2/org/apache/ant/ant-parent/1.8.1/ant-parent-1.8.1.pom (4.3 kB at 130 kB/s)
[INFO] Downloading from central: https://repo.maven.apache.org/maven2/org/apache/maven/shared/maven-artifact-transfer/0.9.1/maven-artifact-transfer-0.9.1.pom
[INFO] Downloaded from central: https://repo.maven.apache.org/maven2/org/apache/maven/shared/maven-artifact-transfer/0.9.1/maven-artifact-transfer-0.9.1.pom (7.6 kB at 245 kB/s)
[INFO] Downloading from central: https://repo.maven.apache.org/maven2/org/apache/maven/doxia/doxia-sink-api/1.7/doxia-sink-api-1.7.pom
[INFO] Downloaded from central: https://repo.maven.apache.org/maven2/org/apache/maven/doxia/doxia-sink-api/1.7/doxia-sink-api-1.7.pom (1.5 kB at 48 kB/s)
[INFO] Downloading from central: https://repo.maven.apache.org/maven2/org/apache/maven/doxia/doxia/1.7/doxia-1.7.pom
[INFO] Downloaded from central: https://repo.maven.apache.org/maven2/org/apache/maven/doxia/doxia/1.7/doxia-1.7.pom (15 kB at 477 kB/s)
[INFO] Downloading from central: https://repo.maven.apache.org/maven2/org/apache/maven/doxia/doxia-logging-api/1.7/doxia-logging-api-1.7.pom
[INFO] Downloaded from central: https://repo.maven.apache.org/maven2/org/apache/maven/doxia/doxia-logging-api/1.7/doxia-logging-api-1.7.pom (1.5 kB at 45 kB/s)
[INFO] Downloading from central: https://repo.maven.apache.org/maven2/org/apache/maven/doxia/doxia-site-renderer/1.7.4/doxia-site-renderer-1.7.4.pom
[INFO] Downloaded from central: https://repo.maven.apache.org/maven2/org/apache/maven/doxia/doxia-site-renderer/1.7.4/doxia-site-renderer-1.7.4.pom (6.7 kB at 203 kB/s)
[INFO] Downloading from central: https://repo.maven.apache.org/maven2/org/apache/maven/doxia/doxia-sitetools/1.7.4/doxia-sitetools-1.7.4.pom
[INFO] Downloaded from central: https://repo.maven.apache.org/maven2/org/apache/maven/doxia/doxia-sitetools/1.7.4/doxia-sitetools-1.7.4.pom (14 kB at 453 kB/s)
[INFO] Downloading from central: https://repo.maven.apache.org/maven2/org/apache/maven/doxia/doxia-core/1.7/doxia-core-1.7.pom
[INFO] Downloaded from central: https://repo.maven.apache.org/maven2/org/apache/maven/doxia/doxia-core/1.7/doxia-core-1.7.pom (4.1 kB at 156 kB/s)
[INFO] Downloading from central: https://repo.maven.apache.org/maven2/org/apache/maven/doxia/doxia-decoration-model/1.7.4/doxia-decoration-model-1.7.4.pom
[INFO] Downloaded from central: https://repo.maven.apache.org/maven2/org/apache/maven/doxia/doxia-decoration-model/1.7.4/doxia-decoration-model-1.7.4.pom (3.4 kB at 121 kB/s)
[INFO] Downloading from central: https://repo.maven.apache.org/maven2/org/apache/maven/doxia/doxia-skin-model/1.7.4/doxia-skin-model-1.7.4.pom
[INFO] Downloaded from central: https://repo.maven.apache.org/maven2/org/apache/maven/doxia/doxia-skin-model/1.7.4/doxia-skin-model-1.7.4.pom (3.0 kB at 104 kB/s)
[INFO] Downloading from central: https://repo.maven.apache.org/maven2/org/apache/maven/doxia/doxia-module-xhtml/1.7/doxia-module-xhtml-1.7.pom
[INFO] Downloaded from central: https://repo.maven.apache.org/maven2/org/apache/maven/doxia/doxia-module-xhtml/1.7/doxia-module-xhtml-1.7.pom (1.6 kB at 44 kB/s)
[INFO] Downloading from central: https://repo.maven.apache.org/maven2/org/apache/maven/doxia/doxia-modules/1.7/doxia-modules-1.7.pom
[INFO] Downloaded from central: https://repo.maven.apache.org/maven2/org/apache/maven/doxia/doxia-modules/1.7/doxia-modules-1.7.pom (2.6 kB at 79 kB/s)
[INFO] Downloading from central: https://repo.maven.apache.org/maven2/org/codehaus/groovy/groovy-all/2.4.8/groovy-all-2.4.8.pom
[INFO] Downloaded from central: https://repo.maven.apache.org/maven2/org/codehaus/groovy/groovy-all/2.4.8/groovy-all-2.4.8.pom (21 kB at 629 kB/s)
[INFO] Downloading from central: https://repo.maven.apache.org/maven2/org/apache/maven/shared/maven-invoker/3.0.1/maven-invoker-3.0.1.jar
[INFO] Downloading from central: https://repo.maven.apache.org/maven2/commons-digester/commons-digester/1.8.1/commons-digester-1.8.1.jar
[INFO] Downloading from central: https://repo.maven.apache.org/maven2/commons-beanutils/commons-beanutils/1.8.3/commons-beanutils-1.8.3.jar
[INFO] Downloading from central: https://repo.maven.apache.org/maven2/commons-validator/commons-validator/1.4.1/commons-validator-1.4.1.jar
[INFO] Downloading from central: https://repo.maven.apache.org/maven2/org/apache/maven/reporting/maven-reporting-impl/2.4/maven-reporting-impl-2.4.jar
[INFO] Downloaded from central: https://repo.maven.apache.org/maven2/org/apache/maven/shared/maven-invoker/3.0.1/maven-invoker-3.0.1.jar (33 kB at 1.0 MB/s)
[INFO] Downloading from central: https://repo.maven.apache.org/maven2/commons-logging/commons-logging/1.2/commons-logging-1.2.jar
[INFO] Downloaded from central: https://repo.maven.apache.org/maven2/commons-beanutils/commons-beanutils/1.8.3/commons-beanutils-1.8.3.jar (232 kB at 4.4 MB/s)
[INFO] Downloaded from central: https://repo.maven.apache.org/maven2/commons-digester/commons-digester/1.8.1/commons-digester-1.8.1.jar (146 kB at 2.8 MB/s)
[INFO] Downloading from central: https://repo.maven.apache.org/maven2/org/apache/ant/ant/1.8.1/ant-1.8.1.jar
[INFO] Downloading from central: https://repo.maven.apache.org/maven2/org/apache/maven/shared/maven-script-interpreter/1.2/maven-script-interpreter-1.2.jar
[INFO] Downloaded from central: https://repo.maven.apache.org/maven2/commons-logging/commons-logging/1.2/commons-logging-1.2.jar (62 kB at 896 kB/s)
[INFO] Downloading from central: https://repo.maven.apache.org/maven2/org/apache/maven/shared/maven-artifact-transfer/0.9.1/maven-artifact-transfer-0.9.1.jar
[INFO] Downloaded from central: https://repo.maven.apache.org/maven2/commons-validator/commons-validator/1.4.1/commons-validator-1.4.1.jar (190 kB at 2.3 MB/s)
[INFO] Downloading from central: https://repo.maven.apache.org/maven2/org/apache/maven/doxia/doxia-sink-api/1.7/doxia-sink-api-1.7.jar
[INFO] Downloaded from central: https://repo.maven.apache.org/maven2/org/apache/maven/shared/maven-artifact-transfer/0.9.1/maven-artifact-transfer-0.9.1.jar (123 kB at 1.0 MB/s)
[INFO] Downloading from central: https://repo.maven.apache.org/maven2/org/apache/maven/doxia/doxia-logging-api/1.7/doxia-logging-api-1.7.jar
[INFO] Downloaded from central: https://repo.maven.apache.org/maven2/org/apache/maven/reporting/maven-reporting-impl/2.4/maven-reporting-impl-2.4.jar (20 kB at 159 kB/s)
[INFO] Downloading from central: https://repo.maven.apache.org/maven2/org/apache/maven/doxia/doxia-site-renderer/1.7.4/doxia-site-renderer-1.7.4.jar
[INFO] Downloaded from central: https://repo.maven.apache.org/maven2/org/apache/maven/doxia/doxia-site-renderer/1.7.4/doxia-site-renderer-1.7.4.jar (64 kB at 390 kB/s)
[INFO] Downloading from central: https://repo.maven.apache.org/maven2/org/apache/maven/doxia/doxia-decoration-model/1.7.4/doxia-decoration-model-1.7.4.jar
[INFO] Downloaded from central: https://repo.maven.apache.org/maven2/org/apache/maven/doxia/doxia-sink-api/1.7/doxia-sink-api-1.7.jar (11 kB at 66 kB/s)
[INFO] Downloaded from central: https://repo.maven.apache.org/maven2/org/apache/ant/ant/1.8.1/ant-1.8.1.jar (1.5 MB at 8.7 MB/s)
[INFO] Downloading from central: https://repo.maven.apache.org/maven2/org/apache/maven/doxia/doxia-skin-model/1.7.4/doxia-skin-model-1.7.4.jar
[INFO] Downloading from central: https://repo.maven.apache.org/maven2/org/apache/maven/doxia/doxia-module-xhtml/1.7/doxia-module-xhtml-1.7.jar
[INFO] Downloaded from central: https://repo.maven.apache.org/maven2/org/apache/maven/doxia/doxia-decoration-model/1.7.4/doxia-decoration-model-1.7.4.jar (61 kB at 294 kB/s)
[INFO] Downloading from central: https://repo.maven.apache.org/maven2/org/codehaus/groovy/groovy-all/2.4.8/groovy-all-2.4.8.jar
[INFO] Downloaded from central: https://repo.maven.apache.org/maven2/org/apache/maven/shared/maven-script-interpreter/1.2/maven-script-interpreter-1.2.jar (22 kB at 100 kB/s)
[INFO] Downloaded from central: https://repo.maven.apache.org/maven2/org/apache/maven/doxia/doxia-logging-api/1.7/doxia-logging-api-1.7.jar (12 kB at 51 kB/s)
[INFO] Downloaded from central: https://repo.maven.apache.org/maven2/org/apache/maven/doxia/doxia-module-xhtml/1.7/doxia-module-xhtml-1.7.jar (17 kB at 59 kB/s)
[INFO] Downloaded from central: https://repo.maven.apache.org/maven2/org/apache/maven/doxia/doxia-skin-model/1.7.4/doxia-skin-model-1.7.4.jar (16 kB at 53 kB/s)
[INFO] Downloaded from central: https://repo.maven.apache.org/maven2/org/codehaus/groovy/groovy-all/2.4.8/groovy-all-2.4.8.jar (7.0 MB at 17 MB/s)
[INFO] Installing F:\jenkins\jenkins-slave\workspace\maven-box_maven-scm_SCM-777\m\maven-scm-managers\maven-scm-manager-plexus\pom.xml to F:\jenkins\jenkins-slave\workspace\maven-box_maven-scm_SCM-777\m\maven-scm-plugin\target\local-repo\org\apache\maven\scm\maven-scm-manager-plexus\1.11.2-SNAPSHOT\maven-scm-manager-plexus-1.11.2-SNAPSHOT.pom
[INFO] Installing F:\jenkins\jenkins-slave\workspace\maven-box_maven-scm_SCM-777\m\maven-scm-managers\maven-scm-manager-plexus\target\maven-scm-manager-plexus-1.11.2-SNAPSHOT.jar to F:\jenkins\jenkins-slave\workspace\maven-box_maven-scm_SCM-777\m\maven-scm-plugin\target\local-repo\org\apache\maven\scm\maven-scm-manager-plexus\1.11.2-SNAPSHOT\maven-scm-manager-plexus-1.11.2-SNAPSHOT.jar
[INFO] Installing F:\jenkins\jenkins-slave\workspace\maven-box_maven-scm_SCM-777\m\maven-scm-managers\pom.xml to F:\jenkins\jenkins-slave\workspace\maven-box_maven-scm_SCM-777\m\maven-scm-plugin\target\local-repo\org\apache\maven\scm\maven-scm-managers\1.11.2-SNAPSHOT\maven-scm-managers-1.11.2-SNAPSHOT.pom
[INFO] Installing f:\jenkins\jenkins-slave\workspace\maven-box_maven-scm_SCM-777\m\pom.xml to F:\jenkins\jenkins-slave\workspace\maven-box_maven-scm_SCM-777\m\maven-scm-plugin\target\local-repo\org\apache\maven\scm\maven-scm\1.11.2-SNAPSHOT\maven-scm-1.11.2-SNAPSHOT.pom
[INFO] Installing F:\jenkins\jenkins-slave\workspace\maven-box_maven-scm_SCM-777\m\maven-scm-providers\maven-scm-providers-git\maven-scm-provider-gittest\pom.xml to F:\jenkins\jenkins-slave\workspace\maven-box_maven-scm_SCM-777\m\maven-scm-plugin\target\local-repo\org\apache\maven\scm\maven-scm-provider-gittest\1.11.2-SNAPSHOT\maven-scm-provider-gittest-1.11.2-SNAPSHOT.pom
[INFO] Installing F:\jenkins\jenkins-slave\workspace\maven-box_maven-scm_SCM-777\m\maven-scm-providers\maven-scm-providers-git\maven-scm-provider-gittest\target\maven-scm-provider-gittest-1.11.2-SNAPSHOT.jar to F:\jenkins\jenkins-slave\workspace\maven-box_maven-scm_SCM-777\m\maven-scm-plugin\target\local-repo\org\apache\maven\scm\maven-scm-provider-gittest\1.11.2-SNAPSHOT\maven-scm-provider-gittest-1.11.2-SNAPSHOT.jar
[INFO] Installing F:\jenkins\jenkins-slave\workspace\maven-box_maven-scm_SCM-777\m\maven-scm-providers\maven-scm-providers-git\pom.xml to F:\jenkins\jenkins-slave\workspace\maven-box_maven-scm_SCM-777\m\maven-scm-plugin\target\local-repo\org\apache\maven\scm\maven-scm-providers-git\1.11.2-SNAPSHOT\maven-scm-providers-git-1.11.2-SNAPSHOT.pom
[INFO] Installing F:\jenkins\jenkins-slave\workspace\maven-box_maven-scm_SCM-777\m\maven-scm-providers\pom.xml to F:\jenkins\jenkins-slave\workspace\maven-box_maven-scm_SCM-777\m\maven-scm-plugin\target\local-repo\org\apache\maven\scm\maven-scm-providers\1.11.2-SNAPSHOT\maven-scm-providers-1.11.2-SNAPSHOT.pom
[INFO] Installing F:\jenkins\jenkins-slave\workspace\maven-box_maven-scm_SCM-777\m\maven-scm-providers\maven-scm-provider-local\pom.xml to F:\jenkins\jenkins-slave\workspace\maven-box_maven-scm_SCM-777\m\maven-scm-plugin\target\local-repo\org\apache\maven\scm\maven-scm-provider-local\1.11.2-SNAPSHOT\maven-scm-provider-local-1.11.2-SNAPSHOT.pom
[INFO] Installing F:\jenkins\jenkins-slave\workspace\maven-box_maven-scm_SCM-777\m\maven-scm-providers\maven-scm-provider-local\target\maven-scm-provider-local-1.11.2-SNAPSHOT.jar to F:\jenkins\jenkins-slave\workspace\maven-box_maven-scm_SCM-777\m\maven-scm-plugin\target\local-repo\org\apache\maven\scm\maven-scm-provider-local\1.11.2-SNAPSHOT\maven-scm-provider-local-1.11.2-SNAPSHOT.jar
[INFO] Installing F:\jenkins\jenkins-slave\workspace\maven-box_maven-scm_SCM-777\m\maven-scm-providers\maven-scm-providers-svn\maven-scm-provider-svn-commons\pom.xml to F:\jenkins\jenkins-slave\workspace\maven-box_maven-scm_SCM-777\m\maven-scm-plugin\target\local-repo\org\apache\maven\scm\maven-scm-provider-svn-commons\1.11.2-SNAPSHOT\maven-scm-provider-svn-commons-1.11.2-SNAPSHOT.pom
[INFO] Installing F:\jenkins\jenkins-slave\workspace\maven-box_maven-scm_SCM-777\m\maven-scm-providers\maven-scm-providers-svn\maven-scm-provider-svn-commons\target\maven-scm-provider-svn-commons-1.11.2-SNAPSHOT.jar to F:\jenkins\jenkins-slave\workspace\maven-box_maven-scm_SCM-777\m\maven-scm-plugin\target\local-repo\org\apache\maven\scm\maven-scm-provider-svn-commons\1.11.2-SNAPSHOT\maven-scm-provider-svn-commons-1.11.2-SNAPSHOT.jar
[INFO] Installing F:\jenkins\jenkins-slave\workspace\maven-box_maven-scm_SCM-777\m\maven-scm-providers\maven-scm-providers-svn\pom.xml to F:\jenkins\jenkins-slave\workspace\maven-box_maven-scm_SCM-777\m\maven-scm-plugin\target\local-repo\org\apache\maven\scm\maven-scm-providers-svn\1.11.2-SNAPSHOT\maven-scm-providers-svn-1.11.2-SNAPSHOT.pom
[INFO] Installing F:\jenkins\jenkins-slave\workspace\maven-box_maven-scm_SCM-777\m\maven-scm-providers\maven-scm-providers-svn\maven-scm-provider-svntest\pom.xml to F:\jenkins\jenkins-slave\workspace\maven-box_maven-scm_SCM-777\m\maven-scm-plugin\target\local-repo\org\apache\maven\scm\maven-scm-provider-svntest\1.11.2-SNAPSHOT\maven-scm-provider-svntest-1.11.2-SNAPSHOT.pom
[INFO] Installing F:\jenkins\jenkins-slave\workspace\maven-box_maven-scm_SCM-777\m\maven-scm-providers\maven-scm-providers-svn\maven-scm-provider-svntest\target\maven-scm-provider-svntest-1.11.2-SNAPSHOT.jar to F:\jenkins\jenkins-slave\workspace\maven-box_maven-scm_SCM-777\m\maven-scm-plugin\target\local-repo\org\apache\maven\scm\maven-scm-provider-svntest\1.11.2-SNAPSHOT\maven-scm-provider-svntest-1.11.2-SNAPSHOT.jar
[INFO] Installing F:\jenkins\jenkins-slave\workspace\maven-box_maven-scm_SCM-777\m\maven-scm-providers\maven-scm-providers-standard\pom.xml to F:\jenkins\jenkins-slave\workspace\maven-box_maven-scm_SCM-777\m\maven-scm-plugin\target\local-repo\org\apache\maven\scm\maven-scm-providers-standard\1.11.2-SNAPSHOT\maven-scm-providers-standard-1.11.2-SNAPSHOT.pom
[INFO] Installing F:\jenkins\jenkins-slave\workspace\maven-box_maven-scm_SCM-777\m\maven-scm-plugin\pom.xml to F:\jenkins\jenkins-slave\workspace\maven-box_maven-scm_SCM-777\m\maven-scm-plugin\target\local-repo\org\apache\maven\plugins\maven-scm-plugin\1.11.2-SNAPSHOT\maven-scm-plugin-1.11.2-SNAPSHOT.pom
[INFO] Installing F:\jenkins\jenkins-slave\workspace\maven-box_maven-scm_SCM-777\m\maven-scm-plugin\target\maven-scm-plugin-1.11.2-SNAPSHOT.jar to F:\jenkins\jenkins-slave\workspace\maven-box_maven-scm_SCM-777\m\maven-scm-plugin\target\local-repo\org\apache\maven\plugins\maven-scm-plugin\1.11.2-SNAPSHOT\maven-scm-plugin-1.11.2-SNAPSHOT.jar
[INFO]
[INFO] --- maven-invoker-plugin:3.1.0:run (integration-test) @ maven-scm-plugin ---
[INFO] No projects were selected for execution.
[INFO]
[INFO] --- maven-checkstyle-plugin:3.0.0:check (checkstyle-check) @ maven-scm-plugin ---
[INFO] ------------------------------------------------------------------------
[INFO] Reactor Summary for Maven SCM 1.11.2-SNAPSHOT:
[INFO]
[INFO] Maven SCM .......................................... SUCCESS [ 58.185 s]
[INFO] Maven SCM API ...................................... SUCCESS [ 13.731 s]
[INFO] Maven SCM Managers ................................. SUCCESS [  0.969 s]
[INFO] Maven SCM Manager for Plexus ....................... SUCCESS [  4.096 s]
[INFO] Maven SCM Test ..................................... SUCCESS [  4.450 s]
[INFO] Maven SCM Providers ................................ SUCCESS [  1.219 s]
[INFO] Maven SCM AccuRev Provider ......................... SUCCESS [ 12.259 s]
[INFO] Maven SCM Bazaar Provider .......................... SUCCESS [  7.023 s]
[INFO] Maven SCM Clearcase Provider ....................... SUCCESS [ 10.528 s]
[INFO] Maven SCM CVS Provider - Parent .................... SUCCESS [  0.842 s]
[INFO] Maven SCM CVS Provider TCK tests ................... SUCCESS [  2.943 s]
[INFO] Maven SCM CVS Provider - Common library ............ SUCCESS [  5.418 s]
[INFO] Maven SCM CVS Provider - CVS Executable Impl. ...... SUCCESS [  4.766 s]
[INFO] Maven SCM CVS Provider - CVS Java Impl. ............ SUCCESS [  6.108 s]
[INFO] Maven SCM Mercurial (Hg) Provider .................. SUCCESS [  4.905 s]
[INFO] Maven SCM Git Provider - Parent .................... SUCCESS [  0.779 s]
[INFO] Maven SCM Git Provider - Common library ............ SUCCESS [  4.536 s]
[INFO] Maven SCM Git Provider TCK Tests ................... SUCCESS [  1.742 s]
[INFO] Maven SCM Git Provider - Git Executable Impl. ...... SUCCESS [ 21.641 s]
[INFO] Maven SCM Git Provider - JGit Impl. ................ SUCCESS [01:25 min]
[INFO] Maven SCM Local Provider ........................... SUCCESS [  4.208 s]
[INFO] Maven SCM Perforce Provider ........................ SUCCESS [  5.857 s]
[INFO] Maven SCM Starteam Provider ........................ SUCCESS [  7.977 s]
[INFO] Maven SCM Subversion Provider - Parent ............. SUCCESS [  0.696 s]
[INFO] Maven SCM Subversion Provider - Common library ..... SUCCESS [  4.198 s]
[INFO] Maven SCM Subversion Provider TCK Tests ............ SUCCESS [  1.275 s]
[INFO] Maven SCM Subversion Provider - SVN Executable Impl. SUCCESS [  7.019 s]
[INFO] Maven SCM Synergy Provider ......................... SUCCESS [  5.109 s]
[INFO] Maven SCM Visual Source Safe Provider .............. SUCCESS [  4.732 s]
[INFO] Maven SCM TFS Provider ............................. SUCCESS [  4.261 s]
[INFO] Maven SCM MKS Integrity Provider ................... SUCCESS [  7.558 s]
[INFO] Maven SCM Jazz/Rational Team Concert Provider ...... SUCCESS [  6.382 s]
[INFO] Maven SCM Standard Providers ....................... SUCCESS [  1.304 s]
[INFO] Maven SCM Client ................................... SUCCESS [  5.072 s]
[INFO] Maven SCM Plugin ................................... SUCCESS [01:41 min]
[INFO] ------------------------------------------------------------------------
[INFO] BUILD SUCCESS
[INFO] ------------------------------------------------------------------------
[INFO] Total time:  07:01 min
[INFO] Finished at: 2020-01-12T09:54:24-08:00
[INFO] ------------------------------------------------------------------------
[WARNING] The requested profile "run-its" could not be activated because it does not exist.
[INFO] [jenkins-event-spy] Generated F:\jenkins\jenkins-slave\workspace\maven-box_maven-scm_SCM-777@tmp\withMaven03813d14\maven-spy-20200112-094722-754336439006105287657.log
[Pipeline] }
[Pipeline] // dir
[Pipeline] }
[withMaven] invokerPublisher - Archive invoker results for Maven artifact MavenArtifact{org.apache.maven.plugins:maven-scm-plugin:maven-plugin:1.11.2-SNAPSHOT(version: 1.11.2-SNAPSHOT, snapshot:false) } generated by PluginInvocation{org.apache.maven.plugins:maven-invoker-plugin:3.1.0@run  integration-test}: m\maven-scm-plugin\target\invoker-reports\*.xml
[withMaven] junitPublisher - Archive test results for Maven artifact org.apache.maven.scm:maven-scm-api:jar:1.11.2-SNAPSHOT generated by maven-surefire-plugin:test (default-test): m\maven-scm-api\target\surefire-reports\*.xml
[withMaven] junitPublisher - Archive test results for Maven artifact org.apache.maven.scm:maven-scm-manager-plexus:jar:1.11.2-SNAPSHOT generated by maven-surefire-plugin:test (default-test): m\maven-scm-managers\maven-scm-manager-plexus\target\surefire-reports\*.xml
[withMaven] junitPublisher - Archive test results for Maven artifact org.apache.maven.scm:maven-scm-test:jar:1.11.2-SNAPSHOT generated by maven-surefire-plugin:test (default-test): m\maven-scm-test\target\surefire-reports\*.xml
[withMaven] junitPublisher - Archive test results for Maven artifact org.apache.maven.scm:maven-scm-provider-accurev:jar:1.11.2-SNAPSHOT generated by maven-surefire-plugin:test (default-test): m\maven-scm-providers\maven-scm-provider-accurev\target\surefire-reports\*.xml
[withMaven] junitPublisher - Archive test results for Maven artifact org.apache.maven.scm:maven-scm-provider-bazaar:jar:1.11.2-SNAPSHOT generated by maven-surefire-plugin:test (default-test): m\maven-scm-providers\maven-scm-provider-bazaar\target\surefire-reports\*.xml
[withMaven] junitPublisher - Archive test results for Maven artifact org.apache.maven.scm:maven-scm-provider-clearcase:jar:1.11.2-SNAPSHOT generated by maven-surefire-plugin:test (default-test): m\maven-scm-providers\maven-scm-provider-clearcase\target\surefire-reports\*.xml
[withMaven] junitPublisher - Archive test results for Maven artifact org.apache.maven.scm:maven-scm-provider-cvstest:jar:1.11.2-SNAPSHOT generated by maven-surefire-plugin:test (default-test): m\maven-scm-providers\maven-scm-providers-cvs\maven-scm-provider-cvstest\target\surefire-reports\*.xml
[withMaven] junitPublisher - Archive test results for Maven artifact org.apache.maven.scm:maven-scm-provider-cvs-commons:jar:1.11.2-SNAPSHOT generated by maven-surefire-plugin:test (default-test): m\maven-scm-providers\maven-scm-providers-cvs\maven-scm-provider-cvs-commons\target\surefire-reports\*.xml
[withMaven] junitPublisher - Archive test results for Maven artifact org.apache.maven.scm:maven-scm-provider-cvsexe:jar:1.11.2-SNAPSHOT generated by maven-surefire-plugin:test (default-test): m\maven-scm-providers\maven-scm-providers-cvs\maven-scm-provider-cvsexe\target\surefire-reports\*.xml
[withMaven] junitPublisher - Archive test results for Maven artifact org.apache.maven.scm:maven-scm-provider-cvsjava:jar:1.11.2-SNAPSHOT generated by maven-surefire-plugin:test (default-test): m\maven-scm-providers\maven-scm-providers-cvs\maven-scm-provider-cvsjava\target\surefire-reports\*.xml
[withMaven] junitPublisher - Archive test results for Maven artifact org.apache.maven.scm:maven-scm-provider-hg:jar:1.11.2-SNAPSHOT generated by maven-surefire-plugin:test (default-test): m\maven-scm-providers\maven-scm-provider-hg\target\surefire-reports\*.xml
[withMaven] junitPublisher - Archive test results for Maven artifact org.apache.maven.scm:maven-scm-provider-git-commons:jar:1.11.2-SNAPSHOT generated by maven-surefire-plugin:test (default-test): m\maven-scm-providers\maven-scm-providers-git\maven-scm-provider-git-commons\target\surefire-reports\*.xml
[withMaven] junitPublisher - Archive test results for Maven artifact org.apache.maven.scm:maven-scm-provider-gittest:jar:1.11.2-SNAPSHOT generated by maven-surefire-plugin:test (default-test): m\maven-scm-providers\maven-scm-providers-git\maven-scm-provider-gittest\target\surefire-reports\*.xml
[withMaven] junitPublisher - Archive test results for Maven artifact org.apache.maven.scm:maven-scm-provider-gitexe:jar:1.11.2-SNAPSHOT generated by maven-surefire-plugin:test (default-test): m\maven-scm-providers\maven-scm-providers-git\maven-scm-provider-gitexe\target\surefire-reports\*.xml
[withMaven] junitPublisher - Archive test results for Maven artifact org.apache.maven.scm:maven-scm-provider-jgit:jar:1.11.2-SNAPSHOT generated by maven-surefire-plugin:test (default-test): m\maven-scm-providers\maven-scm-providers-git\maven-scm-provider-jgit\target\surefire-reports\*.xml
[withMaven] junitPublisher - Archive test results for Maven artifact org.apache.maven.scm:maven-scm-provider-local:jar:1.11.2-SNAPSHOT generated by maven-surefire-plugin:test (default-test): m\maven-scm-providers\maven-scm-provider-local\target\surefire-reports\*.xml
[withMaven] junitPublisher - Archive test results for Maven artifact org.apache.maven.scm:maven-scm-provider-perforce:jar:1.11.2-SNAPSHOT generated by maven-surefire-plugin:test (default-test): m\maven-scm-providers\maven-scm-provider-perforce\target\surefire-reports\*.xml
[withMaven] junitPublisher - Archive test results for Maven artifact org.apache.maven.scm:maven-scm-provider-starteam:jar:1.11.2-SNAPSHOT generated by maven-surefire-plugin:test (default-test): m\maven-scm-providers\maven-scm-provider-starteam\target\surefire-reports\*.xml
[withMaven] junitPublisher - Archive test results for Maven artifact org.apache.maven.scm:maven-scm-provider-svn-commons:jar:1.11.2-SNAPSHOT generated by maven-surefire-plugin:test (default-test): m\maven-scm-providers\maven-scm-providers-svn\maven-scm-provider-svn-commons\target\surefire-reports\*.xml
[withMaven] junitPublisher - Archive test results for Maven artifact org.apache.maven.scm:maven-scm-provider-svntest:jar:1.11.2-SNAPSHOT generated by maven-surefire-plugin:test (default-test): m\maven-scm-providers\maven-scm-providers-svn\maven-scm-provider-svntest\target\surefire-reports\*.xml
[withMaven] junitPublisher - Archive test results for Maven artifact org.apache.maven.scm:maven-scm-provider-svnexe:jar:1.11.2-SNAPSHOT generated by maven-surefire-plugin:test (default-test): m\maven-scm-providers\maven-scm-providers-svn\maven-scm-provider-svnexe\target\surefire-reports\*.xml
[withMaven] junitPublisher - Archive test results for Maven artifact org.apache.maven.scm:maven-scm-provider-synergy:jar:1.11.2-SNAPSHOT generated by maven-surefire-plugin:test (default-test): m\maven-scm-providers\maven-scm-provider-synergy\target\surefire-reports\*.xml
[withMaven] junitPublisher - Archive test results for Maven artifact org.apache.maven.scm:maven-scm-provider-vss:jar:1.11.2-SNAPSHOT generated by maven-surefire-plugin:test (default-test): m\maven-scm-providers\maven-scm-provider-vss\target\surefire-reports\*.xml
[withMaven] junitPublisher - Archive test results for Maven artifact org.apache.maven.scm:maven-scm-provider-tfs:jar:1.11.2-SNAPSHOT generated by maven-surefire-plugin:test (default-test): m\maven-scm-providers\maven-scm-provider-tfs\target\surefire-reports\*.xml
[withMaven] junitPublisher - Archive test results for Maven artifact org.apache.maven.scm:maven-scm-provider-integrity:jar:1.11.2-SNAPSHOT generated by maven-surefire-plugin:test (default-test): m\maven-scm-providers\maven-scm-provider-integrity\target\surefire-reports\*.xml
[withMaven] junitPublisher - Archive test results for Maven artifact org.apache.maven.scm:maven-scm-provider-jazz:jar:1.11.2-SNAPSHOT generated by maven-surefire-plugin:test (default-test): m\maven-scm-providers\maven-scm-provider-jazz\target\surefire-reports\*.xml
[withMaven] junitPublisher - Archive test results for Maven artifact org.apache.maven.scm:maven-scm-client:jar:1.11.2-SNAPSHOT generated by maven-surefire-plugin:test (default-test): m\maven-scm-client\target\surefire-reports\*.xml
[withMaven] junitPublisher - Archive test results for Maven artifact org.apache.maven.plugins:maven-scm-plugin:maven-plugin:1.11.2-SNAPSHOT generated by maven-surefire-plugin:test (default-test): m\maven-scm-plugin\target\surefire-reports\*.xml
Recording test results
[withMaven] Publishers: Pipeline Graph Publisher: 16 ms, Invoker Publisher: 511 ms, Junit Publisher: 5874 ms, Concordion Publisher: 1 ms, Dependencies Fingerprint Publisher: 1054 ms, JGiven Publisher: 1 ms, SpotBugs Publisher: 1 ms
[Pipeline] // withMaven
[Pipeline] cleanWs
[WS-CLEANUP] Deleting project workspace...
[WS-CLEANUP] Deferred wipeout is used...
[WS-CLEANUP] done
[Pipeline] }
[Pipeline] // stage
[Pipeline] }
[Pipeline] // node
[Pipeline] }
[Pipeline] // parallel
[Pipeline] echo
[FAILURE-003] AbortException hudson.AbortException: Error cloning remote repo 'origin'
[Pipeline] stage
[Pipeline] { (Notifications)
[Pipeline] echo
Build result: FAILURE
[Pipeline] jiraIssueSelector
[Pipeline] echo
The authors of changes [rfscholte].
[Pipeline] echo
Sending email ...
[Pipeline] emailext
Reply | Threaded
Open this post in threaded view
|

Build failed in Jenkins: Maven TLP » maven-scm » SCM-777 #20

Apache Jenkins Server-2
See https://builds.apache.org/job/maven-box/job/maven-scm/job/SCM-777/20/

Changes:

* Add JDK 15
* Add Maven 3.6.3

No tests ran.

Build log:
Branch indexing
Obtained Jenkinsfile from 04b16dc3a80bcc1a8875adde4e6484bb208af281
Running in Durability level: MAX_SURVIVABILITY
Loading library jenkins-env@master
Attempting to resolve master from remote references...
 > git --version # timeout=10
 > git ls-remote -h https://gitbox.apache.org/repos/asf/maven-jenkins-env.git # timeout=10
Found match: refs/heads/master revision 60cdcce21e0f2ffbb7982b6bcb3085938bc43694
No credentials specified
 > git rev-parse --is-inside-work-tree # timeout=10
Fetching changes from the remote Git repository
 > git config remote.origin.url https://gitbox.apache.org/repos/asf/maven-jenkins-env.git # timeout=10
Fetching without tags
Fetching upstream changes from https://gitbox.apache.org/repos/asf/maven-jenkins-env.git
 > git --version # timeout=10
 > git fetch --no-tags --progress https://gitbox.apache.org/repos/asf/maven-jenkins-env.git +refs/heads/*:refs/remotes/origin/*
Checking out Revision 60cdcce21e0f2ffbb7982b6bcb3085938bc43694 (master)
 > git config core.sparsecheckout # timeout=10
 > git checkout -f 60cdcce21e0f2ffbb7982b6bcb3085938bc43694
Commit message: "Add Maven 3.6.3"
 > git rev-list --no-walk 7765a90edaad26e06bc4c32b05b561342f8db351 # timeout=10
Loading library jenkins-lib@master
Attempting to resolve master from remote references...
 > git --version # timeout=10
 > git ls-remote -h https://gitbox.apache.org/repos/asf/maven-jenkins-lib.git # timeout=10
Found match: refs/heads/master revision 57fbd117325ce13ef69bd591f457300c75dfc13b
No credentials specified
 > git rev-parse --is-inside-work-tree # timeout=10
Fetching changes from the remote Git repository
 > git config remote.origin.url https://gitbox.apache.org/repos/asf/maven-jenkins-lib.git # timeout=10
Fetching without tags
Fetching upstream changes from https://gitbox.apache.org/repos/asf/maven-jenkins-lib.git
 > git --version # timeout=10
 > git fetch --no-tags --progress https://gitbox.apache.org/repos/asf/maven-jenkins-lib.git +refs/heads/*:refs/remotes/origin/*
Checking out Revision 57fbd117325ce13ef69bd591f457300c75dfc13b (master)
 > git config core.sparsecheckout # timeout=10
 > git checkout -f 57fbd117325ce13ef69bd591f457300c75dfc13b
Commit message: "echo NODE_NAME"
 > git rev-list --no-walk 57fbd117325ce13ef69bd591f457300c75dfc13b # timeout=10
[Pipeline] Start of Pipeline
[Pipeline] properties
[Pipeline] echo
OS: linux JDK: 7 Maven: 3.x.x => Label: ubuntu && !H30 JDK: JDK 1.7 (latest) Maven: Maven 3.6.2
[Pipeline] echo
OS: linux JDK: 8 Maven: 3.x.x => Label: ubuntu && !H30 JDK: JDK 1.8 (latest) Maven: Maven 3.6.2
[Pipeline] echo
OS: linux JDK: 11 Maven: 3.x.x => Label: ubuntu && !H30 JDK: JDK 11 (latest) Maven: Maven 3.6.2
[Pipeline] echo
OS: linux JDK: 13 Maven: 3.x.x => Label: ubuntu && !H30 JDK: JDK 13 (latest) Maven: Maven 3.6.2
[Pipeline] echo
OS: linux JDK: 14 Maven: 3.x.x => Label: ubuntu && !H30 JDK: JDK 14 (latest) Maven: Maven 3.6.2
[Pipeline] echo
OS: windows JDK: 7 Maven: 3.x.x => Label: Windows JDK: JDK 1.7 (latest) Maven: Maven 3.6.2 (Windows)
[Pipeline] echo
OS: windows JDK: 8 Maven: 3.x.x => Label: Windows JDK: JDK 1.8 (latest) Maven: Maven 3.6.2 (Windows)
[Pipeline] echo
OS: windows JDK: 11 Maven: 3.x.x => Label: Windows JDK: JDK 11 (latest) Maven: Maven 3.6.2 (Windows)
[Pipeline] echo
OS: windows JDK: 13 Maven: 3.x.x => Label: Windows JDK: JDK 13 (latest) Maven: Maven 3.6.2 (Windows)
[Pipeline] echo
OS: windows JDK: 14 Maven: 3.x.x => Label: Windows JDK: JDK 14 (latest) Maven: Maven 3.6.2 (Windows)
[Pipeline] parallel
[Pipeline] { (Branch: linux-jdk7)
[Pipeline] { (Branch: linux-jdk8)
[Pipeline] { (Branch: linux-jdk11)
[Pipeline] { (Branch: linux-jdk13)
[Pipeline] { (Branch: linux-jdk14)
[Pipeline] { (Branch: windows-jdk7)
[Pipeline] { (Branch: windows-jdk8)
[Pipeline] { (Branch: windows-jdk11)
[Pipeline] { (Branch: windows-jdk13)
[Pipeline] { (Branch: windows-jdk14)
[Pipeline] node
[Pipeline] node
[Pipeline] node
[Pipeline] node
[Pipeline] node
[Pipeline] node
[Pipeline] node
[Pipeline] node
[Pipeline] node
[Pipeline] node
Still waiting to schedule task
‘H0’ doesn’t have label ‘ubuntu&&!H30’; ‘H10’ doesn’t have label ‘ubuntu&&!H30’; ‘H12’ doesn’t have label ‘ubuntu&&!H30’; ‘H13’ doesn’t have label ‘ubuntu&&!H30’; ‘H14’ doesn’t have label ‘ubuntu&&!H30’; ‘H15’ doesn’t have label ‘ubuntu&&!H30’; ‘H16’ doesn’t have label ‘ubuntu&&!H30’; ‘H17’ doesn’t have label ‘ubuntu&&!H30’; ‘H18’ doesn’t have label ‘ubuntu&&!H30’; ‘H1’ doesn’t have label ‘ubuntu&&!H30’; ‘H20’ doesn’t have label ‘ubuntu&&!H30’; ‘H21’ doesn’t have label ‘ubuntu&&!H30’; ‘H26’ is offline; ‘H28’ is offline; ‘H2’ doesn’t have label ‘ubuntu&&!H30’; ‘H31’ is offline; ‘H37’ is offline; ‘H38’ is offline; ‘H42’ is offline; ‘H4’ doesn’t have label ‘ubuntu&&!H30’; ‘H50’ doesn’t have label ‘ubuntu&&!H30’; ‘H5’ doesn’t have label ‘ubuntu&&!H30’; ‘H6’ doesn’t have label ‘ubuntu&&!H30’; ‘Jenkins’ doesn’t have label ‘ubuntu&&!H30’; ‘apache-beam-jenkins-10’ doesn’t have label ‘ubuntu&&!H30’; ‘apache-beam-jenkins-11’ doesn’t have label ‘ubuntu&&!H30’; ‘apache-beam-jenkins-12’ doesn’t have label ‘ubuntu&&!H30’; ‘apache-beam-jenkins-13’ doesn’t have label ‘ubuntu&&!H30’; ‘apache-beam-jenkins-14’ doesn’t have label ‘ubuntu&&!H30’; ‘apache-beam-jenkins-15’ doesn’t have label ‘ubuntu&&!H30’; ‘apache-beam-jenkins-1’ doesn’t have label ‘ubuntu&&!H30’; ‘apache-beam-jenkins-2’ doesn’t have label ‘ubuntu&&!H30’; ‘apache-beam-jenkins-3’ doesn’t have label ‘ubuntu&&!H30’; ‘apache-beam-jenkins-4’ doesn’t have label ‘ubuntu&&!H30’; ‘apache-beam-jenkins-5’ doesn’t have label ‘ubuntu&&!H30’; ‘apache-beam-jenkins-6’ doesn’t have label ‘ubuntu&&!H30’; ‘apache-beam-jenkins-7’ doesn’t have label ‘ubuntu&&!H30’; ‘apache-beam-jenkins-8’ doesn’t have label ‘ubuntu&&!H30’; ‘apache-beam-jenkins-9’ doesn’t have label ‘ubuntu&&!H30’; ‘arm1’ doesn’t have label ‘ubuntu&&!H30’; ‘arm2’ doesn’t have label ‘ubuntu&&!H30’; ‘arm3’ doesn’t have label ‘ubuntu&&!H30’; ‘cassandra10’ doesn’t have label ‘ubuntu&&!H30’; ‘cassandra11’ doesn’t have label ‘ubuntu&&!H30’; ‘cassandra12’ doesn’t have label ‘ubuntu&&!H30’; ‘cassandra13’ doesn’t have label ‘ubuntu&&!H30’; ‘cassandra14’ doesn’t have label ‘ubuntu&&!H30’; ‘cassandra15’ doesn’t have label ‘ubuntu&&!H30’; ‘cassandra16’ doesn’t have label ‘ubuntu&&!H30’; ‘cassandra1’ doesn’t have label ‘ubuntu&&!H30’; ‘cassandra2’ doesn’t have label ‘ubuntu&&!H30’; ‘cassandra3’ doesn’t have label ‘ubuntu&&!H30’; ‘cassandra4’ doesn’t have label ‘ubuntu&&!H30’; ‘cassandra5’ doesn’t have label ‘ubuntu&&!H30’; ‘cassandra6’ doesn’t have label ‘ubuntu&&!H30’; ‘cassandra7’ doesn’t have label ‘ubuntu&&!H30’; ‘cassandra8’ doesn’t have label ‘ubuntu&&!H30’; ‘cassandra9’ doesn’t have label ‘ubuntu&&!H30’; ‘hadoop-ppc64le-1’ doesn’t have label ‘ubuntu&&!H30’; ‘hadoop-win1’ doesn’t have label ‘ubuntu&&!H30’; ‘jenkins-skywalking1’ doesn’t have label ‘ubuntu&&!H30’; ‘jenkins-skywalking2’ doesn’t have label ‘ubuntu&&!H30’; ‘jenkins-skywalking3’ doesn’t have label ‘ubuntu&&!H30’; ‘jenkins-skywalking4-se’ doesn’t have label ‘ubuntu&&!H30’; ‘jenkins-skywalking5’ doesn’t have label ‘ubuntu&&!H30’; ‘jenkins-skywalking6’ doesn’t have label ‘ubuntu&&!H30’; ‘jenkins-win-he-de-1’ doesn’t have label ‘ubuntu&&!H30’; ‘jenkins-win-he-de-2’ doesn’t have label ‘ubuntu&&!H30’; ‘jenkins-win-he-de-4’ doesn’t have label ‘ubuntu&&!H30’; ‘jenkins-win-he-de-5’ doesn’t have label ‘ubuntu&&!H30’; ‘openwhisk1’ doesn’t have label ‘ubuntu&&!H30’; ‘openwhisk2’ doesn’t have label ‘ubuntu&&!H30’; ‘openwhisk3’ doesn’t have label ‘ubuntu&&!H30’; ‘plc4x1’ doesn’t have label ‘ubuntu&&!H30’; ‘ubuntu-ppc64le’ doesn’t have label ‘ubuntu&&!H30’; ‘websites’ doesn’t have label ‘ubuntu&&!H30’
Still waiting to schedule task
‘H0’ doesn’t have label ‘ubuntu&&!H30’; ‘H10’ doesn’t have label ‘ubuntu&&!H30’; ‘H12’ doesn’t have label ‘ubuntu&&!H30’; ‘H13’ doesn’t have label ‘ubuntu&&!H30’; ‘H14’ doesn’t have label ‘ubuntu&&!H30’; ‘H15’ doesn’t have label ‘ubuntu&&!H30’; ‘H16’ doesn’t have label ‘ubuntu&&!H30’; ‘H17’ doesn’t have label ‘ubuntu&&!H30’; ‘H18’ doesn’t have label ‘ubuntu&&!H30’; ‘H1’ doesn’t have label ‘ubuntu&&!H30’; ‘H20’ doesn’t have label ‘ubuntu&&!H30’; ‘H21’ doesn’t have label ‘ubuntu&&!H30’; ‘H26’ is offline; ‘H28’ is offline; ‘H2’ doesn’t have label ‘ubuntu&&!H30’; ‘H31’ is offline; ‘H37’ is offline; ‘H38’ is offline; ‘H42’ is offline; ‘H4’ doesn’t have label ‘ubuntu&&!H30’; ‘H50’ doesn’t have label ‘ubuntu&&!H30’; ‘H5’ doesn’t have label ‘ubuntu&&!H30’; ‘H6’ doesn’t have label ‘ubuntu&&!H30’; ‘Jenkins’ doesn’t have label ‘ubuntu&&!H30’; ‘apache-beam-jenkins-10’ doesn’t have label ‘ubuntu&&!H30’; ‘apache-beam-jenkins-11’ doesn’t have label ‘ubuntu&&!H30’; ‘apache-beam-jenkins-12’ doesn’t have label ‘ubuntu&&!H30’; ‘apache-beam-jenkins-13’ doesn’t have label ‘ubuntu&&!H30’; ‘apache-beam-jenkins-14’ doesn’t have label ‘ubuntu&&!H30’; ‘apache-beam-jenkins-15’ doesn’t have label ‘ubuntu&&!H30’; ‘apache-beam-jenkins-1’ doesn’t have label ‘ubuntu&&!H30’; ‘apache-beam-jenkins-2’ doesn’t have label ‘ubuntu&&!H30’; ‘apache-beam-jenkins-3’ doesn’t have label ‘ubuntu&&!H30’; ‘apache-beam-jenkins-4’ doesn’t have label ‘ubuntu&&!H30’; ‘apache-beam-jenkins-5’ doesn’t have label ‘ubuntu&&!H30’; ‘apache-beam-jenkins-6’ doesn’t have label ‘ubuntu&&!H30’; ‘apache-beam-jenkins-7’ doesn’t have label ‘ubuntu&&!H30’; ‘apache-beam-jenkins-8’ doesn’t have label ‘ubuntu&&!H30’; ‘apache-beam-jenkins-9’ doesn’t have label ‘ubuntu&&!H30’; ‘arm1’ doesn’t have label ‘ubuntu&&!H30’; ‘arm2’ doesn’t have label ‘ubuntu&&!H30’; ‘arm3’ doesn’t have label ‘ubuntu&&!H30’; ‘cassandra10’ doesn’t have label ‘ubuntu&&!H30’; ‘cassandra11’ doesn’t have label ‘ubuntu&&!H30’; ‘cassandra12’ doesn’t have label ‘ubuntu&&!H30’; ‘cassandra13’ doesn’t have label ‘ubuntu&&!H30’; ‘cassandra14’ doesn’t have label ‘ubuntu&&!H30’; ‘cassandra15’ doesn’t have label ‘ubuntu&&!H30’; ‘cassandra16’ doesn’t have label ‘ubuntu&&!H30’; ‘cassandra1’ doesn’t have label ‘ubuntu&&!H30’; ‘cassandra2’ doesn’t have label ‘ubuntu&&!H30’; ‘cassandra3’ doesn’t have label ‘ubuntu&&!H30’; ‘cassandra4’ doesn’t have label ‘ubuntu&&!H30’; ‘cassandra5’ doesn’t have label ‘ubuntu&&!H30’; ‘cassandra6’ doesn’t have label ‘ubuntu&&!H30’; ‘cassandra7’ doesn’t have label ‘ubuntu&&!H30’; ‘cassandra8’ doesn’t have label ‘ubuntu&&!H30’; ‘cassandra9’ doesn’t have label ‘ubuntu&&!H30’; ‘hadoop-ppc64le-1’ doesn’t have label ‘ubuntu&&!H30’; ‘hadoop-win1’ doesn’t have label ‘ubuntu&&!H30’; ‘jenkins-skywalking1’ doesn’t have label ‘ubuntu&&!H30’; ‘jenkins-skywalking2’ doesn’t have label ‘ubuntu&&!H30’; ‘jenkins-skywalking3’ doesn’t have label ‘ubuntu&&!H30’; ‘jenkins-skywalking4-se’ doesn’t have label ‘ubuntu&&!H30’; ‘jenkins-skywalking5’ doesn’t have label ‘ubuntu&&!H30’; ‘jenkins-skywalking6’ doesn’t have label ‘ubuntu&&!H30’; ‘jenkins-win-he-de-1’ doesn’t have label ‘ubuntu&&!H30’; ‘jenkins-win-he-de-2’ doesn’t have label ‘ubuntu&&!H30’; ‘jenkins-win-he-de-4’ doesn’t have label ‘ubuntu&&!H30’; ‘jenkins-win-he-de-5’ doesn’t have label ‘ubuntu&&!H30’; ‘openwhisk1’ doesn’t have label ‘ubuntu&&!H30’; ‘openwhisk2’ doesn’t have label ‘ubuntu&&!H30’; ‘openwhisk3’ doesn’t have label ‘ubuntu&&!H30’; ‘plc4x1’ doesn’t have label ‘ubuntu&&!H30’; ‘ubuntu-ppc64le’ doesn’t have label ‘ubuntu&&!H30’; ‘websites’ doesn’t have label ‘ubuntu&&!H30’
Still waiting to schedule task
‘H0’ doesn’t have label ‘ubuntu&&!H30’; ‘H10’ doesn’t have label ‘ubuntu&&!H30’; ‘H12’ doesn’t have label ‘ubuntu&&!H30’; ‘H13’ doesn’t have label ‘ubuntu&&!H30’; ‘H14’ doesn’t have label ‘ubuntu&&!H30’; ‘H15’ doesn’t have label ‘ubuntu&&!H30’; ‘H16’ doesn’t have label ‘ubuntu&&!H30’; ‘H17’ doesn’t have label ‘ubuntu&&!H30’; ‘H18’ doesn’t have label ‘ubuntu&&!H30’; ‘H1’ doesn’t have label ‘ubuntu&&!H30’; ‘H20’ doesn’t have label ‘ubuntu&&!H30’; ‘H21’ doesn’t have label ‘ubuntu&&!H30’; ‘H26’ is offline; ‘H28’ is offline; ‘H2’ doesn’t have label ‘ubuntu&&!H30’; ‘H31’ is offline; ‘H37’ is offline; ‘H38’ is offline; ‘H42’ is offline; ‘H4’ doesn’t have label ‘ubuntu&&!H30’; ‘H50’ doesn’t have label ‘ubuntu&&!H30’; ‘H5’ doesn’t have label ‘ubuntu&&!H30’; ‘H6’ doesn’t have label ‘ubuntu&&!H30’; ‘Jenkins’ doesn’t have label ‘ubuntu&&!H30’; ‘apache-beam-jenkins-10’ doesn’t have label ‘ubuntu&&!H30’; ‘apache-beam-jenkins-11’ doesn’t have label ‘ubuntu&&!H30’; ‘apache-beam-jenkins-12’ doesn’t have label ‘ubuntu&&!H30’; ‘apache-beam-jenkins-13’ doesn’t have label ‘ubuntu&&!H30’; ‘apache-beam-jenkins-14’ doesn’t have label ‘ubuntu&&!H30’; ‘apache-beam-jenkins-15’ doesn’t have label ‘ubuntu&&!H30’; ‘apache-beam-jenkins-1’ doesn’t have label ‘ubuntu&&!H30’; ‘apache-beam-jenkins-2’ doesn’t have label ‘ubuntu&&!H30’; ‘apache-beam-jenkins-3’ doesn’t have label ‘ubuntu&&!H30’; ‘apache-beam-jenkins-4’ doesn’t have label ‘ubuntu&&!H30’; ‘apache-beam-jenkins-5’ doesn’t have label ‘ubuntu&&!H30’; ‘apache-beam-jenkins-6’ doesn’t have label ‘ubuntu&&!H30’; ‘apache-beam-jenkins-7’ doesn’t have label ‘ubuntu&&!H30’; ‘apache-beam-jenkins-8’ doesn’t have label ‘ubuntu&&!H30’; ‘apache-beam-jenkins-9’ doesn’t have label ‘ubuntu&&!H30’; ‘arm1’ doesn’t have label ‘ubuntu&&!H30’; ‘arm2’ doesn’t have label ‘ubuntu&&!H30’; ‘arm3’ doesn’t have label ‘ubuntu&&!H30’; ‘cassandra10’ doesn’t have label ‘ubuntu&&!H30’; ‘cassandra11’ doesn’t have label ‘ubuntu&&!H30’; ‘cassandra12’ doesn’t have label ‘ubuntu&&!H30’; ‘cassandra13’ doesn’t have label ‘ubuntu&&!H30’; ‘cassandra14’ doesn’t have label ‘ubuntu&&!H30’; ‘cassandra15’ doesn’t have label ‘ubuntu&&!H30’; ‘cassandra16’ doesn’t have label ‘ubuntu&&!H30’; ‘cassandra1’ doesn’t have label ‘ubuntu&&!H30’; ‘cassandra2’ doesn’t have label ‘ubuntu&&!H30’; ‘cassandra3’ doesn’t have label ‘ubuntu&&!H30’; ‘cassandra4’ doesn’t have label ‘ubuntu&&!H30’; ‘cassandra5’ doesn’t have label ‘ubuntu&&!H30’; ‘cassandra6’ doesn’t have label ‘ubuntu&&!H30’; ‘cassandra7’ doesn’t have label ‘ubuntu&&!H30’; ‘cassandra8’ doesn’t have label ‘ubuntu&&!H30’; ‘cassandra9’ doesn’t have label ‘ubuntu&&!H30’; ‘hadoop-ppc64le-1’ doesn’t have label ‘ubuntu&&!H30’; ‘hadoop-win1’ doesn’t have label ‘ubuntu&&!H30’; ‘jenkins-skywalking1’ doesn’t have label ‘ubuntu&&!H30’; ‘jenkins-skywalking2’ doesn’t have label ‘ubuntu&&!H30’; ‘jenkins-skywalking3’ doesn’t have label ‘ubuntu&&!H30’; ‘jenkins-skywalking4-se’ doesn’t have label ‘ubuntu&&!H30’; ‘jenkins-skywalking5’ doesn’t have label ‘ubuntu&&!H30’; ‘jenkins-skywalking6’ doesn’t have label ‘ubuntu&&!H30’; ‘jenkins-win-he-de-1’ doesn’t have label ‘ubuntu&&!H30’; ‘jenkins-win-he-de-2’ doesn’t have label ‘ubuntu&&!H30’; ‘jenkins-win-he-de-4’ doesn’t have label ‘ubuntu&&!H30’; ‘jenkins-win-he-de-5’ doesn’t have label ‘ubuntu&&!H30’; ‘openwhisk1’ doesn’t have label ‘ubuntu&&!H30’; ‘openwhisk2’ doesn’t have label ‘ubuntu&&!H30’; ‘openwhisk3’ doesn’t have label ‘ubuntu&&!H30’; ‘plc4x1’ doesn’t have label ‘ubuntu&&!H30’; ‘ubuntu-ppc64le’ doesn’t have label ‘ubuntu&&!H30’; ‘websites’ doesn’t have label ‘ubuntu&&!H30’
Still waiting to schedule task
‘H0’ doesn’t have label ‘ubuntu&&!H30’; ‘H10’ doesn’t have label ‘ubuntu&&!H30’; ‘H12’ doesn’t have label ‘ubuntu&&!H30’; ‘H13’ doesn’t have label ‘ubuntu&&!H30’; ‘H14’ doesn’t have label ‘ubuntu&&!H30’; ‘H15’ doesn’t have label ‘ubuntu&&!H30’; ‘H16’ doesn’t have label ‘ubuntu&&!H30’; ‘H17’ doesn’t have label ‘ubuntu&&!H30’; ‘H18’ doesn’t have label ‘ubuntu&&!H30’; ‘H1’ doesn’t have label ‘ubuntu&&!H30’; ‘H20’ doesn’t have label ‘ubuntu&&!H30’; ‘H21’ doesn’t have label ‘ubuntu&&!H30’; ‘H26’ is offline; ‘H28’ is offline; ‘H2’ doesn’t have label ‘ubuntu&&!H30’; ‘H31’ is offline; ‘H37’ is offline; ‘H38’ is offline; ‘H42’ is offline; ‘H4’ doesn’t have label ‘ubuntu&&!H30’; ‘H50’ doesn’t have label ‘ubuntu&&!H30’; ‘H5’ doesn’t have label ‘ubuntu&&!H30’; ‘H6’ doesn’t have label ‘ubuntu&&!H30’; ‘Jenkins’ doesn’t have label ‘ubuntu&&!H30’; ‘apache-beam-jenkins-10’ doesn’t have label ‘ubuntu&&!H30’; ‘apache-beam-jenkins-11’ doesn’t have label ‘ubuntu&&!H30’; ‘apache-beam-jenkins-12’ doesn’t have label ‘ubuntu&&!H30’; ‘apache-beam-jenkins-13’ doesn’t have label ‘ubuntu&&!H30’; ‘apache-beam-jenkins-14’ doesn’t have label ‘ubuntu&&!H30’; ‘apache-beam-jenkins-15’ doesn’t have label ‘ubuntu&&!H30’; ‘apache-beam-jenkins-1’ doesn’t have label ‘ubuntu&&!H30’; ‘apache-beam-jenkins-2’ doesn’t have label ‘ubuntu&&!H30’; ‘apache-beam-jenkins-3’ doesn’t have label ‘ubuntu&&!H30’; ‘apache-beam-jenkins-4’ doesn’t have label ‘ubuntu&&!H30’; ‘apache-beam-jenkins-5’ doesn’t have label ‘ubuntu&&!H30’; ‘apache-beam-jenkins-6’ doesn’t have label ‘ubuntu&&!H30’; ‘apache-beam-jenkins-7’ doesn’t have label ‘ubuntu&&!H30’; ‘apache-beam-jenkins-8’ doesn’t have label ‘ubuntu&&!H30’; ‘apache-beam-jenkins-9’ doesn’t have label ‘ubuntu&&!H30’; ‘arm1’ doesn’t have label ‘ubuntu&&!H30’; ‘arm2’ doesn’t have label ‘ubuntu&&!H30’; ‘arm3’ doesn’t have label ‘ubuntu&&!H30’; ‘cassandra10’ doesn’t have label ‘ubuntu&&!H30’; ‘cassandra11’ doesn’t have label ‘ubuntu&&!H30’; ‘cassandra12’ doesn’t have label ‘ubuntu&&!H30’; ‘cassandra13’ doesn’t have label ‘ubuntu&&!H30’; ‘cassandra14’ doesn’t have label ‘ubuntu&&!H30’; ‘cassandra15’ doesn’t have label ‘ubuntu&&!H30’; ‘cassandra16’ doesn’t have label ‘ubuntu&&!H30’; ‘cassandra1’ doesn’t have label ‘ubuntu&&!H30’; ‘cassandra2’ doesn’t have label ‘ubuntu&&!H30’; ‘cassandra3’ doesn’t have label ‘ubuntu&&!H30’; ‘cassandra4’ doesn’t have label ‘ubuntu&&!H30’; ‘cassandra5’ doesn’t have label ‘ubuntu&&!H30’; ‘cassandra6’ doesn’t have label ‘ubuntu&&!H30’; ‘cassandra7’ doesn’t have label ‘ubuntu&&!H30’; ‘cassandra8’ doesn’t have label ‘ubuntu&&!H30’; ‘cassandra9’ doesn’t have label ‘ubuntu&&!H30’; ‘hadoop-ppc64le-1’ doesn’t have label ‘ubuntu&&!H30’; ‘hadoop-win1’ doesn’t have label ‘ubuntu&&!H30’; ‘jenkins-skywalking1’ doesn’t have label ‘ubuntu&&!H30’; ‘jenkins-skywalking2’ doesn’t have label ‘ubuntu&&!H30’; ‘jenkins-skywalking3’ doesn’t have label ‘ubuntu&&!H30’; ‘jenkins-skywalking4-se’ doesn’t have label ‘ubuntu&&!H30’; ‘jenkins-skywalking5’ doesn’t have label ‘ubuntu&&!H30’; ‘jenkins-skywalking6’ doesn’t have label ‘ubuntu&&!H30’; ‘jenkins-win-he-de-1’ doesn’t have label ‘ubuntu&&!H30’; ‘jenkins-win-he-de-2’ doesn’t have label ‘ubuntu&&!H30’; ‘jenkins-win-he-de-4’ doesn’t have label ‘ubuntu&&!H30’; ‘jenkins-win-he-de-5’ doesn’t have label ‘ubuntu&&!H30’; ‘openwhisk1’ doesn’t have label ‘ubuntu&&!H30’; ‘openwhisk2’ doesn’t have label ‘ubuntu&&!H30’; ‘openwhisk3’ doesn’t have label ‘ubuntu&&!H30’; ‘plc4x1’ doesn’t have label ‘ubuntu&&!H30’; ‘ubuntu-ppc64le’ doesn’t have label ‘ubuntu&&!H30’; ‘websites’ doesn’t have label ‘ubuntu&&!H30’
Still waiting to schedule task
‘H0’ doesn’t have label ‘ubuntu&&!H30’; ‘H10’ doesn’t have label ‘ubuntu&&!H30’; ‘H12’ doesn’t have label ‘ubuntu&&!H30’; ‘H13’ doesn’t have label ‘ubuntu&&!H30’; ‘H14’ doesn’t have label ‘ubuntu&&!H30’; ‘H15’ doesn’t have label ‘ubuntu&&!H30’; ‘H16’ doesn’t have label ‘ubuntu&&!H30’; ‘H17’ doesn’t have label ‘ubuntu&&!H30’; ‘H18’ doesn’t have label ‘ubuntu&&!H30’; ‘H1’ doesn’t have label ‘ubuntu&&!H30’; ‘H20’ doesn’t have label ‘ubuntu&&!H30’; ‘H21’ doesn’t have label ‘ubuntu&&!H30’; ‘H26’ is offline; ‘H28’ is offline; ‘H2’ doesn’t have label ‘ubuntu&&!H30’; ‘H31’ is offline; ‘H37’ is offline; ‘H38’ is offline; ‘H42’ is offline; ‘H4’ doesn’t have label ‘ubuntu&&!H30’; ‘H50’ doesn’t have label ‘ubuntu&&!H30’; ‘H5’ doesn’t have label ‘ubuntu&&!H30’; ‘H6’ doesn’t have label ‘ubuntu&&!H30’; ‘Jenkins’ doesn’t have label ‘ubuntu&&!H30’; ‘apache-beam-jenkins-10’ doesn’t have label ‘ubuntu&&!H30’; ‘apache-beam-jenkins-11’ doesn’t have label ‘ubuntu&&!H30’; ‘apache-beam-jenkins-12’ doesn’t have label ‘ubuntu&&!H30’; ‘apache-beam-jenkins-13’ doesn’t have label ‘ubuntu&&!H30’; ‘apache-beam-jenkins-14’ doesn’t have label ‘ubuntu&&!H30’; ‘apache-beam-jenkins-15’ doesn’t have label ‘ubuntu&&!H30’; ‘apache-beam-jenkins-1’ doesn’t have label ‘ubuntu&&!H30’; ‘apache-beam-jenkins-2’ doesn’t have label ‘ubuntu&&!H30’; ‘apache-beam-jenkins-3’ doesn’t have label ‘ubuntu&&!H30’; ‘apache-beam-jenkins-4’ doesn’t have label ‘ubuntu&&!H30’; ‘apache-beam-jenkins-5’ doesn’t have label ‘ubuntu&&!H30’; ‘apache-beam-jenkins-6’ doesn’t have label ‘ubuntu&&!H30’; ‘apache-beam-jenkins-7’ doesn’t have label ‘ubuntu&&!H30’; ‘apache-beam-jenkins-8’ doesn’t have label ‘ubuntu&&!H30’; ‘apache-beam-jenkins-9’ doesn’t have label ‘ubuntu&&!H30’; ‘arm1’ doesn’t have label ‘ubuntu&&!H30’; ‘arm2’ doesn’t have label ‘ubuntu&&!H30’; ‘arm3’ doesn’t have label ‘ubuntu&&!H30’; ‘cassandra10’ doesn’t have label ‘ubuntu&&!H30’; ‘cassandra11’ doesn’t have label ‘ubuntu&&!H30’; ‘cassandra12’ doesn’t have label ‘ubuntu&&!H30’; ‘cassandra13’ doesn’t have label ‘ubuntu&&!H30’; ‘cassandra14’ doesn’t have label ‘ubuntu&&!H30’; ‘cassandra15’ doesn’t have label ‘ubuntu&&!H30’; ‘cassandra16’ doesn’t have label ‘ubuntu&&!H30’; ‘cassandra1’ doesn’t have label ‘ubuntu&&!H30’; ‘cassandra2’ doesn’t have label ‘ubuntu&&!H30’; ‘cassandra3’ doesn’t have label ‘ubuntu&&!H30’; ‘cassandra4’ doesn’t have label ‘ubuntu&&!H30’; ‘cassandra5’ doesn’t have label ‘ubuntu&&!H30’; ‘cassandra6’ doesn’t have label ‘ubuntu&&!H30’; ‘cassandra7’ doesn’t have label ‘ubuntu&&!H30’; ‘cassandra8’ doesn’t have label ‘ubuntu&&!H30’; ‘cassandra9’ doesn’t have label ‘ubuntu&&!H30’; ‘hadoop-ppc64le-1’ doesn’t have label ‘ubuntu&&!H30’; ‘hadoop-win1’ doesn’t have label ‘ubuntu&&!H30’; ‘jenkins-skywalking1’ doesn’t have label ‘ubuntu&&!H30’; ‘jenkins-skywalking2’ doesn’t have label ‘ubuntu&&!H30’; ‘jenkins-skywalking3’ doesn’t have label ‘ubuntu&&!H30’; ‘jenkins-skywalking4-se’ doesn’t have label ‘ubuntu&&!H30’; ‘jenkins-skywalking5’ doesn’t have label ‘ubuntu&&!H30’; ‘jenkins-skywalking6’ doesn’t have label ‘ubuntu&&!H30’; ‘jenkins-win-he-de-1’ doesn’t have label ‘ubuntu&&!H30’; ‘jenkins-win-he-de-2’ doesn’t have label ‘ubuntu&&!H30’; ‘jenkins-win-he-de-4’ doesn’t have label ‘ubuntu&&!H30’; ‘jenkins-win-he-de-5’ doesn’t have label ‘ubuntu&&!H30’; ‘openwhisk1’ doesn’t have label ‘ubuntu&&!H30’; ‘openwhisk2’ doesn’t have label ‘ubuntu&&!H30’; ‘openwhisk3’ doesn’t have label ‘ubuntu&&!H30’; ‘plc4x1’ doesn’t have label ‘ubuntu&&!H30’; ‘ubuntu-ppc64le’ doesn’t have label ‘ubuntu&&!H30’; ‘websites’ doesn’t have label ‘ubuntu&&!H30’
Still waiting to schedule task
Waiting for next available executor on ‘Windows’
Still waiting to schedule task
Waiting for next available executor on ‘Windows’
Still waiting to schedule task
Waiting for next available executor on ‘Windows’
Still waiting to schedule task
Waiting for next available executor on ‘Windows’
Still waiting to schedule task
Waiting for next available executor on ‘Windows’
Aborted by slachiewicz
[Pipeline] // node
[Pipeline] // node
[Pipeline] // node
[Pipeline] // node
[Pipeline] // node
[Pipeline] // node
[Pipeline] // node
[Pipeline] // node
[Pipeline] // node
[Pipeline] // node
[Pipeline] }
Failed in branch linux-jdk7
[Pipeline] }
Failed in branch linux-jdk8
[Pipeline] }
Failed in branch linux-jdk11
[Pipeline] }
Failed in branch linux-jdk13
[Pipeline] }
Failed in branch linux-jdk14
[Pipeline] }
Failed in branch windows-jdk7
[Pipeline] }
Failed in branch windows-jdk8
[Pipeline] }
Failed in branch windows-jdk11
[Pipeline] }
Failed in branch windows-jdk13
[Pipeline] }
Failed in branch windows-jdk14
[Pipeline] // parallel
[Pipeline] echo
[FAILURE-002] FlowInterruptedException org.jenkinsci.plugins.workflow.steps.FlowInterruptedException
[Pipeline] stage
[Pipeline] { (Notifications)
[Pipeline] echo
Build result: FAILURE
[Pipeline] jiraIssueSelector
[Pipeline] echo
The authors of changes [slachiewicz].
[Pipeline] echo
Sending email ...
[Pipeline] emailext
Reply | Threaded
Open this post in threaded view
|

Build succeeded in Jenkins: Maven TLP » maven-scm » SCM-777 #21

Apache Jenkins Server-2
See https://builds.apache.org/job/maven-box/job/maven-scm/job/SCM-777/21/

Changes:

* H30 is having issues
* H23 has issues.
* GitHub emails should not trigger notifier which otherwise breaks the
* Revert "GitHub emails should not trigger notifier which otherwise breaks
* H40 is unstable
* GitHub emails should not trigger notifier which otherwise breaks the
* send email if authors exist
* fixed Scripts not permitted to use staticMethod
* H24 in unstable

All tests passed