Build failed in Jenkins: Maven TLP » maven-resolver » master #80

classic Classic list List threaded Threaded
5 messages Options
Reply | Threaded
Open this post in threaded view
|

Build failed in Jenkins: Maven TLP » maven-resolver » master #80

Apache Jenkins Server-2
See https://builds.apache.org/job/maven-box/job/maven-resolver/job/master/80/

Changes:

* Bump maven-bundle-plugin from 3.5.0 to 4.2.1

All tests passed

Build log:
[...truncated 30838 lines...]
[INFO] Downloaded from central: https://repo.maven.apache.org/maven2/org/ow2/asm/asm-analysis/6.1.1/asm-analysis-6.1.1.jar (32 kB at 941 kB/s)
[INFO] Downloading from central: https://repo.maven.apache.org/maven2/org/apache/maven/plugin-tools/maven-plugin-tools-java/3.5.2/maven-plugin-tools-java-3.5.2.jar
[INFO] Downloading from central: https://repo.maven.apache.org/maven2/com/thoughtworks/qdox/qdox/2.0-M5/qdox-2.0-M5.jar
[INFO] Downloaded from central: https://repo.maven.apache.org/maven2/org/ow2/asm/asm-commons/6.1.1/asm-commons-6.1.1.jar (78 kB at 1.8 MB/s)
[INFO] Downloaded from central: https://repo.maven.apache.org/maven2/org/apache/maven/plugin-tools/maven-plugin-tools-generators/3.5.2/maven-plugin-tools-generators-3.5.2.jar (48 kB at 1.1 MB/s)
[INFO] Downloading from central: https://repo.maven.apache.org/maven2/org/apache/maven/plugin-tools/maven-plugin-tools-annotations/3.5.2/maven-plugin-tools-annotations-3.5.2.jar
[INFO] Downloading from central: https://repo.maven.apache.org/maven2/org/codehaus/plexus/plexus-archiver/3.4.1/plexus-archiver-3.4.1.jar
[INFO] Downloaded from central: https://repo.maven.apache.org/maven2/net/sf/jtidy/jtidy/r938/jtidy-r938.jar (250 kB at 4.0 MB/s)
[INFO] Downloading from central: https://repo.maven.apache.org/maven2/org/apache/maven/doxia/doxia-core/1.4/doxia-core-1.4.jar
[INFO] Downloaded from central: https://repo.maven.apache.org/maven2/org/apache/maven/plugin-tools/maven-plugin-tools-java/3.5.2/maven-plugin-tools-java-3.5.2.jar (18 kB at 259 kB/s)
[INFO] Downloading from central: https://repo.maven.apache.org/maven2/javax/servlet/servlet-api/2.3/servlet-api-2.3.jar
[INFO] Downloaded from central: https://repo.maven.apache.org/maven2/org/apache/maven/plugin-tools/maven-plugin-tools-annotations/3.5.2/maven-plugin-tools-annotations-3.5.2.jar (43 kB at 307 kB/s)
[INFO] Downloading from central: https://repo.maven.apache.org/maven2/org/codehaus/plexus/plexus-utils/3.0.20/plexus-utils-3.0.20.jar
[INFO] Downloaded from central: https://repo.maven.apache.org/maven2/org/codehaus/plexus/plexus-archiver/3.4.1/plexus-archiver-3.4.1.jar (187 kB at 1.2 MB/s)
[INFO] Downloading from central: https://repo.maven.apache.org/maven2/org/apache/maven/surefire/maven-surefire-common/2.19.1/maven-surefire-common-2.19.1.jar
[INFO] Downloaded from central: https://repo.maven.apache.org/maven2/javax/servlet/servlet-api/2.3/servlet-api-2.3.jar (78 kB at 282 kB/s)
[INFO] Downloaded from central: https://repo.maven.apache.org/maven2/com/thoughtworks/qdox/qdox/2.0-M5/qdox-2.0-M5.jar (313 kB at 1.1 MB/s)
[INFO] Downloading from central: https://repo.maven.apache.org/maven2/org/apache/maven/surefire/surefire-api/2.19.1/surefire-api-2.19.1.jar
[INFO] Downloading from central: https://repo.maven.apache.org/maven2/org/apache/maven/surefire/surefire-booter/2.19.1/surefire-booter-2.19.1.jar
[INFO] Downloaded from central: https://repo.maven.apache.org/maven2/org/apache/maven/surefire/maven-surefire-common/2.19.1/maven-surefire-common-2.19.1.jar (293 kB at 1.0 MB/s)
[INFO] Downloading from central: https://repo.maven.apache.org/maven2/org/apache/commons/commons-lang3/3.1/commons-lang3-3.1.jar
[INFO] Downloaded from central: https://repo.maven.apache.org/maven2/org/apache/maven/doxia/doxia-core/1.4/doxia-core-1.4.jar (165 kB at 551 kB/s)
[INFO] Downloaded from central: https://repo.maven.apache.org/maven2/org/codehaus/plexus/plexus-utils/3.0.20/plexus-utils-3.0.20.jar (243 kB at 795 kB/s)
[INFO] Downloaded from central: https://repo.maven.apache.org/maven2/org/apache/maven/surefire/surefire-booter/2.19.1/surefire-booter-2.19.1.jar (46 kB at 146 kB/s)
[INFO] Downloaded from central: https://repo.maven.apache.org/maven2/org/apache/maven/surefire/surefire-api/2.19.1/surefire-api-2.19.1.jar (196 kB at 626 kB/s)
[INFO] Downloaded from central: https://repo.maven.apache.org/maven2/org/apache/commons/commons-lang3/3.1/commons-lang3-3.1.jar (316 kB at 951 kB/s)
[withMaven] Publishers: Pipeline Graph Publisher: 4 ms, Invoker Publisher: 9647 ms, Junit Publisher: 3465 ms, Concordion Publisher: 1 ms, Dependencies Fingerprint Publisher: 409 ms
[Pipeline] // withMaven
[Pipeline] cleanWs
[WS-CLEANUP] Deleting project workspace...
[WS-CLEANUP] Deferred wipeout is used...
[WS-CLEANUP] done
[Pipeline] }
[Pipeline] // stage
[Pipeline] }
[Pipeline] // node
[Pipeline] }
[ERROR]

Artifact Ids of the format maven-___-plugin are reserved for
plugins in the Group Id org.apache.maven.plugins
Please change your artifactId to the format ___-maven-plugin
In the future this error will break the build.


[INFO] Using 'UTF-8' encoding to read mojo source files.
[INFO] java-javadoc mojo extractor found 0 mojo descriptor.
[INFO] java-annotations mojo extractor found 1 mojo descriptor.
[INFO]
[INFO] --- maven-resources-plugin:3.1.0:testResources (default-testResources) @ maven-resolver-demo-maven-plugin ---
[INFO] Using 'UTF-8' encoding to copy filtered resources.
[INFO] skip non existing resourceDirectory F:\jenkins\jenkins-slave\workspace\maven-box_maven-resolver_master@2\m\maven-resolver-demos\maven-resolver-demo-maven-plugin\src\test\resources
[INFO] Copying 3 resources
[INFO]
[INFO] --- maven-compiler-plugin:3.8.1:testCompile (default-testCompile) @ maven-resolver-demo-maven-plugin ---
[INFO] No sources to compile
[INFO]
[INFO] --- maven-surefire-plugin:2.22.0:test (default-test) @ maven-resolver-demo-maven-plugin ---
[INFO]
[INFO] --- maven-jar-plugin:3.2.0:jar (default-jar) @ maven-resolver-demo-maven-plugin ---
[INFO] Building jar: F:\jenkins\jenkins-slave\workspace\maven-box_maven-resolver_master@2\m\maven-resolver-demos\maven-resolver-demo-maven-plugin\target\maven-resolver-demo-maven-plugin-1.4.3-SNAPSHOT.jar
[INFO]
[INFO] --- maven-plugin-plugin:3.5.2:addPluginArtifactMetadata (default-addPluginArtifactMetadata) @ maven-resolver-demo-maven-plugin ---
[INFO]
[INFO] --- maven-site-plugin:3.7.1:attach-descriptor (attach-descriptor) @ maven-resolver-demo-maven-plugin ---
[INFO] Skipping because packaging 'maven-plugin' is not pom.
[INFO]
[INFO] --- maven-invoker-plugin:3.2.1:install (integration-test) @ maven-resolver-demo-maven-plugin ---
[INFO] Downloading from central: https://repo.maven.apache.org/maven2/org/apache/maven/shared/maven-invoker/3.0.1/maven-invoker-3.0.1.pom
[INFO] Downloaded from central: https://repo.maven.apache.org/maven2/org/apache/maven/shared/maven-invoker/3.0.1/maven-invoker-3.0.1.pom (4.9 kB at 174 kB/s)
[INFO] Downloading from central: https://repo.maven.apache.org/maven2/org/apache/maven/shared/maven-shared-components/31/maven-shared-components-31.pom
[INFO] Downloaded from central: https://repo.maven.apache.org/maven2/org/apache/maven/shared/maven-shared-components/31/maven-shared-components-31.pom (5.1 kB at 243 kB/s)
[INFO] Downloading from central: https://repo.maven.apache.org/maven2/org/apache/maven/reporting/maven-reporting-impl/2.4/maven-reporting-impl-2.4.pom
[INFO] Downloaded from central: https://repo.maven.apache.org/maven2/org/apache/maven/reporting/maven-reporting-impl/2.4/maven-reporting-impl-2.4.pom (6.1 kB at 303 kB/s)
[INFO] Downloading from central: https://repo.maven.apache.org/maven2/commons-validator/commons-validator/1.4.1/commons-validator-1.4.1.pom
[INFO] Downloaded from central: https://repo.maven.apache.org/maven2/commons-validator/commons-validator/1.4.1/commons-validator-1.4.1.pom (13 kB at 453 kB/s)
[INFO] Downloading from central: https://repo.maven.apache.org/maven2/org/apache/commons/commons-parent/36/commons-parent-36.pom
[INFO] Downloaded from central: https://repo.maven.apache.org/maven2/org/apache/commons/commons-parent/36/commons-parent-36.pom (58 kB at 2.3 MB/s)
[INFO] Downloading from central: https://repo.maven.apache.org/maven2/commons-beanutils/commons-beanutils/1.8.3/commons-beanutils-1.8.3.pom
[INFO] Downloaded from central: https://repo.maven.apache.org/maven2/commons-beanutils/commons-beanutils/1.8.3/commons-beanutils-1.8.3.pom (11 kB at 659 kB/s)
[INFO] Downloading from central: https://repo.maven.apache.org/maven2/org/apache/commons/commons-parent/14/commons-parent-14.pom
[INFO] Downloaded from central: https://repo.maven.apache.org/maven2/org/apache/commons/commons-parent/14/commons-parent-14.pom (31 kB at 1.0 MB/s)
[INFO] Downloading from central: https://repo.maven.apache.org/maven2/commons-digester/commons-digester/1.8.1/commons-digester-1.8.1.pom
[INFO] Downloaded from central: https://repo.maven.apache.org/maven2/commons-digester/commons-digester/1.8.1/commons-digester-1.8.1.pom (10 kB at 418 kB/s)
[INFO] Downloading from central: https://repo.maven.apache.org/maven2/org/apache/maven/shared/maven-script-interpreter/1.2/maven-script-interpreter-1.2.pom
[INFO] Downloaded from central: https://repo.maven.apache.org/maven2/org/apache/maven/shared/maven-script-interpreter/1.2/maven-script-interpreter-1.2.pom (4.0 kB at 148 kB/s)
[INFO] Downloading from central: https://repo.maven.apache.org/maven2/org/apache/maven/maven-plugin-api/2.0.6/maven-plugin-api-2.0.6.pom
[INFO] Downloaded from central: https://repo.maven.apache.org/maven2/org/apache/maven/maven-plugin-api/2.0.6/maven-plugin-api-2.0.6.pom (1.5 kB at 81 kB/s)
[INFO] Downloading from central: https://repo.maven.apache.org/maven2/org/apache/maven/maven/2.0.6/maven-2.0.6.pom
[INFO] Downloaded from central: https://repo.maven.apache.org/maven2/org/apache/maven/maven/2.0.6/maven-2.0.6.pom (9.0 kB at 503 kB/s)
[INFO] Downloading from central: https://repo.maven.apache.org/maven2/org/apache/maven/maven-parent/5/maven-parent-5.pom
[INFO] Downloaded from central: https://repo.maven.apache.org/maven2/org/apache/maven/maven-parent/5/maven-parent-5.pom (15 kB at 846 kB/s)
[INFO] Downloading from central: https://repo.maven.apache.org/maven2/org/apache/ant/ant/1.8.1/ant-1.8.1.pom
[INFO] Downloaded from central: https://repo.maven.apache.org/maven2/org/apache/ant/ant/1.8.1/ant-1.8.1.pom (8.8 kB at 352 kB/s)
[INFO] Downloading from central: https://repo.maven.apache.org/maven2/org/apache/ant/ant-parent/1.8.1/ant-parent-1.8.1.pom
[INFO] Downloaded from central: https://repo.maven.apache.org/maven2/org/apache/ant/ant-parent/1.8.1/ant-parent-1.8.1.pom (4.3 kB at 214 kB/s)
[INFO] Downloading from central: https://repo.maven.apache.org/maven2/org/apache/maven/shared/maven-artifact-transfer/0.11.0/maven-artifact-transfer-0.11.0.pom
[INFO] Downloaded from central: https://repo.maven.apache.org/maven2/org/apache/maven/shared/maven-artifact-transfer/0.11.0/maven-artifact-transfer-0.11.0.pom (11 kB at 636 kB/s)
[INFO] Downloading from central: https://repo.maven.apache.org/maven2/org/apache/maven/shared/maven-common-artifact-filters/3.0.1/maven-common-artifact-filters-3.0.1.pom
[INFO] Downloaded from central: https://repo.maven.apache.org/maven2/org/apache/maven/shared/maven-common-artifact-filters/3.0.1/maven-common-artifact-filters-3.0.1.pom (4.8 kB at 210 kB/s)
[INFO] Downloading from central: https://repo.maven.apache.org/maven2/org/codehaus/plexus/plexus-utils/3.1.1/plexus-utils-3.1.1.pom
[INFO] Downloaded from central: https://repo.maven.apache.org/maven2/org/codehaus/plexus/plexus-utils/3.1.1/plexus-utils-3.1.1.pom (5.1 kB at 230 kB/s)
[INFO] Downloading from central: https://repo.maven.apache.org/maven2/org/slf4j/slf4j-api/1.7.5/slf4j-api-1.7.5.pom
[INFO] Downloaded from central: https://repo.maven.apache.org/maven2/org/slf4j/slf4j-api/1.7.5/slf4j-api-1.7.5.pom (2.7 kB at 168 kB/s)
[INFO] Downloading from central: https://repo.maven.apache.org/maven2/org/slf4j/slf4j-parent/1.7.5/slf4j-parent-1.7.5.pom
[INFO] Downloaded from central: https://repo.maven.apache.org/maven2/org/slf4j/slf4j-parent/1.7.5/slf4j-parent-1.7.5.pom (12 kB at 656 kB/s)
[INFO] Downloading from central: https://repo.maven.apache.org/maven2/org/apache/maven/doxia/doxia-sink-api/1.7/doxia-sink-api-1.7.pom
[INFO] Downloaded from central: https://repo.maven.apache.org/maven2/org/apache/maven/doxia/doxia-sink-api/1.7/doxia-sink-api-1.7.pom (1.5 kB at 67 kB/s)
[INFO] Downloading from central: https://repo.maven.apache.org/maven2/org/apache/maven/doxia/doxia/1.7/doxia-1.7.pom
[INFO] Downloaded from central: https://repo.maven.apache.org/maven2/org/apache/maven/doxia/doxia/1.7/doxia-1.7.pom (15 kB at 693 kB/s)
[INFO] Downloading from central: https://repo.maven.apache.org/maven2/org/apache/maven/doxia/doxia-logging-api/1.7/doxia-logging-api-1.7.pom
[INFO] Downloaded from central: https://repo.maven.apache.org/maven2/org/apache/maven/doxia/doxia-logging-api/1.7/doxia-logging-api-1.7.pom (1.5 kB at 96 kB/s)
[INFO] Downloading from central: https://repo.maven.apache.org/maven2/org/apache/maven/doxia/doxia-site-renderer/1.7.4/doxia-site-renderer-1.7.4.pom
[INFO] Downloaded from central: https://repo.maven.apache.org/maven2/org/apache/maven/doxia/doxia-site-renderer/1.7.4/doxia-site-renderer-1.7.4.pom (6.7 kB at 304 kB/s)
[INFO] Downloading from central: https://repo.maven.apache.org/maven2/org/apache/maven/doxia/doxia-sitetools/1.7.4/doxia-sitetools-1.7.4.pom
[INFO] Downloaded from central: https://repo.maven.apache.org/maven2/org/apache/maven/doxia/doxia-sitetools/1.7.4/doxia-sitetools-1.7.4.pom (14 kB at 604 kB/s)
[INFO] Downloading from central: https://repo.maven.apache.org/maven2/org/apache/maven/doxia/doxia-core/1.7/doxia-core-1.7.pom
[INFO] Downloaded from central: https://repo.maven.apache.org/maven2/org/apache/maven/doxia/doxia-core/1.7/doxia-core-1.7.pom (4.1 kB at 150 kB/s)
[INFO] Downloading from central: https://repo.maven.apache.org/maven2/org/apache/maven/doxia/doxia-decoration-model/1.7.4/doxia-decoration-model-1.7.4.pom
[INFO] Downloaded from central: https://repo.maven.apache.org/maven2/org/apache/maven/doxia/doxia-decoration-model/1.7.4/doxia-decoration-model-1.7.4.pom (3.4 kB at 170 kB/s)
[INFO] Downloading from central: https://repo.maven.apache.org/maven2/org/apache/maven/doxia/doxia-skin-model/1.7.4/doxia-skin-model-1.7.4.pom
[INFO] Downloaded from central: https://repo.maven.apache.org/maven2/org/apache/maven/doxia/doxia-skin-model/1.7.4/doxia-skin-model-1.7.4.pom (3.0 kB at 159 kB/s)
[INFO] Downloading from central: https://repo.maven.apache.org/maven2/org/apache/maven/doxia/doxia-module-xhtml/1.7/doxia-module-xhtml-1.7.pom
[INFO] Downloaded from central: https://repo.maven.apache.org/maven2/org/apache/maven/doxia/doxia-module-xhtml/1.7/doxia-module-xhtml-1.7.pom (1.6 kB at 68 kB/s)
[INFO] Downloading from central: https://repo.maven.apache.org/maven2/org/apache/maven/doxia/doxia-modules/1.7/doxia-modules-1.7.pom
[INFO] Downloaded from central: https://repo.maven.apache.org/maven2/org/apache/maven/doxia/doxia-modules/1.7/doxia-modules-1.7.pom (2.6 kB at 138 kB/s)
[INFO] Downloading from central: https://repo.maven.apache.org/maven2/org/codehaus/groovy/groovy-all/2.4.8/groovy-all-2.4.8.pom
[INFO] Downloaded from central: https://repo.maven.apache.org/maven2/org/codehaus/groovy/groovy-all/2.4.8/groovy-all-2.4.8.pom (21 kB at 1.1 MB/s)
[INFO] Downloading from central: https://repo.maven.apache.org/maven2/org/codehaus/plexus/plexus-interpolation/1.26/plexus-interpolation-1.26.pom
[INFO] Downloaded from central: https://repo.maven.apache.org/maven2/org/codehaus/plexus/plexus-interpolation/1.26/plexus-interpolation-1.26.pom (2.7 kB at 156 kB/s)
[INFO] Downloading from central: https://repo.maven.apache.org/maven2/org/apache/maven/shared/maven-invoker/3.0.1/maven-invoker-3.0.1.jar
[INFO] Downloading from central: https://repo.maven.apache.org/maven2/commons-digester/commons-digester/1.8.1/commons-digester-1.8.1.jar
[INFO] Downloading from central: https://repo.maven.apache.org/maven2/commons-beanutils/commons-beanutils/1.8.3/commons-beanutils-1.8.3.jar
[INFO] Downloading from central: https://repo.maven.apache.org/maven2/commons-validator/commons-validator/1.4.1/commons-validator-1.4.1.jar
[INFO] Downloading from central: https://repo.maven.apache.org/maven2/org/apache/maven/reporting/maven-reporting-impl/2.4/maven-reporting-impl-2.4.jar
[INFO] Downloaded from central: https://repo.maven.apache.org/maven2/org/apache/maven/shared/maven-invoker/3.0.1/maven-invoker-3.0.1.jar (33 kB at 1.7 MB/s)
[INFO] Downloading from central: https://repo.maven.apache.org/maven2/commons-logging/commons-logging/1.2/commons-logging-1.2.jar
[INFO] Downloaded from central: https://repo.maven.apache.org/maven2/commons-digester/commons-digester/1.8.1/commons-digester-1.8.1.jar (146 kB at 5.6 MB/s)
[INFO] Downloading from central: https://repo.maven.apache.org/maven2/org/apache/maven/shared/maven-script-interpreter/1.2/maven-script-interpreter-1.2.jar
[INFO] Downloaded from central: https://repo.maven.apache.org/maven2/commons-beanutils/commons-beanutils/1.8.3/commons-beanutils-1.8.3.jar (232 kB at 7.7 MB/s)
[INFO] Downloading from central: https://repo.maven.apache.org/maven2/org/apache/ant/ant/1.8.1/ant-1.8.1.jar
[INFO] Downloaded from central: https://repo.maven.apache.org/maven2/commons-validator/commons-validator/1.4.1/commons-validator-1.4.1.jar (190 kB at 5.9 MB/s)
[INFO] Downloading from central: https://repo.maven.apache.org/maven2/org/apache/maven/shared/maven-artifact-transfer/0.11.0/maven-artifact-transfer-0.11.0.jar
[INFO] Downloaded from central: https://repo.maven.apache.org/maven2/org/apache/maven/reporting/maven-reporting-impl/2.4/maven-reporting-impl-2.4.jar (20 kB at 569 kB/s)
[INFO] Downloading from central: https://repo.maven.apache.org/maven2/org/apache/maven/shared/maven-common-artifact-filters/3.0.1/maven-common-artifact-filters-3.0.1.jar
[INFO] Downloaded from central: https://repo.maven.apache.org/maven2/commons-logging/commons-logging/1.2/commons-logging-1.2.jar (62 kB at 1.4 MB/s)
[INFO] Downloading from central: https://repo.maven.apache.org/maven2/org/slf4j/slf4j-api/1.7.5/slf4j-api-1.7.5.jar
[INFO] Downloaded from central: https://repo.maven.apache.org/maven2/org/apache/maven/shared/maven-script-interpreter/1.2/maven-script-interpreter-1.2.jar (22 kB at 394 kB/s)
[INFO] Downloading from central: https://repo.maven.apache.org/maven2/org/apache/maven/doxia/doxia-sink-api/1.7/doxia-sink-api-1.7.jar
[INFO] Downloaded from central: https://repo.maven.apache.org/maven2/org/apache/maven/shared/maven-artifact-transfer/0.11.0/maven-artifact-transfer-0.11.0.jar (128 kB at 2.0 MB/s)
[INFO] Downloading from central: https://repo.maven.apache.org/maven2/org/apache/maven/doxia/doxia-logging-api/1.7/doxia-logging-api-1.7.jar
[INFO] Downloaded from central: https://repo.maven.apache.org/maven2/org/apache/maven/shared/maven-common-artifact-filters/3.0.1/maven-common-artifact-filters-3.0.1.jar (61 kB at 891 kB/s)
[INFO] Downloading from central: https://repo.maven.apache.org/maven2/org/apache/maven/doxia/doxia-site-renderer/1.7.4/doxia-site-renderer-1.7.4.jar
[INFO] Downloaded from central: https://repo.maven.apache.org/maven2/org/slf4j/slf4j-api/1.7.5/slf4j-api-1.7.5.jar (26 kB at 352 kB/s)
[INFO] Downloading from central: https://repo.maven.apache.org/maven2/org/apache/maven/doxia/doxia-decoration-model/1.7.4/doxia-decoration-model-1.7.4.jar
[INFO] Downloaded from central: https://repo.maven.apache.org/maven2/org/apache/maven/doxia/doxia-sink-api/1.7/doxia-sink-api-1.7.jar (11 kB at 131 kB/s)
[INFO] Downloaded from central: https://repo.maven.apache.org/maven2/org/apache/maven/doxia/doxia-logging-api/1.7/doxia-logging-api-1.7.jar (12 kB at 131 kB/s)
[INFO] Downloading from central: https://repo.maven.apache.org/maven2/org/apache/maven/doxia/doxia-skin-model/1.7.4/doxia-skin-model-1.7.4.jar
[INFO] Downloading from central: https://repo.maven.apache.org/maven2/org/apache/maven/doxia/doxia-module-xhtml/1.7/doxia-module-xhtml-1.7.jar
[INFO] Downloaded from central: https://repo.maven.apache.org/maven2/org/apache/ant/ant/1.8.1/ant-1.8.1.jar (1.5 MB at 15 MB/s)
[INFO] Downloading from central: https://repo.maven.apache.org/maven2/org/codehaus/groovy/groovy-all/2.4.8/groovy-all-2.4.8.jar
[INFO] Downloaded from central: https://repo.maven.apache.org/maven2/org/apache/maven/doxia/doxia-decoration-model/1.7.4/doxia-decoration-model-1.7.4.jar (61 kB at 600 kB/s)
[INFO] Downloaded from central: https://repo.maven.apache.org/maven2/org/apache/maven/doxia/doxia-site-renderer/1.7.4/doxia-site-renderer-1.7.4.jar (64 kB at 627 kB/s)
[INFO] Downloading from central: https://repo.maven.apache.org/maven2/org/codehaus/plexus/plexus-interpolation/1.26/plexus-interpolation-1.26.jar
[INFO] Downloaded from central: https://repo.maven.apache.org/maven2/org/apache/maven/doxia/doxia-module-xhtml/1.7/doxia-module-xhtml-1.7.jar (17 kB at 143 kB/s)
[INFO] Downloaded from central: https://repo.maven.apache.org/maven2/org/apache/maven/doxia/doxia-skin-model/1.7.4/doxia-skin-model-1.7.4.jar (16 kB at 127 kB/s)
[INFO] Downloaded from central: https://repo.maven.apache.org/maven2/org/codehaus/plexus/plexus-interpolation/1.26/plexus-interpolation-1.26.jar (85 kB at 632 kB/s)
[INFO] Downloaded from central: https://repo.maven.apache.org/maven2/org/codehaus/groovy/groovy-all/2.4.8/groovy-all-2.4.8.jar (7.0 MB at 3.9 MB/s)
[INFO] Installing F:\jenkins\jenkins-slave\workspace\maven-box_maven-resolver_master@2\m\maven-resolver-api\pom.xml to F:\jenkins\jenkins-slave\workspace\maven-box_maven-resolver_master@2\m\maven-resolver-demos\maven-resolver-demo-maven-plugin\target\local-repo\org\apache\maven\resolver\maven-resolver-api\1.4.3-SNAPSHOT\maven-resolver-api-1.4.3-SNAPSHOT.pom
[INFO] Installing F:\jenkins\jenkins-slave\workspace\maven-box_maven-resolver_master@2\m\maven-resolver-api\target\maven-resolver-api-1.4.3-SNAPSHOT.jar to F:\jenkins\jenkins-slave\workspace\maven-box_maven-resolver_master@2\m\maven-resolver-demos\maven-resolver-demo-maven-plugin\target\local-repo\org\apache\maven\resolver\maven-resolver-api\1.4.3-SNAPSHOT\maven-resolver-api-1.4.3-SNAPSHOT.jar
[INFO] Installing f:\jenkins\jenkins-slave\workspace\maven-box_maven-resolver_master@2\m\pom.xml to F:\jenkins\jenkins-slave\workspace\maven-box_maven-resolver_master@2\m\maven-resolver-demos\maven-resolver-demo-maven-plugin\target\local-repo\org\apache\maven\resolver\maven-resolver\1.4.3-SNAPSHOT\maven-resolver-1.4.3-SNAPSHOT.pom
[INFO] Installing F:\jenkins\jenkins-slave\workspace\maven-box_maven-resolver_master@2\m\maven-resolver-demos\pom.xml to F:\jenkins\jenkins-slave\workspace\maven-box_maven-resolver_master@2\m\maven-resolver-demos\maven-resolver-demo-maven-plugin\target\local-repo\org\apache\maven\resolver\maven-resolver-demos\1.4.3-SNAPSHOT\maven-resolver-demos-1.4.3-SNAPSHOT.pom
[INFO] Installing F:\jenkins\jenkins-slave\workspace\maven-box_maven-resolver_master@2\m\maven-resolver-demos\maven-resolver-demo-maven-plugin\pom.xml to F:\jenkins\jenkins-slave\workspace\maven-box_maven-resolver_master@2\m\maven-resolver-demos\maven-resolver-demo-maven-plugin\target\local-repo\org\apache\maven\resolver\maven-resolver-demo-maven-plugin\1.4.3-SNAPSHOT\maven-resolver-demo-maven-plugin-1.4.3-SNAPSHOT.pom
[INFO] Installing F:\jenkins\jenkins-slave\workspace\maven-box_maven-resolver_master@2\m\maven-resolver-demos\maven-resolver-demo-maven-plugin\target\maven-resolver-demo-maven-plugin-1.4.3-SNAPSHOT.jar to F:\jenkins\jenkins-slave\workspace\maven-box_maven-resolver_master@2\m\maven-resolver-demos\maven-resolver-demo-maven-plugin\target\local-repo\org\apache\maven\resolver\maven-resolver-demo-maven-plugin\1.4.3-SNAPSHOT\maven-resolver-demo-maven-plugin-1.4.3-SNAPSHOT.jar
[INFO]
[INFO] --- maven-invoker-plugin:3.2.1:run (integration-test) @ maven-resolver-demo-maven-plugin ---
[INFO] Building: resolve-artifact\pom.xml
[INFO]           resolve-artifact\pom.xml ......................... SUCCESS (4.3 s)
[INFO] -------------------------------------------------
[INFO] Build Summary:
[INFO]   Passed: 1, Failed: 0, Errors: 0, Skipped: 0
[INFO] -------------------------------------------------
[INFO]
[INFO] --- maven-checkstyle-plugin:3.0.0:check (checkstyle-check) @ maven-resolver-demo-maven-plugin ---
[INFO] ------------------------------------------------------------------------
[INFO] Reactor Summary for Maven Artifact Resolver 1.4.3-SNAPSHOT:
[INFO]
[INFO] Maven Artifact Resolver ............................ SUCCESS [ 42.619 s]
[INFO] Maven Artifact Resolver API ........................ SUCCESS [ 23.742 s]
[INFO] Maven Artifact Resolver SPI ........................ SUCCESS [  4.695 s]
[INFO] Maven Artifact Resolver Test Utilities ............. SUCCESS [  3.452 s]
[INFO] Maven Artifact Resolver Utilities .................. SUCCESS [  9.060 s]
[INFO] Maven Artifact Resolver Implementation ............. SUCCESS [ 23.324 s]
[INFO] Maven Artifact Resolver Connector Basic ............ SUCCESS [  8.140 s]
[INFO] Maven Artifact Resolver Transport Classpath ........ SUCCESS [  2.481 s]
[INFO] Maven Artifact Resolver Transport File ............. SUCCESS [  2.644 s]
[INFO] Maven Artifact Resolver Transport HTTP ............. SUCCESS [  9.969 s]
[INFO] Maven Artifact Resolver Transport Wagon ............ SUCCESS [  5.190 s]
[INFO] Maven Artifact Resolver Demos ...................... SUCCESS [  0.321 s]
[INFO] Maven Artifact Resolver Demo Snippets .............. SUCCESS [  3.017 s]
[INFO] Maven Artifact Resolver Demo Maven Plugin .......... SUCCESS [ 13.968 s]
[INFO] ------------------------------------------------------------------------
[INFO] BUILD SUCCESS
[INFO] ------------------------------------------------------------------------
[INFO] Total time:  02:34 min
[INFO] Finished at: 2020-06-17T15:36:11-07:00
[INFO] ------------------------------------------------------------------------
[INFO] [jenkins-event-spy] Generated F:\jenkins\jenkins-slave\workspace\maven-box_maven-resolver_master@2@tmp\withMavenb1bf549f\maven-spy-20200617-153336-6607049853159424943376.log
[Pipeline] }
[Pipeline] // dir
[Pipeline] }
[withMaven] invokerPublisher - Archive invoker results for Maven artifact MavenArtifact{org.apache.maven.resolver:maven-resolver-demo-maven-plugin:maven-plugin:1.4.3-SNAPSHOT(version: 1.4.3-SNAPSHOT, snapshot:false) } generated by PluginInvocation{org.apache.maven.plugins:maven-invoker-plugin:3.2.1@run  integration-test}: m\maven-resolver-demos\maven-resolver-demo-maven-plugin\target\invoker-reports\*.xml
[withMaven] junitPublisher - Archive test results for Maven artifact org.apache.maven.resolver:maven-resolver-api:jar:1.4.3-SNAPSHOT generated by maven-surefire-plugin:test (default-test): m\maven-resolver-api\target\surefire-reports\*.xml
[withMaven] junitPublisher - Archive test results for Maven artifact org.apache.maven.resolver:maven-resolver-spi:jar:1.4.3-SNAPSHOT generated by maven-surefire-plugin:test (default-test): m\maven-resolver-spi\target\surefire-reports\*.xml
[withMaven] junitPublisher - Archive test results for Maven artifact org.apache.maven.resolver:maven-resolver-test-util:jar:1.4.3-SNAPSHOT generated by maven-surefire-plugin:test (default-test): m\maven-resolver-test-util\target\surefire-reports\*.xml
[withMaven] junitPublisher - Archive test results for Maven artifact org.apache.maven.resolver:maven-resolver-util:jar:1.4.3-SNAPSHOT generated by maven-surefire-plugin:test (default-test): m\maven-resolver-util\target\surefire-reports\*.xml
[withMaven] junitPublisher - Archive test results for Maven artifact org.apache.maven.resolver:maven-resolver-impl:jar:1.4.3-SNAPSHOT generated by maven-surefire-plugin:test (default-test): m\maven-resolver-impl\target\surefire-reports\*.xml
[withMaven] junitPublisher - Archive test results for Maven artifact org.apache.maven.resolver:maven-resolver-connector-basic:jar:1.4.3-SNAPSHOT generated by maven-surefire-plugin:test (default-test): m\maven-resolver-connector-basic\target\surefire-reports\*.xml
[withMaven] junitPublisher - Archive test results for Maven artifact org.apache.maven.resolver:maven-resolver-transport-classpath:jar:1.4.3-SNAPSHOT generated by maven-surefire-plugin:test (default-test): m\maven-resolver-transport-classpath\target\surefire-reports\*.xml
[withMaven] junitPublisher - Archive test results for Maven artifact org.apache.maven.resolver:maven-resolver-transport-file:jar:1.4.3-SNAPSHOT generated by maven-surefire-plugin:test (default-test): m\maven-resolver-transport-file\target\surefire-reports\*.xml
[withMaven] junitPublisher - Archive test results for Maven artifact org.apache.maven.resolver:maven-resolver-transport-http:jar:1.4.3-SNAPSHOT generated by maven-surefire-plugin:test (default-test): m\maven-resolver-transport-http\target\surefire-reports\*.xml
[withMaven] junitPublisher - Archive test results for Maven artifact org.apache.maven.resolver:maven-resolver-transport-wagon:jar:1.4.3-SNAPSHOT generated by maven-surefire-plugin:test (default-test): m\maven-resolver-transport-wagon\target\surefire-reports\*.xml
[withMaven] junitPublisher - Archive test results for Maven artifact org.apache.maven.resolver:maven-resolver-demo-snippets:jar:1.4.3-SNAPSHOT generated by maven-surefire-plugin:test (default-test): m\maven-resolver-demos\maven-resolver-demo-snippets\target\surefire-reports\*.xml
[withMaven] junitPublisher - Archive test results for Maven artifact org.apache.maven.resolver:maven-resolver-demo-maven-plugin:maven-plugin:1.4.3-SNAPSHOT generated by maven-surefire-plugin:test (default-test): m\maven-resolver-demos\maven-resolver-demo-maven-plugin\target\surefire-reports\*.xml
Recording test results
[withMaven] Publishers: Pipeline Graph Publisher: 4 ms, Invoker Publisher: 679 ms, Junit Publisher: 3674 ms, Concordion Publisher: 1 ms, Dependencies Fingerprint Publisher: 431 ms
[Pipeline] // withMaven
[Pipeline] cleanWs
[WS-CLEANUP] Deleting project workspace...
[WS-CLEANUP] Deferred wipeout is used...
[WS-CLEANUP] done
[Pipeline] }
[Pipeline] // stage
[Pipeline] }
[Pipeline] // node
[Pipeline] }
[Pipeline] // parallel
[Pipeline] echo
[FAILURE-003] AbortException hudson.AbortException: script returned exit code 1
[Pipeline] stage
[Pipeline] { (Notifications)
[Pipeline] echo
Build result: FAILURE
[Pipeline] jiraIssueSelector
[Pipeline] echo
The authors of changes [slachiewicz].
[Pipeline] echo
Sending email ...
[Pipeline] emailext
Reply | Threaded
Open this post in threaded view
|

Build failed in Jenkins: Maven TLP » maven-resolver » master #81

Apache Jenkins Server-2
See https://builds.apache.org/job/maven-box/job/maven-resolver/job/master/81/

Changes:

* Upgrade maven-bundle-plugin 4.1.0

All tests passed

Build log:
[...truncated 29976 lines...]
[INFO] Downloaded from central: https://repo.maven.apache.org/maven2/org/apache/commons/commons-lang3/3.1/commons-lang3-3.1.pom (17 kB at 983 kB/s)
[INFO] Downloading from central: https://repo.maven.apache.org/maven2/org/apache/commons/commons-parent/22/commons-parent-22.pom
[INFO] Downloaded from central: https://repo.maven.apache.org/maven2/org/apache/commons/commons-parent/22/commons-parent-22.pom (42 kB at 2.3 MB/s)
[INFO] Downloading from central: https://repo.maven.apache.org/maven2/org/apache/maven/plugin-tools/maven-plugin-tools-api/3.5.2/maven-plugin-tools-api-3.5.2.jar
[INFO] Downloading from central: https://repo.maven.apache.org/maven2/org/ow2/asm/asm-analysis/6.1.1/asm-analysis-6.1.1.jar
[INFO] Downloading from central: https://repo.maven.apache.org/maven2/org/ow2/asm/asm-tree/6.1.1/asm-tree-6.1.1.jar
[INFO] Downloading from central: https://repo.maven.apache.org/maven2/org/ow2/asm/asm-commons/6.1.1/asm-commons-6.1.1.jar
[INFO] Downloading from central: https://repo.maven.apache.org/maven2/org/apache/maven/plugin-tools/maven-plugin-tools-generators/3.5.2/maven-plugin-tools-generators-3.5.2.jar
[INFO] Downloaded from central: https://repo.maven.apache.org/maven2/org/ow2/asm/asm-analysis/6.1.1/asm-analysis-6.1.1.jar (32 kB at 2.0 MB/s)
[INFO] Downloading from central: https://repo.maven.apache.org/maven2/net/sf/jtidy/jtidy/r938/jtidy-r938.jar
[INFO] Downloaded from central: https://repo.maven.apache.org/maven2/org/apache/maven/plugin-tools/maven-plugin-tools-api/3.5.2/maven-plugin-tools-api-3.5.2.jar (24 kB at 1.4 MB/s)
[INFO] Downloading from central: https://repo.maven.apache.org/maven2/org/apache/maven/plugin-tools/maven-plugin-tools-java/3.5.2/maven-plugin-tools-java-3.5.2.jar
[INFO] Downloaded from central: https://repo.maven.apache.org/maven2/org/ow2/asm/asm-commons/6.1.1/asm-commons-6.1.1.jar (78 kB at 3.5 MB/s)
[INFO] Downloading from central: https://repo.maven.apache.org/maven2/com/thoughtworks/qdox/qdox/2.0-M5/qdox-2.0-M5.jar
[INFO] Downloaded from central: https://repo.maven.apache.org/maven2/org/ow2/asm/asm-tree/6.1.1/asm-tree-6.1.1.jar (50 kB at 2.3 MB/s)
[INFO] Downloading from central: https://repo.maven.apache.org/maven2/org/apache/maven/plugin-tools/maven-plugin-tools-annotations/3.5.2/maven-plugin-tools-annotations-3.5.2.jar
[INFO] Downloaded from central: https://repo.maven.apache.org/maven2/org/apache/maven/plugin-tools/maven-plugin-tools-generators/3.5.2/maven-plugin-tools-generators-3.5.2.jar (48 kB at 1.9 MB/s)
[INFO] Downloading from central: https://repo.maven.apache.org/maven2/org/codehaus/plexus/plexus-archiver/3.4.1/plexus-archiver-3.4.1.jar
[INFO] Downloaded from central: https://repo.maven.apache.org/maven2/org/apache/maven/plugin-tools/maven-plugin-tools-java/3.5.2/maven-plugin-tools-java-3.5.2.jar (18 kB at 549 kB/s)
[INFO] Downloading from central: https://repo.maven.apache.org/maven2/org/apache/maven/doxia/doxia-core/1.4/doxia-core-1.4.jar
[INFO] Downloaded from central: https://repo.maven.apache.org/maven2/org/apache/maven/plugin-tools/maven-plugin-tools-annotations/3.5.2/maven-plugin-tools-annotations-3.5.2.jar (43 kB at 978 kB/s)
[INFO] Downloaded from central: https://repo.maven.apache.org/maven2/net/sf/jtidy/jtidy/r938/jtidy-r938.jar (250 kB at 5.7 MB/s)
[INFO] Downloading from central: https://repo.maven.apache.org/maven2/javax/servlet/servlet-api/2.3/servlet-api-2.3.jar
[INFO] Downloaded from central: https://repo.maven.apache.org/maven2/org/codehaus/plexus/plexus-archiver/3.4.1/plexus-archiver-3.4.1.jar (187 kB at 4.0 MB/s)
[INFO] Downloading from central: https://repo.maven.apache.org/maven2/org/codehaus/plexus/plexus-utils/3.0.20/plexus-utils-3.0.20.jar
[INFO] Downloading from central: https://repo.maven.apache.org/maven2/org/apache/maven/surefire/maven-surefire-common/2.19.1/maven-surefire-common-2.19.1.jar
[INFO] Downloaded from central: https://repo.maven.apache.org/maven2/com/thoughtworks/qdox/qdox/2.0-M5/qdox-2.0-M5.jar (313 kB at 6.5 MB/s)
[INFO] Downloading from central: https://repo.maven.apache.org/maven2/org/apache/maven/surefire/surefire-api/2.19.1/surefire-api-2.19.1.jar
[INFO] Downloaded from central: https://repo.maven.apache.org/maven2/org/apache/maven/doxia/doxia-core/1.4/doxia-core-1.4.jar (165 kB at 2.8 MB/s)
[INFO] Downloading from central: https://repo.maven.apache.org/maven2/org/apache/maven/surefire/surefire-booter/2.19.1/surefire-booter-2.19.1.jar
[INFO] Downloaded from central: https://repo.maven.apache.org/maven2/org/apache/maven/surefire/surefire-api/2.19.1/surefire-api-2.19.1.jar (196 kB at 2.8 MB/s)
[INFO] Downloaded from central: https://repo.maven.apache.org/maven2/javax/servlet/servlet-api/2.3/servlet-api-2.3.jar (78 kB at 1.1 MB/s)
[INFO] Downloaded from central: https://repo.maven.apache.org/maven2/org/apache/maven/surefire/maven-surefire-common/2.19.1/maven-surefire-common-2.19.1.jar (293 kB at 4.0 MB/s)
[INFO] Downloading from central: https://repo.maven.apache.org/maven2/org/apache/commons/commons-lang3/3.1/commons-lang3-3.1.jar
[INFO] Downloaded from central: https://repo.maven.apache.org/maven2/org/codehaus/plexus/plexus-utils/3.0.20/plexus-utils-3.0.20.jar (243 kB at 3.3 MB/s)
[INFO] Downloaded from central: https://repo.maven.apache.org/maven2/org/apache/maven/surefire/surefire-booter/2.19.1/surefire-booter-2.19.1.jar (46 kB at 479 kB/s)
[INFO] Downloaded from central: https://repo.maven.apache.org/maven2/org/apache/commons/commons-lang3/3.1/commons-lang3-3.1.jar (316 kB at 3.0 MB/s)
[ERROR]

Artifact Ids of the format maven-___-plugin are reserved for
plugins in the Group Id org.apache.maven.plugins
Please change your artifactId to the format ___-maven-plugin
In the future this error will break the build.


[INFO] Using 'UTF-8' encoding to read mojo source files.
[INFO] java-javadoc mojo extractor found 0 mojo descriptor.
[INFO] java-annotations mojo extractor found 1 mojo descriptor.
[INFO]
[INFO] --- maven-resources-plugin:3.1.0:testResources (default-testResources) @ maven-resolver-demo-maven-plugin ---
[INFO] Using 'UTF-8' encoding to copy filtered resources.
[INFO] skip non existing resourceDirectory /home/jenkins/jenkins-slave/workspace/maven-box_maven-resolver_master/m/maven-resolver-demos/maven-resolver-demo-maven-plugin/src/test/resources
[INFO] Copying 3 resources
[INFO]
[INFO] --- maven-compiler-plugin:3.8.1:testCompile (default-testCompile) @ maven-resolver-demo-maven-plugin ---
[INFO] No sources to compile
[INFO]
[INFO] --- maven-surefire-plugin:2.22.0:test (default-test) @ maven-resolver-demo-maven-plugin ---
[INFO]
[INFO] --- maven-jar-plugin:3.2.0:jar (default-jar) @ maven-resolver-demo-maven-plugin ---
[INFO] Building jar: /home/jenkins/jenkins-slave/workspace/maven-box_maven-resolver_master/m/maven-resolver-demos/maven-resolver-demo-maven-plugin/target/maven-resolver-demo-maven-plugin-1.4.3-SNAPSHOT.jar
[INFO]
[INFO] --- maven-plugin-plugin:3.5.2:addPluginArtifactMetadata (default-addPluginArtifactMetadata) @ maven-resolver-demo-maven-plugin ---
[INFO]
[INFO] --- maven-site-plugin:3.7.1:attach-descriptor (attach-descriptor) @ maven-resolver-demo-maven-plugin ---
[INFO] Skipping because packaging 'maven-plugin' is not pom.
[INFO]
[INFO] --- maven-invoker-plugin:3.2.1:install (integration-test) @ maven-resolver-demo-maven-plugin ---
[INFO] Downloading from central: https://repo.maven.apache.org/maven2/org/apache/maven/shared/maven-invoker/3.0.1/maven-invoker-3.0.1.pom
[INFO] Downloaded from central: https://repo.maven.apache.org/maven2/org/apache/maven/shared/maven-invoker/3.0.1/maven-invoker-3.0.1.pom (4.9 kB at 286 kB/s)
[INFO] Downloading from central: https://repo.maven.apache.org/maven2/org/apache/maven/shared/maven-shared-components/31/maven-shared-components-31.pom
[INFO] Downloaded from central: https://repo.maven.apache.org/maven2/org/apache/maven/shared/maven-shared-components/31/maven-shared-components-31.pom (5.1 kB at 301 kB/s)
[INFO] Downloading from central: https://repo.maven.apache.org/maven2/org/apache/maven/reporting/maven-reporting-impl/2.4/maven-reporting-impl-2.4.pom
[INFO] Downloaded from central: https://repo.maven.apache.org/maven2/org/apache/maven/reporting/maven-reporting-impl/2.4/maven-reporting-impl-2.4.pom (6.1 kB at 356 kB/s)
[INFO] Downloading from central: https://repo.maven.apache.org/maven2/commons-validator/commons-validator/1.4.1/commons-validator-1.4.1.pom
[INFO] Downloaded from central: https://repo.maven.apache.org/maven2/commons-validator/commons-validator/1.4.1/commons-validator-1.4.1.pom (13 kB at 905 kB/s)
[INFO] Downloading from central: https://repo.maven.apache.org/maven2/org/apache/commons/commons-parent/36/commons-parent-36.pom
[INFO] Downloaded from central: https://repo.maven.apache.org/maven2/org/apache/commons/commons-parent/36/commons-parent-36.pom (58 kB at 3.4 MB/s)
[INFO] Downloading from central: https://repo.maven.apache.org/maven2/commons-beanutils/commons-beanutils/1.8.3/commons-beanutils-1.8.3.pom
[INFO] Downloaded from central: https://repo.maven.apache.org/maven2/commons-beanutils/commons-beanutils/1.8.3/commons-beanutils-1.8.3.pom (11 kB at 861 kB/s)
[INFO] Downloading from central: https://repo.maven.apache.org/maven2/org/apache/commons/commons-parent/14/commons-parent-14.pom
[INFO] Downloaded from central: https://repo.maven.apache.org/maven2/org/apache/commons/commons-parent/14/commons-parent-14.pom (31 kB at 2.2 MB/s)
[INFO] Downloading from central: https://repo.maven.apache.org/maven2/commons-digester/commons-digester/1.8.1/commons-digester-1.8.1.pom
[INFO] Downloaded from central: https://repo.maven.apache.org/maven2/commons-digester/commons-digester/1.8.1/commons-digester-1.8.1.pom (10 kB at 557 kB/s)
[INFO] Downloading from central: https://repo.maven.apache.org/maven2/org/apache/maven/shared/maven-script-interpreter/1.2/maven-script-interpreter-1.2.pom
[INFO] Downloaded from central: https://repo.maven.apache.org/maven2/org/apache/maven/shared/maven-script-interpreter/1.2/maven-script-interpreter-1.2.pom (4.0 kB at 250 kB/s)
[INFO] Downloading from central: https://repo.maven.apache.org/maven2/org/apache/maven/maven-plugin-api/2.0.6/maven-plugin-api-2.0.6.pom
[INFO] Downloaded from central: https://repo.maven.apache.org/maven2/org/apache/maven/maven-plugin-api/2.0.6/maven-plugin-api-2.0.6.pom (1.5 kB at 97 kB/s)
[INFO] Downloading from central: https://repo.maven.apache.org/maven2/org/apache/maven/maven/2.0.6/maven-2.0.6.pom
[INFO] Downloaded from central: https://repo.maven.apache.org/maven2/org/apache/maven/maven/2.0.6/maven-2.0.6.pom (9.0 kB at 646 kB/s)
[INFO] Downloading from central: https://repo.maven.apache.org/maven2/org/apache/maven/maven-parent/5/maven-parent-5.pom
[INFO] Downloaded from central: https://repo.maven.apache.org/maven2/org/apache/maven/maven-parent/5/maven-parent-5.pom (15 kB at 1.2 MB/s)
[INFO] Downloading from central: https://repo.maven.apache.org/maven2/org/apache/ant/ant/1.8.1/ant-1.8.1.pom
[INFO] Downloaded from central: https://repo.maven.apache.org/maven2/org/apache/ant/ant/1.8.1/ant-1.8.1.pom (8.8 kB at 587 kB/s)
[INFO] Downloading from central: https://repo.maven.apache.org/maven2/org/apache/ant/ant-parent/1.8.1/ant-parent-1.8.1.pom
[INFO] Downloaded from central: https://repo.maven.apache.org/maven2/org/apache/ant/ant-parent/1.8.1/ant-parent-1.8.1.pom (4.3 kB at 225 kB/s)
[INFO] Downloading from central: https://repo.maven.apache.org/maven2/org/apache/maven/shared/maven-artifact-transfer/0.11.0/maven-artifact-transfer-0.11.0.pom
[INFO] Downloaded from central: https://repo.maven.apache.org/maven2/org/apache/maven/shared/maven-artifact-transfer/0.11.0/maven-artifact-transfer-0.11.0.pom (11 kB at 954 kB/s)
[INFO] Downloading from central: https://repo.maven.apache.org/maven2/org/apache/maven/shared/maven-common-artifact-filters/3.0.1/maven-common-artifact-filters-3.0.1.pom
[INFO] Downloaded from central: https://repo.maven.apache.org/maven2/org/apache/maven/shared/maven-common-artifact-filters/3.0.1/maven-common-artifact-filters-3.0.1.pom (4.8 kB at 322 kB/s)
[INFO] Downloading from central: https://repo.maven.apache.org/maven2/org/codehaus/plexus/plexus-utils/3.1.1/plexus-utils-3.1.1.pom
[INFO] Downloaded from central: https://repo.maven.apache.org/maven2/org/codehaus/plexus/plexus-utils/3.1.1/plexus-utils-3.1.1.pom (5.1 kB at 298 kB/s)
[INFO] Downloading from central: https://repo.maven.apache.org/maven2/org/slf4j/slf4j-api/1.7.5/slf4j-api-1.7.5.pom
[INFO] Downloaded from central: https://repo.maven.apache.org/maven2/org/slf4j/slf4j-api/1.7.5/slf4j-api-1.7.5.pom (2.7 kB at 149 kB/s)
[INFO] Downloading from central: https://repo.maven.apache.org/maven2/org/slf4j/slf4j-parent/1.7.5/slf4j-parent-1.7.5.pom
[INFO] Downloaded from central: https://repo.maven.apache.org/maven2/org/slf4j/slf4j-parent/1.7.5/slf4j-parent-1.7.5.pom (12 kB at 843 kB/s)
[INFO] Downloading from central: https://repo.maven.apache.org/maven2/org/apache/maven/doxia/doxia-sink-api/1.7/doxia-sink-api-1.7.pom
[INFO] Downloaded from central: https://repo.maven.apache.org/maven2/org/apache/maven/doxia/doxia-sink-api/1.7/doxia-sink-api-1.7.pom (1.5 kB at 118 kB/s)
[INFO] Downloading from central: https://repo.maven.apache.org/maven2/org/apache/maven/doxia/doxia/1.7/doxia-1.7.pom
[INFO] Downloaded from central: https://repo.maven.apache.org/maven2/org/apache/maven/doxia/doxia/1.7/doxia-1.7.pom (15 kB at 953 kB/s)
[INFO] Downloading from central: https://repo.maven.apache.org/maven2/org/apache/maven/doxia/doxia-logging-api/1.7/doxia-logging-api-1.7.pom
[INFO] Downloaded from central: https://repo.maven.apache.org/maven2/org/apache/maven/doxia/doxia-logging-api/1.7/doxia-logging-api-1.7.pom (1.5 kB at 110 kB/s)
[INFO] Downloading from central: https://repo.maven.apache.org/maven2/org/apache/maven/doxia/doxia-site-renderer/1.7.4/doxia-site-renderer-1.7.4.pom
[INFO] Downloaded from central: https://repo.maven.apache.org/maven2/org/apache/maven/doxia/doxia-site-renderer/1.7.4/doxia-site-renderer-1.7.4.pom (6.7 kB at 514 kB/s)
[INFO] Downloading from central: https://repo.maven.apache.org/maven2/org/apache/maven/doxia/doxia-sitetools/1.7.4/doxia-sitetools-1.7.4.pom
[INFO] Downloaded from central: https://repo.maven.apache.org/maven2/org/apache/maven/doxia/doxia-sitetools/1.7.4/doxia-sitetools-1.7.4.pom (14 kB at 1.1 MB/s)
[INFO] Downloading from central: https://repo.maven.apache.org/maven2/org/apache/maven/doxia/doxia-core/1.7/doxia-core-1.7.pom
[INFO] Downloaded from central: https://repo.maven.apache.org/maven2/org/apache/maven/doxia/doxia-core/1.7/doxia-core-1.7.pom (4.1 kB at 290 kB/s)
[INFO] Downloading from central: https://repo.maven.apache.org/maven2/org/apache/maven/doxia/doxia-decoration-model/1.7.4/doxia-decoration-model-1.7.4.pom
[INFO] Downloaded from central: https://repo.maven.apache.org/maven2/org/apache/maven/doxia/doxia-decoration-model/1.7.4/doxia-decoration-model-1.7.4.pom (3.4 kB at 226 kB/s)
[INFO] Downloading from central: https://repo.maven.apache.org/maven2/org/apache/maven/doxia/doxia-skin-model/1.7.4/doxia-skin-model-1.7.4.pom
[INFO] Downloaded from central: https://repo.maven.apache.org/maven2/org/apache/maven/doxia/doxia-skin-model/1.7.4/doxia-skin-model-1.7.4.pom (3.0 kB at 233 kB/s)
[INFO] Downloading from central: https://repo.maven.apache.org/maven2/org/apache/maven/doxia/doxia-module-xhtml/1.7/doxia-module-xhtml-1.7.pom
[INFO] Downloaded from central: https://repo.maven.apache.org/maven2/org/apache/maven/doxia/doxia-module-xhtml/1.7/doxia-module-xhtml-1.7.pom (1.6 kB at 125 kB/s)
[INFO] Downloading from central: https://repo.maven.apache.org/maven2/org/apache/maven/doxia/doxia-modules/1.7/doxia-modules-1.7.pom
[INFO] Downloaded from central: https://repo.maven.apache.org/maven2/org/apache/maven/doxia/doxia-modules/1.7/doxia-modules-1.7.pom (2.6 kB at 175 kB/s)
[INFO] Downloading from central: https://repo.maven.apache.org/maven2/org/codehaus/groovy/groovy-all/2.4.8/groovy-all-2.4.8.pom
[INFO] Downloaded from central: https://repo.maven.apache.org/maven2/org/codehaus/groovy/groovy-all/2.4.8/groovy-all-2.4.8.pom (21 kB at 1.1 MB/s)
[INFO] Downloading from central: https://repo.maven.apache.org/maven2/org/codehaus/plexus/plexus-interpolation/1.26/plexus-interpolation-1.26.pom
[INFO] Downloaded from central: https://repo.maven.apache.org/maven2/org/codehaus/plexus/plexus-interpolation/1.26/plexus-interpolation-1.26.pom (2.7 kB at 166 kB/s)
[INFO] Downloading from central: https://repo.maven.apache.org/maven2/org/apache/maven/shared/maven-invoker/3.0.1/maven-invoker-3.0.1.jar
[INFO] Downloading from central: https://repo.maven.apache.org/maven2/commons-beanutils/commons-beanutils/1.8.3/commons-beanutils-1.8.3.jar
[INFO] Downloading from central: https://repo.maven.apache.org/maven2/commons-validator/commons-validator/1.4.1/commons-validator-1.4.1.jar
[INFO] Downloading from central: https://repo.maven.apache.org/maven2/org/apache/maven/reporting/maven-reporting-impl/2.4/maven-reporting-impl-2.4.jar
[INFO] Downloading from central: https://repo.maven.apache.org/maven2/commons-digester/commons-digester/1.8.1/commons-digester-1.8.1.jar
[INFO] Downloaded from central: https://repo.maven.apache.org/maven2/org/apache/maven/reporting/maven-reporting-impl/2.4/maven-reporting-impl-2.4.jar (20 kB at 1.0 MB/s)
[INFO] Downloading from central: https://repo.maven.apache.org/maven2/commons-logging/commons-logging/1.2/commons-logging-1.2.jar
[INFO] Downloaded from central: https://repo.maven.apache.org/maven2/commons-validator/commons-validator/1.4.1/commons-validator-1.4.1.jar (190 kB at 7.9 MB/s)
[INFO] Downloading from central: https://repo.maven.apache.org/maven2/org/apache/maven/shared/maven-script-interpreter/1.2/maven-script-interpreter-1.2.jar
[INFO] Downloaded from central: https://repo.maven.apache.org/maven2/org/apache/maven/shared/maven-invoker/3.0.1/maven-invoker-3.0.1.jar (33 kB at 1.3 MB/s)
[INFO] Downloaded from central: https://repo.maven.apache.org/maven2/commons-beanutils/commons-beanutils/1.8.3/commons-beanutils-1.8.3.jar (232 kB at 8.9 MB/s)
[INFO] Downloading from central: https://repo.maven.apache.org/maven2/org/apache/maven/shared/maven-artifact-transfer/0.11.0/maven-artifact-transfer-0.11.0.jar
[INFO] Downloaded from central: https://repo.maven.apache.org/maven2/commons-digester/commons-digester/1.8.1/commons-digester-1.8.1.jar (146 kB at 5.8 MB/s)
[INFO] Downloading from central: https://repo.maven.apache.org/maven2/org/apache/maven/shared/maven-common-artifact-filters/3.0.1/maven-common-artifact-filters-3.0.1.jar
[INFO] Downloading from central: https://repo.maven.apache.org/maven2/org/apache/ant/ant/1.8.1/ant-1.8.1.jar
[INFO] Downloaded from central: https://repo.maven.apache.org/maven2/commons-logging/commons-logging/1.2/commons-logging-1.2.jar (62 kB at 1.8 MB/s)
[INFO] Downloading from central: https://repo.maven.apache.org/maven2/org/slf4j/slf4j-api/1.7.5/slf4j-api-1.7.5.jar
[INFO] Downloaded from central: https://repo.maven.apache.org/maven2/org/apache/maven/shared/maven-script-interpreter/1.2/maven-script-interpreter-1.2.jar (22 kB at 551 kB/s)
[INFO] Downloading from central: https://repo.maven.apache.org/maven2/org/apache/maven/doxia/doxia-sink-api/1.7/doxia-sink-api-1.7.jar
[INFO] Downloaded from central: https://repo.maven.apache.org/maven2/org/apache/maven/shared/maven-common-artifact-filters/3.0.1/maven-common-artifact-filters-3.0.1.jar (61 kB at 1.3 MB/s)
[INFO] Downloaded from central: https://repo.maven.apache.org/maven2/org/slf4j/slf4j-api/1.7.5/slf4j-api-1.7.5.jar (26 kB at 522 kB/s)
[INFO] Downloaded from central: https://repo.maven.apache.org/maven2/org/apache/maven/shared/maven-artifact-transfer/0.11.0/maven-artifact-transfer-0.11.0.jar (128 kB at 2.7 MB/s)
[INFO] Downloading from central: https://repo.maven.apache.org/maven2/org/apache/maven/doxia/doxia-decoration-model/1.7.4/doxia-decoration-model-1.7.4.jar
[INFO] Downloading from central: https://repo.maven.apache.org/maven2/org/apache/maven/doxia/doxia-site-renderer/1.7.4/doxia-site-renderer-1.7.4.jar
[INFO] Downloading from central: https://repo.maven.apache.org/maven2/org/apache/maven/doxia/doxia-logging-api/1.7/doxia-logging-api-1.7.jar
[INFO] Downloaded from central: https://repo.maven.apache.org/maven2/org/apache/maven/doxia/doxia-sink-api/1.7/doxia-sink-api-1.7.jar (11 kB at 204 kB/s)
[INFO] Downloading from central: https://repo.maven.apache.org/maven2/org/apache/maven/doxia/doxia-skin-model/1.7.4/doxia-skin-model-1.7.4.jar
[INFO] Downloaded from central: https://repo.maven.apache.org/maven2/org/apache/maven/doxia/doxia-logging-api/1.7/doxia-logging-api-1.7.jar (12 kB at 173 kB/s)
[INFO] Downloading from central: https://repo.maven.apache.org/maven2/org/apache/maven/doxia/doxia-module-xhtml/1.7/doxia-module-xhtml-1.7.jar
[INFO] Downloaded from central: https://repo.maven.apache.org/maven2/org/apache/maven/doxia/doxia-decoration-model/1.7.4/doxia-decoration-model-1.7.4.jar (61 kB at 879 kB/s)
[INFO] Downloading from central: https://repo.maven.apache.org/maven2/org/codehaus/groovy/groovy-all/2.4.8/groovy-all-2.4.8.jar
[INFO] Downloaded from central: https://repo.maven.apache.org/maven2/org/apache/maven/doxia/doxia-site-renderer/1.7.4/doxia-site-renderer-1.7.4.jar (64 kB at 888 kB/s)
[INFO] Downloading from central: https://repo.maven.apache.org/maven2/org/codehaus/plexus/plexus-interpolation/1.26/plexus-interpolation-1.26.jar
[INFO] Downloaded from central: https://repo.maven.apache.org/maven2/org/apache/maven/doxia/doxia-skin-model/1.7.4/doxia-skin-model-1.7.4.jar (16 kB at 205 kB/s)
[INFO] Downloaded from central: https://repo.maven.apache.org/maven2/org/codehaus/plexus/plexus-interpolation/1.26/plexus-interpolation-1.26.jar (85 kB at 959 kB/s)
[INFO] Downloaded from central: https://repo.maven.apache.org/maven2/org/apache/ant/ant/1.8.1/ant-1.8.1.jar (1.5 MB at 16 MB/s)
[INFO] Downloaded from central: https://repo.maven.apache.org/maven2/org/apache/maven/doxia/doxia-module-xhtml/1.7/doxia-module-xhtml-1.7.jar (17 kB at 184 kB/s)
[INFO] Downloaded from central: https://repo.maven.apache.org/maven2/org/codehaus/groovy/groovy-all/2.4.8/groovy-all-2.4.8.jar (7.0 MB at 22 MB/s)
[INFO] Installing /home/jenkins/jenkins-slave/workspace/maven-box_maven-resolver_master/m/maven-resolver-api/pom.xml to /home/jenkins/jenkins-slave/workspace/maven-box_maven-resolver_master/m/maven-resolver-demos/maven-resolver-demo-maven-plugin/target/local-repo/org/apache/maven/resolver/maven-resolver-api/1.4.3-SNAPSHOT/maven-resolver-api-1.4.3-SNAPSHOT.pom
[INFO] Installing /home/jenkins/jenkins-slave/workspace/maven-box_maven-resolver_master/m/maven-resolver-api/target/maven-resolver-api-1.4.3-SNAPSHOT.jar to /home/jenkins/jenkins-slave/workspace/maven-box_maven-resolver_master/m/maven-resolver-demos/maven-resolver-demo-maven-plugin/target/local-repo/org/apache/maven/resolver/maven-resolver-api/1.4.3-SNAPSHOT/maven-resolver-api-1.4.3-SNAPSHOT.jar
[INFO] Installing /home/jenkins/jenkins-slave/workspace/maven-box_maven-resolver_master/m/pom.xml to /home/jenkins/jenkins-slave/workspace/maven-box_maven-resolver_master/m/maven-resolver-demos/maven-resolver-demo-maven-plugin/target/local-repo/org/apache/maven/resolver/maven-resolver/1.4.3-SNAPSHOT/maven-resolver-1.4.3-SNAPSHOT.pom
[INFO] Installing /home/jenkins/jenkins-slave/workspace/maven-box_maven-resolver_master/m/maven-resolver-demos/pom.xml to /home/jenkins/jenkins-slave/workspace/maven-box_maven-resolver_master/m/maven-resolver-demos/maven-resolver-demo-maven-plugin/target/local-repo/org/apache/maven/resolver/maven-resolver-demos/1.4.3-SNAPSHOT/maven-resolver-demos-1.4.3-SNAPSHOT.pom
[INFO] Installing /home/jenkins/jenkins-slave/workspace/maven-box_maven-resolver_master/m/maven-resolver-demos/maven-resolver-demo-maven-plugin/pom.xml to /home/jenkins/jenkins-slave/workspace/maven-box_maven-resolver_master/m/maven-resolver-demos/maven-resolver-demo-maven-plugin/target/local-repo/org/apache/maven/resolver/maven-resolver-demo-maven-plugin/1.4.3-SNAPSHOT/maven-resolver-demo-maven-plugin-1.4.3-SNAPSHOT.pom
[INFO] Installing /home/jenkins/jenkins-slave/workspace/maven-box_maven-resolver_master/m/maven-resolver-demos/maven-resolver-demo-maven-plugin/target/maven-resolver-demo-maven-plugin-1.4.3-SNAPSHOT.jar to /home/jenkins/jenkins-slave/workspace/maven-box_maven-resolver_master/m/maven-resolver-demos/maven-resolver-demo-maven-plugin/target/local-repo/org/apache/maven/resolver/maven-resolver-demo-maven-plugin/1.4.3-SNAPSHOT/maven-resolver-demo-maven-plugin-1.4.3-SNAPSHOT.jar
[INFO]
[INFO] --- maven-invoker-plugin:3.2.1:run (integration-test) @ maven-resolver-demo-maven-plugin ---
[INFO] Building: resolve-artifact/pom.xml
[INFO]           resolve-artifact/pom.xml ......................... SUCCESS (4.2 s)
[INFO] -------------------------------------------------
[INFO] Build Summary:
[INFO]   Passed: 1, Failed: 0, Errors: 0, Skipped: 0
[INFO] -------------------------------------------------
[INFO]
[INFO] --- maven-checkstyle-plugin:3.0.0:check (checkstyle-check) @ maven-resolver-demo-maven-plugin ---
[INFO] ------------------------------------------------------------------------
[INFO] Reactor Summary for Maven Artifact Resolver 1.4.3-SNAPSHOT:
[INFO]
[INFO] Maven Artifact Resolver ............................ SUCCESS [ 18.501 s]
[INFO] Maven Artifact Resolver API ........................ SUCCESS [ 15.783 s]
[INFO] Maven Artifact Resolver SPI ........................ SUCCESS [  2.470 s]
[INFO] Maven Artifact Resolver Test Utilities ............. SUCCESS [  2.917 s]
[INFO] Maven Artifact Resolver Utilities .................. SUCCESS [  6.616 s]
[INFO] Maven Artifact Resolver Implementation ............. SUCCESS [ 14.092 s]
[INFO] Maven Artifact Resolver Connector Basic ............ SUCCESS [  7.749 s]
[INFO] Maven Artifact Resolver Transport Classpath ........ SUCCESS [  2.227 s]
[INFO] Maven Artifact Resolver Transport File ............. SUCCESS [  2.190 s]
[INFO] Maven Artifact Resolver Transport HTTP ............. SUCCESS [  8.420 s]
[INFO] Maven Artifact Resolver Transport Wagon ............ SUCCESS [  4.891 s]
[INFO] Maven Artifact Resolver Demos ...................... SUCCESS [  0.427 s]
[INFO] Maven Artifact Resolver Demo Snippets .............. SUCCESS [  1.870 s]
[INFO] Maven Artifact Resolver Demo Maven Plugin .......... SUCCESS [  7.553 s]
[INFO] ------------------------------------------------------------------------
[INFO] BUILD SUCCESS
[INFO] ------------------------------------------------------------------------
[INFO] Total time:  01:37 min
[INFO] Finished at: 2020-06-17T22:46:50Z
[INFO] ------------------------------------------------------------------------
[INFO] [jenkins-event-spy] Generated /home/jenkins/jenkins-slave/workspace/maven-box_maven-resolver_master@tmp/withMaven5468275a/maven-spy-20200617-224513-8212991415182215921104.log
[Pipeline] }
[Pipeline] // dir
[Pipeline] }
[withMaven] invokerPublisher - Archive invoker results for Maven artifact MavenArtifact{org.apache.maven.resolver:maven-resolver-demo-maven-plugin:maven-plugin:1.4.3-SNAPSHOT(version: 1.4.3-SNAPSHOT, snapshot:false) } generated by PluginInvocation{org.apache.maven.plugins:maven-invoker-plugin:3.2.1@run  integration-test}: m/maven-resolver-demos/maven-resolver-demo-maven-plugin/target/invoker-reports/*.xml
[withMaven] junitPublisher - Archive test results for Maven artifact org.apache.maven.resolver:maven-resolver-api:jar:1.4.3-SNAPSHOT generated by maven-surefire-plugin:test (default-test): m/maven-resolver-api/target/surefire-reports/*.xml
[withMaven] junitPublisher - Archive test results for Maven artifact org.apache.maven.resolver:maven-resolver-spi:jar:1.4.3-SNAPSHOT generated by maven-surefire-plugin:test (default-test): m/maven-resolver-spi/target/surefire-reports/*.xml
[withMaven] junitPublisher - Archive test results for Maven artifact org.apache.maven.resolver:maven-resolver-test-util:jar:1.4.3-SNAPSHOT generated by maven-surefire-plugin:test (default-test): m/maven-resolver-test-util/target/surefire-reports/*.xml
[withMaven] junitPublisher - Archive test results for Maven artifact org.apache.maven.resolver:maven-resolver-util:jar:1.4.3-SNAPSHOT generated by maven-surefire-plugin:test (default-test): m/maven-resolver-util/target/surefire-reports/*.xml
[withMaven] junitPublisher - Archive test results for Maven artifact org.apache.maven.resolver:maven-resolver-impl:jar:1.4.3-SNAPSHOT generated by maven-surefire-plugin:test (default-test): m/maven-resolver-impl/target/surefire-reports/*.xml
[withMaven] junitPublisher - Archive test results for Maven artifact org.apache.maven.resolver:maven-resolver-connector-basic:jar:1.4.3-SNAPSHOT generated by maven-surefire-plugin:test (default-test): m/maven-resolver-connector-basic/target/surefire-reports/*.xml
[withMaven] junitPublisher - Archive test results for Maven artifact org.apache.maven.resolver:maven-resolver-transport-classpath:jar:1.4.3-SNAPSHOT generated by maven-surefire-plugin:test (default-test): m/maven-resolver-transport-classpath/target/surefire-reports/*.xml
[withMaven] junitPublisher - Archive test results for Maven artifact org.apache.maven.resolver:maven-resolver-transport-file:jar:1.4.3-SNAPSHOT generated by maven-surefire-plugin:test (default-test): m/maven-resolver-transport-file/target/surefire-reports/*.xml
[withMaven] junitPublisher - Archive test results for Maven artifact org.apache.maven.resolver:maven-resolver-transport-http:jar:1.4.3-SNAPSHOT generated by maven-surefire-plugin:test (default-test): m/maven-resolver-transport-http/target/surefire-reports/*.xml
[withMaven] junitPublisher - Archive test results for Maven artifact org.apache.maven.resolver:maven-resolver-transport-wagon:jar:1.4.3-SNAPSHOT generated by maven-surefire-plugin:test (default-test): m/maven-resolver-transport-wagon/target/surefire-reports/*.xml
[withMaven] junitPublisher - Archive test results for Maven artifact org.apache.maven.resolver:maven-resolver-demo-snippets:jar:1.4.3-SNAPSHOT generated by maven-surefire-plugin:test (default-test): m/maven-resolver-demos/maven-resolver-demo-snippets/target/surefire-reports/*.xml
[withMaven] junitPublisher - Archive test results for Maven artifact org.apache.maven.resolver:maven-resolver-demo-maven-plugin:maven-plugin:1.4.3-SNAPSHOT generated by maven-surefire-plugin:test (default-test): m/maven-resolver-demos/maven-resolver-demo-maven-plugin/target/surefire-reports/*.xml
Recording test results
[withMaven] Publishers: Pipeline Graph Publisher: 9 ms, Invoker Publisher: 1311 ms, Junit Publisher: 55359 ms, Concordion Publisher: 1 ms, Dependencies Fingerprint Publisher: 9165 ms, JGiven Publisher: 1 ms
[Pipeline] // withMaven
[Pipeline] cleanWs
[WS-CLEANUP] Deleting project workspace...
[WS-CLEANUP] Deferred wipeout is used...
[WS-CLEANUP] done
[Pipeline] }
[Pipeline] // stage
[Pipeline] }
[Pipeline] // node
[Pipeline] }
[Pipeline] // parallel
[Pipeline] echo
[FAILURE-003] AbortException hudson.AbortException: script returned exit code 1
[Pipeline] stage
[Pipeline] { (Notifications)
[Pipeline] echo
Build result: FAILURE
[Pipeline] jiraIssueSelector
[Pipeline] echo
The authors of changes [slachiewicz].
[Pipeline] echo
Sending email ...
[Pipeline] emailext
Reply | Threaded
Open this post in threaded view
|

Build failed in Jenkins: Maven TLP » maven-resolver » master #82

Apache Jenkins Server-2
See https://builds.apache.org/job/maven-box/job/maven-resolver/job/master/82/

Changes:

* Upgrade maven-bundle-plugin 4.0.0

All tests passed

Build log:
[...truncated 31218 lines...]
[INFO] Installing F:\jenkins\jenkins-slave\workspace\maven-box_maven-resolver_master\m\maven-resolver-demos\pom.xml to F:\jenkins\jenkins-slave\workspace\maven-box_maven-resolver_master\m\maven-resolver-demos\maven-resolver-demo-maven-plugin\target\local-repo\org\apache\maven\resolver\maven-resolver-demos\1.4.3-SNAPSHOT\maven-resolver-demos-1.4.3-SNAPSHOT.pom
[INFO] Installing F:\jenkins\jenkins-slave\workspace\maven-box_maven-resolver_master\m\maven-resolver-demos\maven-resolver-demo-maven-plugin\pom.xml to F:\jenkins\jenkins-slave\workspace\maven-box_maven-resolver_master\m\maven-resolver-demos\maven-resolver-demo-maven-plugin\target\local-repo\org\apache\maven\resolver\maven-resolver-demo-maven-plugin\1.4.3-SNAPSHOT\maven-resolver-demo-maven-plugin-1.4.3-SNAPSHOT.pom
[INFO] Installing F:\jenkins\jenkins-slave\workspace\maven-box_maven-resolver_master\m\maven-resolver-demos\maven-resolver-demo-maven-plugin\target\maven-resolver-demo-maven-plugin-1.4.3-SNAPSHOT.jar to F:\jenkins\jenkins-slave\workspace\maven-box_maven-resolver_master\m\maven-resolver-demos\maven-resolver-demo-maven-plugin\target\local-repo\org\apache\maven\resolver\maven-resolver-demo-maven-plugin\1.4.3-SNAPSHOT\maven-resolver-demo-maven-plugin-1.4.3-SNAPSHOT.jar
[INFO]
[INFO] --- maven-invoker-plugin:3.2.1:run (integration-test) @ maven-resolver-demo-maven-plugin ---
[INFO] Building: resolve-artifact\pom.xml
[INFO]           resolve-artifact\pom.xml ......................... SUCCESS (4.6 s)
[INFO] -------------------------------------------------
[INFO] Build Summary:
[INFO]   Passed: 1, Failed: 0, Errors: 0, Skipped: 0
[INFO] -------------------------------------------------
[INFO]
[INFO] --- maven-checkstyle-plugin:3.0.0:check (checkstyle-check) @ maven-resolver-demo-maven-plugin ---
[INFO]           resolve-artifact\pom.xml ......................... SUCCESS (4.6 s)
[INFO] -------------------------------------------------
[INFO] Build Summary:
[INFO]   Passed: 1, Failed: 0, Errors: 0, Skipped: 0
[INFO] -------------------------------------------------
[INFO]
[INFO] --- maven-checkstyle-plugin:3.0.0:check (checkstyle-check) @ maven-resolver-demo-maven-plugin ---
[INFO] ------------------------------------------------------------------------
[INFO] Reactor Summary for Maven Artifact Resolver 1.4.3-SNAPSHOT:
[INFO]
[INFO] Maven Artifact Resolver ............................ SUCCESS [ 47.530 s]
[INFO] Maven Artifact Resolver API ........................ SUCCESS [ 27.016 s]
[INFO] Maven Artifact Resolver SPI ........................ SUCCESS [  3.074 s]
[INFO] Maven Artifact Resolver Test Utilities ............. SUCCESS [  3.377 s]
[INFO] Maven Artifact Resolver Utilities .................. SUCCESS [ 12.318 s]
[INFO] Maven Artifact Resolver Implementation ............. SUCCESS [ 26.093 s]
[INFO] Maven Artifact Resolver Connector Basic ............ SUCCESS [  7.946 s]
[INFO] Maven Artifact Resolver Transport Classpath ........ SUCCESS [  2.294 s]
[INFO] Maven Artifact Resolver Transport File ............. SUCCESS [  3.158 s]
[INFO] Maven Artifact Resolver Transport HTTP ............. SUCCESS [  9.760 s]
[INFO] Maven Artifact Resolver Transport Wagon ............ SUCCESS [  5.392 s]
[INFO] Maven Artifact Resolver Demos ...................... SUCCESS [  0.366 s]
[INFO] Maven Artifact Resolver Demo Snippets .............. SUCCESS [  3.386 s]
[INFO] Maven Artifact Resolver Demo Maven Plugin .......... SUCCESS [ 14.209 s]
[INFO] ------------------------------------------------------------------------
[INFO] BUILD SUCCESS
[INFO] ------------------------------------------------------------------------
[INFO] Total time:  02:47 min
[INFO] Finished at: 2020-06-18T05:32:30-07:00
[INFO] ------------------------------------------------------------------------
[INFO] [jenkins-event-spy] Generated F:\jenkins\jenkins-slave\workspace\maven-box_maven-resolver_master@2@tmp\withMavend1fdb5f7\maven-spy-20200618-052942-834263669404008026479.log
[INFO] ------------------------------------------------------------------------
[INFO] Reactor Summary for Maven Artifact Resolver 1.4.3-SNAPSHOT:
[INFO]
[INFO] Maven Artifact Resolver ............................ SUCCESS [ 47.691 s]
[INFO] Maven Artifact Resolver API ........................ SUCCESS [ 27.028 s]
[INFO] Maven Artifact Resolver SPI ........................ SUCCESS [  2.958 s]
[INFO] Maven Artifact Resolver Test Utilities ............. SUCCESS [  3.717 s]
[INFO] Maven Artifact Resolver Utilities .................. SUCCESS [ 11.963 s]
[INFO] Maven Artifact Resolver Implementation ............. SUCCESS [ 25.960 s]
[INFO] Maven Artifact Resolver Connector Basic ............ SUCCESS [  8.099 s]
[INFO] Maven Artifact Resolver Transport Classpath ........ SUCCESS [  2.355 s]
[INFO] Maven Artifact Resolver Transport File ............. SUCCESS [  2.644 s]
[INFO] Maven Artifact Resolver Transport HTTP ............. SUCCESS [ 10.055 s]
[INFO] Maven Artifact Resolver Transport Wagon ............ SUCCESS [  5.645 s]
[INFO] Maven Artifact Resolver Demos ...................... SUCCESS [  0.409 s]
[INFO] Maven Artifact Resolver Demo Snippets .............. SUCCESS [  3.383 s]
[INFO] Maven Artifact Resolver Demo Maven Plugin .......... SUCCESS [ 14.222 s]
[INFO] ------------------------------------------------------------------------
[INFO] BUILD SUCCESS
[INFO] ------------------------------------------------------------------------
[INFO] Total time:  02:47 min
[INFO] Finished at: 2020-06-18T05:32:30-07:00
[INFO] ------------------------------------------------------------------------
[INFO] [jenkins-event-spy] Generated F:\jenkins\jenkins-slave\workspace\maven-box_maven-resolver_master@tmp\withMavenf761d536\maven-spy-20200618-052941-6757533172405332107984.log
Picked up JAVA_TOOL_OPTIONS: -Dmaven.ext.class.path="f:\jenkins\jenkins-slave\workspace\maven-box_maven-resolver_master@tmp\withMavenf761d536\pipeline-maven-spy.jar" -Dorg.jenkinsci.plugins.pipeline.maven.reportsFolder="f:\jenkins\jenkins-slave\workspace\maven-box_maven-resolver_master@tmp\withMavenf761d536"
[Pipeline] cleanWs
[withMaven] junitPublisher - Archive test results for Maven artifact org.apache.maven.resolver:maven-resolver-api:jar:1.4.3-SNAPSHOT generated by maven-surefire-plugin:test (default-test): m/maven-resolver-api/target/surefire-reports/*.xml
[withMaven] junitPublisher - Archive test results for Maven artifact org.apache.maven.resolver:maven-resolver-spi:jar:1.4.3-SNAPSHOT generated by maven-surefire-plugin:test (default-test): m/maven-resolver-spi/target/surefire-reports/*.xml
[withMaven] junitPublisher - Archive test results for Maven artifact org.apache.maven.resolver:maven-resolver-test-util:jar:1.4.3-SNAPSHOT generated by maven-surefire-plugin:test (default-test): m/maven-resolver-test-util/target/surefire-reports/*.xml
[withMaven] junitPublisher - Archive test results for Maven artifact org.apache.maven.resolver:maven-resolver-util:jar:1.4.3-SNAPSHOT generated by maven-surefire-plugin:test (default-test): m/maven-resolver-util/target/surefire-reports/*.xml
[withMaven] junitPublisher - Archive test results for Maven artifact org.apache.maven.resolver:maven-resolver-impl:jar:1.4.3-SNAPSHOT generated by maven-surefire-plugin:test (default-test): m/maven-resolver-impl/target/surefire-reports/*.xml
[withMaven] junitPublisher - Archive test results for Maven artifact org.apache.maven.resolver:maven-resolver-connector-basic:jar:1.4.3-SNAPSHOT generated by maven-surefire-plugin:test (default-test): m/maven-resolver-connector-basic/target/surefire-reports/*.xml
[withMaven] junitPublisher - Archive test results for Maven artifact org.apache.maven.resolver:maven-resolver-transport-classpath:jar:1.4.3-SNAPSHOT generated by maven-surefire-plugin:test (default-test): m/maven-resolver-transport-classpath/target/surefire-reports/*.xml
[withMaven] junitPublisher - Archive test results for Maven artifact org.apache.maven.resolver:maven-resolver-transport-file:jar:1.4.3-SNAPSHOT generated by maven-surefire-plugin:test (default-test): m/maven-resolver-transport-file/target/surefire-reports/*.xml
[withMaven] junitPublisher - Archive test results for Maven artifact org.apache.maven.resolver:maven-resolver-transport-http:jar:1.4.3-SNAPSHOT generated by maven-surefire-plugin:test (default-test): m/maven-resolver-transport-http/target/surefire-reports/*.xml
[withMaven] junitPublisher - Archive test results for Maven artifact org.apache.maven.resolver:maven-resolver-transport-wagon:jar:1.4.3-SNAPSHOT generated by maven-surefire-plugin:test (default-test): m/maven-resolver-transport-wagon/target/surefire-reports/*.xml
[withMaven] junitPublisher - Archive test results for Maven artifact org.apache.maven.resolver:maven-resolver-demo-snippets:jar:1.4.3-SNAPSHOT generated by maven-surefire-plugin:test (default-test): m/maven-resolver-demos/maven-resolver-demo-snippets/target/surefire-reports/*.xml
[withMaven] junitPublisher - Archive test results for Maven artifact org.apache.maven.resolver:maven-resolver-demo-maven-plugin:maven-plugin:1.4.3-SNAPSHOT generated by maven-surefire-plugin:test (default-test): m/maven-resolver-demos/maven-resolver-demo-maven-plugin/target/surefire-reports/*.xml
Recording test results
[WS-CLEANUP] Deleting project workspace...
[WS-CLEANUP] Deferred wipeout is used...
[WS-CLEANUP] done
[withMaven] Publishers: Pipeline Graph Publisher: 13 ms, Invoker Publisher: 1181 ms, Junit Publisher: 54159 ms, Concordion Publisher: 1 ms, Dependencies Fingerprint Publisher: 9675 ms
[Pipeline] }
[Pipeline] }
[Pipeline] }
[Pipeline] }
[Pipeline] }
[Pipeline] // withMaven
[Pipeline] cleanWs
[WS-CLEANUP] Deleting project workspace...
[WS-CLEANUP] Deferred wipeout is used...
[WS-CLEANUP] done
[withMaven] Publishers: Pipeline Graph Publisher: 13 ms, Invoker Publisher: 1155 ms, Junit Publisher: 111632 ms, Concordion Publisher: 1 ms, Dependencies Fingerprint Publisher: 9511 ms
[Pipeline] // stage
[Pipeline] // dir
[Pipeline] // dir
[Pipeline] // dir
[Pipeline] // dir
[Pipeline] }
[Pipeline] }
[Pipeline] }
[Pipeline] }
[Pipeline] }
[Pipeline] // withMaven
[Pipeline] cleanWs
[Pipeline] }
[Pipeline] // node
[Pipeline] }
[withMaven] invokerPublisher - Archive invoker results for Maven artifact MavenArtifact{org.apache.maven.resolver:maven-resolver-demo-maven-plugin:maven-plugin:1.4.3-SNAPSHOT(version: 1.4.3-SNAPSHOT, snapshot:false) } generated by PluginInvocation{org.apache.maven.plugins:maven-invoker-plugin:3.2.1@run  integration-test}: m\maven-resolver-demos\maven-resolver-demo-maven-plugin\target\invoker-reports\*.xml
[withMaven] invokerPublisher - Archive invoker results for Maven artifact MavenArtifact{org.apache.maven.resolver:maven-resolver-demo-maven-plugin:maven-plugin:1.4.3-SNAPSHOT(version: 1.4.3-SNAPSHOT, snapshot:false) } generated by PluginInvocation{org.apache.maven.plugins:maven-invoker-plugin:3.2.1@run  integration-test}: m\maven-resolver-demos\maven-resolver-demo-maven-plugin\target\invoker-reports\*.xml
[withMaven] invokerPublisher - Archive invoker results for Maven artifact MavenArtifact{org.apache.maven.resolver:maven-resolver-demo-maven-plugin:maven-plugin:1.4.3-SNAPSHOT(version: 1.4.3-SNAPSHOT, snapshot:false) } generated by PluginInvocation{org.apache.maven.plugins:maven-invoker-plugin:3.2.1@run  integration-test}: m\maven-resolver-demos\maven-resolver-demo-maven-plugin\target\invoker-reports\*.xml
[withMaven] invokerPublisher - Archive invoker results for Maven artifact MavenArtifact{org.apache.maven.resolver:maven-resolver-demo-maven-plugin:maven-plugin:1.4.3-SNAPSHOT(version: 1.4.3-SNAPSHOT, snapshot:false) } generated by PluginInvocation{org.apache.maven.plugins:maven-invoker-plugin:3.2.1@run  integration-test}: m\maven-resolver-demos\maven-resolver-demo-maven-plugin\target\invoker-reports\*.xml
[Pipeline] // stage
[Pipeline] }
[Pipeline] // node
[Pipeline] }
[WS-CLEANUP] Deleting project workspace...
[WS-CLEANUP] Deferred wipeout is used...
[WS-CLEANUP] done
[Pipeline] }
[Pipeline] // stage
[Pipeline] }
[withMaven] junitPublisher - Archive test results for Maven artifact org.apache.maven.resolver:maven-resolver-api:jar:1.4.3-SNAPSHOT generated by maven-surefire-plugin:test (default-test): m\maven-resolver-api\target\surefire-reports\*.xml
[withMaven] junitPublisher - Archive test results for Maven artifact org.apache.maven.resolver:maven-resolver-spi:jar:1.4.3-SNAPSHOT generated by maven-surefire-plugin:test (default-test): m\maven-resolver-spi\target\surefire-reports\*.xml
[withMaven] junitPublisher - Archive test results for Maven artifact org.apache.maven.resolver:maven-resolver-test-util:jar:1.4.3-SNAPSHOT generated by maven-surefire-plugin:test (default-test): m\maven-resolver-test-util\target\surefire-reports\*.xml
[withMaven] junitPublisher - Archive test results for Maven artifact org.apache.maven.resolver:maven-resolver-util:jar:1.4.3-SNAPSHOT generated by maven-surefire-plugin:test (default-test): m\maven-resolver-util\target\surefire-reports\*.xml
[withMaven] junitPublisher - Archive test results for Maven artifact org.apache.maven.resolver:maven-resolver-impl:jar:1.4.3-SNAPSHOT generated by maven-surefire-plugin:test (default-test): m\maven-resolver-impl\target\surefire-reports\*.xml
[withMaven] junitPublisher - Archive test results for Maven artifact org.apache.maven.resolver:maven-resolver-connector-basic:jar:1.4.3-SNAPSHOT generated by maven-surefire-plugin:test (default-test): m\maven-resolver-connector-basic\target\surefire-reports\*.xml
[withMaven] junitPublisher - Archive test results for Maven artifact org.apache.maven.resolver:maven-resolver-transport-classpath:jar:1.4.3-SNAPSHOT generated by maven-surefire-plugin:test (default-test): m\maven-resolver-transport-classpath\target\surefire-reports\*.xml
[withMaven] junitPublisher - Archive test results for Maven artifact org.apache.maven.resolver:maven-resolver-transport-file:jar:1.4.3-SNAPSHOT generated by maven-surefire-plugin:test (default-test): m\maven-resolver-transport-file\target\surefire-reports\*.xml
[withMaven] junitPublisher - Archive test results for Maven artifact org.apache.maven.resolver:maven-resolver-transport-http:jar:1.4.3-SNAPSHOT generated by maven-surefire-plugin:test (default-test): m\maven-resolver-transport-http\target\surefire-reports\*.xml
[withMaven] junitPublisher - Archive test results for Maven artifact org.apache.maven.resolver:maven-resolver-transport-wagon:jar:1.4.3-SNAPSHOT generated by maven-surefire-plugin:test (default-test): m\maven-resolver-transport-wagon\target\surefire-reports\*.xml
[withMaven] junitPublisher - Archive test results for Maven artifact org.apache.maven.resolver:maven-resolver-demo-snippets:jar:1.4.3-SNAPSHOT generated by maven-surefire-plugin:test (default-test): m\maven-resolver-demos\maven-resolver-demo-snippets\target\surefire-reports\*.xml
[withMaven] junitPublisher - Archive test results for Maven artifact org.apache.maven.resolver:maven-resolver-demo-maven-plugin:maven-plugin:1.4.3-SNAPSHOT generated by maven-surefire-plugin:test (default-test): m\maven-resolver-demos\maven-resolver-demo-maven-plugin\target\surefire-reports\*.xml
Recording test results
[withMaven] junitPublisher - Archive test results for Maven artifact org.apache.maven.resolver:maven-resolver-api:jar:1.4.3-SNAPSHOT generated by maven-surefire-plugin:test (default-test): m\maven-resolver-api\target\surefire-reports\*.xml
[withMaven] junitPublisher - Archive test results for Maven artifact org.apache.maven.resolver:maven-resolver-spi:jar:1.4.3-SNAPSHOT generated by maven-surefire-plugin:test (default-test): m\maven-resolver-spi\target\surefire-reports\*.xml
[withMaven] junitPublisher - Archive test results for Maven artifact org.apache.maven.resolver:maven-resolver-test-util:jar:1.4.3-SNAPSHOT generated by maven-surefire-plugin:test (default-test): m\maven-resolver-test-util\target\surefire-reports\*.xml
[withMaven] junitPublisher - Archive test results for Maven artifact org.apache.maven.resolver:maven-resolver-util:jar:1.4.3-SNAPSHOT generated by maven-surefire-plugin:test (default-test): m\maven-resolver-util\target\surefire-reports\*.xml
[withMaven] junitPublisher - Archive test results for Maven artifact org.apache.maven.resolver:maven-resolver-impl:jar:1.4.3-SNAPSHOT generated by maven-surefire-plugin:test (default-test): m\maven-resolver-impl\target\surefire-reports\*.xml
[withMaven] junitPublisher - Archive test results for Maven artifact org.apache.maven.resolver:maven-resolver-connector-basic:jar:1.4.3-SNAPSHOT generated by maven-surefire-plugin:test (default-test): m\maven-resolver-connector-basic\target\surefire-reports\*.xml
[withMaven] junitPublisher - Archive test results for Maven artifact org.apache.maven.resolver:maven-resolver-transport-classpath:jar:1.4.3-SNAPSHOT generated by maven-surefire-plugin:test (default-test): m\maven-resolver-transport-classpath\target\surefire-reports\*.xml
[withMaven] junitPublisher - Archive test results for Maven artifact org.apache.maven.resolver:maven-resolver-transport-file:jar:1.4.3-SNAPSHOT generated by maven-surefire-plugin:test (default-test): m\maven-resolver-transport-file\target\surefire-reports\*.xml
[withMaven] junitPublisher - Archive test results for Maven artifact org.apache.maven.resolver:maven-resolver-transport-http:jar:1.4.3-SNAPSHOT generated by maven-surefire-plugin:test (default-test): m\maven-resolver-transport-http\target\surefire-reports\*.xml
[withMaven] junitPublisher - Archive test results for Maven artifact org.apache.maven.resolver:maven-resolver-transport-wagon:jar:1.4.3-SNAPSHOT generated by maven-surefire-plugin:test (default-test): m\maven-resolver-transport-wagon\target\surefire-reports\*.xml
[withMaven] junitPublisher - Archive test results for Maven artifact org.apache.maven.resolver:maven-resolver-demo-snippets:jar:1.4.3-SNAPSHOT generated by maven-surefire-plugin:test (default-test): m\maven-resolver-demos\maven-resolver-demo-snippets\target\surefire-reports\*.xml
[withMaven] junitPublisher - Archive test results for Maven artifact org.apache.maven.resolver:maven-resolver-demo-maven-plugin:maven-plugin:1.4.3-SNAPSHOT generated by maven-surefire-plugin:test (default-test): m\maven-resolver-demos\maven-resolver-demo-maven-plugin\target\surefire-reports\*.xml
Recording test results
[Pipeline] // node
[Pipeline] }
[withMaven] junitPublisher - Archive test results for Maven artifact org.apache.maven.resolver:maven-resolver-api:jar:1.4.3-SNAPSHOT generated by maven-surefire-plugin:test (default-test): m\maven-resolver-api\target\surefire-reports\*.xml
[withMaven] junitPublisher - Archive test results for Maven artifact org.apache.maven.resolver:maven-resolver-spi:jar:1.4.3-SNAPSHOT generated by maven-surefire-plugin:test (default-test): m\maven-resolver-spi\target\surefire-reports\*.xml
[withMaven] junitPublisher - Archive test results for Maven artifact org.apache.maven.resolver:maven-resolver-test-util:jar:1.4.3-SNAPSHOT generated by maven-surefire-plugin:test (default-test): m\maven-resolver-test-util\target\surefire-reports\*.xml
[withMaven] junitPublisher - Archive test results for Maven artifact org.apache.maven.resolver:maven-resolver-util:jar:1.4.3-SNAPSHOT generated by maven-surefire-plugin:test (default-test): m\maven-resolver-util\target\surefire-reports\*.xml
[withMaven] junitPublisher - Archive test results for Maven artifact org.apache.maven.resolver:maven-resolver-impl:jar:1.4.3-SNAPSHOT generated by maven-surefire-plugin:test (default-test): m\maven-resolver-impl\target\surefire-reports\*.xml
[withMaven] junitPublisher - Archive test results for Maven artifact org.apache.maven.resolver:maven-resolver-connector-basic:jar:1.4.3-SNAPSHOT generated by maven-surefire-plugin:test (default-test): m\maven-resolver-connector-basic\target\surefire-reports\*.xml
[withMaven] junitPublisher - Archive test results for Maven artifact org.apache.maven.resolver:maven-resolver-transport-classpath:jar:1.4.3-SNAPSHOT generated by maven-surefire-plugin:test (default-test): m\maven-resolver-transport-classpath\target\surefire-reports\*.xml
[withMaven] junitPublisher - Archive test results for Maven artifact org.apache.maven.resolver:maven-resolver-transport-file:jar:1.4.3-SNAPSHOT generated by maven-surefire-plugin:test (default-test): m\maven-resolver-transport-file\target\surefire-reports\*.xml
[withMaven] junitPublisher - Archive test results for Maven artifact org.apache.maven.resolver:maven-resolver-transport-http:jar:1.4.3-SNAPSHOT generated by maven-surefire-plugin:test (default-test): m\maven-resolver-transport-http\target\surefire-reports\*.xml
[withMaven] junitPublisher - Archive test results for Maven artifact org.apache.maven.resolver:maven-resolver-transport-wagon:jar:1.4.3-SNAPSHOT generated by maven-surefire-plugin:test (default-test): m\maven-resolver-transport-wagon\target\surefire-reports\*.xml
[withMaven] junitPublisher - Archive test results for Maven artifact org.apache.maven.resolver:maven-resolver-demo-snippets:jar:1.4.3-SNAPSHOT generated by maven-surefire-plugin:test (default-test): m\maven-resolver-demos\maven-resolver-demo-snippets\target\surefire-reports\*.xml
[withMaven] junitPublisher - Archive test results for Maven artifact org.apache.maven.resolver:maven-resolver-demo-maven-plugin:maven-plugin:1.4.3-SNAPSHOT generated by maven-surefire-plugin:test (default-test): m\maven-resolver-demos\maven-resolver-demo-maven-plugin\target\surefire-reports\*.xml
Recording test results
[withMaven] junitPublisher - Archive test results for Maven artifact org.apache.maven.resolver:maven-resolver-api:jar:1.4.3-SNAPSHOT generated by maven-surefire-plugin:test (default-test): m\maven-resolver-api\target\surefire-reports\*.xml
[withMaven] junitPublisher - Archive test results for Maven artifact org.apache.maven.resolver:maven-resolver-spi:jar:1.4.3-SNAPSHOT generated by maven-surefire-plugin:test (default-test): m\maven-resolver-spi\target\surefire-reports\*.xml
[withMaven] junitPublisher - Archive test results for Maven artifact org.apache.maven.resolver:maven-resolver-test-util:jar:1.4.3-SNAPSHOT generated by maven-surefire-plugin:test (default-test): m\maven-resolver-test-util\target\surefire-reports\*.xml
[withMaven] junitPublisher - Archive test results for Maven artifact org.apache.maven.resolver:maven-resolver-util:jar:1.4.3-SNAPSHOT generated by maven-surefire-plugin:test (default-test): m\maven-resolver-util\target\surefire-reports\*.xml
[withMaven] junitPublisher - Archive test results for Maven artifact org.apache.maven.resolver:maven-resolver-impl:jar:1.4.3-SNAPSHOT generated by maven-surefire-plugin:test (default-test): m\maven-resolver-impl\target\surefire-reports\*.xml
[withMaven] junitPublisher - Archive test results for Maven artifact org.apache.maven.resolver:maven-resolver-connector-basic:jar:1.4.3-SNAPSHOT generated by maven-surefire-plugin:test (default-test): m\maven-resolver-connector-basic\target\surefire-reports\*.xml
[withMaven] junitPublisher - Archive test results for Maven artifact org.apache.maven.resolver:maven-resolver-transport-classpath:jar:1.4.3-SNAPSHOT generated by maven-surefire-plugin:test (default-test): m\maven-resolver-transport-classpath\target\surefire-reports\*.xml
[withMaven] junitPublisher - Archive test results for Maven artifact org.apache.maven.resolver:maven-resolver-transport-file:jar:1.4.3-SNAPSHOT generated by maven-surefire-plugin:test (default-test): m\maven-resolver-transport-file\target\surefire-reports\*.xml
[withMaven] junitPublisher - Archive test results for Maven artifact org.apache.maven.resolver:maven-resolver-transport-http:jar:1.4.3-SNAPSHOT generated by maven-surefire-plugin:test (default-test): m\maven-resolver-transport-http\target\surefire-reports\*.xml
[withMaven] junitPublisher - Archive test results for Maven artifact org.apache.maven.resolver:maven-resolver-transport-wagon:jar:1.4.3-SNAPSHOT generated by maven-surefire-plugin:test (default-test): m\maven-resolver-transport-wagon\target\surefire-reports\*.xml
[withMaven] junitPublisher - Archive test results for Maven artifact org.apache.maven.resolver:maven-resolver-demo-snippets:jar:1.4.3-SNAPSHOT generated by maven-surefire-plugin:test (default-test): m\maven-resolver-demos\maven-resolver-demo-snippets\target\surefire-reports\*.xml
[withMaven] junitPublisher - Archive test results for Maven artifact org.apache.maven.resolver:maven-resolver-demo-maven-plugin:maven-plugin:1.4.3-SNAPSHOT generated by maven-surefire-plugin:test (default-test): m\maven-resolver-demos\maven-resolver-demo-maven-plugin\target\surefire-reports\*.xml
Recording test results
[withMaven] Publishers: Pipeline Graph Publisher: 65 ms, Invoker Publisher: 655 ms, Junit Publisher: 3176 ms, Dependencies Fingerprint Publisher: 447 ms
[Pipeline] // withMaven
[withMaven] Publishers: Pipeline Graph Publisher: 11 ms, Invoker Publisher: 708 ms, Junit Publisher: 5770 ms, Dependencies Fingerprint Publisher: 414 ms
[withMaven] Publishers: Pipeline Graph Publisher: 11 ms, Invoker Publisher: 679 ms, Junit Publisher: 7946 ms, Dependencies Fingerprint Publisher: 411 ms, JGiven Publisher: 1 ms
[withMaven] Publishers: Pipeline Graph Publisher: 13 ms, Invoker Publisher: 53839 ms, Junit Publisher: 109800 ms, Concordion Publisher: 1 ms, Dependencies Fingerprint Publisher: 9280 ms
[Pipeline] cleanWs
[WS-CLEANUP] Deleting project workspace...
[WS-CLEANUP] Deferred wipeout is used...
[Pipeline] // withMaven
[Pipeline] // withMaven
[Pipeline] // withMaven
[WS-CLEANUP] done
[Pipeline] cleanWs
[Pipeline] cleanWs
[Pipeline] cleanWs
[WS-CLEANUP] Deleting project workspace...
[WS-CLEANUP] Deferred wipeout is used...
[Pipeline] }
[WS-CLEANUP] Deleting project workspace...
[WS-CLEANUP] Deferred wipeout is used...
[Pipeline] // stage
[WS-CLEANUP] done
[WS-CLEANUP] done
[Pipeline] }
[Pipeline] // node
[Pipeline] }
[Pipeline] }
[Pipeline] }
[Pipeline] // stage
[Pipeline] // stage
[Pipeline] }
[Pipeline] }
[Pipeline] // node
[Pipeline] // node
[Pipeline] }
[Pipeline] }
[WS-CLEANUP] Deleting project workspace...
[WS-CLEANUP] Deferred wipeout is used...
[withMaven] Publishers: Pipeline Graph Publisher: 64 ms, Invoker Publisher: 654 ms, Junit Publisher: 10276 ms, Dependencies Fingerprint Publisher: 440 ms
[Pipeline] // withMaven
[Pipeline] cleanWs
[WS-CLEANUP] Deleting project workspace...
[WS-CLEANUP] Deferred wipeout is used...
[WS-CLEANUP] done
[Pipeline] }
[Pipeline] // stage
[Pipeline] }
[Pipeline] // node
[WS-CLEANUP] done
[Pipeline] }
[Pipeline] }
[Pipeline] // stage
[Pipeline] }
[Pipeline] // node
[Pipeline] }
[Pipeline] // parallel
[Pipeline] echo
[FAILURE-003] AbortException hudson.AbortException: script returned exit code 1
[Pipeline] stage
[Pipeline] { (Notifications)
[Pipeline] echo
Build result: FAILURE
[Pipeline] jiraIssueSelector
[Pipeline] echo
The authors of changes [slachiewicz].
[Pipeline] echo
Sending email ...
[Pipeline] emailext
Reply | Threaded
Open this post in threaded view
|

Build failed in Jenkins: Maven TLP » maven-resolver » master #83

Apache Jenkins Server-2
See https://builds.apache.org/job/maven-box/job/maven-resolver/job/master/83/

Changes:

* Revert bundle plugin upgrade

All tests passed

Build log:
[...truncated 31218 lines...]
[INFO]
[INFO] --- maven-invoker-plugin:3.2.1:run (integration-test) @ maven-resolver-demo-maven-plugin ---
[INFO] Building: resolve-artifact\pom.xml
[INFO]
[INFO] --- maven-invoker-plugin:3.2.1:run (integration-test) @ maven-resolver-demo-maven-plugin ---
[INFO] Building: resolve-artifact\pom.xml
[INFO]           resolve-artifact\pom.xml ......................... SUCCESS (4.4 s)
[INFO] -------------------------------------------------
[INFO] Build Summary:
[INFO]   Passed: 1, Failed: 0, Errors: 0, Skipped: 0
[INFO] -------------------------------------------------
[INFO]
[INFO] --- maven-checkstyle-plugin:3.0.0:check (checkstyle-check) @ maven-resolver-demo-maven-plugin ---
[INFO]           resolve-artifact\pom.xml ......................... SUCCESS (4.4 s)
[INFO] -------------------------------------------------
[INFO] Build Summary:
[INFO]   Passed: 1, Failed: 0, Errors: 0, Skipped: 0
[INFO] -------------------------------------------------
[INFO]
[INFO] --- maven-checkstyle-plugin:3.0.0:check (checkstyle-check) @ maven-resolver-demo-maven-plugin ---
[INFO] ------------------------------------------------------------------------
[INFO] Reactor Summary for Maven Artifact Resolver 1.4.3-SNAPSHOT:
[INFO]
[INFO] Maven Artifact Resolver ............................ SUCCESS [ 49.683 s]
[INFO] Maven Artifact Resolver API ........................ SUCCESS [ 24.899 s]
[INFO] Maven Artifact Resolver SPI ........................ SUCCESS [  3.121 s]
[INFO] Maven Artifact Resolver Test Utilities ............. SUCCESS [  3.974 s]
[INFO] Maven Artifact Resolver Utilities .................. SUCCESS [ 13.017 s]
[INFO] Maven Artifact Resolver Implementation ............. SUCCESS [ 24.336 s]
[INFO] Maven Artifact Resolver Connector Basic ............ SUCCESS [  8.426 s]
[INFO] Maven Artifact Resolver Transport Classpath ........ SUCCESS [  2.425 s]
[INFO] Maven Artifact Resolver Transport File ............. SUCCESS [  2.527 s]
[INFO] Maven Artifact Resolver Transport HTTP ............. SUCCESS [ 11.112 s]
[INFO] Maven Artifact Resolver Transport Wagon ............ SUCCESS [  5.187 s]
[INFO] Maven Artifact Resolver Demos ...................... SUCCESS [  0.337 s]
[INFO] Maven Artifact Resolver Demo Snippets .............. SUCCESS [  2.886 s]
[INFO] Maven Artifact Resolver Demo Maven Plugin .......... SUCCESS [ 13.880 s]
[INFO] ------------------------------------------------------------------------
[INFO] BUILD SUCCESS
[INFO] ------------------------------------------------------------------------
[INFO] Total time:  02:47 min
[INFO] Finished at: 2020-06-18T06:01:21-07:00
[INFO] ------------------------------------------------------------------------
[INFO] [jenkins-event-spy] Generated F:\jenkins\jenkins-slave\workspace\maven-box_maven-resolver_master@2@tmp\withMaven66526e3b\maven-spy-20200618-055834-36215607171372111304603.log
[INFO] ------------------------------------------------------------------------
[INFO] Reactor Summary for Maven Artifact Resolver 1.4.3-SNAPSHOT:
[INFO]
[INFO] Maven Artifact Resolver ............................ SUCCESS [ 51.182 s]
[INFO] Maven Artifact Resolver API ........................ SUCCESS [ 26.221 s]
[INFO] Maven Artifact Resolver SPI ........................ SUCCESS [  2.120 s]
[INFO] Maven Artifact Resolver Test Utilities ............. SUCCESS [  3.864 s]
[INFO] Maven Artifact Resolver Utilities .................. SUCCESS [ 12.574 s]
[INFO] Maven Artifact Resolver Implementation ............. SUCCESS [ 24.702 s]
[INFO] Maven Artifact Resolver Connector Basic ............ SUCCESS [  8.565 s]
[INFO] Maven Artifact Resolver Transport Classpath ........ SUCCESS [  2.465 s]
[INFO] Maven Artifact Resolver Transport File ............. SUCCESS [  2.290 s]
[INFO] Maven Artifact Resolver Transport HTTP ............. SUCCESS [ 11.425 s]
[INFO] Maven Artifact Resolver Transport Wagon ............ SUCCESS [  5.126 s]
[INFO] Maven Artifact Resolver Demos ...................... SUCCESS [  0.340 s]
[INFO] Maven Artifact Resolver Demo Snippets .............. SUCCESS [  2.978 s]
[INFO] Maven Artifact Resolver Demo Maven Plugin .......... SUCCESS [ 13.746 s]
[INFO] ------------------------------------------------------------------------
[INFO] BUILD SUCCESS
[INFO] ------------------------------------------------------------------------
[INFO] Total time:  02:49 min
[INFO] Finished at: 2020-06-18T06:01:21-07:00
[INFO] ------------------------------------------------------------------------
[INFO] [jenkins-event-spy] Generated F:\jenkins\jenkins-slave\workspace\maven-box_maven-resolver_master@tmp\withMaven2c747a21\maven-spy-20200618-055831-1046699384122807734131.log
Picked up JAVA_TOOL_OPTIONS: -Dmaven.ext.class.path="f:\jenkins\jenkins-slave\workspace\maven-box_maven-resolver_master@tmp\withMaven2c747a21\pipeline-maven-spy.jar" -Dorg.jenkinsci.plugins.pipeline.maven.reportsFolder="f:\jenkins\jenkins-slave\workspace\maven-box_maven-resolver_master@tmp\withMaven2c747a21"
[Pipeline] cleanWs
[WS-CLEANUP] Deleting project workspace...
[WS-CLEANUP] Deferred wipeout is used...
[WS-CLEANUP] done
[withMaven] Publishers: Pipeline Graph Publisher: 14 ms, Invoker Publisher: 1174 ms, Junit Publisher: 55625 ms, Concordion Publisher: 1 ms, Dependencies Fingerprint Publisher: 9300 ms
[Pipeline] }
[Pipeline] }
[Pipeline] }
[Pipeline] }
[Pipeline] }
[Pipeline] // withMaven
[Pipeline] // dir
[Pipeline] // dir
[withMaven] junitPublisher - Archive test results for Maven artifact org.apache.maven.resolver:maven-resolver-api:jar:1.4.3-SNAPSHOT generated by maven-surefire-plugin:test (default-test): m/maven-resolver-api/target/surefire-reports/*.xml
[withMaven] junitPublisher - Archive test results for Maven artifact org.apache.maven.resolver:maven-resolver-spi:jar:1.4.3-SNAPSHOT generated by maven-surefire-plugin:test (default-test): m/maven-resolver-spi/target/surefire-reports/*.xml
[withMaven] junitPublisher - Archive test results for Maven artifact org.apache.maven.resolver:maven-resolver-test-util:jar:1.4.3-SNAPSHOT generated by maven-surefire-plugin:test (default-test): m/maven-resolver-test-util/target/surefire-reports/*.xml
[withMaven] junitPublisher - Archive test results for Maven artifact org.apache.maven.resolver:maven-resolver-util:jar:1.4.3-SNAPSHOT generated by maven-surefire-plugin:test (default-test): m/maven-resolver-util/target/surefire-reports/*.xml
[withMaven] junitPublisher - Archive test results for Maven artifact org.apache.maven.resolver:maven-resolver-impl:jar:1.4.3-SNAPSHOT generated by maven-surefire-plugin:test (default-test): m/maven-resolver-impl/target/surefire-reports/*.xml
[withMaven] junitPublisher - Archive test results for Maven artifact org.apache.maven.resolver:maven-resolver-connector-basic:jar:1.4.3-SNAPSHOT generated by maven-surefire-plugin:test (default-test): m/maven-resolver-connector-basic/target/surefire-reports/*.xml
[withMaven] junitPublisher - Archive test results for Maven artifact org.apache.maven.resolver:maven-resolver-transport-classpath:jar:1.4.3-SNAPSHOT generated by maven-surefire-plugin:test (default-test): m/maven-resolver-transport-classpath/target/surefire-reports/*.xml
[withMaven] junitPublisher - Archive test results for Maven artifact org.apache.maven.resolver:maven-resolver-transport-file:jar:1.4.3-SNAPSHOT generated by maven-surefire-plugin:test (default-test): m/maven-resolver-transport-file/target/surefire-reports/*.xml
[withMaven] junitPublisher - Archive test results for Maven artifact org.apache.maven.resolver:maven-resolver-transport-http:jar:1.4.3-SNAPSHOT generated by maven-surefire-plugin:test (default-test): m/maven-resolver-transport-http/target/surefire-reports/*.xml
[withMaven] junitPublisher - Archive test results for Maven artifact org.apache.maven.resolver:maven-resolver-transport-wagon:jar:1.4.3-SNAPSHOT generated by maven-surefire-plugin:test (default-test): m/maven-resolver-transport-wagon/target/surefire-reports/*.xml
[withMaven] junitPublisher - Archive test results for Maven artifact org.apache.maven.resolver:maven-resolver-demo-snippets:jar:1.4.3-SNAPSHOT generated by maven-surefire-plugin:test (default-test): m/maven-resolver-demos/maven-resolver-demo-snippets/target/surefire-reports/*.xml
[withMaven] junitPublisher - Archive test results for Maven artifact org.apache.maven.resolver:maven-resolver-demo-maven-plugin:maven-plugin:1.4.3-SNAPSHOT generated by maven-surefire-plugin:test (default-test): m/maven-resolver-demos/maven-resolver-demo-maven-plugin/target/surefire-reports/*.xml
Recording test results
[Pipeline] // dir
[Pipeline] // dir
[Pipeline] cleanWs
[Pipeline] }
[Pipeline] }
[Pipeline] }
[Pipeline] }
[Pipeline] // stage
[Pipeline] }
[withMaven] invokerPublisher - Archive invoker results for Maven artifact MavenArtifact{org.apache.maven.resolver:maven-resolver-demo-maven-plugin:maven-plugin:1.4.3-SNAPSHOT(version: 1.4.3-SNAPSHOT, snapshot:false) } generated by PluginInvocation{org.apache.maven.plugins:maven-invoker-plugin:3.2.1@run  integration-test}: m\maven-resolver-demos\maven-resolver-demo-maven-plugin\target\invoker-reports\*.xml
[withMaven] invokerPublisher - Archive invoker results for Maven artifact MavenArtifact{org.apache.maven.resolver:maven-resolver-demo-maven-plugin:maven-plugin:1.4.3-SNAPSHOT(version: 1.4.3-SNAPSHOT, snapshot:false) } generated by PluginInvocation{org.apache.maven.plugins:maven-invoker-plugin:3.2.1@run  integration-test}: m\maven-resolver-demos\maven-resolver-demo-maven-plugin\target\invoker-reports\*.xml
[Pipeline] // node
[WS-CLEANUP] Deleting project workspace...
[WS-CLEANUP] Deferred wipeout is used...
[Pipeline] }
[withMaven] invokerPublisher - Archive invoker results for Maven artifact MavenArtifact{org.apache.maven.resolver:maven-resolver-demo-maven-plugin:maven-plugin:1.4.3-SNAPSHOT(version: 1.4.3-SNAPSHOT, snapshot:false) } generated by PluginInvocation{org.apache.maven.plugins:maven-invoker-plugin:3.2.1@run  integration-test}: m\maven-resolver-demos\maven-resolver-demo-maven-plugin\target\invoker-reports\*.xml
[withMaven] invokerPublisher - Archive invoker results for Maven artifact MavenArtifact{org.apache.maven.resolver:maven-resolver-demo-maven-plugin:maven-plugin:1.4.3-SNAPSHOT(version: 1.4.3-SNAPSHOT, snapshot:false) } generated by PluginInvocation{org.apache.maven.plugins:maven-invoker-plugin:3.2.1@run  integration-test}: m\maven-resolver-demos\maven-resolver-demo-maven-plugin\target\invoker-reports\*.xml
[WS-CLEANUP] done
[Pipeline] }
[Pipeline] // stage
[Pipeline] }
[Pipeline] // node
[Pipeline] }
[withMaven] junitPublisher - Archive test results for Maven artifact org.apache.maven.resolver:maven-resolver-api:jar:1.4.3-SNAPSHOT generated by maven-surefire-plugin:test (default-test): m\maven-resolver-api\target\surefire-reports\*.xml
[withMaven] junitPublisher - Archive test results for Maven artifact org.apache.maven.resolver:maven-resolver-spi:jar:1.4.3-SNAPSHOT generated by maven-surefire-plugin:test (default-test): m\maven-resolver-spi\target\surefire-reports\*.xml
[withMaven] junitPublisher - Archive test results for Maven artifact org.apache.maven.resolver:maven-resolver-test-util:jar:1.4.3-SNAPSHOT generated by maven-surefire-plugin:test (default-test): m\maven-resolver-test-util\target\surefire-reports\*.xml
[withMaven] junitPublisher - Archive test results for Maven artifact org.apache.maven.resolver:maven-resolver-util:jar:1.4.3-SNAPSHOT generated by maven-surefire-plugin:test (default-test): m\maven-resolver-util\target\surefire-reports\*.xml
[withMaven] junitPublisher - Archive test results for Maven artifact org.apache.maven.resolver:maven-resolver-impl:jar:1.4.3-SNAPSHOT generated by maven-surefire-plugin:test (default-test): m\maven-resolver-impl\target\surefire-reports\*.xml
[withMaven] junitPublisher - Archive test results for Maven artifact org.apache.maven.resolver:maven-resolver-connector-basic:jar:1.4.3-SNAPSHOT generated by maven-surefire-plugin:test (default-test): m\maven-resolver-connector-basic\target\surefire-reports\*.xml
[withMaven] junitPublisher - Archive test results for Maven artifact org.apache.maven.resolver:maven-resolver-transport-classpath:jar:1.4.3-SNAPSHOT generated by maven-surefire-plugin:test (default-test): m\maven-resolver-transport-classpath\target\surefire-reports\*.xml
[withMaven] junitPublisher - Archive test results for Maven artifact org.apache.maven.resolver:maven-resolver-transport-file:jar:1.4.3-SNAPSHOT generated by maven-surefire-plugin:test (default-test): m\maven-resolver-transport-file\target\surefire-reports\*.xml
[withMaven] junitPublisher - Archive test results for Maven artifact org.apache.maven.resolver:maven-resolver-transport-http:jar:1.4.3-SNAPSHOT generated by maven-surefire-plugin:test (default-test): m\maven-resolver-transport-http\target\surefire-reports\*.xml
[withMaven] junitPublisher - Archive test results for Maven artifact org.apache.maven.resolver:maven-resolver-transport-wagon:jar:1.4.3-SNAPSHOT generated by maven-surefire-plugin:test (default-test): m\maven-resolver-transport-wagon\target\surefire-reports\*.xml
[withMaven] junitPublisher - Archive test results for Maven artifact org.apache.maven.resolver:maven-resolver-demo-snippets:jar:1.4.3-SNAPSHOT generated by maven-surefire-plugin:test (default-test): m\maven-resolver-demos\maven-resolver-demo-snippets\target\surefire-reports\*.xml
[withMaven] junitPublisher - Archive test results for Maven artifact org.apache.maven.resolver:maven-resolver-demo-maven-plugin:maven-plugin:1.4.3-SNAPSHOT generated by maven-surefire-plugin:test (default-test): m\maven-resolver-demos\maven-resolver-demo-maven-plugin\target\surefire-reports\*.xml
Recording test results
[withMaven] junitPublisher - Archive test results for Maven artifact org.apache.maven.resolver:maven-resolver-api:jar:1.4.3-SNAPSHOT generated by maven-surefire-plugin:test (default-test): m\maven-resolver-api\target\surefire-reports\*.xml
[withMaven] junitPublisher - Archive test results for Maven artifact org.apache.maven.resolver:maven-resolver-spi:jar:1.4.3-SNAPSHOT generated by maven-surefire-plugin:test (default-test): m\maven-resolver-spi\target\surefire-reports\*.xml
[withMaven] junitPublisher - Archive test results for Maven artifact org.apache.maven.resolver:maven-resolver-test-util:jar:1.4.3-SNAPSHOT generated by maven-surefire-plugin:test (default-test): m\maven-resolver-test-util\target\surefire-reports\*.xml
[withMaven] junitPublisher - Archive test results for Maven artifact org.apache.maven.resolver:maven-resolver-util:jar:1.4.3-SNAPSHOT generated by maven-surefire-plugin:test (default-test): m\maven-resolver-util\target\surefire-reports\*.xml
[withMaven] junitPublisher - Archive test results for Maven artifact org.apache.maven.resolver:maven-resolver-impl:jar:1.4.3-SNAPSHOT generated by maven-surefire-plugin:test (default-test): m\maven-resolver-impl\target\surefire-reports\*.xml
[withMaven] junitPublisher - Archive test results for Maven artifact org.apache.maven.resolver:maven-resolver-connector-basic:jar:1.4.3-SNAPSHOT generated by maven-surefire-plugin:test (default-test): m\maven-resolver-connector-basic\target\surefire-reports\*.xml
[withMaven] junitPublisher - Archive test results for Maven artifact org.apache.maven.resolver:maven-resolver-transport-classpath:jar:1.4.3-SNAPSHOT generated by maven-surefire-plugin:test (default-test): m\maven-resolver-transport-classpath\target\surefire-reports\*.xml
[withMaven] junitPublisher - Archive test results for Maven artifact org.apache.maven.resolver:maven-resolver-transport-file:jar:1.4.3-SNAPSHOT generated by maven-surefire-plugin:test (default-test): m\maven-resolver-transport-file\target\surefire-reports\*.xml
[withMaven] junitPublisher - Archive test results for Maven artifact org.apache.maven.resolver:maven-resolver-transport-http:jar:1.4.3-SNAPSHOT generated by maven-surefire-plugin:test (default-test): m\maven-resolver-transport-http\target\surefire-reports\*.xml
[withMaven] junitPublisher - Archive test results for Maven artifact org.apache.maven.resolver:maven-resolver-transport-wagon:jar:1.4.3-SNAPSHOT generated by maven-surefire-plugin:test (default-test): m\maven-resolver-transport-wagon\target\surefire-reports\*.xml
[withMaven] junitPublisher - Archive test results for Maven artifact org.apache.maven.resolver:maven-resolver-demo-snippets:jar:1.4.3-SNAPSHOT generated by maven-surefire-plugin:test (default-test): m\maven-resolver-demos\maven-resolver-demo-snippets\target\surefire-reports\*.xml
[withMaven] junitPublisher - Archive test results for Maven artifact org.apache.maven.resolver:maven-resolver-demo-maven-plugin:maven-plugin:1.4.3-SNAPSHOT generated by maven-surefire-plugin:test (default-test): m\maven-resolver-demos\maven-resolver-demo-maven-plugin\target\surefire-reports\*.xml
Recording test results
[withMaven] Publishers: Pipeline Graph Publisher: 12 ms, Invoker Publisher: 1174 ms, Junit Publisher: 107344 ms, Concordion Publisher: 1 ms, Dependencies Fingerprint Publisher: 9103 ms, JGiven Publisher: 1 ms
[Pipeline] // withMaven
[Pipeline] cleanWs
[WS-CLEANUP] Deleting project workspace...
[WS-CLEANUP] Deferred wipeout is used...
[WS-CLEANUP] done
[withMaven] Publishers: Pipeline Graph Publisher: 59 ms, Invoker Publisher: 646 ms, Junit Publisher: 57120 ms, Dependencies Fingerprint Publisher: 408 ms
[withMaven] junitPublisher - Archive test results for Maven artifact org.apache.maven.resolver:maven-resolver-api:jar:1.4.3-SNAPSHOT generated by maven-surefire-plugin:test (default-test): m\maven-resolver-api\target\surefire-reports\*.xml
[withMaven] junitPublisher - Archive test results for Maven artifact org.apache.maven.resolver:maven-resolver-spi:jar:1.4.3-SNAPSHOT generated by maven-surefire-plugin:test (default-test): m\maven-resolver-spi\target\surefire-reports\*.xml
[withMaven] junitPublisher - Archive test results for Maven artifact org.apache.maven.resolver:maven-resolver-test-util:jar:1.4.3-SNAPSHOT generated by maven-surefire-plugin:test (default-test): m\maven-resolver-test-util\target\surefire-reports\*.xml
[withMaven] junitPublisher - Archive test results for Maven artifact org.apache.maven.resolver:maven-resolver-util:jar:1.4.3-SNAPSHOT generated by maven-surefire-plugin:test (default-test): m\maven-resolver-util\target\surefire-reports\*.xml
[withMaven] junitPublisher - Archive test results for Maven artifact org.apache.maven.resolver:maven-resolver-impl:jar:1.4.3-SNAPSHOT generated by maven-surefire-plugin:test (default-test): m\maven-resolver-impl\target\surefire-reports\*.xml
[withMaven] junitPublisher - Archive test results for Maven artifact org.apache.maven.resolver:maven-resolver-connector-basic:jar:1.4.3-SNAPSHOT generated by maven-surefire-plugin:test (default-test): m\maven-resolver-connector-basic\target\surefire-reports\*.xml
[withMaven] junitPublisher - Archive test results for Maven artifact org.apache.maven.resolver:maven-resolver-transport-classpath:jar:1.4.3-SNAPSHOT generated by maven-surefire-plugin:test (default-test): m\maven-resolver-transport-classpath\target\surefire-reports\*.xml
[withMaven] junitPublisher - Archive test results for Maven artifact org.apache.maven.resolver:maven-resolver-transport-file:jar:1.4.3-SNAPSHOT generated by maven-surefire-plugin:test (default-test): m\maven-resolver-transport-file\target\surefire-reports\*.xml
[withMaven] junitPublisher - Archive test results for Maven artifact org.apache.maven.resolver:maven-resolver-transport-http:jar:1.4.3-SNAPSHOT generated by maven-surefire-plugin:test (default-test): m\maven-resolver-transport-http\target\surefire-reports\*.xml
[withMaven] junitPublisher - Archive test results for Maven artifact org.apache.maven.resolver:maven-resolver-transport-wagon:jar:1.4.3-SNAPSHOT generated by maven-surefire-plugin:test (default-test): m\maven-resolver-transport-wagon\target\surefire-reports\*.xml
[withMaven] junitPublisher - Archive test results for Maven artifact org.apache.maven.resolver:maven-resolver-demo-snippets:jar:1.4.3-SNAPSHOT generated by maven-surefire-plugin:test (default-test): m\maven-resolver-demos\maven-resolver-demo-snippets\target\surefire-reports\*.xml
[withMaven] junitPublisher - Archive test results for Maven artifact org.apache.maven.resolver:maven-resolver-demo-maven-plugin:maven-plugin:1.4.3-SNAPSHOT generated by maven-surefire-plugin:test (default-test): m\maven-resolver-demos\maven-resolver-demo-maven-plugin\target\surefire-reports\*.xml
Recording test results
[withMaven] junitPublisher - Archive test results for Maven artifact org.apache.maven.resolver:maven-resolver-api:jar:1.4.3-SNAPSHOT generated by maven-surefire-plugin:test (default-test): m\maven-resolver-api\target\surefire-reports\*.xml
[withMaven] junitPublisher - Archive test results for Maven artifact org.apache.maven.resolver:maven-resolver-spi:jar:1.4.3-SNAPSHOT generated by maven-surefire-plugin:test (default-test): m\maven-resolver-spi\target\surefire-reports\*.xml
[withMaven] junitPublisher - Archive test results for Maven artifact org.apache.maven.resolver:maven-resolver-test-util:jar:1.4.3-SNAPSHOT generated by maven-surefire-plugin:test (default-test): m\maven-resolver-test-util\target\surefire-reports\*.xml
[withMaven] junitPublisher - Archive test results for Maven artifact org.apache.maven.resolver:maven-resolver-util:jar:1.4.3-SNAPSHOT generated by maven-surefire-plugin:test (default-test): m\maven-resolver-util\target\surefire-reports\*.xml
[withMaven] junitPublisher - Archive test results for Maven artifact org.apache.maven.resolver:maven-resolver-impl:jar:1.4.3-SNAPSHOT generated by maven-surefire-plugin:test (default-test): m\maven-resolver-impl\target\surefire-reports\*.xml
[withMaven] junitPublisher - Archive test results for Maven artifact org.apache.maven.resolver:maven-resolver-connector-basic:jar:1.4.3-SNAPSHOT generated by maven-surefire-plugin:test (default-test): m\maven-resolver-connector-basic\target\surefire-reports\*.xml
[withMaven] junitPublisher - Archive test results for Maven artifact org.apache.maven.resolver:maven-resolver-transport-classpath:jar:1.4.3-SNAPSHOT generated by maven-surefire-plugin:test (default-test): m\maven-resolver-transport-classpath\target\surefire-reports\*.xml
[withMaven] junitPublisher - Archive test results for Maven artifact org.apache.maven.resolver:maven-resolver-transport-file:jar:1.4.3-SNAPSHOT generated by maven-surefire-plugin:test (default-test): m\maven-resolver-transport-file\target\surefire-reports\*.xml
[withMaven] junitPublisher - Archive test results for Maven artifact org.apache.maven.resolver:maven-resolver-transport-http:jar:1.4.3-SNAPSHOT generated by maven-surefire-plugin:test (default-test): m\maven-resolver-transport-http\target\surefire-reports\*.xml
[withMaven] junitPublisher - Archive test results for Maven artifact org.apache.maven.resolver:maven-resolver-transport-wagon:jar:1.4.3-SNAPSHOT generated by maven-surefire-plugin:test (default-test): m\maven-resolver-transport-wagon\target\surefire-reports\*.xml
[withMaven] junitPublisher - Archive test results for Maven artifact org.apache.maven.resolver:maven-resolver-demo-snippets:jar:1.4.3-SNAPSHOT generated by maven-surefire-plugin:test (default-test): m\maven-resolver-demos\maven-resolver-demo-snippets\target\surefire-reports\*.xml
[withMaven] junitPublisher - Archive test results for Maven artifact org.apache.maven.resolver:maven-resolver-demo-maven-plugin:maven-plugin:1.4.3-SNAPSHOT generated by maven-surefire-plugin:test (default-test): m\maven-resolver-demos\maven-resolver-demo-maven-plugin\target\surefire-reports\*.xml
Recording test results
[Pipeline] // withMaven
[Pipeline] }
[Pipeline] cleanWs
[WS-CLEANUP] Deleting project workspace...
[WS-CLEANUP] Deferred wipeout is used...
[WS-CLEANUP] done
[Pipeline] // stage
[Pipeline] }
[Pipeline] }
[Pipeline] // node
[Pipeline] // stage
[Pipeline] }
[Pipeline] }
[Pipeline] // node
[Pipeline] }
[withMaven] Publishers: Pipeline Graph Publisher: 57 ms, Invoker Publisher: 638 ms, Junit Publisher: 59216 ms, Concordion Publisher: 1 ms, Dependencies Fingerprint Publisher: 1225 ms, JGiven Publisher: 1 ms
[Pipeline] // withMaven
[Pipeline] cleanWs
[WS-CLEANUP] Deleting project workspace...
[WS-CLEANUP] Deferred wipeout is used...
[WS-CLEANUP] done
[withMaven] Publishers: Pipeline Graph Publisher: 9 ms, Invoker Publisher: 59750 ms, Junit Publisher: 3744 ms, Dependencies Fingerprint Publisher: 430 ms
[Pipeline] // withMaven
[Pipeline] }
[Pipeline] cleanWs
[withMaven] Publishers: Pipeline Graph Publisher: 9 ms, Invoker Publisher: 108508 ms, Junit Publisher: 55954 ms, Concordion Publisher: 1 ms, Dependencies Fingerprint Publisher: 9255 ms, JGiven Publisher: 1 ms
[WS-CLEANUP] Deleting project workspace...
[WS-CLEANUP] Deferred wipeout is used...
[Pipeline] // stage
[Pipeline] }
[WS-CLEANUP] done
[Pipeline] // node
[Pipeline] }
[Pipeline] }
[Pipeline] // stage
[Pipeline] }
[Pipeline] // node
[Pipeline] }
[Pipeline] // withMaven
[Pipeline] cleanWs
[WS-CLEANUP] Deleting project workspace...
[WS-CLEANUP] Deferred wipeout is used...
[withMaven] Publishers: Pipeline Graph Publisher: 5 ms, Invoker Publisher: 59756 ms, Junit Publisher: 5872 ms, Dependencies Fingerprint Publisher: 755 ms
[WS-CLEANUP] done
[Pipeline] }
[Pipeline] // withMaven
[Pipeline] // stage
[Pipeline] }
[Pipeline] cleanWs
[WS-CLEANUP] Deleting project workspace...
[WS-CLEANUP] Deferred wipeout is used...
[Pipeline] // node
[Pipeline] }
[WS-CLEANUP] done
[Pipeline] }
[Pipeline] // stage
[Pipeline] }
[Pipeline] // node
[Pipeline] }
[Pipeline] // parallel
[Pipeline] echo
[FAILURE-003] AbortException hudson.AbortException: script returned exit code 1
[Pipeline] stage
[Pipeline] { (Notifications)
[Pipeline] echo
Build result: FAILURE
[Pipeline] jiraIssueSelector
[Pipeline] echo
The authors of changes [slachiewicz].
[Pipeline] echo
Sending email ...
[Pipeline] emailext
Reply | Threaded
Open this post in threaded view
|

Build succeeded in Jenkins: Maven TLP » maven-resolver » master #84

Apache Jenkins Server-2