Build failed in Jenkins: Maven TLP » maven-resolver » master #46

classic Classic list List threaded Threaded
4 messages Options
Reply | Threaded
Open this post in threaded view
|

Build failed in Jenkins: Maven TLP » maven-resolver » master #46

Apache Jenkins Server-2
See https://builds.apache.org/job/maven-box/job/maven-resolver/job/master/46/

Changes:

* Removed exclusion for problematic node cause the node is back online.
* reduce the history archiving
* reduce the history archiving
* increase a bit archiving
* increase a bit archiving
* Activate sonarqube on first project
* Disable sonar:sonar for now
* use publisherStrategy: 'EXPLICIT' to avoid non used publishers
* [INFRA-17514] Fix file separator + add other locations for workspaces
* fix indent
* use a special local repo to have a bit of caching

All tests passed

Build log:
[...truncated 2.85 MB...]
[windows-jdk8] [INFO] ------------------------------------------------------------------------
[windows-jdk8] [INFO] Total time: 02:10 min
[windows-jdk8] [INFO] Finished at: 2018-12-30T10:50:31Z
[windows-jdk8] [INFO] Final Memory: 71M/794M
[windows-jdk8] [INFO] ------------------------------------------------------------------------
[windows-jdk8] [INFO] [jenkins-event-spy] Generated F:\jenkins\jenkins-slave\workspace\n-box_maven-resolver_master-L2RUGOEIK5O5H3FE4SPFSXXNL7FPE37KLTBGLDWAT7DNTIKVZVEQ@tmp\withMavend7f05b28\maven-spy-20181230-104820-3868700496226054223748.log
[windows-jdk8] Picked up JAVA_TOOL_OPTIONS: -Dmaven.ext.class.path="f:\jenkins\jenkins-slave\workspace\n-box_maven-resolver_master-L2RUGOEIK5O5H3FE4SPFSXXNL7FPE37KLTBGLDWAT7DNTIKVZVEQ@tmp\withMavend7f05b28\pipeline-maven-spy.jar" -Dorg.jenkinsci.plugins.pipeline.maven.reportsFolder="f:\jenkins\jenkins-slave\workspace\n-box_maven-resolver_master-L2RUGOEIK5O5H3FE4SPFSXXNL7FPE37KLTBGLDWAT7DNTIKVZVEQ@tmp\withMavend7f05b28"
[Pipeline] [linux-jdk8] }
[linux-jdk8] [withMaven] invokerPublisher - Archive invoker results for Maven artifact MavenArtifact{org.apache.maven.resolver:maven-resolver-demo-maven-plugin::1.3.2-SNAPSHOT(version: 1.3.2-SNAPSHOT, snapshot:false) } generated by PluginInvocation{org.apache.maven.plugins:maven-invoker-plugin:3.0.1@run  integration-test}: m/maven-resolver-demos/maven-resolver-demo-maven-plugin/target/invoker-reports/*.xml
[linux-jdk8] [withMaven] junitPublisher - Archive test results for Maven artifact org.apache.maven.resolver:maven-resolver-api:1.3.2-SNAPSHOT generated by maven-surefire-plugin:test (default-test): m/maven-resolver-api/target/surefire-reports/*.xml
[linux-jdk8] Recording test results
[linux-jdk8] [withMaven] junitPublisher - Archive test results for Maven artifact org.apache.maven.resolver:maven-resolver-spi:1.3.2-SNAPSHOT generated by maven-surefire-plugin:test (default-test): m/maven-resolver-spi/target/surefire-reports/*.xml
[linux-jdk8] Recording test results
[linux-jdk8] [withMaven] junitPublisher - Archive test results for Maven artifact org.apache.maven.resolver:maven-resolver-test-util:1.3.2-SNAPSHOT generated by maven-surefire-plugin:test (default-test): m/maven-resolver-test-util/target/surefire-reports/*.xml
[linux-jdk8] Recording test results
[linux-jdk8] [withMaven] junitPublisher - Archive test results for Maven artifact org.apache.maven.resolver:maven-resolver-util:1.3.2-SNAPSHOT generated by maven-surefire-plugin:test (default-test): m/maven-resolver-util/target/surefire-reports/*.xml
[linux-jdk8] Recording test results
[linux-jdk8] [withMaven] junitPublisher - Archive test results for Maven artifact org.apache.maven.resolver:maven-resolver-impl:1.3.2-SNAPSHOT generated by maven-surefire-plugin:test (default-test): m/maven-resolver-impl/target/surefire-reports/*.xml
[linux-jdk8] Recording test results
[linux-jdk8] [withMaven] junitPublisher - Archive test results for Maven artifact org.apache.maven.resolver:maven-resolver-connector-basic:1.3.2-SNAPSHOT generated by maven-surefire-plugin:test (default-test): m/maven-resolver-connector-basic/target/surefire-reports/*.xml
[linux-jdk8] Recording test results
[linux-jdk8] [withMaven] junitPublisher - Archive test results for Maven artifact org.apache.maven.resolver:maven-resolver-transport-classpath:1.3.2-SNAPSHOT generated by maven-surefire-plugin:test (default-test): m/maven-resolver-transport-classpath/target/surefire-reports/*.xml
[linux-jdk8] Recording test results
[linux-jdk8] [withMaven] junitPublisher - Archive test results for Maven artifact org.apache.maven.resolver:maven-resolver-transport-file:1.3.2-SNAPSHOT generated by maven-surefire-plugin:test (default-test): m/maven-resolver-transport-file/target/surefire-reports/*.xml
[linux-jdk8] Recording test results
[linux-jdk8] [withMaven] junitPublisher - Archive test results for Maven artifact org.apache.maven.resolver:maven-resolver-transport-http:1.3.2-SNAPSHOT generated by maven-surefire-plugin:test (default-test): m/maven-resolver-transport-http/target/surefire-reports/*.xml
[linux-jdk8] Recording test results
[linux-jdk8] [withMaven] junitPublisher - Archive test results for Maven artifact org.apache.maven.resolver:maven-resolver-transport-wagon:1.3.2-SNAPSHOT generated by maven-surefire-plugin:test (default-test): m/maven-resolver-transport-wagon/target/surefire-reports/*.xml
[linux-jdk8] Recording test results
[linux-jdk8] [withMaven] junitPublisher - Archive test results for Maven artifact org.apache.maven.resolver:maven-resolver-demo-snippets:1.3.2-SNAPSHOT generated by maven-surefire-plugin:test (default-test): m/maven-resolver-demos/maven-resolver-demo-snippets/target/surefire-reports/*.xml
[linux-jdk8] Recording test results
[linux-jdk8] None of the test reports contained any result
[linux-jdk8] [withMaven] junitPublisher - Archive test results for Maven artifact org.apache.maven.resolver:maven-resolver-demo-maven-plugin:1.3.2-SNAPSHOT generated by maven-surefire-plugin:test (default-test): m/maven-resolver-demos/maven-resolver-demo-maven-plugin/target/surefire-reports/*.xml
[linux-jdk8] Recording test results
[linux-jdk8] None of the test reports contained any result
[Pipeline] [linux-jdk7] }
[linux-jdk7] [withMaven] artifactsPublisher - Archive artifact m/pom.xml under org/apache/maven/resolver/maven-resolver/1.3.2-SNAPSHOT/maven-resolver-1.3.2-SNAPSHOT.pom
[linux-jdk7] [withMaven] artifactsPublisher - Archive artifact m/target/maven-resolver-1.3.2-SNAPSHOT-site.xml under org/apache/maven/resolver/maven-resolver/1.3.2-SNAPSHOT/maven-resolver-1.3.2-SNAPSHOT-site.xml
[linux-jdk7] [withMaven] artifactsPublisher - Archive artifact m/maven-resolver-api/pom.xml under org/apache/maven/resolver/maven-resolver-api/1.3.2-SNAPSHOT/maven-resolver-api-1.3.2-SNAPSHOT.pom
[linux-jdk7] [withMaven] artifactsPublisher - Archive artifact m/maven-resolver-api/target/maven-resolver-api-1.3.2-SNAPSHOT.jar under org/apache/maven/resolver/maven-resolver-api/1.3.2-SNAPSHOT/maven-resolver-api-1.3.2-SNAPSHOT.jar
[linux-jdk7] [withMaven] artifactsPublisher - Archive artifact m/maven-resolver-spi/pom.xml under org/apache/maven/resolver/maven-resolver-spi/1.3.2-SNAPSHOT/maven-resolver-spi-1.3.2-SNAPSHOT.pom
[linux-jdk7] [withMaven] artifactsPublisher - Archive artifact m/maven-resolver-spi/target/maven-resolver-spi-1.3.2-SNAPSHOT.jar under org/apache/maven/resolver/maven-resolver-spi/1.3.2-SNAPSHOT/maven-resolver-spi-1.3.2-SNAPSHOT.jar
[linux-jdk7] [withMaven] artifactsPublisher - Archive artifact m/maven-resolver-test-util/pom.xml under org/apache/maven/resolver/maven-resolver-test-util/1.3.2-SNAPSHOT/maven-resolver-test-util-1.3.2-SNAPSHOT.pom
[linux-jdk7] [withMaven] artifactsPublisher - Archive artifact m/maven-resolver-test-util/target/maven-resolver-test-util-1.3.2-SNAPSHOT.jar under org/apache/maven/resolver/maven-resolver-test-util/1.3.2-SNAPSHOT/maven-resolver-test-util-1.3.2-SNAPSHOT.jar
[linux-jdk7] [withMaven] artifactsPublisher - Archive artifact m/maven-resolver-util/pom.xml under org/apache/maven/resolver/maven-resolver-util/1.3.2-SNAPSHOT/maven-resolver-util-1.3.2-SNAPSHOT.pom
[linux-jdk7] [withMaven] artifactsPublisher - Archive artifact m/maven-resolver-util/target/maven-resolver-util-1.3.2-SNAPSHOT.jar under org/apache/maven/resolver/maven-resolver-util/1.3.2-SNAPSHOT/maven-resolver-util-1.3.2-SNAPSHOT.jar
[linux-jdk7] [withMaven] artifactsPublisher - Archive artifact m/maven-resolver-impl/pom.xml under org/apache/maven/resolver/maven-resolver-impl/1.3.2-SNAPSHOT/maven-resolver-impl-1.3.2-SNAPSHOT.pom
[linux-jdk7] [withMaven] artifactsPublisher - Archive artifact m/maven-resolver-impl/target/maven-resolver-impl-1.3.2-SNAPSHOT.jar under org/apache/maven/resolver/maven-resolver-impl/1.3.2-SNAPSHOT/maven-resolver-impl-1.3.2-SNAPSHOT.jar
[linux-jdk7] [withMaven] artifactsPublisher - Archive artifact m/maven-resolver-connector-basic/pom.xml under org/apache/maven/resolver/maven-resolver-connector-basic/1.3.2-SNAPSHOT/maven-resolver-connector-basic-1.3.2-SNAPSHOT.pom
[linux-jdk7] [withMaven] artifactsPublisher - Archive artifact m/maven-resolver-connector-basic/target/maven-resolver-connector-basic-1.3.2-SNAPSHOT.jar under org/apache/maven/resolver/maven-resolver-connector-basic/1.3.2-SNAPSHOT/maven-resolver-connector-basic-1.3.2-SNAPSHOT.jar
[linux-jdk7] [withMaven] artifactsPublisher - Archive artifact m/maven-resolver-transport-classpath/pom.xml under org/apache/maven/resolver/maven-resolver-transport-classpath/1.3.2-SNAPSHOT/maven-resolver-transport-classpath-1.3.2-SNAPSHOT.pom
[linux-jdk7] [withMaven] artifactsPublisher - Archive artifact m/maven-resolver-transport-classpath/target/maven-resolver-transport-classpath-1.3.2-SNAPSHOT.jar under org/apache/maven/resolver/maven-resolver-transport-classpath/1.3.2-SNAPSHOT/maven-resolver-transport-classpath-1.3.2-SNAPSHOT.jar
[linux-jdk7] [withMaven] artifactsPublisher - Archive artifact m/maven-resolver-transport-file/pom.xml under org/apache/maven/resolver/maven-resolver-transport-file/1.3.2-SNAPSHOT/maven-resolver-transport-file-1.3.2-SNAPSHOT.pom
[linux-jdk7] [withMaven] artifactsPublisher - Archive artifact m/maven-resolver-transport-file/target/maven-resolver-transport-file-1.3.2-SNAPSHOT.jar under org/apache/maven/resolver/maven-resolver-transport-file/1.3.2-SNAPSHOT/maven-resolver-transport-file-1.3.2-SNAPSHOT.jar
[linux-jdk7] [withMaven] artifactsPublisher - Archive artifact m/maven-resolver-transport-http/pom.xml under org/apache/maven/resolver/maven-resolver-transport-http/1.3.2-SNAPSHOT/maven-resolver-transport-http-1.3.2-SNAPSHOT.pom
[linux-jdk7] [withMaven] artifactsPublisher - Archive artifact m/maven-resolver-transport-http/target/maven-resolver-transport-http-1.3.2-SNAPSHOT.jar under org/apache/maven/resolver/maven-resolver-transport-http/1.3.2-SNAPSHOT/maven-resolver-transport-http-1.3.2-SNAPSHOT.jar
[linux-jdk7] [withMaven] artifactsPublisher - Archive artifact m/maven-resolver-transport-wagon/pom.xml under org/apache/maven/resolver/maven-resolver-transport-wagon/1.3.2-SNAPSHOT/maven-resolver-transport-wagon-1.3.2-SNAPSHOT.pom
[linux-jdk7] [withMaven] artifactsPublisher - Archive artifact m/maven-resolver-transport-wagon/target/maven-resolver-transport-wagon-1.3.2-SNAPSHOT.jar under org/apache/maven/resolver/maven-resolver-transport-wagon/1.3.2-SNAPSHOT/maven-resolver-transport-wagon-1.3.2-SNAPSHOT.jar
[linux-jdk7] [withMaven] artifactsPublisher - Archive artifact m/maven-resolver-demos/pom.xml under org/apache/maven/resolver/maven-resolver-demos/1.3.2-SNAPSHOT/maven-resolver-demos-1.3.2-SNAPSHOT.pom
[linux-jdk7] [withMaven] artifactsPublisher - Archive artifact m/maven-resolver-demos/target/maven-resolver-demos-1.3.2-SNAPSHOT-site.xml under org/apache/maven/resolver/maven-resolver-demos/1.3.2-SNAPSHOT/maven-resolver-demos-1.3.2-SNAPSHOT-site.xml
[linux-jdk7] [withMaven] artifactsPublisher - Archive artifact m/maven-resolver-demos/maven-resolver-demo-snippets/pom.xml under org/apache/maven/resolver/maven-resolver-demo-snippets/1.3.2-SNAPSHOT/maven-resolver-demo-snippets-1.3.2-SNAPSHOT.pom
[linux-jdk7] [withMaven] artifactsPublisher - Archive artifact m/maven-resolver-demos/maven-resolver-demo-snippets/target/maven-resolver-demo-snippets-1.3.2-SNAPSHOT.jar under org/apache/maven/resolver/maven-resolver-demo-snippets/1.3.2-SNAPSHOT/maven-resolver-demo-snippets-1.3.2-SNAPSHOT.jar
[linux-jdk7] [withMaven] artifactsPublisher - Archive artifact m/maven-resolver-demos/maven-resolver-demo-maven-plugin/pom.xml under org/apache/maven/resolver/maven-resolver-demo-maven-plugin/1.3.2-SNAPSHOT/maven-resolver-demo-maven-plugin-1.3.2-SNAPSHOT.pom
[linux-jdk7] [withMaven] artifactsPublisher - Archive artifact m/maven-resolver-demos/maven-resolver-demo-maven-plugin/target/maven-resolver-demo-maven-plugin-1.3.2-SNAPSHOT.jar under org/apache/maven/resolver/maven-resolver-demo-maven-plugin/1.3.2-SNAPSHOT/maven-resolver-demo-maven-plugin-1.3.2-SNAPSHOT.jar
[linux-jdk7] [withMaven] invokerPublisher - Archive invoker results for Maven artifact MavenArtifact{org.apache.maven.resolver:maven-resolver-demo-maven-plugin::1.3.2-SNAPSHOT(version: 1.3.2-SNAPSHOT, snapshot:false) } generated by PluginInvocation{org.apache.maven.plugins:maven-invoker-plugin:3.0.1@run  integration-test}: m/maven-resolver-demos/maven-resolver-demo-maven-plugin/target/invoker-reports/*.xml
[linux-jdk7] [withMaven] junitPublisher - Archive test results for Maven artifact org.apache.maven.resolver:maven-resolver-api:1.3.2-SNAPSHOT generated by maven-surefire-plugin:test (default-test): m/maven-resolver-api/target/surefire-reports/*.xml
[linux-jdk7] Recording test results
[linux-jdk7] [withMaven] junitPublisher - Archive test results for Maven artifact org.apache.maven.resolver:maven-resolver-spi:1.3.2-SNAPSHOT generated by maven-surefire-plugin:test (default-test): m/maven-resolver-spi/target/surefire-reports/*.xml
[linux-jdk7] Recording test results
[linux-jdk7] [withMaven] junitPublisher - Archive test results for Maven artifact org.apache.maven.resolver:maven-resolver-test-util:1.3.2-SNAPSHOT generated by maven-surefire-plugin:test (default-test): m/maven-resolver-test-util/target/surefire-reports/*.xml
[linux-jdk7] Recording test results
[linux-jdk7] [withMaven] junitPublisher - Archive test results for Maven artifact org.apache.maven.resolver:maven-resolver-util:1.3.2-SNAPSHOT generated by maven-surefire-plugin:test (default-test): m/maven-resolver-util/target/surefire-reports/*.xml
[linux-jdk7] Recording test results
[linux-jdk7] [withMaven] junitPublisher - Archive test results for Maven artifact org.apache.maven.resolver:maven-resolver-impl:1.3.2-SNAPSHOT generated by maven-surefire-plugin:test (default-test): m/maven-resolver-impl/target/surefire-reports/*.xml
[linux-jdk7] Recording test results
[linux-jdk7] [withMaven] junitPublisher - Archive test results for Maven artifact org.apache.maven.resolver:maven-resolver-connector-basic:1.3.2-SNAPSHOT generated by maven-surefire-plugin:test (default-test): m/maven-resolver-connector-basic/target/surefire-reports/*.xml
[linux-jdk7] Recording test results
[linux-jdk7] [withMaven] junitPublisher - Archive test results for Maven artifact org.apache.maven.resolver:maven-resolver-transport-classpath:1.3.2-SNAPSHOT generated by maven-surefire-plugin:test (default-test): m/maven-resolver-transport-classpath/target/surefire-reports/*.xml
[linux-jdk7] Recording test results
[linux-jdk7] [withMaven] junitPublisher - Archive test results for Maven artifact org.apache.maven.resolver:maven-resolver-transport-file:1.3.2-SNAPSHOT generated by maven-surefire-plugin:test (default-test): m/maven-resolver-transport-file/target/surefire-reports/*.xml
[linux-jdk7] Recording test results
[linux-jdk7] [withMaven] junitPublisher - Archive test results for Maven artifact org.apache.maven.resolver:maven-resolver-transport-http:1.3.2-SNAPSHOT generated by maven-surefire-plugin:test (default-test): m/maven-resolver-transport-http/target/surefire-reports/*.xml
[linux-jdk7] Recording test results
[linux-jdk7] [withMaven] junitPublisher - Archive test results for Maven artifact org.apache.maven.resolver:maven-resolver-transport-wagon:1.3.2-SNAPSHOT generated by maven-surefire-plugin:test (default-test): m/maven-resolver-transport-wagon/target/surefire-reports/*.xml
[linux-jdk7] Recording test results
[linux-jdk7] [withMaven] junitPublisher - Archive test results for Maven artifact org.apache.maven.resolver:maven-resolver-demo-snippets:1.3.2-SNAPSHOT generated by maven-surefire-plugin:test (default-test): m/maven-resolver-demos/maven-resolver-demo-snippets/target/surefire-reports/*.xml
[linux-jdk7] Recording test results
[linux-jdk7] None of the test reports contained any result
[linux-jdk7] [withMaven] junitPublisher - Archive test results for Maven artifact org.apache.maven.resolver:maven-resolver-demo-maven-plugin:1.3.2-SNAPSHOT generated by maven-surefire-plugin:test (default-test): m/maven-resolver-demos/maven-resolver-demo-maven-plugin/target/surefire-reports/*.xml
[linux-jdk7] Recording test results
[linux-jdk7] None of the test reports contained any result
[linux-jdk7] [withMaven] openTasksPublisher - Scan Tasks for Maven artifact org.apache.maven.resolver:maven-resolver-api:1.3.2-SNAPSHOT in source directory m/maven-resolver-api/src/main/java
[linux-jdk7] [withMaven] openTasksPublisher - Scan Tasks for Maven artifact org.apache.maven.resolver:maven-resolver-spi:1.3.2-SNAPSHOT in source directory m/maven-resolver-spi/src/main/java
[linux-jdk7] [withMaven] openTasksPublisher - Scan Tasks for Maven artifact org.apache.maven.resolver:maven-resolver-test-util:1.3.2-SNAPSHOT in source directory m/maven-resolver-test-util/src/main/java
[linux-jdk7] [withMaven] openTasksPublisher - Scan Tasks for Maven artifact org.apache.maven.resolver:maven-resolver-util:1.3.2-SNAPSHOT in source directory m/maven-resolver-util/src/main/java
[linux-jdk7] [withMaven] openTasksPublisher - Scan Tasks for Maven artifact org.apache.maven.resolver:maven-resolver-impl:1.3.2-SNAPSHOT in source directory m/maven-resolver-impl/src/main/java
[linux-jdk7] [withMaven] openTasksPublisher - Scan Tasks for Maven artifact org.apache.maven.resolver:maven-resolver-connector-basic:1.3.2-SNAPSHOT in source directory m/maven-resolver-connector-basic/src/main/java
[linux-jdk7] [withMaven] openTasksPublisher - Scan Tasks for Maven artifact org.apache.maven.resolver:maven-resolver-transport-classpath:1.3.2-SNAPSHOT in source directory m/maven-resolver-transport-classpath/src/main/java
[linux-jdk7] [withMaven] openTasksPublisher - Scan Tasks for Maven artifact org.apache.maven.resolver:maven-resolver-transport-file:1.3.2-SNAPSHOT in source directory m/maven-resolver-transport-file/src/main/java
[linux-jdk7] [withMaven] openTasksPublisher - Scan Tasks for Maven artifact org.apache.maven.resolver:maven-resolver-transport-http:1.3.2-SNAPSHOT in source directory m/maven-resolver-transport-http/src/main/java
[linux-jdk7] [withMaven] openTasksPublisher - Scan Tasks for Maven artifact org.apache.maven.resolver:maven-resolver-transport-wagon:1.3.2-SNAPSHOT in source directory m/maven-resolver-transport-wagon/src/main/java
[linux-jdk7] [withMaven] openTasksPublisher - Scan Tasks for Maven artifact org.apache.maven.resolver:maven-resolver-demo-snippets:1.3.2-SNAPSHOT in source directory m/maven-resolver-demos/maven-resolver-demo-snippets/src/main/java
[linux-jdk7] [withMaven] openTasksPublisher - Scan Tasks for Maven artifact org.apache.maven.resolver:maven-resolver-demo-maven-plugin:1.3.2-SNAPSHOT in source directory m/maven-resolver-demos/maven-resolver-demo-maven-plugin/src/main/java
[linux-jdk7] [TASKS] Scanning folder '/home/jenkins/jenkins-slave/workspace/n-box_maven-resolver_master-L2RUGOEIK5O5H3FE4SPFSXXNL7FPE37KLTBGLDWAT7DNTIKVZVEQ' for files matching the pattern 'm/maven-resolver-api/src/main/java/**/*,m/maven-resolver-spi/src/main/java/**/*,m/maven-resolver-test-util/src/main/java/**/*,m/maven-resolver-util/src/main/java/**/*,m/maven-resolver-impl/src/main/java/**/*,m/maven-resolver-connector-basic/src/main/java/**/*,m/maven-resolver-transport-classpath/src/main/java/**/*,m/maven-resolver-transport-file/src/main/java/**/*,m/maven-resolver-transport-http/src/main/java/**/*,m/maven-resolver-transport-wagon/src/main/java/**/*,m/maven-resolver-demos/maven-resolver-demo-snippets/src/main/java/**/*,m/maven-resolver-demos/maven-resolver-demo-maven-plugin/src/main/java/**/*' - excludes: null
[linux-jdk7] [TASKS] Found 409 files to scan for tasks
[linux-jdk7] [TASKS] Found 0 open tasks.
[linux-jdk7] Skipping warnings blame since pipelines do not have an SCM link.%n
[linux-jdk7] [TASKS] Computing warning deltas based on reference build #45
[Pipeline] [windows-jdk11] }
[windows-jdk11] [withMaven] invokerPublisher - Archive invoker results for Maven artifact MavenArtifact{org.apache.maven.resolver:maven-resolver-demo-maven-plugin::1.3.2-SNAPSHOT(version: 1.3.2-SNAPSHOT, snapshot:false) } generated by PluginInvocation{org.apache.maven.plugins:maven-invoker-plugin:3.0.1@run  integration-test}: m\maven-resolver-demos\maven-resolver-demo-maven-plugin\target\invoker-reports\*.xml
[windows-jdk11] [withMaven] junitPublisher - Archive test results for Maven artifact org.apache.maven.resolver:maven-resolver-api:1.3.2-SNAPSHOT generated by maven-surefire-plugin:test (default-test): m\maven-resolver-api\target\surefire-reports\*.xml
[windows-jdk11] Recording test results
[windows-jdk11] [withMaven] junitPublisher - Archive test results for Maven artifact org.apache.maven.resolver:maven-resolver-spi:1.3.2-SNAPSHOT generated by maven-surefire-plugin:test (default-test): m\maven-resolver-spi\target\surefire-reports\*.xml
[windows-jdk11] Recording test results
[windows-jdk11] [withMaven] junitPublisher - Archive test results for Maven artifact org.apache.maven.resolver:maven-resolver-test-util:1.3.2-SNAPSHOT generated by maven-surefire-plugin:test (default-test): m\maven-resolver-test-util\target\surefire-reports\*.xml
[windows-jdk11] Recording test results
[windows-jdk11] [withMaven] junitPublisher - Archive test results for Maven artifact org.apache.maven.resolver:maven-resolver-util:1.3.2-SNAPSHOT generated by maven-surefire-plugin:test (default-test): m\maven-resolver-util\target\surefire-reports\*.xml
[windows-jdk11] Recording test results
[windows-jdk11] [withMaven] junitPublisher - Archive test results for Maven artifact org.apache.maven.resolver:maven-resolver-impl:1.3.2-SNAPSHOT generated by maven-surefire-plugin:test (default-test): m\maven-resolver-impl\target\surefire-reports\*.xml
[windows-jdk11] Recording test results
[windows-jdk11] [withMaven] junitPublisher - Archive test results for Maven artifact org.apache.maven.resolver:maven-resolver-connector-basic:1.3.2-SNAPSHOT generated by maven-surefire-plugin:test (default-test): m\maven-resolver-connector-basic\target\surefire-reports\*.xml
[windows-jdk11] Recording test results
[windows-jdk11] [withMaven] junitPublisher - Archive test results for Maven artifact org.apache.maven.resolver:maven-resolver-transport-classpath:1.3.2-SNAPSHOT generated by maven-surefire-plugin:test (default-test): m\maven-resolver-transport-classpath\target\surefire-reports\*.xml
[windows-jdk11] Recording test results
[windows-jdk11] [withMaven] junitPublisher - Archive test results for Maven artifact org.apache.maven.resolver:maven-resolver-transport-file:1.3.2-SNAPSHOT generated by maven-surefire-plugin:test (default-test): m\maven-resolver-transport-file\target\surefire-reports\*.xml
[windows-jdk11] Recording test results
[windows-jdk11] [withMaven] junitPublisher - Archive test results for Maven artifact org.apache.maven.resolver:maven-resolver-transport-http:1.3.2-SNAPSHOT generated by maven-surefire-plugin:test (default-test): m\maven-resolver-transport-http\target\surefire-reports\*.xml
[windows-jdk11] Recording test results
[windows-jdk11] [withMaven] junitPublisher - Archive test results for Maven artifact org.apache.maven.resolver:maven-resolver-transport-wagon:1.3.2-SNAPSHOT generated by maven-surefire-plugin:test (default-test): m\maven-resolver-transport-wagon\target\surefire-reports\*.xml
[windows-jdk11] Recording test results
[windows-jdk11] [withMaven] junitPublisher - Archive test results for Maven artifact org.apache.maven.resolver:maven-resolver-demo-snippets:1.3.2-SNAPSHOT generated by maven-surefire-plugin:test (default-test): m\maven-resolver-demos\maven-resolver-demo-snippets\target\surefire-reports\*.xml
[windows-jdk11] Recording test results
[windows-jdk11] None of the test reports contained any result
[windows-jdk11] [withMaven] junitPublisher - Archive test results for Maven artifact org.apache.maven.resolver:maven-resolver-demo-maven-plugin:1.3.2-SNAPSHOT generated by maven-surefire-plugin:test (default-test): m\maven-resolver-demos\maven-resolver-demo-maven-plugin\target\surefire-reports\*.xml
[windows-jdk11] Recording test results
[windows-jdk11] None of the test reports contained any result
[Pipeline] [windows-jdk7] }
[windows-jdk7] [withMaven] invokerPublisher - Archive invoker results for Maven artifact MavenArtifact{org.apache.maven.resolver:maven-resolver-demo-maven-plugin::1.3.2-SNAPSHOT(version: 1.3.2-SNAPSHOT, snapshot:false) } generated by PluginInvocation{org.apache.maven.plugins:maven-invoker-plugin:3.0.1@run  integration-test}: m\maven-resolver-demos\maven-resolver-demo-maven-plugin\target\invoker-reports\*.xml
[windows-jdk7] [withMaven] junitPublisher - Archive test results for Maven artifact org.apache.maven.resolver:maven-resolver-api:1.3.2-SNAPSHOT generated by maven-surefire-plugin:test (default-test): m\maven-resolver-api\target\surefire-reports\*.xml
[windows-jdk7] Recording test results
[windows-jdk7] [withMaven] junitPublisher - Archive test results for Maven artifact org.apache.maven.resolver:maven-resolver-spi:1.3.2-SNAPSHOT generated by maven-surefire-plugin:test (default-test): m\maven-resolver-spi\target\surefire-reports\*.xml
[windows-jdk7] Recording test results
[windows-jdk7] [withMaven] junitPublisher - Archive test results for Maven artifact org.apache.maven.resolver:maven-resolver-test-util:1.3.2-SNAPSHOT generated by maven-surefire-plugin:test (default-test): m\maven-resolver-test-util\target\surefire-reports\*.xml
[windows-jdk7] Recording test results
[windows-jdk7] [withMaven] junitPublisher - Archive test results for Maven artifact org.apache.maven.resolver:maven-resolver-util:1.3.2-SNAPSHOT generated by maven-surefire-plugin:test (default-test): m\maven-resolver-util\target\surefire-reports\*.xml
[windows-jdk7] Recording test results
[windows-jdk7] [withMaven] junitPublisher - Archive test results for Maven artifact org.apache.maven.resolver:maven-resolver-impl:1.3.2-SNAPSHOT generated by maven-surefire-plugin:test (default-test): m\maven-resolver-impl\target\surefire-reports\*.xml
[windows-jdk7] Recording test results
[windows-jdk7] [withMaven] junitPublisher - Archive test results for Maven artifact org.apache.maven.resolver:maven-resolver-connector-basic:1.3.2-SNAPSHOT generated by maven-surefire-plugin:test (default-test): m\maven-resolver-connector-basic\target\surefire-reports\*.xml
[windows-jdk7] Recording test results
[windows-jdk7] [withMaven] junitPublisher - Archive test results for Maven artifact org.apache.maven.resolver:maven-resolver-transport-classpath:1.3.2-SNAPSHOT generated by maven-surefire-plugin:test (default-test): m\maven-resolver-transport-classpath\target\surefire-reports\*.xml
[windows-jdk7] Recording test results
[windows-jdk7] [withMaven] junitPublisher - Archive test results for Maven artifact org.apache.maven.resolver:maven-resolver-transport-file:1.3.2-SNAPSHOT generated by maven-surefire-plugin:test (default-test): m\maven-resolver-transport-file\target\surefire-reports\*.xml
[windows-jdk7] Recording test results
[windows-jdk7] [withMaven] junitPublisher - Archive test results for Maven artifact org.apache.maven.resolver:maven-resolver-transport-http:1.3.2-SNAPSHOT generated by maven-surefire-plugin:test (default-test): m\maven-resolver-transport-http\target\surefire-reports\*.xml
[windows-jdk7] Recording test results
[windows-jdk7] [withMaven] junitPublisher - Archive test results for Maven artifact org.apache.maven.resolver:maven-resolver-transport-wagon:1.3.2-SNAPSHOT generated by maven-surefire-plugin:test (default-test): m\maven-resolver-transport-wagon\target\surefire-reports\*.xml
[windows-jdk7] Recording test results
[windows-jdk7] [withMaven] junitPublisher - Archive test results for Maven artifact org.apache.maven.resolver:maven-resolver-demo-snippets:1.3.2-SNAPSHOT generated by maven-surefire-plugin:test (default-test): m\maven-resolver-demos\maven-resolver-demo-snippets\target\surefire-reports\*.xml
[windows-jdk7] Recording test results
[windows-jdk7] None of the test reports contained any result
[windows-jdk7] [withMaven] junitPublisher - Archive test results for Maven artifact org.apache.maven.resolver:maven-resolver-demo-maven-plugin:1.3.2-SNAPSHOT generated by maven-surefire-plugin:test (default-test): m\maven-resolver-demos\maven-resolver-demo-maven-plugin\target\surefire-reports\*.xml
[windows-jdk7] Recording test results
[windows-jdk7] None of the test reports contained any result
[Pipeline] [linux-jdk8] // withMaven
[Pipeline] [linux-jdk7] // withMaven
[Pipeline] [windows-jdk11] // withMaven
[Pipeline] [windows-jdk7] // withMaven
[Pipeline] [linux-jdk8] cleanWs
[Pipeline] [linux-jdk7] cleanWs
[Pipeline] [linux-jdk11] }
[Pipeline] [windows-jdk11] cleanWs
[Pipeline] [windows-jdk8] }
[Pipeline] [windows-jdk7] cleanWs
[linux-jdk8] [WS-CLEANUP] Deleting project workspace...[WS-CLEANUP] done
[windows-jdk11] [WS-CLEANUP] Deleting project workspace...Cannot delete workspace :remote file operation failed: f:\jenkins\jenkins-slave\workspace\n-box_maven-resolver_master-L2RUGOEIK5O5H3FE4SPFSXXNL7FPE37KLTBGLDWAT7DNTIKVZVEQ@2 at hudson.remoting.Channel@4ee2423:JNLP4-connect connection from 37.48.69.226/37.48.69.226:64887: java.nio.file.AccessDeniedException: f:\jenkins\jenkins-slave\workspace\n-box_maven-resolver_master-L2RUGOEIK5O5H3FE4SPFSXXNL7FPE37KLTBGLDWAT7DNTIKVZVEQ@2 -> f:\jenkins\jenkins-slave\workspace\n-box_maven-resolver_master-L2RUGOEIK5O5H3FE4SPFSXXNL7FPE37KLTBGLDWAT7DNTIKVZVEQ@2_ws-cleanup_1546167161927
[Pipeline] [linux-jdk11] // stage
[Pipeline] [windows-jdk8] // dir
[linux-jdk7] [WS-CLEANUP] Deleting project workspace...[WS-CLEANUP] done
[windows-jdk7] [WS-CLEANUP] Deleting project workspace...Cannot delete workspace :remote file operation failed: f:\jenkins\jenkins-slave\workspace\n-box_maven-resolver_master-L2RUGOEIK5O5H3FE4SPFSXXNL7FPE37KLTBGLDWAT7DNTIKVZVEQ at hudson.remoting.Channel@398d98d3:JNLP4-connect connection from ec2-34-228-168-168.compute-1.amazonaws.com/34.228.168.168:51626: java.nio.file.AccessDeniedException: f:\jenkins\jenkins-slave\workspace\n-box_maven-resolver_master-L2RUGOEIK5O5H3FE4SPFSXXNL7FPE37KLTBGLDWAT7DNTIKVZVEQ -> f:\jenkins\jenkins-slave\workspace\n-box_maven-resolver_master-L2RUGOEIK5O5H3FE4SPFSXXNL7FPE37KLTBGLDWAT7DNTIKVZVEQ_ws-cleanup_1546167162115
[Pipeline] [linux-jdk11] }
[Pipeline] [linux-jdk8] }
[Pipeline] [windows-jdk11] }
[Pipeline] [windows-jdk8] }
[windows-jdk8] [withMaven] invokerPublisher - Archive invoker results for Maven artifact MavenArtifact{org.apache.maven.resolver:maven-resolver-demo-maven-plugin::1.3.2-SNAPSHOT(version: 1.3.2-SNAPSHOT, snapshot:false) } generated by PluginInvocation{org.apache.maven.plugins:maven-invoker-plugin:3.0.1@run  integration-test}: m\maven-resolver-demos\maven-resolver-demo-maven-plugin\target\invoker-reports\*.xml
[windows-jdk8] [withMaven] junitPublisher - Archive test results for Maven artifact org.apache.maven.resolver:maven-resolver-api:1.3.2-SNAPSHOT generated by maven-surefire-plugin:test (default-test): m\maven-resolver-api\target\surefire-reports\*.xml
[windows-jdk8] Recording test results
[windows-jdk8] [withMaven] junitPublisher - Archive test results for Maven artifact org.apache.maven.resolver:maven-resolver-spi:1.3.2-SNAPSHOT generated by maven-surefire-plugin:test (default-test): m\maven-resolver-spi\target\surefire-reports\*.xml
[windows-jdk8] Recording test results
[windows-jdk8] [withMaven] junitPublisher - Archive test results for Maven artifact org.apache.maven.resolver:maven-resolver-test-util:1.3.2-SNAPSHOT generated by maven-surefire-plugin:test (default-test): m\maven-resolver-test-util\target\surefire-reports\*.xml
[windows-jdk8] Recording test results
[windows-jdk8] [withMaven] junitPublisher - Archive test results for Maven artifact org.apache.maven.resolver:maven-resolver-util:1.3.2-SNAPSHOT generated by maven-surefire-plugin:test (default-test): m\maven-resolver-util\target\surefire-reports\*.xml
[windows-jdk8] Recording test results
[windows-jdk8] [withMaven] junitPublisher - Archive test results for Maven artifact org.apache.maven.resolver:maven-resolver-impl:1.3.2-SNAPSHOT generated by maven-surefire-plugin:test (default-test): m\maven-resolver-impl\target\surefire-reports\*.xml
[windows-jdk8] Recording test results
[windows-jdk8] [withMaven] junitPublisher - Archive test results for Maven artifact org.apache.maven.resolver:maven-resolver-connector-basic:1.3.2-SNAPSHOT generated by maven-surefire-plugin:test (default-test): m\maven-resolver-connector-basic\target\surefire-reports\*.xml
[windows-jdk8] Recording test results
[windows-jdk8] [withMaven] junitPublisher - Archive test results for Maven artifact org.apache.maven.resolver:maven-resolver-transport-classpath:1.3.2-SNAPSHOT generated by maven-surefire-plugin:test (default-test): m\maven-resolver-transport-classpath\target\surefire-reports\*.xml
[windows-jdk8] Recording test results
[windows-jdk8] [withMaven] junitPublisher - Archive test results for Maven artifact org.apache.maven.resolver:maven-resolver-transport-file:1.3.2-SNAPSHOT generated by maven-surefire-plugin:test (default-test): m\maven-resolver-transport-file\target\surefire-reports\*.xml
[windows-jdk8] Recording test results
[windows-jdk8] [withMaven] junitPublisher - Archive test results for Maven artifact org.apache.maven.resolver:maven-resolver-transport-http:1.3.2-SNAPSHOT generated by maven-surefire-plugin:test (default-test): m\maven-resolver-transport-http\target\surefire-reports\*.xml
[windows-jdk8] Recording test results
[windows-jdk8] [withMaven] junitPublisher - Archive test results for Maven artifact org.apache.maven.resolver:maven-resolver-transport-wagon:1.3.2-SNAPSHOT generated by maven-surefire-plugin:test (default-test): m\maven-resolver-transport-wagon\target\surefire-reports\*.xml
[windows-jdk8] Recording test results
[windows-jdk8] [withMaven] junitPublisher - Archive test results for Maven artifact org.apache.maven.resolver:maven-resolver-demo-snippets:1.3.2-SNAPSHOT generated by maven-surefire-plugin:test (default-test): m\maven-resolver-demos\maven-resolver-demo-snippets\target\surefire-reports\*.xml
[windows-jdk8] Recording test results
[windows-jdk8] None of the test reports contained any result
[windows-jdk8] [withMaven] junitPublisher - Archive test results for Maven artifact org.apache.maven.resolver:maven-resolver-demo-maven-plugin:1.3.2-SNAPSHOT generated by maven-surefire-plugin:test (default-test): m\maven-resolver-demos\maven-resolver-demo-maven-plugin\target\surefire-reports\*.xml
[windows-jdk8] Recording test results
[windows-jdk8] None of the test reports contained any result
[Pipeline] [linux-jdk11] // node
[Pipeline] [linux-jdk8] // stage
[Pipeline] [windows-jdk11] // stage
[Pipeline] [windows-jdk8] // withMaven
[Pipeline] [linux-jdk11] }
[Pipeline] [linux-jdk8] }
[Pipeline] [windows-jdk11] }
[Pipeline] [linux-jdk7] }
[Pipeline] [windows-jdk8] cleanWs
[Pipeline] [windows-jdk7] }
[Pipeline] [linux-jdk8] // node
[windows-jdk8] [WS-CLEANUP] Deleting project workspace...Cannot delete workspace :remote file operation failed: f:\jenkins\jenkins-slave\workspace\n-box_maven-resolver_master-L2RUGOEIK5O5H3FE4SPFSXXNL7FPE37KLTBGLDWAT7DNTIKVZVEQ at hudson.remoting.Channel@4ee2423:JNLP4-connect connection from 37.48.69.226/37.48.69.226:64887: java.nio.file.AccessDeniedException: f:\jenkins\jenkins-slave\workspace\n-box_maven-resolver_master-L2RUGOEIK5O5H3FE4SPFSXXNL7FPE37KLTBGLDWAT7DNTIKVZVEQ -> f:\jenkins\jenkins-slave\workspace\n-box_maven-resolver_master-L2RUGOEIK5O5H3FE4SPFSXXNL7FPE37KLTBGLDWAT7DNTIKVZVEQ_ws-cleanup_1546167169921
[Pipeline] [windows-jdk11] // node
[Pipeline] [linux-jdk7] // stage
[Pipeline] [windows-jdk7] // stage
[Pipeline] [linux-jdk8] }
[Pipeline] [windows-jdk11] }
[windows-jdk11] Failed in branch windows-jdk11
[Pipeline] [linux-jdk7] }
[Pipeline] [windows-jdk7] }
[Pipeline] [windows-jdk8] }
[Pipeline] [linux-jdk7] // node
[Pipeline] [windows-jdk7] // node
[Pipeline] [linux-jdk7] }
[Pipeline] [windows-jdk7] }
[windows-jdk7] Failed in branch windows-jdk7
[Pipeline] [windows-jdk8] // stage
[Pipeline] [windows-jdk8] }
[Pipeline] [windows-jdk8] // node
[Pipeline] [windows-jdk8] }
[windows-jdk8] Failed in branch windows-jdk8
[Pipeline] // parallel
[Pipeline] stage
[Pipeline] { (Notifications)
[Pipeline] echo
Build result: FAILURE
[Pipeline] jiraIssueSelector
[Pipeline] emailext
Reply | Threaded
Open this post in threaded view
|

Build failed in Jenkins: Maven TLP » maven-resolver » master #47

Apache Jenkins Server-2
See https://builds.apache.org/job/maven-box/job/maven-resolver/job/master/47/

Changes:

* add mavenLinkerPublisher

All tests passed

Build log:
[...truncated 10292 lines...]
Running on windows-2016-1 in f:\jenkins\jenkins-slave\workspace\n-box_maven-resolver_master-L2RUGOEIK5O5H3FE4SPFSXXNL7FPE37KLTBGLDWAT7DNTIKVZVEQ
[Pipeline] {
[Pipeline] stage
[Pipeline] { (Checkout windows-jdk8)
[Pipeline] dir
Running in f:\jenkins\jenkins-slave\workspace\n-box_maven-resolver_master-L2RUGOEIK5O5H3FE4SPFSXXNL7FPE37KLTBGLDWAT7DNTIKVZVEQ\m
[Pipeline] {
[Pipeline] checkout
Cloning the remote Git repository
Cloning with configured refspecs honoured and without tags
Cloning repository https://gitbox.apache.org/repos/asf/maven-resolver.git
ERROR: Failed to clean the workspace
java.io.IOException: Unable to delete 'f:\jenkins\jenkins-slave\workspace\n-box_maven-resolver_master-L2RUGOEIK5O5H3FE4SPFSXXNL7FPE37KLTBGLDWAT7DNTIKVZVEQ\m'. Tried 3 times (of a maximum of 3) waiting 0.1 sec between attempts.
        at hudson.Util.deleteContentsRecursive(Util.java:257)
        at org.jenkinsci.plugins.gitclient.CliGitAPIImpl$2.execute(CliGitAPIImpl.java:592)
        at org.jenkinsci.plugins.gitclient.RemoteGitImpl$CommandInvocationHandler$1.call(RemoteGitImpl.java:153)
        at org.jenkinsci.plugins.gitclient.RemoteGitImpl$CommandInvocationHandler$1.call(RemoteGitImpl.java:146)
        at hudson.remoting.UserRequest.perform(UserRequest.java:181)
        at hudson.remoting.UserRequest.perform(UserRequest.java:52)
        at hudson.remoting.Request$2.run(Request.java:336)
        at hudson.remoting.InterceptingExecutorService$1.call(InterceptingExecutorService.java:68)
        at java.util.concurrent.FutureTask.run(Unknown Source)
        at java.util.concurrent.ThreadPoolExecutor.runWorker(Unknown Source)
        at java.util.concurrent.ThreadPoolExecutor$Worker.run(Unknown Source)
        at hudson.remoting.Engine$1$1.run(Engine.java:98)
        at java.lang.Thread.run(Unknown Source)
Caused by: java.nio.file.AccessDeniedException: f:\jenkins\jenkins-slave\workspace\n-box_maven-resolver_master-L2RUGOEIK5O5H3FE4SPFSXXNL7FPE37KLTBGLDWAT7DNTIKVZVEQ\m\maven-resolver-demos\maven-resolver-demo-maven-plugin\target\invoker-reports\BUILD-resolve-artifact.xml
        at sun.nio.fs.WindowsException.translateToIOException(Unknown Source)
        at sun.nio.fs.WindowsException.rethrowAsIOException(Unknown Source)
        at sun.nio.fs.WindowsException.rethrowAsIOException(Unknown Source)
        at sun.nio.fs.WindowsFileAttributeViews$Basic.readAttributes(Unknown Source)
        at sun.nio.fs.WindowsFileAttributeViews$Basic.readAttributes(Unknown Source)
        at sun.nio.fs.WindowsFileSystemProvider.readAttributes(Unknown Source)
        at java.nio.file.Files.readAttributes(Unknown Source)
        at hudson.Util.isSymlink(Util.java:529)
        at hudson.Util.tryOnceDeleteRecursive(Util.java:386)
        at hudson.Util.tryOnceDeleteContentsRecursive(Util.java:407)
        at hudson.Util.tryOnceDeleteRecursive(Util.java:387)
        at hudson.Util.tryOnceDeleteContentsRecursive(Util.java:407)
        at hudson.Util.tryOnceDeleteRecursive(Util.java:387)
        at hudson.Util.tryOnceDeleteContentsRecursive(Util.java:407)
        at hudson.Util.tryOnceDeleteRecursive(Util.java:387)
        at hudson.Util.tryOnceDeleteContentsRecursive(Util.java:407)
        at hudson.Util.tryOnceDeleteRecursive(Util.java:387)
        at hudson.Util.tryOnceDeleteContentsRecursive(Util.java:407)
        at hudson.Util.deleteContentsRecursive(Util.java:252)
        ... 12 more
ERROR: Error cloning remote repo 'origin'
hudson.plugins.git.GitException: Failed to delete workspace
        at org.jenkinsci.plugins.gitclient.CliGitAPIImpl$2.execute(CliGitAPIImpl.java:595)
        at org.jenkinsci.plugins.gitclient.RemoteGitImpl$CommandInvocationHandler$1.call(RemoteGitImpl.java:153)
        at org.jenkinsci.plugins.gitclient.RemoteGitImpl$CommandInvocationHandler$1.call(RemoteGitImpl.java:146)
        at hudson.remoting.UserRequest.perform(UserRequest.java:181)
        at hudson.remoting.UserRequest.perform(UserRequest.java:52)
        at hudson.remoting.Request$2.run(Request.java:336)
        at hudson.remoting.InterceptingExecutorService$1.call(InterceptingExecutorService.java:68)
        at java.util.concurrent.FutureTask.run(Unknown Source)
        at java.util.concurrent.ThreadPoolExecutor.runWorker(Unknown Source)
        at java.util.concurrent.ThreadPoolExecutor$Worker.run(Unknown Source)
        at hudson.remoting.Engine$1$1.run(Engine.java:98)
        at java.lang.Thread.run(Unknown Source)
        Suppressed: hudson.remoting.Channel$CallSiteStackTrace: Remote call to JNLP4-connect connection from ec2-34-228-168-168.compute-1.amazonaws.com/34.228.168.168:49341
                at hudson.remoting.Channel.attachCallSiteStackTrace(Channel.java:1741)
                at hudson.remoting.UserResponse.retrieve(UserRequest.java:389)
                at hudson.remoting.Channel.call(Channel.java:955)
                at org.jenkinsci.plugins.gitclient.RemoteGitImpl$CommandInvocationHandler.execute(RemoteGitImpl.java:146)
                at sun.reflect.GeneratedMethodAccessor1100.invoke(Unknown Source)
                at sun.reflect.DelegatingMethodAccessorImpl.invoke(DelegatingMethodAccessorImpl.java:43)
                at java.lang.reflect.Method.invoke(Method.java:498)
                at org.jenkinsci.plugins.gitclient.RemoteGitImpl$CommandInvocationHandler.invoke(RemoteGitImpl.java:132)
                at com.sun.proxy.$Proxy125.execute(Unknown Source)
                at hudson.plugins.git.GitSCM.retrieveChanges(GitSCM.java:1146)
                at hudson.plugins.git.GitSCM.checkout(GitSCM.java:1186)
                at org.jenkinsci.plugins.workflow.steps.scm.SCMStep.checkout(SCMStep.java:120)
                at org.jenkinsci.plugins.workflow.steps.scm.SCMStep$StepExecutionImpl.run(SCMStep.java:90)
                at org.jenkinsci.plugins.workflow.steps.scm.SCMStep$StepExecutionImpl.run(SCMStep.java:77)
                at org.jenkinsci.plugins.workflow.steps.SynchronousNonBlockingStepExecution$1$1.call(SynchronousNonBlockingStepExecution.java:51)
                at hudson.security.ACL.impersonate(ACL.java:290)
                at org.jenkinsci.plugins.workflow.steps.SynchronousNonBlockingStepExecution$1.run(SynchronousNonBlockingStepExecution.java:48)
                at java.util.concurrent.Executors$RunnableAdapter.call(Executors.java:511)
                at java.util.concurrent.FutureTask.run(FutureTask.java:266)
                at java.util.concurrent.ThreadPoolExecutor.runWorker(ThreadPoolExecutor.java:1149)
                at java.util.concurrent.ThreadPoolExecutor$Worker.run(ThreadPoolExecutor.java:624)
                at java.lang.Thread.run(Thread.java:748)
Caused by: java.io.IOException: Unable to delete 'f:\jenkins\jenkins-slave\workspace\n-box_maven-resolver_master-L2RUGOEIK5O5H3FE4SPFSXXNL7FPE37KLTBGLDWAT7DNTIKVZVEQ\m'. Tried 3 times (of a maximum of 3) waiting 0.1 sec between attempts.
        at hudson.Util.deleteContentsRecursive(Util.java:257)
        at org.jenkinsci.plugins.gitclient.CliGitAPIImpl$2.execute(CliGitAPIImpl.java:592)
        ... 11 more
Caused by: java.nio.file.AccessDeniedException: f:\jenkins\jenkins-slave\workspace\n-box_maven-resolver_master-L2RUGOEIK5O5H3FE4SPFSXXNL7FPE37KLTBGLDWAT7DNTIKVZVEQ\m\maven-resolver-demos\maven-resolver-demo-maven-plugin\target\invoker-reports\BUILD-resolve-artifact.xml
        at sun.nio.fs.WindowsException.translateToIOException(Unknown Source)
        at sun.nio.fs.WindowsException.rethrowAsIOException(Unknown Source)
        at sun.nio.fs.WindowsException.rethrowAsIOException(Unknown Source)
        at sun.nio.fs.WindowsFileAttributeViews$Basic.readAttributes(Unknown Source)
        at sun.nio.fs.WindowsFileAttributeViews$Basic.readAttributes(Unknown Source)
        at sun.nio.fs.WindowsFileSystemProvider.readAttributes(Unknown Source)
        at java.nio.file.Files.readAttributes(Unknown Source)
        at hudson.Util.isSymlink(Util.java:529)
        at hudson.Util.tryOnceDeleteRecursive(Util.java:386)
        at hudson.Util.tryOnceDeleteContentsRecursive(Util.java:407)
        at hudson.Util.tryOnceDeleteRecursive(Util.java:387)
        at hudson.Util.tryOnceDeleteContentsRecursive(Util.java:407)
        at hudson.Util.tryOnceDeleteRecursive(Util.java:387)
        at hudson.Util.tryOnceDeleteContentsRecursive(Util.java:407)
        at hudson.Util.tryOnceDeleteRecursive(Util.java:387)
        at hudson.Util.tryOnceDeleteContentsRecursive(Util.java:407)
        at hudson.Util.tryOnceDeleteRecursive(Util.java:387)
        at hudson.Util.tryOnceDeleteContentsRecursive(Util.java:407)
        at hudson.Util.deleteContentsRecursive(Util.java:252)
        ... 12 more
[Pipeline] }
[Pipeline] // dir
[Pipeline] cleanWs
[WS-CLEANUP] Deleting project workspace...
[WS-CLEANUP] Deferred wipeout is used...
ERROR: Cannot delete workspace :f:\jenkins\jenkins-slave\workspace\n-box_maven-resolver_master-L2RUGOEIK5O5H3FE4SPFSXXNL7FPE37KLTBGLDWAT7DNTIKVZVEQ\m\maven-resolver-demos\maven-resolver-demo-maven-plugin\target\invoker-reports\BUILD-resolve-artifact.xml
[Pipeline] }
[Pipeline] // stage
[Pipeline] }
[Pipeline] // node
[Pipeline] }
Failed in branch windows-jdk8
Running on windows-2016-1 in f:\jenkins\jenkins-slave\workspace\n-box_maven-resolver_master-L2RUGOEIK5O5H3FE4SPFSXXNL7FPE37KLTBGLDWAT7DNTIKVZVEQ
[Pipeline] {
[Pipeline] stage
[Pipeline] { (Checkout windows-jdk11)
[Pipeline] dir
Running in f:\jenkins\jenkins-slave\workspace\n-box_maven-resolver_master-L2RUGOEIK5O5H3FE4SPFSXXNL7FPE37KLTBGLDWAT7DNTIKVZVEQ\m
[Pipeline] {
[Pipeline] checkout
Cloning the remote Git repository
Cloning with configured refspecs honoured and without tags
Cloning repository https://gitbox.apache.org/repos/asf/maven-resolver.git
ERROR: Failed to clean the workspace
java.io.IOException: Unable to delete 'f:\jenkins\jenkins-slave\workspace\n-box_maven-resolver_master-L2RUGOEIK5O5H3FE4SPFSXXNL7FPE37KLTBGLDWAT7DNTIKVZVEQ\m'. Tried 3 times (of a maximum of 3) waiting 0.1 sec between attempts.
        at hudson.Util.deleteContentsRecursive(Util.java:257)
        at org.jenkinsci.plugins.gitclient.CliGitAPIImpl$2.execute(CliGitAPIImpl.java:592)
        at org.jenkinsci.plugins.gitclient.RemoteGitImpl$CommandInvocationHandler$1.call(RemoteGitImpl.java:153)
        at org.jenkinsci.plugins.gitclient.RemoteGitImpl$CommandInvocationHandler$1.call(RemoteGitImpl.java:146)
        at hudson.remoting.UserRequest.perform(UserRequest.java:181)
        at hudson.remoting.UserRequest.perform(UserRequest.java:52)
        at hudson.remoting.Request$2.run(Request.java:336)
        at hudson.remoting.InterceptingExecutorService$1.call(InterceptingExecutorService.java:68)
        at java.util.concurrent.FutureTask.run(Unknown Source)
        at java.util.concurrent.ThreadPoolExecutor.runWorker(Unknown Source)
        at java.util.concurrent.ThreadPoolExecutor$Worker.run(Unknown Source)
        at hudson.remoting.Engine$1$1.run(Engine.java:98)
        at java.lang.Thread.run(Unknown Source)
Caused by: java.nio.file.AccessDeniedException: f:\jenkins\jenkins-slave\workspace\n-box_maven-resolver_master-L2RUGOEIK5O5H3FE4SPFSXXNL7FPE37KLTBGLDWAT7DNTIKVZVEQ\m\maven-resolver-demos\maven-resolver-demo-maven-plugin\target\invoker-reports\BUILD-resolve-artifact.xml
        at sun.nio.fs.WindowsException.translateToIOException(Unknown Source)
        at sun.nio.fs.WindowsException.rethrowAsIOException(Unknown Source)
        at sun.nio.fs.WindowsException.rethrowAsIOException(Unknown Source)
        at sun.nio.fs.WindowsFileAttributeViews$Basic.readAttributes(Unknown Source)
        at sun.nio.fs.WindowsFileAttributeViews$Basic.readAttributes(Unknown Source)
        at sun.nio.fs.WindowsFileSystemProvider.readAttributes(Unknown Source)
        at java.nio.file.Files.readAttributes(Unknown Source)
        at hudson.Util.isSymlink(Util.java:529)
        at hudson.Util.tryOnceDeleteRecursive(Util.java:386)
        at hudson.Util.tryOnceDeleteContentsRecursive(Util.java:407)
        at hudson.Util.tryOnceDeleteRecursive(Util.java:387)
        at hudson.Util.tryOnceDeleteContentsRecursive(Util.java:407)
        at hudson.Util.tryOnceDeleteRecursive(Util.java:387)
        at hudson.Util.tryOnceDeleteContentsRecursive(Util.java:407)
        at hudson.Util.tryOnceDeleteRecursive(Util.java:387)
        at hudson.Util.tryOnceDeleteContentsRecursive(Util.java:407)
        at hudson.Util.tryOnceDeleteRecursive(Util.java:387)
        at hudson.Util.tryOnceDeleteContentsRecursive(Util.java:407)
        at hudson.Util.deleteContentsRecursive(Util.java:252)
        ... 12 more
ERROR: Error cloning remote repo 'origin'
hudson.plugins.git.GitException: Failed to delete workspace
        at org.jenkinsci.plugins.gitclient.CliGitAPIImpl$2.execute(CliGitAPIImpl.java:595)
        at org.jenkinsci.plugins.gitclient.RemoteGitImpl$CommandInvocationHandler$1.call(RemoteGitImpl.java:153)
        at org.jenkinsci.plugins.gitclient.RemoteGitImpl$CommandInvocationHandler$1.call(RemoteGitImpl.java:146)
        at hudson.remoting.UserRequest.perform(UserRequest.java:181)
        at hudson.remoting.UserRequest.perform(UserRequest.java:52)
        at hudson.remoting.Request$2.run(Request.java:336)
        at hudson.remoting.InterceptingExecutorService$1.call(InterceptingExecutorService.java:68)
        at java.util.concurrent.FutureTask.run(Unknown Source)
        at java.util.concurrent.ThreadPoolExecutor.runWorker(Unknown Source)
        at java.util.concurrent.ThreadPoolExecutor$Worker.run(Unknown Source)
        at hudson.remoting.Engine$1$1.run(Engine.java:98)
        at java.lang.Thread.run(Unknown Source)
        Suppressed: hudson.remoting.Channel$CallSiteStackTrace: Remote call to JNLP4-connect connection from ec2-34-228-168-168.compute-1.amazonaws.com/34.228.168.168:49341
                at hudson.remoting.Channel.attachCallSiteStackTrace(Channel.java:1741)
                at hudson.remoting.UserResponse.retrieve(UserRequest.java:389)
                at hudson.remoting.Channel.call(Channel.java:955)
                at org.jenkinsci.plugins.gitclient.RemoteGitImpl$CommandInvocationHandler.execute(RemoteGitImpl.java:146)
                at sun.reflect.GeneratedMethodAccessor1100.invoke(Unknown Source)
                at sun.reflect.DelegatingMethodAccessorImpl.invoke(DelegatingMethodAccessorImpl.java:43)
                at java.lang.reflect.Method.invoke(Method.java:498)
                at org.jenkinsci.plugins.gitclient.RemoteGitImpl$CommandInvocationHandler.invoke(RemoteGitImpl.java:132)
                at com.sun.proxy.$Proxy125.execute(Unknown Source)
                at hudson.plugins.git.GitSCM.retrieveChanges(GitSCM.java:1146)
                at hudson.plugins.git.GitSCM.checkout(GitSCM.java:1186)
                at org.jenkinsci.plugins.workflow.steps.scm.SCMStep.checkout(SCMStep.java:120)
                at org.jenkinsci.plugins.workflow.steps.scm.SCMStep$StepExecutionImpl.run(SCMStep.java:90)
                at org.jenkinsci.plugins.workflow.steps.scm.SCMStep$StepExecutionImpl.run(SCMStep.java:77)
                at org.jenkinsci.plugins.workflow.steps.SynchronousNonBlockingStepExecution$1$1.call(SynchronousNonBlockingStepExecution.java:51)
                at hudson.security.ACL.impersonate(ACL.java:290)
                at org.jenkinsci.plugins.workflow.steps.SynchronousNonBlockingStepExecution$1.run(SynchronousNonBlockingStepExecution.java:48)
                at java.util.concurrent.Executors$RunnableAdapter.call(Executors.java:511)
                at java.util.concurrent.FutureTask.run(FutureTask.java:266)
                at java.util.concurrent.ThreadPoolExecutor.runWorker(ThreadPoolExecutor.java:1149)
                at java.util.concurrent.ThreadPoolExecutor$Worker.run(ThreadPoolExecutor.java:624)
                at java.lang.Thread.run(Thread.java:748)
Caused by: java.io.IOException: Unable to delete 'f:\jenkins\jenkins-slave\workspace\n-box_maven-resolver_master-L2RUGOEIK5O5H3FE4SPFSXXNL7FPE37KLTBGLDWAT7DNTIKVZVEQ\m'. Tried 3 times (of a maximum of 3) waiting 0.1 sec between attempts.
        at hudson.Util.deleteContentsRecursive(Util.java:257)
        at org.jenkinsci.plugins.gitclient.CliGitAPIImpl$2.execute(CliGitAPIImpl.java:592)
        ... 11 more
Caused by: java.nio.file.AccessDeniedException: f:\jenkins\jenkins-slave\workspace\n-box_maven-resolver_master-L2RUGOEIK5O5H3FE4SPFSXXNL7FPE37KLTBGLDWAT7DNTIKVZVEQ\m\maven-resolver-demos\maven-resolver-demo-maven-plugin\target\invoker-reports\BUILD-resolve-artifact.xml
        at sun.nio.fs.WindowsException.translateToIOException(Unknown Source)
        at sun.nio.fs.WindowsException.rethrowAsIOException(Unknown Source)
        at sun.nio.fs.WindowsException.rethrowAsIOException(Unknown Source)
        at sun.nio.fs.WindowsFileAttributeViews$Basic.readAttributes(Unknown Source)
        at sun.nio.fs.WindowsFileAttributeViews$Basic.readAttributes(Unknown Source)
        at sun.nio.fs.WindowsFileSystemProvider.readAttributes(Unknown Source)
        at java.nio.file.Files.readAttributes(Unknown Source)
        at hudson.Util.isSymlink(Util.java:529)
        at hudson.Util.tryOnceDeleteRecursive(Util.java:386)
        at hudson.Util.tryOnceDeleteContentsRecursive(Util.java:407)
        at hudson.Util.tryOnceDeleteRecursive(Util.java:387)
        at hudson.Util.tryOnceDeleteContentsRecursive(Util.java:407)
        at hudson.Util.tryOnceDeleteRecursive(Util.java:387)
        at hudson.Util.tryOnceDeleteContentsRecursive(Util.java:407)
        at hudson.Util.tryOnceDeleteRecursive(Util.java:387)
        at hudson.Util.tryOnceDeleteContentsRecursive(Util.java:407)
        at hudson.Util.tryOnceDeleteRecursive(Util.java:387)
        at hudson.Util.tryOnceDeleteContentsRecursive(Util.java:407)
        at hudson.Util.deleteContentsRecursive(Util.java:252)
        ... 12 more
[Pipeline] }
[Pipeline] // dir
[Pipeline] cleanWs
[WS-CLEANUP] Deleting project workspace...
[WS-CLEANUP] Deferred wipeout is used...
ERROR: Cannot delete workspace :f:\jenkins\jenkins-slave\workspace\n-box_maven-resolver_master-L2RUGOEIK5O5H3FE4SPFSXXNL7FPE37KLTBGLDWAT7DNTIKVZVEQ\m\maven-resolver-demos\maven-resolver-demo-maven-plugin\target\invoker-reports\BUILD-resolve-artifact.xml
[Pipeline] }
[Pipeline] // stage
[Pipeline] }
[Pipeline] // node
[Pipeline] }
Failed in branch windows-jdk11
[Pipeline] // parallel
[Pipeline] stage
[Pipeline] { (Notifications)
[Pipeline] echo
Build result: FAILURE
[Pipeline] jiraIssueSelector
[Pipeline] emailext
Reply | Threaded
Open this post in threaded view
|

Build failed in Jenkins: Maven TLP » maven-resolver » master #48

Apache Jenkins Server-2
See https://builds.apache.org/job/maven-box/job/maven-resolver/job/master/48/

Changes:

* Disable cleanWs() due to issues with file handles on Windows
* added a link to asf-gitpubsub-jenkins-plugin
* fixed markup (asciidoc, not markdown...)

All tests passed

Build log:
[...truncated 20143 lines...]
[withMaven] artifactsPublisher - Archive artifact m/maven-resolver-transport-wagon/pom.xml under org/apache/maven/resolver/maven-resolver-transport-wagon/1.3.2-SNAPSHOT/maven-resolver-transport-wagon-1.3.2-SNAPSHOT.pom
[withMaven] artifactsPublisher - Archive artifact m/maven-resolver-transport-wagon/target/maven-resolver-transport-wagon-1.3.2-SNAPSHOT.jar under org/apache/maven/resolver/maven-resolver-transport-wagon/1.3.2-SNAPSHOT/maven-resolver-transport-wagon-1.3.2-SNAPSHOT.jar
[withMaven] artifactsPublisher - Archive artifact m/maven-resolver-demos/pom.xml under org/apache/maven/resolver/maven-resolver-demos/1.3.2-SNAPSHOT/maven-resolver-demos-1.3.2-SNAPSHOT.pom
[withMaven] artifactsPublisher - Archive artifact m/maven-resolver-demos/target/maven-resolver-demos-1.3.2-SNAPSHOT-site.xml under org/apache/maven/resolver/maven-resolver-demos/1.3.2-SNAPSHOT/maven-resolver-demos-1.3.2-SNAPSHOT-site.xml
[withMaven] artifactsPublisher - Archive artifact m/maven-resolver-demos/maven-resolver-demo-snippets/pom.xml under org/apache/maven/resolver/maven-resolver-demo-snippets/1.3.2-SNAPSHOT/maven-resolver-demo-snippets-1.3.2-SNAPSHOT.pom
[withMaven] artifactsPublisher - Archive artifact m/maven-resolver-demos/maven-resolver-demo-snippets/target/maven-resolver-demo-snippets-1.3.2-SNAPSHOT.jar under org/apache/maven/resolver/maven-resolver-demo-snippets/1.3.2-SNAPSHOT/maven-resolver-demo-snippets-1.3.2-SNAPSHOT.jar
[withMaven] artifactsPublisher - Archive artifact m/maven-resolver-demos/maven-resolver-demo-maven-plugin/pom.xml under org/apache/maven/resolver/maven-resolver-demo-maven-plugin/1.3.2-SNAPSHOT/maven-resolver-demo-maven-plugin-1.3.2-SNAPSHOT.pom
[withMaven] artifactsPublisher - Archive artifact m/maven-resolver-demos/maven-resolver-demo-maven-plugin/target/maven-resolver-demo-maven-plugin-1.3.2-SNAPSHOT.jar under org/apache/maven/resolver/maven-resolver-demo-maven-plugin/1.3.2-SNAPSHOT/maven-resolver-demo-maven-plugin-1.3.2-SNAPSHOT.jar
[withMaven] invokerPublisher - Archive invoker results for Maven artifact MavenArtifact{org.apache.maven.resolver:maven-resolver-demo-maven-plugin:maven-plugin:1.3.2-SNAPSHOT(version: 1.3.2-SNAPSHOT, snapshot:false) } generated by PluginInvocation{org.apache.maven.plugins:maven-invoker-plugin:3.0.1@run  integration-test}: m/maven-resolver-demos/maven-resolver-demo-maven-plugin/target/invoker-reports/*.xml
[withMaven] junitPublisher - Archive test results for Maven artifact org.apache.maven.resolver:maven-resolver-impl:jar:1.3.2-SNAPSHOT generated by maven-surefire-plugin:test (default-test): m/maven-resolver-impl/target/surefire-reports/*.xml
Recording test results
[Pipeline] // dir
[withMaven] junitPublisher - Archive test results for Maven artifact org.apache.maven.resolver:maven-resolver-api:jar:1.3.2-SNAPSHOT generated by maven-surefire-plugin:test (default-test): m/maven-resolver-api/target/surefire-reports/*.xml
Recording test results
[withMaven] junitPublisher - Archive test results for Maven artifact org.apache.maven.resolver:maven-resolver-transport-classpath:jar:1.3.2-SNAPSHOT generated by maven-surefire-plugin:test (default-test): m/maven-resolver-transport-classpath/target/surefire-reports/*.xml
Recording test results
[withMaven] junitPublisher - Archive test results for Maven artifact org.apache.maven.resolver:maven-resolver-spi:jar:1.3.2-SNAPSHOT generated by maven-surefire-plugin:test (default-test): m/maven-resolver-spi/target/surefire-reports/*.xml
Recording test results
[withMaven] junitPublisher - Archive test results for Maven artifact org.apache.maven.resolver:maven-resolver-connector-basic:jar:1.3.2-SNAPSHOT generated by maven-surefire-plugin:test (default-test): m/maven-resolver-connector-basic/target/surefire-reports/*.xml
Recording test results
[Pipeline] }
[Pipeline] }
[Pipeline] }
[withMaven] invokerPublisher - Archive invoker results for Maven artifact MavenArtifact{org.apache.maven.resolver:maven-resolver-demo-maven-plugin:maven-plugin:1.3.2-SNAPSHOT(version: 1.3.2-SNAPSHOT, snapshot:false) } generated by PluginInvocation{org.apache.maven.plugins:maven-invoker-plugin:3.0.1@run  integration-test}: m\maven-resolver-demos\maven-resolver-demo-maven-plugin\target\invoker-reports\*.xml
[withMaven] junitPublisher - Archive test results for Maven artifact org.apache.maven.resolver:maven-resolver-test-util:jar:1.3.2-SNAPSHOT generated by maven-surefire-plugin:test (default-test): m/maven-resolver-test-util/target/surefire-reports/*.xml
Recording test results
[withMaven] junitPublisher - Archive test results for Maven artifact org.apache.maven.resolver:maven-resolver-transport-file:jar:1.3.2-SNAPSHOT generated by maven-surefire-plugin:test (default-test): m/maven-resolver-transport-file/target/surefire-reports/*.xml
Recording test results
[withMaven] junitPublisher - Archive test results for Maven artifact org.apache.maven.resolver:maven-resolver-api:jar:1.3.2-SNAPSHOT generated by maven-surefire-plugin:test (default-test): m\maven-resolver-api\target\surefire-reports\*.xml
Recording test results
[withMaven] junitPublisher - Archive test results for Maven artifact org.apache.maven.resolver:maven-resolver-util:jar:1.3.2-SNAPSHOT generated by maven-surefire-plugin:test (default-test): m/maven-resolver-util/target/surefire-reports/*.xml
Recording test results
[withMaven] junitPublisher - Archive test results for Maven artifact org.apache.maven.resolver:maven-resolver-transport-classpath:jar:1.3.2-SNAPSHOT generated by maven-surefire-plugin:test (default-test): m/maven-resolver-transport-classpath/target/surefire-reports/*.xml
Recording test results
[Pipeline] // dir
[withMaven] junitPublisher - Archive test results for Maven artifact org.apache.maven.resolver:maven-resolver-impl:jar:1.3.2-SNAPSHOT generated by maven-surefire-plugin:test (default-test): m/maven-resolver-impl/target/surefire-reports/*.xml
Recording test results
[withMaven] junitPublisher - Archive test results for Maven artifact org.apache.maven.resolver:maven-resolver-transport-http:jar:1.3.2-SNAPSHOT generated by maven-surefire-plugin:test (default-test): m/maven-resolver-transport-http/target/surefire-reports/*.xml
Recording test results
[withMaven] junitPublisher - Archive test results for Maven artifact org.apache.maven.resolver:maven-resolver-spi:jar:1.3.2-SNAPSHOT generated by maven-surefire-plugin:test (default-test): m\maven-resolver-spi\target\surefire-reports\*.xml
Recording test results
[withMaven] junitPublisher - Archive test results for Maven artifact org.apache.maven.resolver:maven-resolver-transport-wagon:jar:1.3.2-SNAPSHOT generated by maven-surefire-plugin:test (default-test): m/maven-resolver-transport-wagon/target/surefire-reports/*.xml
Recording test results
[withMaven] junitPublisher - Archive test results for Maven artifact org.apache.maven.resolver:maven-resolver-connector-basic:jar:1.3.2-SNAPSHOT generated by maven-surefire-plugin:test (default-test): m/maven-resolver-connector-basic/target/surefire-reports/*.xml
Recording test results
[withMaven] junitPublisher - Archive test results for Maven artifact org.apache.maven.resolver:maven-resolver-transport-file:jar:1.3.2-SNAPSHOT generated by maven-surefire-plugin:test (default-test): m/maven-resolver-transport-file/target/surefire-reports/*.xml
Recording test results
[Pipeline] // dir
[withMaven] junitPublisher - Archive test results for Maven artifact org.apache.maven.resolver:maven-resolver-transport-classpath:jar:1.3.2-SNAPSHOT generated by maven-surefire-plugin:test (default-test): m/maven-resolver-transport-classpath/target/surefire-reports/*.xml
Recording test results
[withMaven] junitPublisher - Archive test results for Maven artifact org.apache.maven.resolver:maven-resolver-demo-snippets:jar:1.3.2-SNAPSHOT generated by maven-surefire-plugin:test (default-test): m/maven-resolver-demos/maven-resolver-demo-snippets/target/surefire-reports/*.xml
Recording test results
[withMaven] junitPublisher - Archive test results for Maven artifact org.apache.maven.resolver:maven-resolver-test-util:jar:1.3.2-SNAPSHOT generated by maven-surefire-plugin:test (default-test): m\maven-resolver-test-util\target\surefire-reports\*.xml
Recording test results
[withMaven] junitPublisher - Archive test results for Maven artifact org.apache.maven.resolver:maven-resolver-transport-file:jar:1.3.2-SNAPSHOT generated by maven-surefire-plugin:test (default-test): m/maven-resolver-transport-file/target/surefire-reports/*.xml
Recording test results
[withMaven] junitPublisher - Archive test results for Maven artifact org.apache.maven.resolver:maven-resolver-transport-http:jar:1.3.2-SNAPSHOT generated by maven-surefire-plugin:test (default-test): m/maven-resolver-transport-http/target/surefire-reports/*.xml
Recording test results
[Pipeline] }
[Pipeline] }
[withMaven] junitPublisher - Archive test results for Maven artifact org.apache.maven.resolver:maven-resolver-transport-http:jar:1.3.2-SNAPSHOT generated by maven-surefire-plugin:test (default-test): m/maven-resolver-transport-http/target/surefire-reports/*.xml
Recording test results
None of the test reports contained any result
[withMaven] junitPublisher - Archive test results for Maven artifact org.apache.maven.resolver:maven-resolver-demo-maven-plugin:maven-plugin:1.3.2-SNAPSHOT generated by maven-surefire-plugin:test (default-test): m/maven-resolver-demos/maven-resolver-demo-maven-plugin/target/surefire-reports/*.xml
Recording test results
[withMaven] junitPublisher - Archive test results for Maven artifact org.apache.maven.resolver:maven-resolver-util:jar:1.3.2-SNAPSHOT generated by maven-surefire-plugin:test (default-test): m\maven-resolver-util\target\surefire-reports\*.xml
Recording test results
None of the test reports contained any result
[withMaven] invokerPublisher - Archive invoker results for Maven artifact MavenArtifact{org.apache.maven.resolver:maven-resolver-demo-maven-plugin:maven-plugin:1.3.2-SNAPSHOT(version: 1.3.2-SNAPSHOT, snapshot:false) } generated by PluginInvocation{org.apache.maven.plugins:maven-invoker-plugin:3.0.1@run  integration-test}: m\maven-resolver-demos\maven-resolver-demo-maven-plugin\target\invoker-reports\*.xml
[withMaven] invokerPublisher - Archive invoker results for Maven artifact MavenArtifact{org.apache.maven.resolver:maven-resolver-demo-maven-plugin:maven-plugin:1.3.2-SNAPSHOT(version: 1.3.2-SNAPSHOT, snapshot:false) } generated by PluginInvocation{org.apache.maven.plugins:maven-invoker-plugin:3.0.1@run  integration-test}: m\maven-resolver-demos\maven-resolver-demo-maven-plugin\target\invoker-reports\*.xml
[withMaven] junitPublisher - Archive test results for Maven artifact org.apache.maven.resolver:maven-resolver-transport-wagon:jar:1.3.2-SNAPSHOT generated by maven-surefire-plugin:test (default-test): m/maven-resolver-transport-wagon/target/surefire-reports/*.xml
Recording test results
[withMaven] junitPublisher - Archive test results for Maven artifact org.apache.maven.resolver:maven-resolver-transport-wagon:jar:1.3.2-SNAPSHOT generated by maven-surefire-plugin:test (default-test): m/maven-resolver-transport-wagon/target/surefire-reports/*.xml
Recording test results
[withMaven] junitPublisher - Archive test results for Maven artifact org.apache.maven.resolver:maven-resolver-demo-snippets:jar:1.3.2-SNAPSHOT generated by maven-surefire-plugin:test (default-test): m/maven-resolver-demos/maven-resolver-demo-snippets/target/surefire-reports/*.xml
Recording test results
[withMaven] junitPublisher - Archive test results for Maven artifact org.apache.maven.resolver:maven-resolver-api:jar:1.3.2-SNAPSHOT generated by maven-surefire-plugin:test (default-test): m\maven-resolver-api\target\surefire-reports\*.xml
Recording test results
[withMaven] junitPublisher - Archive test results for Maven artifact org.apache.maven.resolver:maven-resolver-api:jar:1.3.2-SNAPSHOT generated by maven-surefire-plugin:test (default-test): m\maven-resolver-api\target\surefire-reports\*.xml
Recording test results
[withMaven] junitPublisher - Archive test results for Maven artifact org.apache.maven.resolver:maven-resolver-impl:jar:1.3.2-SNAPSHOT generated by maven-surefire-plugin:test (default-test): m\maven-resolver-impl\target\surefire-reports\*.xml
Recording test results
[withMaven] Publishers: Pipeline Graph Publisher: 16 ms, Invoker Publisher: 1173 ms, Junit Publisher: 138838 ms, Concordion Publisher: 1 ms, Dependencies Fingerprint Publisher: 8978 ms
[Pipeline] // withMaven
[withMaven] junitPublisher - Archive test results for Maven artifact org.apache.maven.resolver:maven-resolver-spi:jar:1.3.2-SNAPSHOT generated by maven-surefire-plugin:test (default-test): m\maven-resolver-spi\target\surefire-reports\*.xml
Recording test results
[withMaven] junitPublisher - Archive test results for Maven artifact org.apache.maven.resolver:maven-resolver-spi:jar:1.3.2-SNAPSHOT generated by maven-surefire-plugin:test (default-test): m\maven-resolver-spi\target\surefire-reports\*.xml
Recording test results
None of the test reports contained any result
[withMaven] junitPublisher - Archive test results for Maven artifact org.apache.maven.resolver:maven-resolver-demo-maven-plugin:maven-plugin:1.3.2-SNAPSHOT generated by maven-surefire-plugin:test (default-test): m/maven-resolver-demos/maven-resolver-demo-maven-plugin/target/surefire-reports/*.xml
Recording test results
[withMaven] junitPublisher - Archive test results for Maven artifact org.apache.maven.resolver:maven-resolver-demo-snippets:jar:1.3.2-SNAPSHOT generated by maven-surefire-plugin:test (default-test): m/maven-resolver-demos/maven-resolver-demo-snippets/target/surefire-reports/*.xml
Recording test results
None of the test reports contained any result
[withMaven] junitPublisher - Archive test results for Maven artifact org.apache.maven.resolver:maven-resolver-test-util:jar:1.3.2-SNAPSHOT generated by maven-surefire-plugin:test (default-test): m\maven-resolver-test-util\target\surefire-reports\*.xml
Recording test results
[withMaven] junitPublisher - Archive test results for Maven artifact org.apache.maven.resolver:maven-resolver-test-util:jar:1.3.2-SNAPSHOT generated by maven-surefire-plugin:test (default-test): m\maven-resolver-test-util\target\surefire-reports\*.xml
Recording test results
[Pipeline] cleanWs
[WS-CLEANUP] Deleting project workspace...
[WS-CLEANUP] Deferred wipeout is used...
[WS-CLEANUP] done
[withMaven] junitPublisher - Archive test results for Maven artifact org.apache.maven.resolver:maven-resolver-connector-basic:jar:1.3.2-SNAPSHOT generated by maven-surefire-plugin:test (default-test): m\maven-resolver-connector-basic\target\surefire-reports\*.xml
Recording test results
[withMaven] junitPublisher - Archive test results for Maven artifact org.apache.maven.resolver:maven-resolver-util:jar:1.3.2-SNAPSHOT generated by maven-surefire-plugin:test (default-test): m\maven-resolver-util\target\surefire-reports\*.xml
Recording test results
[Pipeline] }
[withMaven] junitPublisher - Archive test results for Maven artifact org.apache.maven.resolver:maven-resolver-util:jar:1.3.2-SNAPSHOT generated by maven-surefire-plugin:test (default-test): m\maven-resolver-util\target\surefire-reports\*.xml
Recording test results
None of the test reports contained any result
[withMaven] junitPublisher - Archive test results for Maven artifact org.apache.maven.resolver:maven-resolver-demo-maven-plugin:maven-plugin:1.3.2-SNAPSHOT generated by maven-surefire-plugin:test (default-test): m/maven-resolver-demos/maven-resolver-demo-maven-plugin/target/surefire-reports/*.xml
Recording test results
[withMaven] openTasksPublisher - Scan Tasks for Maven artifact org.apache.maven.resolver:maven-resolver-api:jar:1.3.2-SNAPSHOT in source directory m/maven-resolver-api/src/main/java
[withMaven] openTasksPublisher - Scan Tasks for Maven artifact org.apache.maven.resolver:maven-resolver-spi:jar:1.3.2-SNAPSHOT in source directory m/maven-resolver-spi/src/main/java
[withMaven] openTasksPublisher - Scan Tasks for Maven artifact org.apache.maven.resolver:maven-resolver-test-util:jar:1.3.2-SNAPSHOT in source directory m/maven-resolver-test-util/src/main/java
[withMaven] openTasksPublisher - Scan Tasks for Maven artifact org.apache.maven.resolver:maven-resolver-util:jar:1.3.2-SNAPSHOT in source directory m/maven-resolver-util/src/main/java
[withMaven] openTasksPublisher - Scan Tasks for Maven artifact org.apache.maven.resolver:maven-resolver-impl:jar:1.3.2-SNAPSHOT in source directory m/maven-resolver-impl/src/main/java
[withMaven] openTasksPublisher - Scan Tasks for Maven artifact org.apache.maven.resolver:maven-resolver-connector-basic:jar:1.3.2-SNAPSHOT in source directory m/maven-resolver-connector-basic/src/main/java
[withMaven] openTasksPublisher - Scan Tasks for Maven artifact org.apache.maven.resolver:maven-resolver-transport-classpath:jar:1.3.2-SNAPSHOT in source directory m/maven-resolver-transport-classpath/src/main/java
[withMaven] openTasksPublisher - Scan Tasks for Maven artifact org.apache.maven.resolver:maven-resolver-transport-file:jar:1.3.2-SNAPSHOT in source directory m/maven-resolver-transport-file/src/main/java
[withMaven] openTasksPublisher - Scan Tasks for Maven artifact org.apache.maven.resolver:maven-resolver-transport-http:jar:1.3.2-SNAPSHOT in source directory m/maven-resolver-transport-http/src/main/java
[withMaven] openTasksPublisher - Scan Tasks for Maven artifact org.apache.maven.resolver:maven-resolver-transport-wagon:jar:1.3.2-SNAPSHOT in source directory m/maven-resolver-transport-wagon/src/main/java
[withMaven] openTasksPublisher - Scan Tasks for Maven artifact org.apache.maven.resolver:maven-resolver-demo-snippets:jar:1.3.2-SNAPSHOT in source directory m/maven-resolver-demos/maven-resolver-demo-snippets/src/main/java
[withMaven] openTasksPublisher - Scan Tasks for Maven artifact org.apache.maven.resolver:maven-resolver-demo-maven-plugin:maven-plugin:1.3.2-SNAPSHOT in source directory m/maven-resolver-demos/maven-resolver-demo-maven-plugin/src/main/java
[TASKS] Scanning folder '/home/jenkins/jenkins-slave/workspace/maven-box_maven-resolver_master' for files matching the pattern 'm/maven-resolver-api/src/main/java/**/*,m/maven-resolver-spi/src/main/java/**/*,m/maven-resolver-test-util/src/main/java/**/*,m/maven-resolver-util/src/main/java/**/*,m/maven-resolver-impl/src/main/java/**/*,m/maven-resolver-connector-basic/src/main/java/**/*,m/maven-resolver-transport-classpath/src/main/java/**/*,m/maven-resolver-transport-file/src/main/java/**/*,m/maven-resolver-transport-http/src/main/java/**/*,m/maven-resolver-transport-wagon/src/main/java/**/*,m/maven-resolver-demos/maven-resolver-demo-snippets/src/main/java/**/*,m/maven-resolver-demos/maven-resolver-demo-maven-plugin/src/main/java/**/*' - excludes: null
[TASKS] Found 409 files to scan for tasks
[TASKS] Found 0 open tasks.
Skipping warnings blame since pipelines do not have an SCM link.%n
[TASKS] Computing warning deltas based on reference build #45
[withMaven] Publishers: Pipeline Graph Publisher: 9 ms, Generated Artifacts Publisher: 22731 ms, Invoker Publisher: 8167 ms, Junit Publisher: 83867 ms, Concordion Publisher: 1 ms, Dependencies Fingerprint Publisher: 8940 ms, Open Task Scanner Publisher: 2618 ms
[withMaven] junitPublisher - Archive test results for Maven artifact org.apache.maven.resolver:maven-resolver-impl:jar:1.3.2-SNAPSHOT generated by maven-surefire-plugin:test (default-test): m\maven-resolver-impl\target\surefire-reports\*.xml
Recording test results
[Pipeline] // stage
[Pipeline] // withMaven
[withMaven] junitPublisher - Archive test results for Maven artifact org.apache.maven.resolver:maven-resolver-transport-classpath:jar:1.3.2-SNAPSHOT generated by maven-surefire-plugin:test (default-test): m\maven-resolver-transport-classpath\target\surefire-reports\*.xml
Recording test results
[withMaven] junitPublisher - Archive test results for Maven artifact org.apache.maven.resolver:maven-resolver-connector-basic:jar:1.3.2-SNAPSHOT generated by maven-surefire-plugin:test (default-test): m\maven-resolver-connector-basic\target\surefire-reports\*.xml
Recording test results
[Pipeline] }
[Pipeline] cleanWs
None of the test reports contained any result
[WS-CLEANUP] Deleting project workspace...
[WS-CLEANUP] Deferred wipeout is used...
[WS-CLEANUP] done
[withMaven] Publishers: Pipeline Graph Publisher: 9 ms, Invoker Publisher: 6456 ms, Junit Publisher: 173059 ms, Concordion Publisher: 1 ms, Dependencies Fingerprint Publisher: 8985 ms
[withMaven] junitPublisher - Archive test results for Maven artifact org.apache.maven.resolver:maven-resolver-impl:jar:1.3.2-SNAPSHOT generated by maven-surefire-plugin:test (default-test): m\maven-resolver-impl\target\surefire-reports\*.xml
Recording test results
[withMaven] junitPublisher - Archive test results for Maven artifact org.apache.maven.resolver:maven-resolver-transport-classpath:jar:1.3.2-SNAPSHOT generated by maven-surefire-plugin:test (default-test): m\maven-resolver-transport-classpath\target\surefire-reports\*.xml
Recording test results
[Pipeline] // node
[withMaven] junitPublisher - Archive test results for Maven artifact org.apache.maven.resolver:maven-resolver-transport-file:jar:1.3.2-SNAPSHOT generated by maven-surefire-plugin:test (default-test): m\maven-resolver-transport-file\target\surefire-reports\*.xml
Recording test results
[withMaven] junitPublisher - Archive test results for Maven artifact org.apache.maven.resolver:maven-resolver-transport-file:jar:1.3.2-SNAPSHOT generated by maven-surefire-plugin:test (default-test): m\maven-resolver-transport-file\target\surefire-reports\*.xml
Recording test results
[Pipeline] // withMaven
[withMaven] junitPublisher - Archive test results for Maven artifact org.apache.maven.resolver:maven-resolver-connector-basic:jar:1.3.2-SNAPSHOT generated by maven-surefire-plugin:test (default-test): m\maven-resolver-connector-basic\target\surefire-reports\*.xml
Recording test results
[withMaven] junitPublisher - Archive test results for Maven artifact org.apache.maven.resolver:maven-resolver-transport-http:jar:1.3.2-SNAPSHOT generated by maven-surefire-plugin:test (default-test): m\maven-resolver-transport-http\target\surefire-reports\*.xml
Recording test results
[Pipeline] }
[Pipeline] }
[Pipeline] cleanWs
[withMaven] junitPublisher - Archive test results for Maven artifact org.apache.maven.resolver:maven-resolver-transport-http:jar:1.3.2-SNAPSHOT generated by maven-surefire-plugin:test (default-test): m\maven-resolver-transport-http\target\surefire-reports\*.xml
Recording test results
[WS-CLEANUP] Deleting project workspace...
[WS-CLEANUP] Deferred wipeout is used...
[WS-CLEANUP] done
[withMaven] junitPublisher - Archive test results for Maven artifact org.apache.maven.resolver:maven-resolver-transport-wagon:jar:1.3.2-SNAPSHOT generated by maven-surefire-plugin:test (default-test): m\maven-resolver-transport-wagon\target\surefire-reports\*.xml
Recording test results
[Pipeline] // stage
[withMaven] junitPublisher - Archive test results for Maven artifact org.apache.maven.resolver:maven-resolver-transport-classpath:jar:1.3.2-SNAPSHOT generated by maven-surefire-plugin:test (default-test): m\maven-resolver-transport-classpath\target\surefire-reports\*.xml
Recording test results
[withMaven] junitPublisher - Archive test results for Maven artifact org.apache.maven.resolver:maven-resolver-demo-snippets:jar:1.3.2-SNAPSHOT generated by maven-surefire-plugin:test (default-test): m\maven-resolver-demos\maven-resolver-demo-snippets\target\surefire-reports\*.xml
Recording test results
[Pipeline] }
[Pipeline] }
[withMaven] junitPublisher - Archive test results for Maven artifact org.apache.maven.resolver:maven-resolver-transport-wagon:jar:1.3.2-SNAPSHOT generated by maven-surefire-plugin:test (default-test): m\maven-resolver-transport-wagon\target\surefire-reports\*.xml
Recording test results
None of the test reports contained any result
[withMaven] junitPublisher - Archive test results for Maven artifact org.apache.maven.resolver:maven-resolver-demo-maven-plugin:maven-plugin:1.3.2-SNAPSHOT generated by maven-surefire-plugin:test (default-test): m\maven-resolver-demos\maven-resolver-demo-maven-plugin\target\surefire-reports\*.xml
Recording test results
[Pipeline] // node
[withMaven] junitPublisher - Archive test results for Maven artifact org.apache.maven.resolver:maven-resolver-transport-file:jar:1.3.2-SNAPSHOT generated by maven-surefire-plugin:test (default-test): m\maven-resolver-transport-file\target\surefire-reports\*.xml
Recording test results
None of the test reports contained any result
[Pipeline] // stage
[withMaven] junitPublisher - Archive test results for Maven artifact org.apache.maven.resolver:maven-resolver-demo-snippets:jar:1.3.2-SNAPSHOT generated by maven-surefire-plugin:test (default-test): m\maven-resolver-demos\maven-resolver-demo-snippets\target\surefire-reports\*.xml
Recording test results
[Pipeline] }
[Pipeline] }
[withMaven] junitPublisher - Archive test results for Maven artifact org.apache.maven.resolver:maven-resolver-transport-http:jar:1.3.2-SNAPSHOT generated by maven-surefire-plugin:test (default-test): m\maven-resolver-transport-http\target\surefire-reports\*.xml
Recording test results
[Pipeline] // node
None of the test reports contained any result
[withMaven] junitPublisher - Archive test results for Maven artifact org.apache.maven.resolver:maven-resolver-demo-maven-plugin:maven-plugin:1.3.2-SNAPSHOT generated by maven-surefire-plugin:test (default-test): m\maven-resolver-demos\maven-resolver-demo-maven-plugin\target\surefire-reports\*.xml
Recording test results
[withMaven] junitPublisher - Archive test results for Maven artifact org.apache.maven.resolver:maven-resolver-transport-wagon:jar:1.3.2-SNAPSHOT generated by maven-surefire-plugin:test (default-test): m\maven-resolver-transport-wagon\target\surefire-reports\*.xml
Recording test results
[Pipeline] }
None of the test reports contained any result
[withMaven] junitPublisher - Archive test results for Maven artifact org.apache.maven.resolver:maven-resolver-demo-snippets:jar:1.3.2-SNAPSHOT generated by maven-surefire-plugin:test (default-test): m\maven-resolver-demos\maven-resolver-demo-snippets\target\surefire-reports\*.xml
Recording test results
[withMaven] Publishers: Pipeline Graph Publisher: 10 ms, Invoker Publisher: 784 ms, Junit Publisher: 113383 ms, Dependencies Fingerprint Publisher: 898 ms
[Pipeline] // withMaven
[Pipeline] cleanWs
[WS-CLEANUP] Deleting project workspace...
[WS-CLEANUP] Deferred wipeout is used...
None of the test reports contained any result
[withMaven] junitPublisher - Archive test results for Maven artifact org.apache.maven.resolver:maven-resolver-demo-maven-plugin:maven-plugin:1.3.2-SNAPSHOT generated by maven-surefire-plugin:test (default-test): m\maven-resolver-demos\maven-resolver-demo-maven-plugin\target\surefire-reports\*.xml
Recording test results
None of the test reports contained any result
ERROR: Cannot delete workspace :f:\jenkins\jenkins-slave\workspace\n-box_maven-resolver_master-L2RUGOEIK5O5H3FE4SPFSXXNL7FPE37KLTBGLDWAT7DNTIKVZVEQ\m\maven-resolver-demos\maven-resolver-demo-maven-plugin\target\invoker-reports\BUILD-resolve-artifact.xml
[Pipeline] }
[Pipeline] // stage
[Pipeline] }
[Pipeline] // node
[Pipeline] }
Failed in branch windows-jdk11
[withMaven] Publishers: Pipeline Graph Publisher: 19 ms, Invoker Publisher: 4694 ms, Junit Publisher: 61659 ms, Concordion Publisher: 1 ms, Dependencies Fingerprint Publisher: 5393 ms
[Pipeline] // withMaven
[Pipeline] cleanWs
[WS-CLEANUP] Deleting project workspace...
[WS-CLEANUP] Deferred wipeout is used...
ERROR: Cannot delete workspace :f:\jenkins\jenkins-slave\workspace\n-box_maven-resolver_master-L2RUGOEIK5O5H3FE4SPFSXXNL7FPE37KLTBGLDWAT7DNTIKVZVEQ@2\m\maven-resolver-demos\maven-resolver-demo-maven-plugin\target\invoker-reports\BUILD-resolve-artifact.xml
[Pipeline] }
[Pipeline] // stage
[Pipeline] }
[Pipeline] // node
[Pipeline] }
Failed in branch windows-jdk8
[withMaven] Publishers: Pipeline Graph Publisher: 33 ms, Invoker Publisher: 4697 ms, Junit Publisher: 64738 ms, Concordion Publisher: 1 ms, Dependencies Fingerprint Publisher: 5611 ms
[Pipeline] // withMaven
[Pipeline] cleanWs
[WS-CLEANUP] Deleting project workspace...
[WS-CLEANUP] Deferred wipeout is used...
ERROR: Cannot delete workspace :f:\jenkins\jenkins-slave\workspace\n-box_maven-resolver_master-L2RUGOEIK5O5H3FE4SPFSXXNL7FPE37KLTBGLDWAT7DNTIKVZVEQ\m\maven-resolver-demos\maven-resolver-demo-maven-plugin\target\invoker-reports\BUILD-resolve-artifact.xml
[Pipeline] }
[Pipeline] // stage
[Pipeline] }
[Pipeline] // node
[Pipeline] }
Failed in branch windows-jdk7
[Pipeline] // parallel
[Pipeline] stage
[Pipeline] { (Notifications)
[Pipeline] echo
Build result: FAILURE
[Pipeline] jiraIssueSelector
[Pipeline] emailext
Reply | Threaded
Open this post in threaded view
|

Build failed in Jenkins: Maven TLP » maven-resolver » master #49

Apache Jenkins Server-2
See https://builds.apache.org/job/maven-box/job/maven-resolver/job/master/49/

Changes:

* Add JDK 13 (latest)

All tests passed

Build log:
[...truncated 10365 lines...]
[INFO] Installing /home/jenkins/jenkins-slave/workspace/maven-box_maven-resolver_master/m/maven-resolver-impl/pom.xml to /home/jenkins/jenkins-slave/workspace/maven-box_maven-resolver_master/m/maven-resolver-demos/maven-resolver-demo-maven-plugin/target/local-repo/org/apache/maven/resolver/maven-resolver-impl/1.3.2-SNAPSHOT/maven-resolver-impl-1.3.2-SNAPSHOT.pom
[INFO] Installing /home/jenkins/jenkins-slave/workspace/maven-box_maven-resolver_master/m/maven-resolver-impl/target/maven-resolver-impl-1.3.2-SNAPSHOT.jar to /home/jenkins/jenkins-slave/workspace/maven-box_maven-resolver_master/m/maven-resolver-demos/maven-resolver-demo-maven-plugin/target/local-repo/org/apache/maven/resolver/maven-resolver-impl/1.3.2-SNAPSHOT/maven-resolver-impl-1.3.2-SNAPSHOT.jar
[INFO] Installing /home/jenkins/jenkins-slave/workspace/maven-box_maven-resolver_master/m/maven-resolver-connector-basic/pom.xml to /home/jenkins/jenkins-slave/workspace/maven-box_maven-resolver_master/m/maven-resolver-demos/maven-resolver-demo-maven-plugin/target/local-repo/org/apache/maven/resolver/maven-resolver-connector-basic/1.3.2-SNAPSHOT/maven-resolver-connector-basic-1.3.2-SNAPSHOT.pom
[INFO] Installing /home/jenkins/jenkins-slave/workspace/maven-box_maven-resolver_master/m/maven-resolver-connector-basic/target/maven-resolver-connector-basic-1.3.2-SNAPSHOT.jar to /home/jenkins/jenkins-slave/workspace/maven-box_maven-resolver_master/m/maven-resolver-demos/maven-resolver-demo-maven-plugin/target/local-repo/org/apache/maven/resolver/maven-resolver-connector-basic/1.3.2-SNAPSHOT/maven-resolver-connector-basic-1.3.2-SNAPSHOT.jar
[INFO] Installing /home/jenkins/jenkins-slave/workspace/maven-box_maven-resolver_master/m/maven-resolver-transport-classpath/pom.xml to /home/jenkins/jenkins-slave/workspace/maven-box_maven-resolver_master/m/maven-resolver-demos/maven-resolver-demo-maven-plugin/target/local-repo/org/apache/maven/resolver/maven-resolver-transport-classpath/1.3.2-SNAPSHOT/maven-resolver-transport-classpath-1.3.2-SNAPSHOT.pom
[INFO] Installing /home/jenkins/jenkins-slave/workspace/maven-box_maven-resolver_master/m/maven-resolver-transport-classpath/target/maven-resolver-transport-classpath-1.3.2-SNAPSHOT.jar to /home/jenkins/jenkins-slave/workspace/maven-box_maven-resolver_master/m/maven-resolver-demos/maven-resolver-demo-maven-plugin/target/local-repo/org/apache/maven/resolver/maven-resolver-transport-classpath/1.3.2-SNAPSHOT/maven-resolver-transport-classpath-1.3.2-SNAPSHOT.jar
[INFO] Installing /home/jenkins/jenkins-slave/workspace/maven-box_maven-resolver_master/m/maven-resolver-transport-file/pom.xml to /home/jenkins/jenkins-slave/workspace/maven-box_maven-resolver_master/m/maven-resolver-demos/maven-resolver-demo-maven-plugin/target/local-repo/org/apache/maven/resolver/maven-resolver-transport-file/1.3.2-SNAPSHOT/maven-resolver-transport-file-1.3.2-SNAPSHOT.pom
[INFO] Installing /home/jenkins/jenkins-slave/workspace/maven-box_maven-resolver_master/m/maven-resolver-transport-file/target/maven-resolver-transport-file-1.3.2-SNAPSHOT.jar to /home/jenkins/jenkins-slave/workspace/maven-box_maven-resolver_master/m/maven-resolver-demos/maven-resolver-demo-maven-plugin/target/local-repo/org/apache/maven/resolver/maven-resolver-transport-file/1.3.2-SNAPSHOT/maven-resolver-transport-file-1.3.2-SNAPSHOT.jar
[INFO] Installing /home/jenkins/jenkins-slave/workspace/maven-box_maven-resolver_master/m/maven-resolver-transport-http/pom.xml to /home/jenkins/jenkins-slave/workspace/maven-box_maven-resolver_master/m/maven-resolver-demos/maven-resolver-demo-maven-plugin/target/local-repo/org/apache/maven/resolver/maven-resolver-transport-http/1.3.2-SNAPSHOT/maven-resolver-transport-http-1.3.2-SNAPSHOT.pom
[INFO] Installing /home/jenkins/jenkins-slave/workspace/maven-box_maven-resolver_master/m/maven-resolver-transport-http/target/maven-resolver-transport-http-1.3.2-SNAPSHOT.jar to /home/jenkins/jenkins-slave/workspace/maven-box_maven-resolver_master/m/maven-resolver-demos/maven-resolver-demo-maven-plugin/target/local-repo/org/apache/maven/resolver/maven-resolver-transport-http/1.3.2-SNAPSHOT/maven-resolver-transport-http-1.3.2-SNAPSHOT.jar
[INFO] Installing /home/jenkins/jenkins-slave/workspace/maven-box_maven-resolver_master/m/maven-resolver-transport-wagon/pom.xml to /home/jenkins/jenkins-slave/workspace/maven-box_maven-resolver_master/m/maven-resolver-demos/maven-resolver-demo-maven-plugin/target/local-repo/org/apache/maven/resolver/maven-resolver-transport-wagon/1.3.2-SNAPSHOT/maven-resolver-transport-wagon-1.3.2-SNAPSHOT.pom
[INFO] Installing /home/jenkins/jenkins-slave/workspace/maven-box_maven-resolver_master/m/maven-resolver-transport-wagon/target/maven-resolver-transport-wagon-1.3.2-SNAPSHOT.jar to /home/jenkins/jenkins-slave/workspace/maven-box_maven-resolver_master/m/maven-resolver-demos/maven-resolver-demo-maven-plugin/target/local-repo/org/apache/maven/resolver/maven-resolver-transport-wagon/1.3.2-SNAPSHOT/maven-resolver-transport-wagon-1.3.2-SNAPSHOT.jar
[INFO] Installing /home/jenkins/jenkins-slave/workspace/maven-box_maven-resolver_master/m/maven-resolver-demos/pom.xml to /home/jenkins/jenkins-slave/workspace/maven-box_maven-resolver_master/m/maven-resolver-demos/maven-resolver-demo-maven-plugin/target/local-repo/org/apache/maven/resolver/maven-resolver-demos/1.3.2-SNAPSHOT/maven-resolver-demos-1.3.2-SNAPSHOT.pom
[INFO] Installing /home/jenkins/jenkins-slave/workspace/maven-box_maven-resolver_master/m/maven-resolver-demos/target/maven-resolver-demos-1.3.2-SNAPSHOT-site.xml to /home/jenkins/jenkins-slave/workspace/maven-box_maven-resolver_master/m/maven-resolver-demos/maven-resolver-demo-maven-plugin/target/local-repo/org/apache/maven/resolver/maven-resolver-demos/1.3.2-SNAPSHOT/maven-resolver-demos-1.3.2-SNAPSHOT-site.xml
[INFO] Installing /home/jenkins/jenkins-slave/workspace/maven-box_maven-resolver_master/m/maven-resolver-demos/maven-resolver-demo-snippets/pom.xml to /home/jenkins/jenkins-slave/workspace/maven-box_maven-resolver_master/m/maven-resolver-demos/maven-resolver-demo-maven-plugin/target/local-repo/org/apache/maven/resolver/maven-resolver-demo-snippets/1.3.2-SNAPSHOT/maven-resolver-demo-snippets-1.3.2-SNAPSHOT.pom
[INFO] Installing /home/jenkins/jenkins-slave/workspace/maven-box_maven-resolver_master/m/maven-resolver-demos/maven-resolver-demo-snippets/target/maven-resolver-demo-snippets-1.3.2-SNAPSHOT.jar to /home/jenkins/jenkins-slave/workspace/maven-box_maven-resolver_master/m/maven-resolver-demos/maven-resolver-demo-maven-plugin/target/local-repo/org/apache/maven/resolver/maven-resolver-demo-snippets/1.3.2-SNAPSHOT/maven-resolver-demo-snippets-1.3.2-SNAPSHOT.jar
[INFO] Installing /home/jenkins/jenkins-slave/workspace/maven-box_maven-resolver_master/m/maven-resolver-demos/maven-resolver-demo-maven-plugin/pom.xml to /home/jenkins/jenkins-slave/workspace/maven-box_maven-resolver_master/m/maven-resolver-demos/maven-resolver-demo-maven-plugin/target/local-repo/org/apache/maven/resolver/maven-resolver-demo-maven-plugin/1.3.2-SNAPSHOT/maven-resolver-demo-maven-plugin-1.3.2-SNAPSHOT.pom
[INFO] Installing /home/jenkins/jenkins-slave/workspace/maven-box_maven-resolver_master/m/maven-resolver-demos/maven-resolver-demo-maven-plugin/target/maven-resolver-demo-maven-plugin-1.3.2-SNAPSHOT.jar to /home/jenkins/jenkins-slave/workspace/maven-box_maven-resolver_master/m/maven-resolver-demos/maven-resolver-demo-maven-plugin/target/local-repo/org/apache/maven/resolver/maven-resolver-demo-maven-plugin/1.3.2-SNAPSHOT/maven-resolver-demo-maven-plugin-1.3.2-SNAPSHOT.jar
[INFO]
[INFO] --- maven-invoker-plugin:3.0.1:run (integration-test) @ maven-resolver-demo-maven-plugin ---
[INFO] Running Setup Jobs
[INFO] Building: resolve-artifact/pom.xml
[withMaven] junitPublisher - Archive test results for Maven artifact org.apache.maven.resolver:maven-resolver-util:jar:1.3.2-SNAPSHOT generated by maven-surefire-plugin:test (default-test): m/maven-resolver-util/target/surefire-reports/*.xml
Recording test results
[INFO]           resolve-artifact/pom.xml ......................... SUCCESS (3.9 s)
[INFO] -------------------------------------------------
[INFO] Build Summary:
[INFO]   Passed: 1, Failed: 0, Errors: 0, Skipped: 0
[INFO] -------------------------------------------------
[INFO]
[INFO] --- maven-checkstyle-plugin:3.0.0:check (checkstyle-check) @ maven-resolver-demo-maven-plugin ---
[INFO]           resolve-artifact/pom.xml ......................... SUCCESS (3.6 s)
[INFO] -------------------------------------------------
[INFO] Build Summary:
[INFO]   Passed: 1, Failed: 0, Errors: 0, Skipped: 0
[INFO] -------------------------------------------------
[INFO]
[INFO] --- maven-checkstyle-plugin:3.0.0:check (checkstyle-check) @ maven-resolver-demo-maven-plugin ---
[INFO] ------------------------------------------------------------------------
[INFO] Reactor Summary:
[INFO]
[INFO] Maven Artifact Resolver 1.3.2-SNAPSHOT ............. SUCCESS [ 15.681 s]
[INFO] Maven Artifact Resolver API ........................ SUCCESS [ 11.900 s]
[INFO] Maven Artifact Resolver SPI ........................ SUCCESS [  1.843 s]
[INFO] Maven Artifact Resolver Test Utilities ............. SUCCESS [  2.411 s]
[INFO] Maven Artifact Resolver Utilities .................. SUCCESS [  4.393 s]
[INFO] Maven Artifact Resolver Implementation ............. SUCCESS [  7.468 s]
[INFO] Maven Artifact Resolver Connector Basic ............ SUCCESS [  7.350 s]
[INFO] Maven Artifact Resolver Transport Classpath ........ SUCCESS [  1.572 s]
[INFO] Maven Artifact Resolver Transport File ............. SUCCESS [  1.786 s]
[INFO] Maven Artifact Resolver Transport HTTP ............. SUCCESS [  6.309 s]
[INFO] Maven Artifact Resolver Transport Wagon ............ SUCCESS [  3.855 s]
[INFO] Maven Artifact Resolver Demos ...................... SUCCESS [  0.419 s]
[INFO] Maven Artifact Resolver Demo Snippets .............. SUCCESS [  2.085 s]
[INFO] Maven Artifact Resolver Demo Maven Plugin 1.3.2-SNAPSHOT SUCCESS [  7.029 s]
[INFO] ------------------------------------------------------------------------
[INFO] BUILD SUCCESS
[INFO] ------------------------------------------------------------------------
[INFO] Total time: 01:15 min
[INFO] Finished at: 2019-01-12T11:25:27Z
[INFO] ------------------------------------------------------------------------
[INFO] [jenkins-event-spy] Generated /home/jenkins/jenkins-slave/workspace/maven-box_maven-resolver_master@tmp/withMaven7f1772d9/maven-spy-20190112-112410-7744997169835772744530.log
[Pipeline] }
[INFO] ------------------------------------------------------------------------
[INFO] Reactor Summary:
[INFO]
[INFO] Maven Artifact Resolver 1.3.2-SNAPSHOT ............. SUCCESS [ 13.830 s]
[INFO] Maven Artifact Resolver API ........................ SUCCESS [ 11.704 s]
[INFO] Maven Artifact Resolver SPI ........................ SUCCESS [  2.113 s]
[INFO] Maven Artifact Resolver Test Utilities ............. SUCCESS [  2.365 s]
[INFO] Maven Artifact Resolver Utilities .................. SUCCESS [  5.174 s]
[INFO] Maven Artifact Resolver Implementation ............. SUCCESS [  8.710 s]
[INFO] Maven Artifact Resolver Connector Basic ............ SUCCESS [  7.642 s]
[INFO] Maven Artifact Resolver Transport Classpath ........ SUCCESS [  2.040 s]
[INFO] Maven Artifact Resolver Transport File ............. SUCCESS [  1.917 s]
[INFO] Maven Artifact Resolver Transport HTTP ............. SUCCESS [  6.843 s]
[INFO] Maven Artifact Resolver Transport Wagon ............ SUCCESS [  3.943 s]
[INFO] Maven Artifact Resolver Demos ...................... SUCCESS [  0.380 s]
[INFO] Maven Artifact Resolver Demo Snippets .............. SUCCESS [  1.992 s]
[INFO] Maven Artifact Resolver Demo Maven Plugin 1.3.2-SNAPSHOT SUCCESS [  6.617 s]
[INFO] ------------------------------------------------------------------------
[INFO] BUILD SUCCESS
[INFO] ------------------------------------------------------------------------
[INFO] Total time: 01:16 min
[INFO] Finished at: 2019-01-12T11:25:27Z
[INFO] ------------------------------------------------------------------------
[INFO] [jenkins-event-spy] Generated /home/jenkins/jenkins-slave/workspace/maven-box_maven-resolver_master@tmp/withMaven674976c1/maven-spy-20190112-112410-846963315993726778241.log
[withMaven] junitPublisher - Archive test results for Maven artifact org.apache.maven.resolver:maven-resolver-impl:jar:1.3.2-SNAPSHOT generated by maven-surefire-plugin:test (default-test): m/maven-resolver-impl/target/surefire-reports/*.xml
Recording test results
[Pipeline] // dir
[Pipeline] }
[Pipeline] }
[Pipeline] // dir
[Pipeline] }
[withMaven] invokerPublisher - Archive invoker results for Maven artifact MavenArtifact{org.apache.maven.resolver:maven-resolver-demo-maven-plugin:maven-plugin:1.3.2-SNAPSHOT(version: 1.3.2-SNAPSHOT, snapshot:false) } generated by PluginInvocation{org.apache.maven.plugins:maven-invoker-plugin:3.0.1@run  integration-test}: m/maven-resolver-demos/maven-resolver-demo-maven-plugin/target/invoker-reports/*.xml
[withMaven] junitPublisher - Archive test results for Maven artifact org.apache.maven.resolver:maven-resolver-connector-basic:jar:1.3.2-SNAPSHOT generated by maven-surefire-plugin:test (default-test): m/maven-resolver-connector-basic/target/surefire-reports/*.xml
Recording test results
[withMaven] junitPublisher - Archive test results for Maven artifact org.apache.maven.resolver:maven-resolver-api:jar:1.3.2-SNAPSHOT generated by maven-surefire-plugin:test (default-test): m/maven-resolver-api/target/surefire-reports/*.xml
Recording test results
[withMaven] artifactsPublisher - Archive artifact m/pom.xml under org/apache/maven/resolver/maven-resolver/1.3.2-SNAPSHOT/maven-resolver-1.3.2-SNAPSHOT.pom
[withMaven] artifactsPublisher - Archive artifact m/target/maven-resolver-1.3.2-SNAPSHOT-site.xml under org/apache/maven/resolver/maven-resolver/1.3.2-SNAPSHOT/maven-resolver-1.3.2-SNAPSHOT-site.xml
[withMaven] artifactsPublisher - Archive artifact m/maven-resolver-api/pom.xml under org/apache/maven/resolver/maven-resolver-api/1.3.2-SNAPSHOT/maven-resolver-api-1.3.2-SNAPSHOT.pom
[withMaven] artifactsPublisher - Archive artifact m/maven-resolver-api/target/maven-resolver-api-1.3.2-SNAPSHOT.jar under org/apache/maven/resolver/maven-resolver-api/1.3.2-SNAPSHOT/maven-resolver-api-1.3.2-SNAPSHOT.jar
[withMaven] junitPublisher - Archive test results for Maven artifact org.apache.maven.resolver:maven-resolver-transport-classpath:jar:1.3.2-SNAPSHOT generated by maven-surefire-plugin:test (default-test): m/maven-resolver-transport-classpath/target/surefire-reports/*.xml
Recording test results
[withMaven] artifactsPublisher - Archive artifact m/maven-resolver-spi/pom.xml under org/apache/maven/resolver/maven-resolver-spi/1.3.2-SNAPSHOT/maven-resolver-spi-1.3.2-SNAPSHOT.pom
[withMaven] artifactsPublisher - Archive artifact m/maven-resolver-spi/target/maven-resolver-spi-1.3.2-SNAPSHOT.jar under org/apache/maven/resolver/maven-resolver-spi/1.3.2-SNAPSHOT/maven-resolver-spi-1.3.2-SNAPSHOT.jar
[withMaven] artifactsPublisher - Archive artifact m/maven-resolver-test-util/pom.xml under org/apache/maven/resolver/maven-resolver-test-util/1.3.2-SNAPSHOT/maven-resolver-test-util-1.3.2-SNAPSHOT.pom
[withMaven] artifactsPublisher - Archive artifact m/maven-resolver-test-util/target/maven-resolver-test-util-1.3.2-SNAPSHOT.jar under org/apache/maven/resolver/maven-resolver-test-util/1.3.2-SNAPSHOT/maven-resolver-test-util-1.3.2-SNAPSHOT.jar
[withMaven] artifactsPublisher - Archive artifact m/maven-resolver-util/pom.xml under org/apache/maven/resolver/maven-resolver-util/1.3.2-SNAPSHOT/maven-resolver-util-1.3.2-SNAPSHOT.pom
[withMaven] artifactsPublisher - Archive artifact m/maven-resolver-util/target/maven-resolver-util-1.3.2-SNAPSHOT.jar under org/apache/maven/resolver/maven-resolver-util/1.3.2-SNAPSHOT/maven-resolver-util-1.3.2-SNAPSHOT.jar
[withMaven] artifactsPublisher - Archive artifact m/maven-resolver-impl/pom.xml under org/apache/maven/resolver/maven-resolver-impl/1.3.2-SNAPSHOT/maven-resolver-impl-1.3.2-SNAPSHOT.pom
[withMaven] artifactsPublisher - Archive artifact m/maven-resolver-impl/target/maven-resolver-impl-1.3.2-SNAPSHOT.jar under org/apache/maven/resolver/maven-resolver-impl/1.3.2-SNAPSHOT/maven-resolver-impl-1.3.2-SNAPSHOT.jar
[withMaven] artifactsPublisher - Archive artifact m/maven-resolver-connector-basic/pom.xml under org/apache/maven/resolver/maven-resolver-connector-basic/1.3.2-SNAPSHOT/maven-resolver-connector-basic-1.3.2-SNAPSHOT.pom
[withMaven] artifactsPublisher - Archive artifact m/maven-resolver-connector-basic/target/maven-resolver-connector-basic-1.3.2-SNAPSHOT.jar under org/apache/maven/resolver/maven-resolver-connector-basic/1.3.2-SNAPSHOT/maven-resolver-connector-basic-1.3.2-SNAPSHOT.jar
[withMaven] artifactsPublisher - Archive artifact m/maven-resolver-transport-classpath/pom.xml under org/apache/maven/resolver/maven-resolver-transport-classpath/1.3.2-SNAPSHOT/maven-resolver-transport-classpath-1.3.2-SNAPSHOT.pom
[withMaven] artifactsPublisher - Archive artifact m/maven-resolver-transport-classpath/target/maven-resolver-transport-classpath-1.3.2-SNAPSHOT.jar under org/apache/maven/resolver/maven-resolver-transport-classpath/1.3.2-SNAPSHOT/maven-resolver-transport-classpath-1.3.2-SNAPSHOT.jar
[withMaven] artifactsPublisher - Archive artifact m/maven-resolver-transport-file/pom.xml under org/apache/maven/resolver/maven-resolver-transport-file/1.3.2-SNAPSHOT/maven-resolver-transport-file-1.3.2-SNAPSHOT.pom
[withMaven] artifactsPublisher - Archive artifact m/maven-resolver-transport-file/target/maven-resolver-transport-file-1.3.2-SNAPSHOT.jar under org/apache/maven/resolver/maven-resolver-transport-file/1.3.2-SNAPSHOT/maven-resolver-transport-file-1.3.2-SNAPSHOT.jar
[withMaven] artifactsPublisher - Archive artifact m/maven-resolver-transport-http/pom.xml under org/apache/maven/resolver/maven-resolver-transport-http/1.3.2-SNAPSHOT/maven-resolver-transport-http-1.3.2-SNAPSHOT.pom
[withMaven] artifactsPublisher - Archive artifact m/maven-resolver-transport-http/target/maven-resolver-transport-http-1.3.2-SNAPSHOT.jar under org/apache/maven/resolver/maven-resolver-transport-http/1.3.2-SNAPSHOT/maven-resolver-transport-http-1.3.2-SNAPSHOT.jar
[withMaven] artifactsPublisher - Archive artifact m/maven-resolver-transport-wagon/pom.xml under org/apache/maven/resolver/maven-resolver-transport-wagon/1.3.2-SNAPSHOT/maven-resolver-transport-wagon-1.3.2-SNAPSHOT.pom
[withMaven] artifactsPublisher - Archive artifact m/maven-resolver-transport-wagon/target/maven-resolver-transport-wagon-1.3.2-SNAPSHOT.jar under org/apache/maven/resolver/maven-resolver-transport-wagon/1.3.2-SNAPSHOT/maven-resolver-transport-wagon-1.3.2-SNAPSHOT.jar
[withMaven] junitPublisher - Archive test results for Maven artifact org.apache.maven.resolver:maven-resolver-spi:jar:1.3.2-SNAPSHOT generated by maven-surefire-plugin:test (default-test): m/maven-resolver-spi/target/surefire-reports/*.xml
Recording test results
[withMaven] artifactsPublisher - Archive artifact m/maven-resolver-demos/pom.xml under org/apache/maven/resolver/maven-resolver-demos/1.3.2-SNAPSHOT/maven-resolver-demos-1.3.2-SNAPSHOT.pom
[withMaven] artifactsPublisher - Archive artifact m/maven-resolver-demos/target/maven-resolver-demos-1.3.2-SNAPSHOT-site.xml under org/apache/maven/resolver/maven-resolver-demos/1.3.2-SNAPSHOT/maven-resolver-demos-1.3.2-SNAPSHOT-site.xml
[withMaven] junitPublisher - Archive test results for Maven artifact org.apache.maven.resolver:maven-resolver-transport-file:jar:1.3.2-SNAPSHOT generated by maven-surefire-plugin:test (default-test): m/maven-resolver-transport-file/target/surefire-reports/*.xml
Recording test results
[withMaven] artifactsPublisher - Archive artifact m/maven-resolver-demos/maven-resolver-demo-snippets/pom.xml under org/apache/maven/resolver/maven-resolver-demo-snippets/1.3.2-SNAPSHOT/maven-resolver-demo-snippets-1.3.2-SNAPSHOT.pom
[withMaven] junitPublisher - Archive test results for Maven artifact org.apache.maven.resolver:maven-resolver-test-util:jar:1.3.2-SNAPSHOT generated by maven-surefire-plugin:test (default-test): m/maven-resolver-test-util/target/surefire-reports/*.xml
Recording test results
[withMaven] artifactsPublisher - Archive artifact m/maven-resolver-demos/maven-resolver-demo-snippets/target/maven-resolver-demo-snippets-1.3.2-SNAPSHOT.jar under org/apache/maven/resolver/maven-resolver-demo-snippets/1.3.2-SNAPSHOT/maven-resolver-demo-snippets-1.3.2-SNAPSHOT.jar
[withMaven] junitPublisher - Archive test results for Maven artifact org.apache.maven.resolver:maven-resolver-transport-http:jar:1.3.2-SNAPSHOT generated by maven-surefire-plugin:test (default-test): m/maven-resolver-transport-http/target/surefire-reports/*.xml
Recording test results
[withMaven] artifactsPublisher - Archive artifact m/maven-resolver-demos/maven-resolver-demo-maven-plugin/pom.xml under org/apache/maven/resolver/maven-resolver-demo-maven-plugin/1.3.2-SNAPSHOT/maven-resolver-demo-maven-plugin-1.3.2-SNAPSHOT.pom
[withMaven] artifactsPublisher - Archive artifact m/maven-resolver-demos/maven-resolver-demo-maven-plugin/target/maven-resolver-demo-maven-plugin-1.3.2-SNAPSHOT.jar under org/apache/maven/resolver/maven-resolver-demo-maven-plugin/1.3.2-SNAPSHOT/maven-resolver-demo-maven-plugin-1.3.2-SNAPSHOT.jar
[withMaven] invokerPublisher - Archive invoker results for Maven artifact MavenArtifact{org.apache.maven.resolver:maven-resolver-demo-maven-plugin:maven-plugin:1.3.2-SNAPSHOT(version: 1.3.2-SNAPSHOT, snapshot:false) } generated by PluginInvocation{org.apache.maven.plugins:maven-invoker-plugin:3.0.1@run  integration-test}: m/maven-resolver-demos/maven-resolver-demo-maven-plugin/target/invoker-reports/*.xml
[withMaven] junitPublisher - Archive test results for Maven artifact org.apache.maven.resolver:maven-resolver-util:jar:1.3.2-SNAPSHOT generated by maven-surefire-plugin:test (default-test): m/maven-resolver-util/target/surefire-reports/*.xml
Recording test results
[withMaven] junitPublisher - Archive test results for Maven artifact org.apache.maven.resolver:maven-resolver-transport-wagon:jar:1.3.2-SNAPSHOT generated by maven-surefire-plugin:test (default-test): m/maven-resolver-transport-wagon/target/surefire-reports/*.xml
Recording test results
[withMaven] junitPublisher - Archive test results for Maven artifact org.apache.maven.resolver:maven-resolver-api:jar:1.3.2-SNAPSHOT generated by maven-surefire-plugin:test (default-test): m/maven-resolver-api/target/surefire-reports/*.xml
Recording test results
[withMaven] junitPublisher - Archive test results for Maven artifact org.apache.maven.resolver:maven-resolver-impl:jar:1.3.2-SNAPSHOT generated by maven-surefire-plugin:test (default-test): m/maven-resolver-impl/target/surefire-reports/*.xml
Recording test results
[withMaven] junitPublisher - Archive test results for Maven artifact org.apache.maven.resolver:maven-resolver-spi:jar:1.3.2-SNAPSHOT generated by maven-surefire-plugin:test (default-test): m/maven-resolver-spi/target/surefire-reports/*.xml
Recording test results
[withMaven] junitPublisher - Archive test results for Maven artifact org.apache.maven.resolver:maven-resolver-demo-snippets:jar:1.3.2-SNAPSHOT generated by maven-surefire-plugin:test (default-test): m/maven-resolver-demos/maven-resolver-demo-snippets/target/surefire-reports/*.xml
Recording test results
[withMaven] junitPublisher - Archive test results for Maven artifact org.apache.maven.resolver:maven-resolver-test-util:jar:1.3.2-SNAPSHOT generated by maven-surefire-plugin:test (default-test): m/maven-resolver-test-util/target/surefire-reports/*.xml
Recording test results
[withMaven] junitPublisher - Archive test results for Maven artifact org.apache.maven.resolver:maven-resolver-connector-basic:jar:1.3.2-SNAPSHOT generated by maven-surefire-plugin:test (default-test): m/maven-resolver-connector-basic/target/surefire-reports/*.xml
Recording test results
[withMaven] junitPublisher - Archive test results for Maven artifact org.apache.maven.resolver:maven-resolver-util:jar:1.3.2-SNAPSHOT generated by maven-surefire-plugin:test (default-test): m/maven-resolver-util/target/surefire-reports/*.xml
Recording test results
None of the test reports contained any result
[withMaven] junitPublisher - Archive test results for Maven artifact org.apache.maven.resolver:maven-resolver-demo-maven-plugin:maven-plugin:1.3.2-SNAPSHOT generated by maven-surefire-plugin:test (default-test): m/maven-resolver-demos/maven-resolver-demo-maven-plugin/target/surefire-reports/*.xml
Recording test results
[withMaven] junitPublisher - Archive test results for Maven artifact org.apache.maven.resolver:maven-resolver-transport-classpath:jar:1.3.2-SNAPSHOT generated by maven-surefire-plugin:test (default-test): m/maven-resolver-transport-classpath/target/surefire-reports/*.xml
Recording test results
None of the test reports contained any result
[withMaven] Publishers: Pipeline Graph Publisher: 61 ms, Invoker Publisher: 1158 ms, Junit Publisher: 102018 ms, Concordion Publisher: 1 ms, Dependencies Fingerprint Publisher: 9060 ms
[Pipeline] // withMaven
[withMaven] junitPublisher - Archive test results for Maven artifact org.apache.maven.resolver:maven-resolver-impl:jar:1.3.2-SNAPSHOT generated by maven-surefire-plugin:test (default-test): m/maven-resolver-impl/target/surefire-reports/*.xml
Recording test results
[Pipeline] cleanWs
[WS-CLEANUP] Deleting project workspace...
[WS-CLEANUP] Deferred wipeout is used...
[withMaven] junitPublisher - Archive test results for Maven artifact org.apache.maven.resolver:maven-resolver-transport-file:jar:1.3.2-SNAPSHOT generated by maven-surefire-plugin:test (default-test): m/maven-resolver-transport-file/target/surefire-reports/*.xml
Recording test results
[WS-CLEANUP] done
[withMaven] junitPublisher - Archive test results for Maven artifact org.apache.maven.resolver:maven-resolver-connector-basic:jar:1.3.2-SNAPSHOT generated by maven-surefire-plugin:test (default-test): m/maven-resolver-connector-basic/target/surefire-reports/*.xml
Recording test results
[Pipeline] }
[withMaven] junitPublisher - Archive test results for Maven artifact org.apache.maven.resolver:maven-resolver-transport-http:jar:1.3.2-SNAPSHOT generated by maven-surefire-plugin:test (default-test): m/maven-resolver-transport-http/target/surefire-reports/*.xml
Recording test results
[withMaven] junitPublisher - Archive test results for Maven artifact org.apache.maven.resolver:maven-resolver-transport-classpath:jar:1.3.2-SNAPSHOT generated by maven-surefire-plugin:test (default-test): m/maven-resolver-transport-classpath/target/surefire-reports/*.xml
Recording test results
[Pipeline] // stage
[withMaven] junitPublisher - Archive test results for Maven artifact org.apache.maven.resolver:maven-resolver-transport-wagon:jar:1.3.2-SNAPSHOT generated by maven-surefire-plugin:test (default-test): m/maven-resolver-transport-wagon/target/surefire-reports/*.xml
Recording test results
[withMaven] junitPublisher - Archive test results for Maven artifact org.apache.maven.resolver:maven-resolver-transport-file:jar:1.3.2-SNAPSHOT generated by maven-surefire-plugin:test (default-test): m/maven-resolver-transport-file/target/surefire-reports/*.xml
Recording test results
[Pipeline] }
[withMaven] junitPublisher - Archive test results for Maven artifact org.apache.maven.resolver:maven-resolver-demo-snippets:jar:1.3.2-SNAPSHOT generated by maven-surefire-plugin:test (default-test): m/maven-resolver-demos/maven-resolver-demo-snippets/target/surefire-reports/*.xml
Recording test results
[withMaven] junitPublisher - Archive test results for Maven artifact org.apache.maven.resolver:maven-resolver-transport-http:jar:1.3.2-SNAPSHOT generated by maven-surefire-plugin:test (default-test): m/maven-resolver-transport-http/target/surefire-reports/*.xml
Recording test results
[Pipeline] // node
None of the test reports contained any result
[withMaven] junitPublisher - Archive test results for Maven artifact org.apache.maven.resolver:maven-resolver-demo-maven-plugin:maven-plugin:1.3.2-SNAPSHOT generated by maven-surefire-plugin:test (default-test): m/maven-resolver-demos/maven-resolver-demo-maven-plugin/target/surefire-reports/*.xml
Recording test results
[Pipeline] }
[withMaven] junitPublisher - Archive test results for Maven artifact org.apache.maven.resolver:maven-resolver-transport-wagon:jar:1.3.2-SNAPSHOT generated by maven-surefire-plugin:test (default-test): m/maven-resolver-transport-wagon/target/surefire-reports/*.xml
Recording test results
None of the test reports contained any result
[withMaven] junitPublisher - Archive test results for Maven artifact org.apache.maven.resolver:maven-resolver-demo-snippets:jar:1.3.2-SNAPSHOT generated by maven-surefire-plugin:test (default-test): m/maven-resolver-demos/maven-resolver-demo-snippets/target/surefire-reports/*.xml
Recording test results
None of the test reports contained any result
[withMaven] junitPublisher - Archive test results for Maven artifact org.apache.maven.resolver:maven-resolver-demo-maven-plugin:maven-plugin:1.3.2-SNAPSHOT generated by maven-surefire-plugin:test (default-test): m/maven-resolver-demos/maven-resolver-demo-maven-plugin/target/surefire-reports/*.xml
Recording test results
None of the test reports contained any result
[withMaven] Publishers: Pipeline Graph Publisher: 12 ms, Invoker Publisher: 10928 ms, Junit Publisher: 100757 ms, Concordion Publisher: 1 ms, Dependencies Fingerprint Publisher: 9109 ms
[Pipeline] // withMaven
[Pipeline] cleanWs
[WS-CLEANUP] Deleting project workspace...
[WS-CLEANUP] Deferred wipeout is used...
[WS-CLEANUP] done
[Pipeline] }
[Pipeline] // stage
[Pipeline] }
[Pipeline] // node
[Pipeline] }
[withMaven] openTasksPublisher - Scan Tasks for Maven artifact org.apache.maven.resolver:maven-resolver-api:jar:1.3.2-SNAPSHOT in source directory m/maven-resolver-api/src/main/java
[withMaven] openTasksPublisher - Scan Tasks for Maven artifact org.apache.maven.resolver:maven-resolver-spi:jar:1.3.2-SNAPSHOT in source directory m/maven-resolver-spi/src/main/java
[withMaven] openTasksPublisher - Scan Tasks for Maven artifact org.apache.maven.resolver:maven-resolver-test-util:jar:1.3.2-SNAPSHOT in source directory m/maven-resolver-test-util/src/main/java
[withMaven] openTasksPublisher - Scan Tasks for Maven artifact org.apache.maven.resolver:maven-resolver-util:jar:1.3.2-SNAPSHOT in source directory m/maven-resolver-util/src/main/java
[withMaven] openTasksPublisher - Scan Tasks for Maven artifact org.apache.maven.resolver:maven-resolver-impl:jar:1.3.2-SNAPSHOT in source directory m/maven-resolver-impl/src/main/java
[withMaven] openTasksPublisher - Scan Tasks for Maven artifact org.apache.maven.resolver:maven-resolver-connector-basic:jar:1.3.2-SNAPSHOT in source directory m/maven-resolver-connector-basic/src/main/java
[withMaven] openTasksPublisher - Scan Tasks for Maven artifact org.apache.maven.resolver:maven-resolver-transport-classpath:jar:1.3.2-SNAPSHOT in source directory m/maven-resolver-transport-classpath/src/main/java
[withMaven] openTasksPublisher - Scan Tasks for Maven artifact org.apache.maven.resolver:maven-resolver-transport-file:jar:1.3.2-SNAPSHOT in source directory m/maven-resolver-transport-file/src/main/java
[withMaven] openTasksPublisher - Scan Tasks for Maven artifact org.apache.maven.resolver:maven-resolver-transport-http:jar:1.3.2-SNAPSHOT in source directory m/maven-resolver-transport-http/src/main/java
[withMaven] openTasksPublisher - Scan Tasks for Maven artifact org.apache.maven.resolver:maven-resolver-transport-wagon:jar:1.3.2-SNAPSHOT in source directory m/maven-resolver-transport-wagon/src/main/java
[withMaven] openTasksPublisher - Scan Tasks for Maven artifact org.apache.maven.resolver:maven-resolver-demo-snippets:jar:1.3.2-SNAPSHOT in source directory m/maven-resolver-demos/maven-resolver-demo-snippets/src/main/java
[withMaven] openTasksPublisher - Scan Tasks for Maven artifact org.apache.maven.resolver:maven-resolver-demo-maven-plugin:maven-plugin:1.3.2-SNAPSHOT in source directory m/maven-resolver-demos/maven-resolver-demo-maven-plugin/src/main/java
[TASKS] Scanning folder '/home/jenkins/jenkins-slave/workspace/maven-box_maven-resolver_master' for files matching the pattern 'm/maven-resolver-api/src/main/java/**/*,m/maven-resolver-spi/src/main/java/**/*,m/maven-resolver-test-util/src/main/java/**/*,m/maven-resolver-util/src/main/java/**/*,m/maven-resolver-impl/src/main/java/**/*,m/maven-resolver-connector-basic/src/main/java/**/*,m/maven-resolver-transport-classpath/src/main/java/**/*,m/maven-resolver-transport-file/src/main/java/**/*,m/maven-resolver-transport-http/src/main/java/**/*,m/maven-resolver-transport-wagon/src/main/java/**/*,m/maven-resolver-demos/maven-resolver-demo-snippets/src/main/java/**/*,m/maven-resolver-demos/maven-resolver-demo-maven-plugin/src/main/java/**/*' - excludes: null
[TASKS] Found 409 files to scan for tasks
[TASKS] Found 0 open tasks.
Skipping warnings blame since pipelines do not have an SCM link.%n
[TASKS] Computing warning deltas based on reference build #45
[withMaven] Publishers: Pipeline Graph Publisher: 11 ms, Generated Artifacts Publisher: 23240 ms, Invoker Publisher: 1598 ms, Junit Publisher: 89499 ms, Concordion Publisher: 1 ms, Dependencies Fingerprint Publisher: 8996 ms, Open Task Scanner Publisher: 2685 ms
[Pipeline] // withMaven
[Pipeline] cleanWs
[WS-CLEANUP] Deleting project workspace...
[WS-CLEANUP] Deferred wipeout is used...
[WS-CLEANUP] done
[Pipeline] }
[Pipeline] // stage
[Pipeline] }
[Pipeline] // node
[Pipeline] }
[Pipeline] // parallel
[Pipeline] stage
[Pipeline] { (Notifications)
[Pipeline] echo
Build result: FAILURE
[Pipeline] jiraIssueSelector
[Pipeline] emailext