Build failed in Jenkins: Maven TLP » maven-resolver » master #37

classic Classic list List threaded Threaded
2 messages Options
Reply | Threaded
Open this post in threaded view
|

Build failed in Jenkins: Maven TLP » maven-resolver » master #37

Apache Jenkins Server-2
See https://builds.apache.org/job/maven-box/job/maven-resolver/job/master/37/

Changes:

* going back version based on mistake.
* going back version based on mistake.
* going back version based on mistake.
* going back version based on mistake.

No tests ran.

Build log:
[...truncated 214.79 KB...]
[linux-jdk10] Running in /home/jenkins/jenkins-slave/workspace/n-box_maven-resolver_master-L2RUGOEIK5O5H3FE4SPFSXXNL7FPE37KLTBGLDWAT7DNTIKVZVEQ/m
[Pipeline] [linux-jdk10] {
[Pipeline] [linux-jdk10] checkout
[linux-jdk9]  > git config remote.origin.url https://gitbox.apache.org/repos/asf/maven-resolver.git # timeout=10
[linux-jdk9]  > git config --add remote.origin.fetch +refs/heads/*:refs/remotes/origin/* # timeout=10
[linux-jdk9]  > git config remote.origin.url https://gitbox.apache.org/repos/asf/maven-resolver.git # timeout=10
[linux-jdk9] Fetching without tags
[linux-jdk10] Cloning the remote Git repository
[linux-jdk10] Cloning with configured refspecs honoured and without tags
[linux-jdk10] Cloning repository https://gitbox.apache.org/repos/asf/maven-resolver.git
[linux-jdk10]  > git init /home/jenkins/jenkins-slave/workspace/n-box_maven-resolver_master-L2RUGOEIK5O5H3FE4SPFSXXNL7FPE37KLTBGLDWAT7DNTIKVZVEQ/m # timeout=10
[linux-jdk10] Fetching upstream changes from https://gitbox.apache.org/repos/asf/maven-resolver.git
[linux-jdk10]  > git --version # timeout=10
[linux-jdk10]  > git fetch --no-tags --progress https://gitbox.apache.org/repos/asf/maven-resolver.git +refs/heads/*:refs/remotes/origin/*
[linux-jdk9] Fetching upstream changes from https://gitbox.apache.org/repos/asf/maven-resolver.git
[linux-jdk9]  > git fetch --no-tags --progress https://gitbox.apache.org/repos/asf/maven-resolver.git +refs/heads/*:refs/remotes/origin/*
[linux-jdk9] Checking out Revision edd52a2b29d38349b064e5d51cd34fe1ccee3155 (master)
[linux-jdk10]  > git config remote.origin.url https://gitbox.apache.org/repos/asf/maven-resolver.git # timeout=10
[linux-jdk10]  > git config --add remote.origin.fetch +refs/heads/*:refs/remotes/origin/* # timeout=10
[linux-jdk9]  > git config core.sparsecheckout # timeout=10
[linux-jdk9]  > git checkout -f edd52a2b29d38349b064e5d51cd34fe1ccee3155
[linux-jdk9] Commit message: "going back version based on mistake."
[linux-jdk9] Cleaning workspace
[linux-jdk9]  > git rev-parse --verify HEAD # timeout=10
[linux-jdk9] Resetting working tree
[linux-jdk9]  > git reset --hard # timeout=10
[linux-jdk9]  > git clean -fdx # timeout=10
[linux-jdk10]  > git config remote.origin.url https://gitbox.apache.org/repos/asf/maven-resolver.git # timeout=10
[linux-jdk10] Fetching without tags
[linux-jdk10] Fetching upstream changes from https://gitbox.apache.org/repos/asf/maven-resolver.git
[linux-jdk10]  > git fetch --no-tags --progress https://gitbox.apache.org/repos/asf/maven-resolver.git +refs/heads/*:refs/remotes/origin/*
[Pipeline] [linux-jdk9] }
[Pipeline] [linux-jdk9] // dir
[Pipeline] [linux-jdk9] }
[Pipeline] [linux-jdk9] // stage
[Pipeline] [linux-jdk9] stage
[Pipeline] [linux-jdk9] { (Build linux-jdk9)
[linux-jdk10] Checking out Revision edd52a2b29d38349b064e5d51cd34fe1ccee3155 (master)
[linux-jdk10]  > git config core.sparsecheckout # timeout=10
[linux-jdk10]  > git checkout -f edd52a2b29d38349b064e5d51cd34fe1ccee3155
[linux-jdk10] Commit message: "going back version based on mistake."
[linux-jdk10] Cleaning workspace
[linux-jdk10]  > git rev-parse --verify HEAD # timeout=10
[linux-jdk10] Resetting working tree
[linux-jdk10]  > git reset --hard # timeout=10
[linux-jdk10]  > git clean -fdx # timeout=10
[Pipeline] [linux-jdk9] withMaven
[linux-jdk9] [withMaven] Options: [org.jenkinsci.plugins.pipeline.maven.publishers.GeneratedArtifactsPublisher[disabled=true], JunitTestsPublisher[disabled=false,healthScaleFactor=,keepLongStdio=false,ignoreAttachments=false], org.jenkinsci.plugins.pipeline.maven.publishers.FindbugsAnalysisPublisher[disabled='true', healthy='', unHealthy='', thresholdLimit='low'], org.jenkinsci.plugins.pipeline.maven.publishers.TasksScannerPublisher[disabled='true', healthy='', unHealthy='', thresholdLimit='low'], org.jenkinsci.plugins.pipeline.maven.publishers.DependenciesFingerprintPublisher[disabled=false, scopes=[compile, provided, runtime], versions={snapshot:true, release:false}], org.jenkinsci.plugins.pipeline.maven.publishers.InvokerRunsPublisher[disabled=false], org.jenkinsci.plugins.pipeline.maven.publishers.PipelineGraphPublisher[disabled=false, scopes=[compile, provided, runtime], versions={snapshot:true, release:false}, skipDownstreamTriggers=false, lifecycleThreshold=deploy, ignoreUpstreamTriggers=false]]
[linux-jdk9] [withMaven] Available options:
[linux-jdk9] [withMaven] using JDK installation JDK 1.9 (latest)
[linux-jdk9] [withMaven] using Maven installation 'Maven 3.5.4'
[Pipeline] [linux-jdk9] {
[Pipeline] [linux-jdk10] }
[Pipeline] [linux-jdk9] dir
[linux-jdk9] Running in /home/jenkins/jenkins-slave/workspace/n-box_maven-resolver_master-L2RUGOEIK5O5H3FE4SPFSXXNL7FPE37KLTBGLDWAT7DNTIKVZVEQ/m
[Pipeline] [linux-jdk9] {
[Pipeline] [linux-jdk10] // dir
[Pipeline] [linux-jdk10] }
[Pipeline] [linux-jdk9] isUnix
[Pipeline] [linux-jdk9] sh
[linux-jdk9] [m] Running shell script
[Pipeline] [linux-jdk10] // stage
[Pipeline] [linux-jdk10] stage
[Pipeline] [linux-jdk10] { (Build linux-jdk10)
[linux-jdk9] + mvn -P+run-its -Dmaven.test.failure.ignore=true -Dfindbugs.failOnError=false -Dfindbugs.skip=true clean verify
[linux-jdk9] ----- withMaven Wrapper script -----
[linux-jdk9] Picked up JAVA_TOOL_OPTIONS: -Dmaven.ext.class.path="/home/jenkins/jenkins-slave/workspace/n-box_maven-resolver_master-L2RUGOEIK5O5H3FE4SPFSXXNL7FPE37KLTBGLDWAT7DNTIKVZVEQ@tmp/withMaven0e5733ab/pipeline-maven-spy.jar" -Dorg.jenkinsci.plugins.pipeline.maven.reportsFolder="/home/jenkins/jenkins-slave/workspace/n-box_maven-resolver_master-L2RUGOEIK5O5H3FE4SPFSXXNL7FPE37KLTBGLDWAT7DNTIKVZVEQ@tmp/withMaven0e5733ab"
[linux-jdk9] Apache Maven 3.5.4 (1edded0938998edf8bf061f1ceb3cfdeccf443fe; 2018-06-17T18:33:14Z)
[linux-jdk9] Maven home: /home/jenkins/tools/maven/apache-maven-3.5.4
[linux-jdk9] Java version: 9.0.1, vendor: Oracle Corporation, runtime: /usr/local/asfpackages/java/jdk-9.0.1
[linux-jdk9] Default locale: en_US, platform encoding: ISO-8859-1
[linux-jdk9] OS name: "linux", version: "4.4.0-133-generic", arch: "amd64", family: "unix"
[Pipeline] [linux-jdk10] withMaven
[linux-jdk10] [withMaven] Options: [org.jenkinsci.plugins.pipeline.maven.publishers.GeneratedArtifactsPublisher[disabled=true], JunitTestsPublisher[disabled=false,healthScaleFactor=,keepLongStdio=false,ignoreAttachments=false], org.jenkinsci.plugins.pipeline.maven.publishers.FindbugsAnalysisPublisher[disabled='true', healthy='', unHealthy='', thresholdLimit='low'], org.jenkinsci.plugins.pipeline.maven.publishers.TasksScannerPublisher[disabled='true', healthy='', unHealthy='', thresholdLimit='low'], org.jenkinsci.plugins.pipeline.maven.publishers.DependenciesFingerprintPublisher[disabled=false, scopes=[compile, provided, runtime], versions={snapshot:true, release:false}], org.jenkinsci.plugins.pipeline.maven.publishers.InvokerRunsPublisher[disabled=false], org.jenkinsci.plugins.pipeline.maven.publishers.PipelineGraphPublisher[disabled=false, scopes=[compile, provided, runtime], versions={snapshot:true, release:false}, skipDownstreamTriggers=false, lifecycleThreshold=deploy, ignoreUpstreamTriggers=false]]
[linux-jdk10] [withMaven] Available options:
[linux-jdk10] [withMaven] using JDK installation JDK 10 (latest)
[linux-jdk10] [withMaven] using Maven installation 'Maven 3.5.4'
[Pipeline] [linux-jdk10] {
[Pipeline] [linux-jdk10] dir
[linux-jdk10] Running in /home/jenkins/jenkins-slave/workspace/n-box_maven-resolver_master-L2RUGOEIK5O5H3FE4SPFSXXNL7FPE37KLTBGLDWAT7DNTIKVZVEQ/m
[Pipeline] [linux-jdk10] {
[linux-jdk9] [INFO] [jenkins-event-spy] Generate /home/jenkins/jenkins-slave/workspace/n-box_maven-resolver_master-L2RUGOEIK5O5H3FE4SPFSXXNL7FPE37KLTBGLDWAT7DNTIKVZVEQ@tmp/withMaven0e5733ab/maven-spy-20181011-195148-7797579566021747583277.log.tmp ...
[Pipeline] [linux-jdk10] isUnix
[Pipeline] [linux-jdk10] sh
[linux-jdk9] [INFO] Scanning for projects...
[linux-jdk9] [INFO] Downloading from central: https://repo.maven.apache.org/maven2/org/apache/maven/maven-parent/33/maven-parent-33.pom
[linux-jdk10] [m] Running shell script
[linux-jdk9] [INFO] Downloaded from central: https://repo.maven.apache.org/maven2/org/apache/maven/maven-parent/33/maven-parent-33.pom (44 kB at 112 kB/s)
[linux-jdk9] [INFO] Downloading from central: https://repo.maven.apache.org/maven2/org/apache/apache/21/apache-21.pom
[linux-jdk9] [INFO] Downloaded from central: https://repo.maven.apache.org/maven2/org/apache/apache/21/apache-21.pom (17 kB at 611 kB/s)
[linux-jdk9] [ERROR] [ERROR] Some problems were encountered while processing the POMs:
[linux-jdk9] [FATAL] Non-resolvable parent POM for org.apache.maven.resolver:maven-resolver-api:[unknown-version]: Could not find artifact org.apache.maven.resolver:maven-resolver:pom:1.3.2-SNAPSHOT and 'parent.relativePath' points at wrong local POM @ line 25, column 11
[linux-jdk9] [FATAL] Non-resolvable parent POM for org.apache.maven.resolver:maven-resolver-spi:[unknown-version]: Could not find artifact org.apache.maven.resolver:maven-resolver:pom:1.3.2-SNAPSHOT and 'parent.relativePath' points at wrong local POM @ line 25, column 11
[linux-jdk9] [FATAL] Non-resolvable parent POM for org.apache.maven.resolver:maven-resolver-util:[unknown-version]: Could not find artifact org.apache.maven.resolver:maven-resolver:pom:1.3.2-SNAPSHOT and 'parent.relativePath' points at wrong local POM @ line 25, column 11
[linux-jdk9] [FATAL] Non-resolvable parent POM for org.apache.maven.resolver:maven-resolver-impl:[unknown-version]: Could not find artifact org.apache.maven.resolver:maven-resolver:pom:1.3.2-SNAPSHOT and 'parent.relativePath' points at wrong local POM @ line 25, column 11
[linux-jdk9] [FATAL] Non-resolvable parent POM for org.apache.maven.resolver:maven-resolver-test-util:[unknown-version]: Could not find artifact org.apache.maven.resolver:maven-resolver:pom:1.3.2-SNAPSHOT and 'parent.relativePath' points at wrong local POM @ line 25, column 11
[linux-jdk9] [FATAL] Non-resolvable parent POM for org.apache.maven.resolver:maven-resolver-connector-basic:[unknown-version]: Could not find artifact org.apache.maven.resolver:maven-resolver:pom:1.3.2-SNAPSHOT and 'parent.relativePath' points at wrong local POM @ line 25, column 11
[linux-jdk9] [FATAL] Non-resolvable parent POM for org.apache.maven.resolver:maven-resolver-transport-classpath:[unknown-version]: Could not find artifact org.apache.maven.resolver:maven-resolver:pom:1.3.2-SNAPSHOT and 'parent.relativePath' points at wrong local POM @ line 25, column 11
[linux-jdk9] [FATAL] Non-resolvable parent POM for org.apache.maven.resolver:maven-resolver-transport-file:[unknown-version]: Could not find artifact org.apache.maven.resolver:maven-resolver:pom:1.3.2-SNAPSHOT and 'parent.relativePath' points at wrong local POM @ line 25, column 11
[linux-jdk9] [FATAL] Non-resolvable parent POM for org.apache.maven.resolver:maven-resolver-transport-http:[unknown-version]: Could not find artifact org.apache.maven.resolver:maven-resolver:pom:1.3.2-SNAPSHOT and 'parent.relativePath' points at wrong local POM @ line 25, column 11
[linux-jdk9] [FATAL] Non-resolvable parent POM for org.apache.maven.resolver:maven-resolver-transport-wagon:[unknown-version]: Could not find artifact org.apache.maven.resolver:maven-resolver:pom:1.3.2-SNAPSHOT and 'parent.relativePath' points at wrong local POM @ line 25, column 11
[linux-jdk9] [FATAL] Non-resolvable parent POM for org.apache.maven.resolver:maven-resolver-demos:[unknown-version]: Could not find artifact org.apache.maven.resolver:maven-resolver:pom:1.3.2-SNAPSHOT and 'parent.relativePath' points at wrong local POM @ line 25, column 11
[linux-jdk9]  @
[linux-jdk9] [INFO] [jenkins-event-spy] Generated /home/jenkins/jenkins-slave/workspace/n-box_maven-resolver_master-L2RUGOEIK5O5H3FE4SPFSXXNL7FPE37KLTBGLDWAT7DNTIKVZVEQ@tmp/withMaven0e5733ab/maven-spy-20181011-195148-7797579566021747583277.log
[linux-jdk9] [ERROR] The build could not read 11 projects -> [Help 1]
[linux-jdk9] [ERROR]  
[linux-jdk9] [ERROR]   The project org.apache.maven.resolver:maven-resolver-api:[unknown-version] (/home/jenkins/jenkins-slave/workspace/n-box_maven-resolver_master-L2RUGOEIK5O5H3FE4SPFSXXNL7FPE37KLTBGLDWAT7DNTIKVZVEQ/m/maven-resolver-api/pom.xml) has 1 error
[linux-jdk9] [ERROR]     Non-resolvable parent POM for org.apache.maven.resolver:maven-resolver-api:[unknown-version]: Could not find artifact org.apache.maven.resolver:maven-resolver:pom:1.3.2-SNAPSHOT and 'parent.relativePath' points at wrong local POM @ line 25, column 11 -> [Help 2]
[linux-jdk9] [ERROR]  
[linux-jdk9] [ERROR]   The project org.apache.maven.resolver:maven-resolver-spi:[unknown-version] (/home/jenkins/jenkins-slave/workspace/n-box_maven-resolver_master-L2RUGOEIK5O5H3FE4SPFSXXNL7FPE37KLTBGLDWAT7DNTIKVZVEQ/m/maven-resolver-spi/pom.xml) has 1 error
[linux-jdk9] [ERROR]     Non-resolvable parent POM for org.apache.maven.resolver:maven-resolver-spi:[unknown-version]: Could not find artifact org.apache.maven.resolver:maven-resolver:pom:1.3.2-SNAPSHOT and 'parent.relativePath' points at wrong local POM @ line 25, column 11 -> [Help 2]
[linux-jdk9] [ERROR]  
[linux-jdk9] [ERROR]   The project org.apache.maven.resolver:maven-resolver-util:[unknown-version] (/home/jenkins/jenkins-slave/workspace/n-box_maven-resolver_master-L2RUGOEIK5O5H3FE4SPFSXXNL7FPE37KLTBGLDWAT7DNTIKVZVEQ/m/maven-resolver-util/pom.xml) has 1 error
[linux-jdk9] [ERROR]     Non-resolvable parent POM for org.apache.maven.resolver:maven-resolver-util:[unknown-version]: Could not find artifact org.apache.maven.resolver:maven-resolver:pom:1.3.2-SNAPSHOT and 'parent.relativePath' points at wrong local POM @ line 25, column 11 -> [Help 2]
[linux-jdk9] [ERROR]  
[linux-jdk9] [ERROR]   The project org.apache.maven.resolver:maven-resolver-impl:[unknown-version] (/home/jenkins/jenkins-slave/workspace/n-box_maven-resolver_master-L2RUGOEIK5O5H3FE4SPFSXXNL7FPE37KLTBGLDWAT7DNTIKVZVEQ/m/maven-resolver-impl/pom.xml) has 1 error
[linux-jdk9] [ERROR]     Non-resolvable parent POM for org.apache.maven.resolver:maven-resolver-impl:[unknown-version]: Could not find artifact org.apache.maven.resolver:maven-resolver:pom:1.3.2-SNAPSHOT and 'parent.relativePath' points at wrong local POM @ line 25, column 11 -> [Help 2]
[linux-jdk9] [ERROR]  
[linux-jdk9] [ERROR]   The project org.apache.maven.resolver:maven-resolver-test-util:[unknown-version] (/home/jenkins/jenkins-slave/workspace/n-box_maven-resolver_master-L2RUGOEIK5O5H3FE4SPFSXXNL7FPE37KLTBGLDWAT7DNTIKVZVEQ/m/maven-resolver-test-util/pom.xml) has 1 error
[linux-jdk9] [ERROR]     Non-resolvable parent POM for org.apache.maven.resolver:maven-resolver-test-util:[unknown-version]: Could not find artifact org.apache.maven.resolver:maven-resolver:pom:1.3.2-SNAPSHOT and 'parent.relativePath' points at wrong local POM @ line 25, column 11 -> [Help 2]
[linux-jdk9] [ERROR]  
[linux-jdk9] [ERROR]   The project org.apache.maven.resolver:maven-resolver-connector-basic:[unknown-version] (/home/jenkins/jenkins-slave/workspace/n-box_maven-resolver_master-L2RUGOEIK5O5H3FE4SPFSXXNL7FPE37KLTBGLDWAT7DNTIKVZVEQ/m/maven-resolver-connector-basic/pom.xml) has 1 error
[linux-jdk9] [ERROR]     Non-resolvable parent POM for org.apache.maven.resolver:maven-resolver-connector-basic:[unknown-version]: Could not find artifact org.apache.maven.resolver:maven-resolver:pom:1.3.2-SNAPSHOT and 'parent.relativePath' points at wrong local POM @ line 25, column 11 -> [Help 2]
[linux-jdk9] [ERROR]  
[linux-jdk9] [ERROR]   The project org.apache.maven.resolver:maven-resolver-transport-classpath:[unknown-version] (/home/jenkins/jenkins-slave/workspace/n-box_maven-resolver_master-L2RUGOEIK5O5H3FE4SPFSXXNL7FPE37KLTBGLDWAT7DNTIKVZVEQ/m/maven-resolver-transport-classpath/pom.xml) has 1 error
[linux-jdk9] [ERROR]     Non-resolvable parent POM for org.apache.maven.resolver:maven-resolver-transport-classpath:[unknown-version]: Could not find artifact org.apache.maven.resolver:maven-resolver:pom:1.3.2-SNAPSHOT and 'parent.relativePath' points at wrong local POM @ line 25, column 11 -> [Help 2]
[linux-jdk9] [ERROR]  
[linux-jdk9] [ERROR]   The project org.apache.maven.resolver:maven-resolver-transport-file:[unknown-version] (/home/jenkins/jenkins-slave/workspace/n-box_maven-resolver_master-L2RUGOEIK5O5H3FE4SPFSXXNL7FPE37KLTBGLDWAT7DNTIKVZVEQ/m/maven-resolver-transport-file/pom.xml) has 1 error
[linux-jdk9] [ERROR]     Non-resolvable parent POM for org.apache.maven.resolver:maven-resolver-transport-file:[unknown-version]: Could not find artifact org.apache.maven.resolver:maven-resolver:pom:1.3.2-SNAPSHOT and 'parent.relativePath' points at wrong local POM @ line 25, column 11 -> [Help 2]
[linux-jdk9] [ERROR]  
[linux-jdk9] [ERROR]   The project org.apache.maven.resolver:maven-resolver-transport-http:[unknown-version] (/home/jenkins/jenkins-slave/workspace/n-box_maven-resolver_master-L2RUGOEIK5O5H3FE4SPFSXXNL7FPE37KLTBGLDWAT7DNTIKVZVEQ/m/maven-resolver-transport-http/pom.xml) has 1 error
[linux-jdk9] [ERROR]     Non-resolvable parent POM for org.apache.maven.resolver:maven-resolver-transport-http:[unknown-version]: Could not find artifact org.apache.maven.resolver:maven-resolver:pom:1.3.2-SNAPSHOT and 'parent.relativePath' points at wrong local POM @ line 25, column 11 -> [Help 2]
[linux-jdk9] [ERROR]  
[linux-jdk9] [ERROR]   The project org.apache.maven.resolver:maven-resolver-transport-wagon:[unknown-version] (/home/jenkins/jenkins-slave/workspace/n-box_maven-resolver_master-L2RUGOEIK5O5H3FE4SPFSXXNL7FPE37KLTBGLDWAT7DNTIKVZVEQ/m/maven-resolver-transport-wagon/pom.xml) has 1 error
[linux-jdk9] [ERROR]     Non-resolvable parent POM for org.apache.maven.resolver:maven-resolver-transport-wagon:[unknown-version]: Could not find artifact org.apache.maven.resolver:maven-resolver:pom:1.3.2-SNAPSHOT and 'parent.relativePath' points at wrong local POM @ line 25, column 11 -> [Help 2]
[linux-jdk9] [ERROR]  
[linux-jdk9] [ERROR]   The project org.apache.maven.resolver:maven-resolver-demos:[unknown-version] (/home/jenkins/jenkins-slave/workspace/n-box_maven-resolver_master-L2RUGOEIK5O5H3FE4SPFSXXNL7FPE37KLTBGLDWAT7DNTIKVZVEQ/m/maven-resolver-demos/pom.xml) has 1 error
[linux-jdk9] [ERROR]     Non-resolvable parent POM for org.apache.maven.resolver:maven-resolver-demos:[unknown-version]: Could not find artifact org.apache.maven.resolver:maven-resolver:pom:1.3.2-SNAPSHOT and 'parent.relativePath' points at wrong local POM @ line 25, column 11 -> [Help 2]
[linux-jdk9] [ERROR]
[linux-jdk9] [ERROR] To see the full stack trace of the errors, re-run Maven with the -e switch.
[linux-jdk9] [ERROR] Re-run Maven using the -X switch to enable full debug logging.
[linux-jdk9] [ERROR]
[linux-jdk9] [ERROR] For more information about the errors and possible solutions, please read the following articles:
[linux-jdk9] [ERROR] [Help 1] http://cwiki.apache.org/confluence/display/MAVEN/ProjectBuildingException
[linux-jdk9] [ERROR] [Help 2] http://cwiki.apache.org/confluence/display/MAVEN/UnresolvableModelException
[linux-jdk10] + mvn -P+run-its -Dmaven.test.failure.ignore=true -Dfindbugs.failOnError=false -Dfindbugs.skip=true clean verify
[linux-jdk10] ----- withMaven Wrapper script -----
[linux-jdk10] Picked up JAVA_TOOL_OPTIONS: -Dmaven.ext.class.path="/home/jenkins/jenkins-slave/workspace/n-box_maven-resolver_master-L2RUGOEIK5O5H3FE4SPFSXXNL7FPE37KLTBGLDWAT7DNTIKVZVEQ@tmp/withMaven6304966c/pipeline-maven-spy.jar" -Dorg.jenkinsci.plugins.pipeline.maven.reportsFolder="/home/jenkins/jenkins-slave/workspace/n-box_maven-resolver_master-L2RUGOEIK5O5H3FE4SPFSXXNL7FPE37KLTBGLDWAT7DNTIKVZVEQ@tmp/withMaven6304966c"
[linux-jdk10] Apache Maven 3.5.4 (1edded0938998edf8bf061f1ceb3cfdeccf443fe; 2018-06-17T18:33:14Z)
[linux-jdk10] Maven home: /home/jenkins/tools/maven/apache-maven-3.5.4
[linux-jdk10] Java version: 10.0.1, vendor: Oracle Corporation, runtime: /usr/local/asfpackages/java/jdk-10.0.1
[linux-jdk10] Default locale: en_US, platform encoding: ISO-8859-1
[linux-jdk10] OS name: "linux", version: "4.4.0-133-generic", arch: "amd64", family: "unix"
[Pipeline] [linux-jdk9] }
[Pipeline] [linux-jdk9] // dir
[linux-jdk10] [INFO] [jenkins-event-spy] Generate /home/jenkins/jenkins-slave/workspace/n-box_maven-resolver_master-L2RUGOEIK5O5H3FE4SPFSXXNL7FPE37KLTBGLDWAT7DNTIKVZVEQ@tmp/withMaven6304966c/maven-spy-20181011-195150-91012625609197068984783.log.tmp ...
[linux-jdk10] [INFO] Scanning for projects...
[linux-jdk10] [INFO] Downloading from central: https://repo.maven.apache.org/maven2/org/apache/maven/maven-parent/33/maven-parent-33.pom
[linux-jdk10] [INFO] Downloaded from central: https://repo.maven.apache.org/maven2/org/apache/maven/maven-parent/33/maven-parent-33.pom (44 kB at 139 kB/s)
[linux-jdk10] [INFO] Downloading from central: https://repo.maven.apache.org/maven2/org/apache/apache/21/apache-21.pom
[linux-jdk10] [INFO] Downloaded from central: https://repo.maven.apache.org/maven2/org/apache/apache/21/apache-21.pom (17 kB at 634 kB/s)
[linux-jdk10] [ERROR] [ERROR] Some problems were encountered while processing the POMs:
[linux-jdk10] [FATAL] Non-resolvable parent POM for org.apache.maven.resolver:maven-resolver-api:[unknown-version]: Could not find artifact org.apache.maven.resolver:maven-resolver:pom:1.3.2-SNAPSHOT and 'parent.relativePath' points at wrong local POM @ line 25, column 11
[linux-jdk10] [FATAL] Non-resolvable parent POM for org.apache.maven.resolver:maven-resolver-spi:[unknown-version]: Could not find artifact org.apache.maven.resolver:maven-resolver:pom:1.3.2-SNAPSHOT and 'parent.relativePath' points at wrong local POM @ line 25, column 11
[linux-jdk10] [FATAL] Non-resolvable parent POM for org.apache.maven.resolver:maven-resolver-util:[unknown-version]: Could not find artifact org.apache.maven.resolver:maven-resolver:pom:1.3.2-SNAPSHOT and 'parent.relativePath' points at wrong local POM @ line 25, column 11
[linux-jdk10] [FATAL] Non-resolvable parent POM for org.apache.maven.resolver:maven-resolver-impl:[unknown-version]: Could not find artifact org.apache.maven.resolver:maven-resolver:pom:1.3.2-SNAPSHOT and 'parent.relativePath' points at wrong local POM @ line 25, column 11
[linux-jdk10] [FATAL] Non-resolvable parent POM for org.apache.maven.resolver:maven-resolver-test-util:[unknown-version]: Could not find artifact org.apache.maven.resolver:maven-resolver:pom:1.3.2-SNAPSHOT and 'parent.relativePath' points at wrong local POM @ line 25, column 11
[linux-jdk10] [FATAL] Non-resolvable parent POM for org.apache.maven.resolver:maven-resolver-connector-basic:[unknown-version]: Could not find artifact org.apache.maven.resolver:maven-resolver:pom:1.3.2-SNAPSHOT and 'parent.relativePath' points at wrong local POM @ line 25, column 11
[linux-jdk10] [FATAL] Non-resolvable parent POM for org.apache.maven.resolver:maven-resolver-transport-classpath:[unknown-version]: Could not find artifact org.apache.maven.resolver:maven-resolver:pom:1.3.2-SNAPSHOT and 'parent.relativePath' points at wrong local POM @ line 25, column 11
[linux-jdk10] [FATAL] Non-resolvable parent POM for org.apache.maven.resolver:maven-resolver-transport-file:[unknown-version]: Could not find artifact org.apache.maven.resolver:maven-resolver:pom:1.3.2-SNAPSHOT and 'parent.relativePath' points at wrong local POM @ line 25, column 11
[linux-jdk10] [FATAL] Non-resolvable parent POM for org.apache.maven.resolver:maven-resolver-transport-http:[unknown-version]: Could not find artifact org.apache.maven.resolver:maven-resolver:pom:1.3.2-SNAPSHOT and 'parent.relativePath' points at wrong local POM @ line 25, column 11
[linux-jdk10] [FATAL] Non-resolvable parent POM for org.apache.maven.resolver:maven-resolver-transport-wagon:[unknown-version]: Could not find artifact org.apache.maven.resolver:maven-resolver:pom:1.3.2-SNAPSHOT and 'parent.relativePath' points at wrong local POM @ line 25, column 11
[linux-jdk10] [FATAL] Non-resolvable parent POM for org.apache.maven.resolver:maven-resolver-demos:[unknown-version]: Could not find artifact org.apache.maven.resolver:maven-resolver:pom:1.3.2-SNAPSHOT and 'parent.relativePath' points at wrong local POM @ line 25, column 11
[linux-jdk10]  @
[linux-jdk10] [INFO] [jenkins-event-spy] Generated /home/jenkins/jenkins-slave/workspace/n-box_maven-resolver_master-L2RUGOEIK5O5H3FE4SPFSXXNL7FPE37KLTBGLDWAT7DNTIKVZVEQ@tmp/withMaven6304966c/maven-spy-20181011-195150-91012625609197068984783.log
[linux-jdk10] [ERROR] The build could not read 11 projects -> [Help 1]
[linux-jdk10] [ERROR]  
[linux-jdk10] [ERROR]   The project org.apache.maven.resolver:maven-resolver-api:[unknown-version] (/home/jenkins/jenkins-slave/workspace/n-box_maven-resolver_master-L2RUGOEIK5O5H3FE4SPFSXXNL7FPE37KLTBGLDWAT7DNTIKVZVEQ/m/maven-resolver-api/pom.xml) has 1 error
[linux-jdk10] [ERROR]     Non-resolvable parent POM for org.apache.maven.resolver:maven-resolver-api:[unknown-version]: Could not find artifact org.apache.maven.resolver:maven-resolver:pom:1.3.2-SNAPSHOT and 'parent.relativePath' points at wrong local POM @ line 25, column 11 -> [Help 2]
[linux-jdk10] [ERROR]  
[linux-jdk10] [ERROR]   The project org.apache.maven.resolver:maven-resolver-spi:[unknown-version] (/home/jenkins/jenkins-slave/workspace/n-box_maven-resolver_master-L2RUGOEIK5O5H3FE4SPFSXXNL7FPE37KLTBGLDWAT7DNTIKVZVEQ/m/maven-resolver-spi/pom.xml) has 1 error
[linux-jdk10] [ERROR]     Non-resolvable parent POM for org.apache.maven.resolver:maven-resolver-spi:[unknown-version]: Could not find artifact org.apache.maven.resolver:maven-resolver:pom:1.3.2-SNAPSHOT and 'parent.relativePath' points at wrong local POM @ line 25, column 11 -> [Help 2]
[linux-jdk10] [ERROR]  
[linux-jdk10] [ERROR]   The project org.apache.maven.resolver:maven-resolver-util:[unknown-version] (/home/jenkins/jenkins-slave/workspace/n-box_maven-resolver_master-L2RUGOEIK5O5H3FE4SPFSXXNL7FPE37KLTBGLDWAT7DNTIKVZVEQ/m/maven-resolver-util/pom.xml) has 1 error
[linux-jdk10] [ERROR]     Non-resolvable parent POM for org.apache.maven.resolver:maven-resolver-util:[unknown-version]: Could not find artifact org.apache.maven.resolver:maven-resolver:pom:1.3.2-SNAPSHOT and 'parent.relativePath' points at wrong local POM @ line 25, column 11 -> [Help 2]
[linux-jdk10] [ERROR]  
[linux-jdk10] [ERROR]   The project org.apache.maven.resolver:maven-resolver-impl:[unknown-version] (/home/jenkins/jenkins-slave/workspace/n-box_maven-resolver_master-L2RUGOEIK5O5H3FE4SPFSXXNL7FPE37KLTBGLDWAT7DNTIKVZVEQ/m/maven-resolver-impl/pom.xml) has 1 error
[linux-jdk10] [ERROR]     Non-resolvable parent POM for org.apache.maven.resolver:maven-resolver-impl:[unknown-version]: Could not find artifact org.apache.maven.resolver:maven-resolver:pom:1.3.2-SNAPSHOT and 'parent.relativePath' points at wrong local POM @ line 25, column 11 -> [Help 2]
[linux-jdk10] [ERROR]  
[linux-jdk10] [ERROR]   The project org.apache.maven.resolver:maven-resolver-test-util:[unknown-version] (/home/jenkins/jenkins-slave/workspace/n-box_maven-resolver_master-L2RUGOEIK5O5H3FE4SPFSXXNL7FPE37KLTBGLDWAT7DNTIKVZVEQ/m/maven-resolver-test-util/pom.xml) has 1 error
[linux-jdk10] [ERROR]     Non-resolvable parent POM for org.apache.maven.resolver:maven-resolver-test-util:[unknown-version]: Could not find artifact org.apache.maven.resolver:maven-resolver:pom:1.3.2-SNAPSHOT and 'parent.relativePath' points at wrong local POM @ line 25, column 11 -> [Help 2]
[linux-jdk10] [ERROR]  
[linux-jdk10] [ERROR]   The project org.apache.maven.resolver:maven-resolver-connector-basic:[unknown-version] (/home/jenkins/jenkins-slave/workspace/n-box_maven-resolver_master-L2RUGOEIK5O5H3FE4SPFSXXNL7FPE37KLTBGLDWAT7DNTIKVZVEQ/m/maven-resolver-connector-basic/pom.xml) has 1 error
[linux-jdk10] [ERROR]     Non-resolvable parent POM for org.apache.maven.resolver:maven-resolver-connector-basic:[unknown-version]: Could not find artifact org.apache.maven.resolver:maven-resolver:pom:1.3.2-SNAPSHOT and 'parent.relativePath' points at wrong local POM @ line 25, column 11 -> [Help 2]
[linux-jdk10] [ERROR]  
[linux-jdk10] [ERROR]   The project org.apache.maven.resolver:maven-resolver-transport-classpath:[unknown-version] (/home/jenkins/jenkins-slave/workspace/n-box_maven-resolver_master-L2RUGOEIK5O5H3FE4SPFSXXNL7FPE37KLTBGLDWAT7DNTIKVZVEQ/m/maven-resolver-transport-classpath/pom.xml) has 1 error
[linux-jdk10] [ERROR]     Non-resolvable parent POM for org.apache.maven.resolver:maven-resolver-transport-classpath:[unknown-version]: Could not find artifact org.apache.maven.resolver:maven-resolver:pom:1.3.2-SNAPSHOT and 'parent.relativePath' points at wrong local POM @ line 25, column 11 -> [Help 2]
[linux-jdk10] [ERROR]  
[linux-jdk10] [ERROR]   The project org.apache.maven.resolver:maven-resolver-transport-file:[unknown-version] (/home/jenkins/jenkins-slave/workspace/n-box_maven-resolver_master-L2RUGOEIK5O5H3FE4SPFSXXNL7FPE37KLTBGLDWAT7DNTIKVZVEQ/m/maven-resolver-transport-file/pom.xml) has 1 error
[linux-jdk10] [ERROR]     Non-resolvable parent POM for org.apache.maven.resolver:maven-resolver-transport-file:[unknown-version]: Could not find artifact org.apache.maven.resolver:maven-resolver:pom:1.3.2-SNAPSHOT and 'parent.relativePath' points at wrong local POM @ line 25, column 11 -> [Help 2]
[linux-jdk10] [ERROR]  
[linux-jdk10] [ERROR]   The project org.apache.maven.resolver:maven-resolver-transport-http:[unknown-version] (/home/jenkins/jenkins-slave/workspace/n-box_maven-resolver_master-L2RUGOEIK5O5H3FE4SPFSXXNL7FPE37KLTBGLDWAT7DNTIKVZVEQ/m/maven-resolver-transport-http/pom.xml) has 1 error
[linux-jdk10] [ERROR]     Non-resolvable parent POM for org.apache.maven.resolver:maven-resolver-transport-http:[unknown-version]: Could not find artifact org.apache.maven.resolver:maven-resolver:pom:1.3.2-SNAPSHOT and 'parent.relativePath' points at wrong local POM @ line 25, column 11 -> [Help 2]
[linux-jdk10] [ERROR]  
[linux-jdk10] [ERROR]   The project org.apache.maven.resolver:maven-resolver-transport-wagon:[unknown-version] (/home/jenkins/jenkins-slave/workspace/n-box_maven-resolver_master-L2RUGOEIK5O5H3FE4SPFSXXNL7FPE37KLTBGLDWAT7DNTIKVZVEQ/m/maven-resolver-transport-wagon/pom.xml) has 1 error
[linux-jdk10] [ERROR]     Non-resolvable parent POM for org.apache.maven.resolver:maven-resolver-transport-wagon:[unknown-version]: Could not find artifact org.apache.maven.resolver:maven-resolver:pom:1.3.2-SNAPSHOT and 'parent.relativePath' points at wrong local POM @ line 25, column 11 -> [Help 2]
[linux-jdk10] [ERROR]  
[linux-jdk10] [ERROR]   The project org.apache.maven.resolver:maven-resolver-demos:[unknown-version] (/home/jenkins/jenkins-slave/workspace/n-box_maven-resolver_master-L2RUGOEIK5O5H3FE4SPFSXXNL7FPE37KLTBGLDWAT7DNTIKVZVEQ/m/maven-resolver-demos/pom.xml) has 1 error
[linux-jdk10] [ERROR]     Non-resolvable parent POM for org.apache.maven.resolver:maven-resolver-demos:[unknown-version]: Could not find artifact org.apache.maven.resolver:maven-resolver:pom:1.3.2-SNAPSHOT and 'parent.relativePath' points at wrong local POM @ line 25, column 11 -> [Help 2]
[linux-jdk10] [ERROR]
[linux-jdk10] [ERROR] To see the full stack trace of the errors, re-run Maven with the -e switch.
[linux-jdk10] [ERROR] Re-run Maven using the -X switch to enable full debug logging.
[linux-jdk10] [ERROR]
[linux-jdk10] [ERROR] For more information about the errors and possible solutions, please read the following articles:
[linux-jdk10] [ERROR] [Help 1] http://cwiki.apache.org/confluence/display/MAVEN/ProjectBuildingException
[linux-jdk10] [ERROR] [Help 2] http://cwiki.apache.org/confluence/display/MAVEN/UnresolvableModelException
[Pipeline] [linux-jdk9] }
[Pipeline] [linux-jdk9] // withMaven
[Pipeline] [linux-jdk9] cleanWs
[Pipeline] [linux-jdk10] }
[Pipeline] [linux-jdk10] // dir
[linux-jdk9] [WS-CLEANUP] Deleting project workspace...[WS-CLEANUP] done
[Pipeline] [linux-jdk10] }
[Pipeline] [linux-jdk10] // withMaven
[Pipeline] [linux-jdk9] cleanWs
[Pipeline] [linux-jdk10] cleanWs
[linux-jdk9] [WS-CLEANUP] Deleting project workspace...[WS-CLEANUP] done
[Pipeline] [linux-jdk9] }
[linux-jdk10] [WS-CLEANUP] Deleting project workspace...[WS-CLEANUP] done
[Pipeline] [linux-jdk9] // stage
[Pipeline] [linux-jdk9] }
[Pipeline] [linux-jdk10] cleanWs
[Pipeline] [linux-jdk9] // node
[Pipeline] [linux-jdk9] }
[linux-jdk9] Failed in branch linux-jdk9
[linux-jdk10] [WS-CLEANUP] Deleting project workspace...[WS-CLEANUP] done
[Pipeline] [linux-jdk10] }
[Pipeline] [linux-jdk10] // stage
[Pipeline] [linux-jdk10] }
[Pipeline] [linux-jdk10] // node
[Pipeline] [linux-jdk10] }
[linux-jdk10] Failed in branch linux-jdk10
[Pipeline] // parallel
[Pipeline] stage
[Pipeline] { (Notifications)
[Pipeline] echo
Build result: FAILURE
[Pipeline] jiraIssueSelector
[Pipeline] emailext
Reply | Threaded
Open this post in threaded view
|

Build succeeded in Jenkins: Maven TLP » maven-resolver » master #38

Apache Jenkins Server-2
See https://builds.apache.org/job/maven-box/job/maven-resolver/job/master/38/

Changes:

* Going back version but also all modules.
* Going back version but also all modules.
* Going back version but also all modules.
* Going back version but also all modules.

All tests passed