Build failed in Jenkins: Maven TLP » maven-resolver » master #31

classic Classic list List threaded Threaded
5 messages Options
Reply | Threaded
Open this post in threaded view
|

Build failed in Jenkins: Maven TLP » maven-resolver » master #31

Apache Jenkins Server-2
See https://builds.apache.org/job/maven-box/job/maven-resolver/job/master/31/

Changes:

* [maven-release-plugin] prepare release maven-resolver-1.3.1
* [maven-release-plugin] prepare release maven-resolver-1.3.1
* [maven-release-plugin] prepare release maven-resolver-1.3.1
* [maven-release-plugin] prepare release maven-resolver-1.3.1

All tests passed

Build log:
[...truncated 1.92 MB...]
[windows-jdk9] Recording test results
[windows-jdk9] [withMaven] junitPublisher - Archive test results for Maven artifact org.apache.maven.resolver:maven-resolver-transport-wagon:1.3.1 generated by maven-surefire-plugin:test (default-test): m\maven-resolver-transport-wagon\target\surefire-reports\*.xml
[windows-jdk9] Recording test results
[windows-jdk9] [withMaven] junitPublisher - Archive test results for Maven artifact org.apache.maven.resolver:maven-resolver-demo-snippets:1.3.1 generated by maven-surefire-plugin:test (default-test): m\maven-resolver-demos\maven-resolver-demo-snippets\target\surefire-reports\*.xml
[windows-jdk9] Recording test results
[windows-jdk9] None of the test reports contained any result
[windows-jdk9] [withMaven] junitPublisher - Archive test results for Maven artifact org.apache.maven.resolver:maven-resolver-demo-maven-plugin:1.3.1 generated by maven-surefire-plugin:test (default-test): m\maven-resolver-demos\maven-resolver-demo-maven-plugin\target\surefire-reports\*.xml
[windows-jdk9] Recording test results
[windows-jdk9] None of the test reports contained any result
[Pipeline] [windows-jdk9] // withMaven
[Pipeline] [windows-jdk9] cleanWs
[Pipeline] [windows-jdk8] }
[Pipeline] [windows-jdk10] }
[Pipeline] [windows-jdk7] }
[Pipeline] [windows-jdk8] // dir
[Pipeline] [windows-jdk10] // stage
[Pipeline] [windows-jdk7] // dir
[windows-jdk9] [WS-CLEANUP] Deleting project workspace...[WS-CLEANUP] done
[Pipeline] [windows-jdk10] }
[Pipeline] [windows-jdk8] }
[windows-jdk8] [withMaven] invokerPublisher - Archive invoker results for Maven artifact MavenArtifact{org.apache.maven.resolver:maven-resolver-demo-maven-plugin::1.3.1(version: 1.3.1, snapshot:false) } generated by PluginInvocation{org.apache.maven.plugins:maven-invoker-plugin:3.0.1@run  integration-test}: m\maven-resolver-demos\maven-resolver-demo-maven-plugin\target\invoker-reports\*.xml
[windows-jdk8] performing MavenInvokerRecorder, reportsFilenamePattern:'**/m\maven-resolver-demos\maven-resolver-demo-maven-plugin\target\invoker-reports/BUILD*.xml', invokerBuildDir:'**/m\maven-resolver-demos\maven-resolver-demo-maven-plugin\target\it'
[windows-jdk8] Found reports:[f:\jenkins\jenkins-slave\workspace\n-box_maven-resolver_master-L2RUGOEIK5O5H3FE4SPFSXXNL7FPE37KLTBGLDWAT7DNTIKVZVEQ\m\maven-resolver-demos\maven-resolver-demo-maven-plugin\target\invoker-reports\BUILD-resolve-artifact.xml]
[windows-jdk8] Found logs:[f:\jenkins\jenkins-slave\workspace\n-box_maven-resolver_master-L2RUGOEIK5O5H3FE4SPFSXXNL7FPE37KLTBGLDWAT7DNTIKVZVEQ\m\maven-resolver-demos\maven-resolver-demo-maven-plugin\target\it\resolve-artifact\build.log]
[windows-jdk8] Finished parsing Maven Invoker results (found 1)
[windows-jdk8] [withMaven] junitPublisher - Archive test results for Maven artifact org.apache.maven.resolver:maven-resolver-api:1.3.1 generated by maven-surefire-plugin:test (default-test): m\maven-resolver-api\target\surefire-reports\*.xml
[windows-jdk8] Recording test results
[windows-jdk8] [withMaven] junitPublisher - Archive test results for Maven artifact org.apache.maven.resolver:maven-resolver-spi:1.3.1 generated by maven-surefire-plugin:test (default-test): m\maven-resolver-spi\target\surefire-reports\*.xml
[windows-jdk8] Recording test results
[windows-jdk8] [withMaven] junitPublisher - Archive test results for Maven artifact org.apache.maven.resolver:maven-resolver-test-util:1.3.1 generated by maven-surefire-plugin:test (default-test): m\maven-resolver-test-util\target\surefire-reports\*.xml
[windows-jdk8] Recording test results
[windows-jdk8] [withMaven] junitPublisher - Archive test results for Maven artifact org.apache.maven.resolver:maven-resolver-util:1.3.1 generated by maven-surefire-plugin:test (default-test): m\maven-resolver-util\target\surefire-reports\*.xml
[windows-jdk8] Recording test results
[windows-jdk8] [withMaven] junitPublisher - Archive test results for Maven artifact org.apache.maven.resolver:maven-resolver-impl:1.3.1 generated by maven-surefire-plugin:test (default-test): m\maven-resolver-impl\target\surefire-reports\*.xml
[windows-jdk8] Recording test results
[windows-jdk8] [withMaven] junitPublisher - Archive test results for Maven artifact org.apache.maven.resolver:maven-resolver-connector-basic:1.3.1 generated by maven-surefire-plugin:test (default-test): m\maven-resolver-connector-basic\target\surefire-reports\*.xml
[windows-jdk8] Recording test results
[windows-jdk8] [withMaven] junitPublisher - Archive test results for Maven artifact org.apache.maven.resolver:maven-resolver-transport-classpath:1.3.1 generated by maven-surefire-plugin:test (default-test): m\maven-resolver-transport-classpath\target\surefire-reports\*.xml
[windows-jdk8] Recording test results
[windows-jdk8] [withMaven] junitPublisher - Archive test results for Maven artifact org.apache.maven.resolver:maven-resolver-transport-file:1.3.1 generated by maven-surefire-plugin:test (default-test): m\maven-resolver-transport-file\target\surefire-reports\*.xml
[windows-jdk8] Recording test results
[windows-jdk8] [withMaven] junitPublisher - Archive test results for Maven artifact org.apache.maven.resolver:maven-resolver-transport-http:1.3.1 generated by maven-surefire-plugin:test (default-test): m\maven-resolver-transport-http\target\surefire-reports\*.xml
[windows-jdk8] Recording test results
[windows-jdk8] [withMaven] junitPublisher - Archive test results for Maven artifact org.apache.maven.resolver:maven-resolver-transport-wagon:1.3.1 generated by maven-surefire-plugin:test (default-test): m\maven-resolver-transport-wagon\target\surefire-reports\*.xml
[windows-jdk8] Recording test results
[windows-jdk8] [withMaven] junitPublisher - Archive test results for Maven artifact org.apache.maven.resolver:maven-resolver-demo-snippets:1.3.1 generated by maven-surefire-plugin:test (default-test): m\maven-resolver-demos\maven-resolver-demo-snippets\target\surefire-reports\*.xml
[windows-jdk8] Recording test results
[windows-jdk8] None of the test reports contained any result
[windows-jdk8] [withMaven] junitPublisher - Archive test results for Maven artifact org.apache.maven.resolver:maven-resolver-demo-maven-plugin:1.3.1 generated by maven-surefire-plugin:test (default-test): m\maven-resolver-demos\maven-resolver-demo-maven-plugin\target\surefire-reports\*.xml
[windows-jdk8] Recording test results
[windows-jdk8] None of the test reports contained any result
[Pipeline] [windows-jdk7] }
[windows-jdk7] [withMaven] invokerPublisher - Archive invoker results for Maven artifact MavenArtifact{org.apache.maven.resolver:maven-resolver-demo-maven-plugin::1.3.1(version: 1.3.1, snapshot:false) } generated by PluginInvocation{org.apache.maven.plugins:maven-invoker-plugin:3.0.1@run  integration-test}: m\maven-resolver-demos\maven-resolver-demo-maven-plugin\target\invoker-reports\*.xml
[windows-jdk7] performing MavenInvokerRecorder, reportsFilenamePattern:'**/m\maven-resolver-demos\maven-resolver-demo-maven-plugin\target\invoker-reports/BUILD*.xml', invokerBuildDir:'**/m\maven-resolver-demos\maven-resolver-demo-maven-plugin\target\it'
[windows-jdk7] Found reports:[f:\jenkins\jenkins-slave\workspace\n-box_maven-resolver_master-L2RUGOEIK5O5H3FE4SPFSXXNL7FPE37KLTBGLDWAT7DNTIKVZVEQ\m\maven-resolver-demos\maven-resolver-demo-maven-plugin\target\invoker-reports\BUILD-resolve-artifact.xml]
[windows-jdk7] Found logs:[f:\jenkins\jenkins-slave\workspace\n-box_maven-resolver_master-L2RUGOEIK5O5H3FE4SPFSXXNL7FPE37KLTBGLDWAT7DNTIKVZVEQ\m\maven-resolver-demos\maven-resolver-demo-maven-plugin\target\it\resolve-artifact\build.log]
[windows-jdk7] Finished parsing Maven Invoker results (found 1)
[windows-jdk7] [withMaven] junitPublisher - Archive test results for Maven artifact org.apache.maven.resolver:maven-resolver-api:1.3.1 generated by maven-surefire-plugin:test (default-test): m\maven-resolver-api\target\surefire-reports\*.xml
[windows-jdk7] Recording test results
[windows-jdk7] [withMaven] junitPublisher - Archive test results for Maven artifact org.apache.maven.resolver:maven-resolver-spi:1.3.1 generated by maven-surefire-plugin:test (default-test): m\maven-resolver-spi\target\surefire-reports\*.xml
[windows-jdk7] Recording test results
[windows-jdk7] [withMaven] junitPublisher - Archive test results for Maven artifact org.apache.maven.resolver:maven-resolver-test-util:1.3.1 generated by maven-surefire-plugin:test (default-test): m\maven-resolver-test-util\target\surefire-reports\*.xml
[windows-jdk7] Recording test results
[windows-jdk7] [withMaven] junitPublisher - Archive test results for Maven artifact org.apache.maven.resolver:maven-resolver-util:1.3.1 generated by maven-surefire-plugin:test (default-test): m\maven-resolver-util\target\surefire-reports\*.xml
[windows-jdk7] Recording test results
[windows-jdk7] [withMaven] junitPublisher - Archive test results for Maven artifact org.apache.maven.resolver:maven-resolver-impl:1.3.1 generated by maven-surefire-plugin:test (default-test): m\maven-resolver-impl\target\surefire-reports\*.xml
[windows-jdk7] Recording test results
[windows-jdk7] [withMaven] junitPublisher - Archive test results for Maven artifact org.apache.maven.resolver:maven-resolver-connector-basic:1.3.1 generated by maven-surefire-plugin:test (default-test): m\maven-resolver-connector-basic\target\surefire-reports\*.xml
[windows-jdk7] Recording test results
[windows-jdk7] [withMaven] junitPublisher - Archive test results for Maven artifact org.apache.maven.resolver:maven-resolver-transport-classpath:1.3.1 generated by maven-surefire-plugin:test (default-test): m\maven-resolver-transport-classpath\target\surefire-reports\*.xml
[windows-jdk7] Recording test results
[windows-jdk7] [withMaven] junitPublisher - Archive test results for Maven artifact org.apache.maven.resolver:maven-resolver-transport-file:1.3.1 generated by maven-surefire-plugin:test (default-test): m\maven-resolver-transport-file\target\surefire-reports\*.xml
[windows-jdk7] Recording test results
[windows-jdk7] [withMaven] junitPublisher - Archive test results for Maven artifact org.apache.maven.resolver:maven-resolver-transport-http:1.3.1 generated by maven-surefire-plugin:test (default-test): m\maven-resolver-transport-http\target\surefire-reports\*.xml
[windows-jdk7] Recording test results
[windows-jdk7] [withMaven] junitPublisher - Archive test results for Maven artifact org.apache.maven.resolver:maven-resolver-transport-wagon:1.3.1 generated by maven-surefire-plugin:test (default-test): m\maven-resolver-transport-wagon\target\surefire-reports\*.xml
[windows-jdk7] Recording test results
[windows-jdk7] [withMaven] junitPublisher - Archive test results for Maven artifact org.apache.maven.resolver:maven-resolver-demo-snippets:1.3.1 generated by maven-surefire-plugin:test (default-test): m\maven-resolver-demos\maven-resolver-demo-snippets\target\surefire-reports\*.xml
[windows-jdk7] Recording test results
[windows-jdk7] None of the test reports contained any result
[windows-jdk7] [withMaven] junitPublisher - Archive test results for Maven artifact org.apache.maven.resolver:maven-resolver-demo-maven-plugin:1.3.1 generated by maven-surefire-plugin:test (default-test): m\maven-resolver-demos\maven-resolver-demo-maven-plugin\target\surefire-reports\*.xml
[windows-jdk7] Recording test results
[windows-jdk7] None of the test reports contained any result
[Pipeline] [windows-jdk10] // node
[Pipeline] [windows-jdk8] // withMaven
[Pipeline] [windows-jdk7] // withMaven
[Pipeline] [windows-jdk10] }
[Pipeline] [windows-jdk9] }
[Pipeline] [windows-jdk8] cleanWs
[Pipeline] [windows-jdk7] cleanWs
[Pipeline] [windows-jdk9] // stage
[Pipeline] [windows-jdk9] }
[Pipeline] [windows-jdk9] // node
[windows-jdk8] [WS-CLEANUP] Deleting project workspace...[WS-CLEANUP] done
[Pipeline] [windows-jdk9] }
[Pipeline] [windows-jdk8] }
[Pipeline] [windows-jdk8] // stage
[Pipeline] [windows-jdk8] }
[Pipeline] [windows-jdk8] // node
[Pipeline] [windows-jdk8] }
[windows-jdk7] [WS-CLEANUP] Deleting project workspace...[WS-CLEANUP] done
[Pipeline] [windows-jdk7] }
[Pipeline] [windows-jdk7] // stage
[Pipeline] [windows-jdk7] }
[Pipeline] [windows-jdk7] // node
[Pipeline] [windows-jdk7] }
[linux-jdk7] Running on H34 in /home/jenkins/jenkins-slave/workspace/n-box_maven-resolver_master-L2RUGOEIK5O5H3FE4SPFSXXNL7FPE37KLTBGLDWAT7DNTIKVZVEQ
[Pipeline] [linux-jdk7] {
[Pipeline] [linux-jdk7] stage
[Pipeline] [linux-jdk7] { (Checkout linux-jdk7)
[Pipeline] [linux-jdk7] dir
[linux-jdk7] Running in /home/jenkins/jenkins-slave/workspace/n-box_maven-resolver_master-L2RUGOEIK5O5H3FE4SPFSXXNL7FPE37KLTBGLDWAT7DNTIKVZVEQ/m
[Pipeline] [linux-jdk7] {
[Pipeline] [linux-jdk7] checkout
[linux-jdk7] Cloning the remote Git repository
[linux-jdk7] Cloning with configured refspecs honoured and without tags
[linux-jdk7] Cloning repository https://gitbox.apache.org/repos/asf/maven-resolver.git
[linux-jdk7]  > git init /home/jenkins/jenkins-slave/workspace/n-box_maven-resolver_master-L2RUGOEIK5O5H3FE4SPFSXXNL7FPE37KLTBGLDWAT7DNTIKVZVEQ/m # timeout=10
[linux-jdk7] Fetching upstream changes from https://gitbox.apache.org/repos/asf/maven-resolver.git
[linux-jdk7]  > git --version # timeout=10
[linux-jdk7]  > git fetch --no-tags --progress https://gitbox.apache.org/repos/asf/maven-resolver.git +refs/heads/*:refs/remotes/origin/*
[linux-jdk7]  > git config remote.origin.url https://gitbox.apache.org/repos/asf/maven-resolver.git # timeout=10
[linux-jdk7]  > git config --add remote.origin.fetch +refs/heads/*:refs/remotes/origin/* # timeout=10
[linux-jdk7]  > git config remote.origin.url https://gitbox.apache.org/repos/asf/maven-resolver.git # timeout=10
[linux-jdk7] Fetching without tags
[linux-jdk7] Fetching upstream changes from https://gitbox.apache.org/repos/asf/maven-resolver.git
[linux-jdk7]  > git fetch --no-tags --progress https://gitbox.apache.org/repos/asf/maven-resolver.git +refs/heads/*:refs/remotes/origin/*
[linux-jdk7] Checking out Revision 8146cd793786f6ac8daf0c98caf9ffeaed8959bb (master)
[linux-jdk7]  > git config core.sparsecheckout # timeout=10
[linux-jdk7]  > git checkout -f 8146cd793786f6ac8daf0c98caf9ffeaed8959bb
[Pipeline] [linux-jdk7] }
[Pipeline] [linux-jdk7] // dir
[Pipeline] [linux-jdk7] cleanWs
[linux-jdk7] [WS-CLEANUP] Deleting project workspace...[WS-CLEANUP] done
[Pipeline] [linux-jdk7] }
[Pipeline] [linux-jdk7] // stage
[Pipeline] [linux-jdk7] }
[Pipeline] [linux-jdk7] // node
[linux-jdk8] Running on H34 in /home/jenkins/jenkins-slave/workspace/n-box_maven-resolver_master-L2RUGOEIK5O5H3FE4SPFSXXNL7FPE37KLTBGLDWAT7DNTIKVZVEQ
[Pipeline] [linux-jdk7] }
[linux-jdk7] Failed in branch linux-jdk7
[Pipeline] [linux-jdk8] {
[Pipeline] [linux-jdk8] stage
[Pipeline] [linux-jdk8] { (Checkout linux-jdk8)
[Pipeline] [linux-jdk8] dir
[linux-jdk8] Running in /home/jenkins/jenkins-slave/workspace/n-box_maven-resolver_master-L2RUGOEIK5O5H3FE4SPFSXXNL7FPE37KLTBGLDWAT7DNTIKVZVEQ/m
[Pipeline] [linux-jdk8] {
[Pipeline] [linux-jdk8] checkout
[linux-jdk8] Cloning the remote Git repository
[linux-jdk8] Cloning with configured refspecs honoured and without tags
[linux-jdk8] Cloning repository https://gitbox.apache.org/repos/asf/maven-resolver.git
[linux-jdk8]  > git init /home/jenkins/jenkins-slave/workspace/n-box_maven-resolver_master-L2RUGOEIK5O5H3FE4SPFSXXNL7FPE37KLTBGLDWAT7DNTIKVZVEQ/m # timeout=10
[linux-jdk8] Fetching upstream changes from https://gitbox.apache.org/repos/asf/maven-resolver.git
[linux-jdk8]  > git --version # timeout=10
[linux-jdk8]  > git fetch --no-tags --progress https://gitbox.apache.org/repos/asf/maven-resolver.git +refs/heads/*:refs/remotes/origin/*
[linux-jdk8]  > git config remote.origin.url https://gitbox.apache.org/repos/asf/maven-resolver.git # timeout=10
[linux-jdk8]  > git config --add remote.origin.fetch +refs/heads/*:refs/remotes/origin/* # timeout=10
[linux-jdk8]  > git config remote.origin.url https://gitbox.apache.org/repos/asf/maven-resolver.git # timeout=10
[linux-jdk8] Fetching without tags
[linux-jdk8] Fetching upstream changes from https://gitbox.apache.org/repos/asf/maven-resolver.git
[linux-jdk8]  > git fetch --no-tags --progress https://gitbox.apache.org/repos/asf/maven-resolver.git +refs/heads/*:refs/remotes/origin/*
[linux-jdk8] Checking out Revision 8146cd793786f6ac8daf0c98caf9ffeaed8959bb (master)
[linux-jdk8]  > git config core.sparsecheckout # timeout=10
[linux-jdk8]  > git checkout -f 8146cd793786f6ac8daf0c98caf9ffeaed8959bb
[Pipeline] [linux-jdk8] }
[Pipeline] [linux-jdk8] // dir
[Pipeline] [linux-jdk8] cleanWs
[linux-jdk8] [WS-CLEANUP] Deleting project workspace...[WS-CLEANUP] done
[Pipeline] [linux-jdk8] }
[Pipeline] [linux-jdk8] // stage
[Pipeline] [linux-jdk8] }
[Pipeline] [linux-jdk8] // node
[linux-jdk9] Running on H34 in /home/jenkins/jenkins-slave/workspace/n-box_maven-resolver_master-L2RUGOEIK5O5H3FE4SPFSXXNL7FPE37KLTBGLDWAT7DNTIKVZVEQ
[Pipeline] [linux-jdk8] }
[linux-jdk8] Failed in branch linux-jdk8
[Pipeline] [linux-jdk9] {
[Pipeline] [linux-jdk9] stage
[Pipeline] [linux-jdk9] { (Checkout linux-jdk9)
[Pipeline] [linux-jdk9] dir
[linux-jdk9] Running in /home/jenkins/jenkins-slave/workspace/n-box_maven-resolver_master-L2RUGOEIK5O5H3FE4SPFSXXNL7FPE37KLTBGLDWAT7DNTIKVZVEQ/m
[Pipeline] [linux-jdk9] {
[Pipeline] [linux-jdk9] checkout
[linux-jdk9] Cloning the remote Git repository
[linux-jdk9] Cloning with configured refspecs honoured and without tags
[linux-jdk9] Cloning repository https://gitbox.apache.org/repos/asf/maven-resolver.git
[linux-jdk9]  > git init /home/jenkins/jenkins-slave/workspace/n-box_maven-resolver_master-L2RUGOEIK5O5H3FE4SPFSXXNL7FPE37KLTBGLDWAT7DNTIKVZVEQ/m # timeout=10
[linux-jdk9] Fetching upstream changes from https://gitbox.apache.org/repos/asf/maven-resolver.git
[linux-jdk9]  > git --version # timeout=10
[linux-jdk9]  > git fetch --no-tags --progress https://gitbox.apache.org/repos/asf/maven-resolver.git +refs/heads/*:refs/remotes/origin/*
[linux-jdk9]  > git config remote.origin.url https://gitbox.apache.org/repos/asf/maven-resolver.git # timeout=10
[linux-jdk9]  > git config --add remote.origin.fetch +refs/heads/*:refs/remotes/origin/* # timeout=10
[linux-jdk9]  > git config remote.origin.url https://gitbox.apache.org/repos/asf/maven-resolver.git # timeout=10
[linux-jdk9] Fetching without tags
[linux-jdk9] Fetching upstream changes from https://gitbox.apache.org/repos/asf/maven-resolver.git
[linux-jdk9]  > git fetch --no-tags --progress https://gitbox.apache.org/repos/asf/maven-resolver.git +refs/heads/*:refs/remotes/origin/*
[linux-jdk9] Checking out Revision 8146cd793786f6ac8daf0c98caf9ffeaed8959bb (master)
[linux-jdk9]  > git config core.sparsecheckout # timeout=10
[linux-jdk9]  > git checkout -f 8146cd793786f6ac8daf0c98caf9ffeaed8959bb
[Pipeline] [linux-jdk9] }
[Pipeline] [linux-jdk9] // dir
[Pipeline] [linux-jdk9] cleanWs
[linux-jdk9] [WS-CLEANUP] Deleting project workspace...[WS-CLEANUP] done
[Pipeline] [linux-jdk9] }
[Pipeline] [linux-jdk9] // stage
[Pipeline] [linux-jdk9] }
[Pipeline] [linux-jdk9] // node
[linux-jdk10] Running on H34 in /home/jenkins/jenkins-slave/workspace/n-box_maven-resolver_master-L2RUGOEIK5O5H3FE4SPFSXXNL7FPE37KLTBGLDWAT7DNTIKVZVEQ
[Pipeline] [linux-jdk9] }
[linux-jdk9] Failed in branch linux-jdk9
[Pipeline] [linux-jdk10] {
[Pipeline] [linux-jdk10] stage
[Pipeline] [linux-jdk10] { (Checkout linux-jdk10)
[Pipeline] [linux-jdk10] dir
[linux-jdk10] Running in /home/jenkins/jenkins-slave/workspace/n-box_maven-resolver_master-L2RUGOEIK5O5H3FE4SPFSXXNL7FPE37KLTBGLDWAT7DNTIKVZVEQ/m
[Pipeline] [linux-jdk10] {
[Pipeline] [linux-jdk10] checkout
[linux-jdk10] Cloning the remote Git repository
[linux-jdk10] Cloning with configured refspecs honoured and without tags
[linux-jdk10] Cloning repository https://gitbox.apache.org/repos/asf/maven-resolver.git
[linux-jdk10]  > git init /home/jenkins/jenkins-slave/workspace/n-box_maven-resolver_master-L2RUGOEIK5O5H3FE4SPFSXXNL7FPE37KLTBGLDWAT7DNTIKVZVEQ/m # timeout=10
[linux-jdk10] Fetching upstream changes from https://gitbox.apache.org/repos/asf/maven-resolver.git
[linux-jdk10]  > git --version # timeout=10
[linux-jdk10]  > git fetch --no-tags --progress https://gitbox.apache.org/repos/asf/maven-resolver.git +refs/heads/*:refs/remotes/origin/*
[linux-jdk10]  > git config remote.origin.url https://gitbox.apache.org/repos/asf/maven-resolver.git # timeout=10
[linux-jdk10]  > git config --add remote.origin.fetch +refs/heads/*:refs/remotes/origin/* # timeout=10
[linux-jdk10]  > git config remote.origin.url https://gitbox.apache.org/repos/asf/maven-resolver.git # timeout=10
[linux-jdk10] Fetching without tags
[linux-jdk10] Fetching upstream changes from https://gitbox.apache.org/repos/asf/maven-resolver.git
[linux-jdk10]  > git fetch --no-tags --progress https://gitbox.apache.org/repos/asf/maven-resolver.git +refs/heads/*:refs/remotes/origin/*
[linux-jdk10] Checking out Revision 8146cd793786f6ac8daf0c98caf9ffeaed8959bb (master)
[linux-jdk10]  > git config core.sparsecheckout # timeout=10
[linux-jdk10]  > git checkout -f 8146cd793786f6ac8daf0c98caf9ffeaed8959bb
[Pipeline] [linux-jdk10] }
[Pipeline] [linux-jdk10] // dir
[Pipeline] [linux-jdk10] cleanWs
[linux-jdk10] [WS-CLEANUP] Deleting project workspace...[WS-CLEANUP] done
[Pipeline] [linux-jdk10] }
[Pipeline] [linux-jdk10] // stage
[Pipeline] [linux-jdk10] }
[Pipeline] [linux-jdk10] // node
[Pipeline] [linux-jdk10] }
[linux-jdk10] Failed in branch linux-jdk10
[Pipeline] // parallel
[Pipeline] stage
[Pipeline] { (Notifications)
[Pipeline] echo
Build result: FAILURE
[Pipeline] jiraIssueSelector
[Pipeline] emailext
Reply | Threaded
Open this post in threaded view
|

Build failed in Jenkins: Maven TLP » maven-resolver » master #32

Apache Jenkins Server-2
See https://builds.apache.org/job/maven-box/job/maven-resolver/job/master/32/

Changes:

* [maven-release-plugin] prepare for next development iteration
* [maven-release-plugin] prepare for next development iteration
* [maven-release-plugin] prepare for next development iteration
* [maven-release-plugin] prepare for next development iteration

All tests passed

Build log:
[...truncated 1.93 MB...]
[windows-jdk8] [INFO]
[windows-jdk8] [INFO] Maven Artifact Resolver ............................ SUCCESS [ 46.566 s]
[windows-jdk8] [INFO] Maven Artifact Resolver API ........................ SUCCESS [ 35.627 s]
[windows-jdk8] [INFO] Maven Artifact Resolver SPI ........................ SUCCESS [  5.667 s]
[windows-jdk8] [INFO] Maven Artifact Resolver Test Utilities ............. SUCCESS [  8.263 s]
[windows-jdk8] [INFO] Maven Artifact Resolver Utilities .................. SUCCESS [ 12.748 s]
[windows-jdk8] [INFO] Maven Artifact Resolver Implementation ............. SUCCESS [ 32.227 s]
[windows-jdk8] [INFO] Maven Artifact Resolver Connector Basic ............ SUCCESS [ 11.839 s]
[windows-jdk8] [INFO] Maven Artifact Resolver Transport Classpath ........ SUCCESS [  4.356 s]
[windows-jdk8] [INFO] Maven Artifact Resolver Transport File ............. SUCCESS [  5.367 s]
[windows-jdk8] [INFO] Maven Artifact Resolver Transport HTTP ............. SUCCESS [ 18.381 s]
[windows-jdk8] [INFO] Maven Artifact Resolver Transport Wagon ............ SUCCESS [ 10.894 s]
[windows-jdk8] [INFO] Maven Artifact Resolver Demos ...................... SUCCESS [  2.569 s]
[windows-jdk8] [INFO] Maven Artifact Resolver Demo Snippets .............. SUCCESS [  4.376 s]
[windows-jdk8] [INFO] Maven Artifact Resolver Demo Maven Plugin .......... SUCCESS [ 19.190 s]
[windows-jdk8] [INFO] ------------------------------------------------------------------------
[windows-jdk8] [INFO] BUILD SUCCESS
[windows-jdk8] [INFO] ------------------------------------------------------------------------
[windows-jdk8] [INFO] Total time: 03:41 min
[windows-jdk8] [INFO] Finished at: 2018-10-11T11:52:31-07:00
[windows-jdk8] [INFO] Final Memory: 68M/1017M
[windows-jdk8] [INFO] ------------------------------------------------------------------------
[windows-jdk8] [INFO] [jenkins-event-spy] Generated F:\jenkins\jenkins-slave\workspace\n-box_maven-resolver_master-L2RUGOEIK5O5H3FE4SPFSXXNL7FPE37KLTBGLDWAT7DNTIKVZVEQ@tmp\withMavene408db38\maven-spy-20181011-114848-7788095404670596209047.log
[windows-jdk8] Picked up JAVA_TOOL_OPTIONS: -Dmaven.ext.class.path="f:\jenkins\jenkins-slave\workspace\n-box_maven-resolver_master-L2RUGOEIK5O5H3FE4SPFSXXNL7FPE37KLTBGLDWAT7DNTIKVZVEQ@tmp\withMavene408db38\pipeline-maven-spy.jar" -Dorg.jenkinsci.plugins.pipeline.maven.reportsFolder="f:\jenkins\jenkins-slave\workspace\n-box_maven-resolver_master-L2RUGOEIK5O5H3FE4SPFSXXNL7FPE37KLTBGLDWAT7DNTIKVZVEQ@tmp\withMavene408db38"
[Pipeline] [windows-jdk9] }
[windows-jdk9] [withMaven] invokerPublisher - Archive invoker results for Maven artifact MavenArtifact{org.apache.maven.resolver:maven-resolver-demo-maven-plugin::1.3.2-SNAPSHOT(version: 1.3.2-SNAPSHOT, snapshot:false) } generated by PluginInvocation{org.apache.maven.plugins:maven-invoker-plugin:3.0.1@run  integration-test}: m\maven-resolver-demos\maven-resolver-demo-maven-plugin\target\invoker-reports\*.xml
[windows-jdk9] performing MavenInvokerRecorder, reportsFilenamePattern:'**/m\maven-resolver-demos\maven-resolver-demo-maven-plugin\target\invoker-reports/BUILD*.xml', invokerBuildDir:'**/m\maven-resolver-demos\maven-resolver-demo-maven-plugin\target\it'
[windows-jdk9] Found reports:[f:\jenkins\jenkins-slave\workspace\n-box_maven-resolver_master-L2RUGOEIK5O5H3FE4SPFSXXNL7FPE37KLTBGLDWAT7DNTIKVZVEQ@2\m\maven-resolver-demos\maven-resolver-demo-maven-plugin\target\invoker-reports\BUILD-resolve-artifact.xml]
[windows-jdk9] Found logs:[f:\jenkins\jenkins-slave\workspace\n-box_maven-resolver_master-L2RUGOEIK5O5H3FE4SPFSXXNL7FPE37KLTBGLDWAT7DNTIKVZVEQ@2\m\maven-resolver-demos\maven-resolver-demo-maven-plugin\target\it\resolve-artifact\build.log]
[windows-jdk9] Finished parsing Maven Invoker results (found 1)
[windows-jdk9] [withMaven] junitPublisher - Archive test results for Maven artifact org.apache.maven.resolver:maven-resolver-api:1.3.2-SNAPSHOT generated by maven-surefire-plugin:test (default-test): m\maven-resolver-api\target\surefire-reports\*.xml
[windows-jdk9] Recording test results
[windows-jdk9] [withMaven] junitPublisher - Archive test results for Maven artifact org.apache.maven.resolver:maven-resolver-spi:1.3.2-SNAPSHOT generated by maven-surefire-plugin:test (default-test): m\maven-resolver-spi\target\surefire-reports\*.xml
[windows-jdk9] Recording test results
[windows-jdk9] [withMaven] junitPublisher - Archive test results for Maven artifact org.apache.maven.resolver:maven-resolver-test-util:1.3.2-SNAPSHOT generated by maven-surefire-plugin:test (default-test): m\maven-resolver-test-util\target\surefire-reports\*.xml
[windows-jdk9] Recording test results
[windows-jdk9] [withMaven] junitPublisher - Archive test results for Maven artifact org.apache.maven.resolver:maven-resolver-util:1.3.2-SNAPSHOT generated by maven-surefire-plugin:test (default-test): m\maven-resolver-util\target\surefire-reports\*.xml
[windows-jdk9] Recording test results
[windows-jdk9] [withMaven] junitPublisher - Archive test results for Maven artifact org.apache.maven.resolver:maven-resolver-impl:1.3.2-SNAPSHOT generated by maven-surefire-plugin:test (default-test): m\maven-resolver-impl\target\surefire-reports\*.xml
[windows-jdk9] Recording test results
[windows-jdk9] [withMaven] junitPublisher - Archive test results for Maven artifact org.apache.maven.resolver:maven-resolver-connector-basic:1.3.2-SNAPSHOT generated by maven-surefire-plugin:test (default-test): m\maven-resolver-connector-basic\target\surefire-reports\*.xml
[windows-jdk9] Recording test results
[windows-jdk9] [withMaven] junitPublisher - Archive test results for Maven artifact org.apache.maven.resolver:maven-resolver-transport-classpath:1.3.2-SNAPSHOT generated by maven-surefire-plugin:test (default-test): m\maven-resolver-transport-classpath\target\surefire-reports\*.xml
[windows-jdk9] Recording test results
[windows-jdk9] [withMaven] junitPublisher - Archive test results for Maven artifact org.apache.maven.resolver:maven-resolver-transport-file:1.3.2-SNAPSHOT generated by maven-surefire-plugin:test (default-test): m\maven-resolver-transport-file\target\surefire-reports\*.xml
[windows-jdk9] Recording test results
[windows-jdk9] [withMaven] junitPublisher - Archive test results for Maven artifact org.apache.maven.resolver:maven-resolver-transport-http:1.3.2-SNAPSHOT generated by maven-surefire-plugin:test (default-test): m\maven-resolver-transport-http\target\surefire-reports\*.xml
[windows-jdk9] Recording test results
[windows-jdk9] [withMaven] junitPublisher - Archive test results for Maven artifact org.apache.maven.resolver:maven-resolver-transport-wagon:1.3.2-SNAPSHOT generated by maven-surefire-plugin:test (default-test): m\maven-resolver-transport-wagon\target\surefire-reports\*.xml
[windows-jdk9] Recording test results
[windows-jdk9] [withMaven] junitPublisher - Archive test results for Maven artifact org.apache.maven.resolver:maven-resolver-demo-snippets:1.3.2-SNAPSHOT generated by maven-surefire-plugin:test (default-test): m\maven-resolver-demos\maven-resolver-demo-snippets\target\surefire-reports\*.xml
[windows-jdk9] Recording test results
[windows-jdk9] None of the test reports contained any result
[windows-jdk9] [withMaven] junitPublisher - Archive test results for Maven artifact org.apache.maven.resolver:maven-resolver-demo-maven-plugin:1.3.2-SNAPSHOT generated by maven-surefire-plugin:test (default-test): m\maven-resolver-demos\maven-resolver-demo-maven-plugin\target\surefire-reports\*.xml
[windows-jdk9] Recording test results
[windows-jdk9] None of the test reports contained any result
[Pipeline] [windows-jdk9] // withMaven
[Pipeline] [windows-jdk9] cleanWs
[Pipeline] [windows-jdk8] }
[Pipeline] [windows-jdk8] // dir
[windows-jdk9] [WS-CLEANUP] Deleting project workspace...[WS-CLEANUP] done
[Pipeline] [windows-jdk8] }
[windows-jdk8] [withMaven] invokerPublisher - Archive invoker results for Maven artifact MavenArtifact{org.apache.maven.resolver:maven-resolver-demo-maven-plugin::1.3.2-SNAPSHOT(version: 1.3.2-SNAPSHOT, snapshot:false) } generated by PluginInvocation{org.apache.maven.plugins:maven-invoker-plugin:3.0.1@run  integration-test}: m\maven-resolver-demos\maven-resolver-demo-maven-plugin\target\invoker-reports\*.xml
[windows-jdk8] performing MavenInvokerRecorder, reportsFilenamePattern:'**/m\maven-resolver-demos\maven-resolver-demo-maven-plugin\target\invoker-reports/BUILD*.xml', invokerBuildDir:'**/m\maven-resolver-demos\maven-resolver-demo-maven-plugin\target\it'
[windows-jdk8] Found reports:[f:\jenkins\jenkins-slave\workspace\n-box_maven-resolver_master-L2RUGOEIK5O5H3FE4SPFSXXNL7FPE37KLTBGLDWAT7DNTIKVZVEQ\m\maven-resolver-demos\maven-resolver-demo-maven-plugin\target\invoker-reports\BUILD-resolve-artifact.xml]
[windows-jdk8] Found logs:[f:\jenkins\jenkins-slave\workspace\n-box_maven-resolver_master-L2RUGOEIK5O5H3FE4SPFSXXNL7FPE37KLTBGLDWAT7DNTIKVZVEQ\m\maven-resolver-demos\maven-resolver-demo-maven-plugin\target\it\resolve-artifact\build.log]
[windows-jdk8] Finished parsing Maven Invoker results (found 1)
[windows-jdk8] [withMaven] junitPublisher - Archive test results for Maven artifact org.apache.maven.resolver:maven-resolver-api:1.3.2-SNAPSHOT generated by maven-surefire-plugin:test (default-test): m\maven-resolver-api\target\surefire-reports\*.xml
[windows-jdk8] Recording test results
[windows-jdk8] [withMaven] junitPublisher - Archive test results for Maven artifact org.apache.maven.resolver:maven-resolver-spi:1.3.2-SNAPSHOT generated by maven-surefire-plugin:test (default-test): m\maven-resolver-spi\target\surefire-reports\*.xml
[windows-jdk8] Recording test results
[windows-jdk8] [withMaven] junitPublisher - Archive test results for Maven artifact org.apache.maven.resolver:maven-resolver-test-util:1.3.2-SNAPSHOT generated by maven-surefire-plugin:test (default-test): m\maven-resolver-test-util\target\surefire-reports\*.xml
[windows-jdk8] Recording test results
[windows-jdk8] [withMaven] junitPublisher - Archive test results for Maven artifact org.apache.maven.resolver:maven-resolver-util:1.3.2-SNAPSHOT generated by maven-surefire-plugin:test (default-test): m\maven-resolver-util\target\surefire-reports\*.xml
[windows-jdk8] Recording test results
[windows-jdk8] [withMaven] junitPublisher - Archive test results for Maven artifact org.apache.maven.resolver:maven-resolver-impl:1.3.2-SNAPSHOT generated by maven-surefire-plugin:test (default-test): m\maven-resolver-impl\target\surefire-reports\*.xml
[windows-jdk8] Recording test results
[windows-jdk8] [withMaven] junitPublisher - Archive test results for Maven artifact org.apache.maven.resolver:maven-resolver-connector-basic:1.3.2-SNAPSHOT generated by maven-surefire-plugin:test (default-test): m\maven-resolver-connector-basic\target\surefire-reports\*.xml
[windows-jdk8] Recording test results
[windows-jdk8] [withMaven] junitPublisher - Archive test results for Maven artifact org.apache.maven.resolver:maven-resolver-transport-classpath:1.3.2-SNAPSHOT generated by maven-surefire-plugin:test (default-test): m\maven-resolver-transport-classpath\target\surefire-reports\*.xml
[windows-jdk8] Recording test results
[windows-jdk8] [withMaven] junitPublisher - Archive test results for Maven artifact org.apache.maven.resolver:maven-resolver-transport-file:1.3.2-SNAPSHOT generated by maven-surefire-plugin:test (default-test): m\maven-resolver-transport-file\target\surefire-reports\*.xml
[windows-jdk8] Recording test results
[windows-jdk8] [withMaven] junitPublisher - Archive test results for Maven artifact org.apache.maven.resolver:maven-resolver-transport-http:1.3.2-SNAPSHOT generated by maven-surefire-plugin:test (default-test): m\maven-resolver-transport-http\target\surefire-reports\*.xml
[windows-jdk8] Recording test results
[windows-jdk8] [withMaven] junitPublisher - Archive test results for Maven artifact org.apache.maven.resolver:maven-resolver-transport-wagon:1.3.2-SNAPSHOT generated by maven-surefire-plugin:test (default-test): m\maven-resolver-transport-wagon\target\surefire-reports\*.xml
[windows-jdk8] Recording test results
[windows-jdk8] [withMaven] junitPublisher - Archive test results for Maven artifact org.apache.maven.resolver:maven-resolver-demo-snippets:1.3.2-SNAPSHOT generated by maven-surefire-plugin:test (default-test): m\maven-resolver-demos\maven-resolver-demo-snippets\target\surefire-reports\*.xml
[windows-jdk8] Recording test results
[windows-jdk8] None of the test reports contained any result
[windows-jdk8] [withMaven] junitPublisher - Archive test results for Maven artifact org.apache.maven.resolver:maven-resolver-demo-maven-plugin:1.3.2-SNAPSHOT generated by maven-surefire-plugin:test (default-test): m\maven-resolver-demos\maven-resolver-demo-maven-plugin\target\surefire-reports\*.xml
[windows-jdk8] Recording test results
[windows-jdk8] None of the test reports contained any result
[Pipeline] [windows-jdk8] // withMaven
[Pipeline] [windows-jdk8] cleanWs
[Pipeline] [windows-jdk9] }
[Pipeline] [windows-jdk9] // stage
[Pipeline] [windows-jdk9] }
[Pipeline] [windows-jdk9] // node
[Pipeline] [windows-jdk9] }
[windows-jdk8] [WS-CLEANUP] Deleting project workspace...[WS-CLEANUP] done
[Pipeline] [windows-jdk8] }
[Pipeline] [windows-jdk8] // stage
[Pipeline] [windows-jdk8] }
[Pipeline] [windows-jdk8] // node
[Pipeline] [windows-jdk8] }
[linux-jdk7] Running on ubuntu-4 in /home/jenkins/jenkins-slave/workspace/n-box_maven-resolver_master-L2RUGOEIK5O5H3FE4SPFSXXNL7FPE37KLTBGLDWAT7DNTIKVZVEQ
[Pipeline] [linux-jdk7] {
[Pipeline] [linux-jdk7] stage
[Pipeline] [linux-jdk7] { (Checkout linux-jdk7)
[Pipeline] [linux-jdk7] dir
[linux-jdk7] Running in /home/jenkins/jenkins-slave/workspace/n-box_maven-resolver_master-L2RUGOEIK5O5H3FE4SPFSXXNL7FPE37KLTBGLDWAT7DNTIKVZVEQ/m
[Pipeline] [linux-jdk7] {
[Pipeline] [linux-jdk7] checkout
[linux-jdk7] Cloning the remote Git repository
[linux-jdk7] Cloning with configured refspecs honoured and without tags
[linux-jdk7] Cloning repository https://gitbox.apache.org/repos/asf/maven-resolver.git
[linux-jdk7]  > git init /home/jenkins/jenkins-slave/workspace/n-box_maven-resolver_master-L2RUGOEIK5O5H3FE4SPFSXXNL7FPE37KLTBGLDWAT7DNTIKVZVEQ/m # timeout=10
[linux-jdk7] Fetching upstream changes from https://gitbox.apache.org/repos/asf/maven-resolver.git
[linux-jdk7]  > git --version # timeout=10
[linux-jdk7]  > git fetch --no-tags --progress https://gitbox.apache.org/repos/asf/maven-resolver.git +refs/heads/*:refs/remotes/origin/*
[linux-jdk7]  > git config remote.origin.url https://gitbox.apache.org/repos/asf/maven-resolver.git # timeout=10
[linux-jdk7]  > git config --add remote.origin.fetch +refs/heads/*:refs/remotes/origin/* # timeout=10
[linux-jdk7]  > git config remote.origin.url https://gitbox.apache.org/repos/asf/maven-resolver.git # timeout=10
[linux-jdk7] Fetching without tags
[linux-jdk7] Fetching upstream changes from https://gitbox.apache.org/repos/asf/maven-resolver.git
[linux-jdk7]  > git fetch --no-tags --progress https://gitbox.apache.org/repos/asf/maven-resolver.git +refs/heads/*:refs/remotes/origin/*
[linux-jdk7] Checking out Revision e7d7b4a953c70c57bb358c1e1af31749c4da3b0f (master)
[linux-jdk7]  > git config core.sparsecheckout # timeout=10
[linux-jdk7]  > git checkout -f e7d7b4a953c70c57bb358c1e1af31749c4da3b0f
[Pipeline] [linux-jdk7] }
[Pipeline] [linux-jdk7] // dir
[Pipeline] [linux-jdk7] cleanWs
[linux-jdk7] [WS-CLEANUP] Deleting project workspace...[WS-CLEANUP] done
[Pipeline] [linux-jdk7] }
[Pipeline] [linux-jdk7] // stage
[Pipeline] [linux-jdk7] }
[Pipeline] [linux-jdk7] // node
[linux-jdk8] Running on ubuntu-4 in /home/jenkins/jenkins-slave/workspace/n-box_maven-resolver_master-L2RUGOEIK5O5H3FE4SPFSXXNL7FPE37KLTBGLDWAT7DNTIKVZVEQ
[Pipeline] [linux-jdk7] }
[linux-jdk7] Failed in branch linux-jdk7
[Pipeline] [linux-jdk8] {
[Pipeline] [linux-jdk8] stage
[Pipeline] [linux-jdk8] { (Checkout linux-jdk8)
[Pipeline] [linux-jdk8] dir
[linux-jdk8] Running in /home/jenkins/jenkins-slave/workspace/n-box_maven-resolver_master-L2RUGOEIK5O5H3FE4SPFSXXNL7FPE37KLTBGLDWAT7DNTIKVZVEQ/m
[Pipeline] [linux-jdk8] {
[Pipeline] [linux-jdk8] checkout
[linux-jdk8] Cloning the remote Git repository
[linux-jdk8] Cloning with configured refspecs honoured and without tags
[linux-jdk8] Cloning repository https://gitbox.apache.org/repos/asf/maven-resolver.git
[linux-jdk8]  > git init /home/jenkins/jenkins-slave/workspace/n-box_maven-resolver_master-L2RUGOEIK5O5H3FE4SPFSXXNL7FPE37KLTBGLDWAT7DNTIKVZVEQ/m # timeout=10
[linux-jdk8] Fetching upstream changes from https://gitbox.apache.org/repos/asf/maven-resolver.git
[linux-jdk8]  > git --version # timeout=10
[linux-jdk8]  > git fetch --no-tags --progress https://gitbox.apache.org/repos/asf/maven-resolver.git +refs/heads/*:refs/remotes/origin/*
[linux-jdk8]  > git config remote.origin.url https://gitbox.apache.org/repos/asf/maven-resolver.git # timeout=10
[linux-jdk8]  > git config --add remote.origin.fetch +refs/heads/*:refs/remotes/origin/* # timeout=10
[linux-jdk8]  > git config remote.origin.url https://gitbox.apache.org/repos/asf/maven-resolver.git # timeout=10
[linux-jdk8] Fetching without tags
[linux-jdk8] Fetching upstream changes from https://gitbox.apache.org/repos/asf/maven-resolver.git
[linux-jdk8]  > git fetch --no-tags --progress https://gitbox.apache.org/repos/asf/maven-resolver.git +refs/heads/*:refs/remotes/origin/*
[linux-jdk8] Checking out Revision e7d7b4a953c70c57bb358c1e1af31749c4da3b0f (master)
[linux-jdk8]  > git config core.sparsecheckout # timeout=10
[linux-jdk8]  > git checkout -f e7d7b4a953c70c57bb358c1e1af31749c4da3b0f
[Pipeline] [linux-jdk8] }
[Pipeline] [linux-jdk8] // dir
[Pipeline] [linux-jdk8] cleanWs
[linux-jdk8] [WS-CLEANUP] Deleting project workspace...[WS-CLEANUP] done
[Pipeline] [linux-jdk8] }
[Pipeline] [linux-jdk8] // stage
[Pipeline] [linux-jdk8] }
[Pipeline] [linux-jdk8] // node
[linux-jdk9] Running on ubuntu-4 in /home/jenkins/jenkins-slave/workspace/n-box_maven-resolver_master-L2RUGOEIK5O5H3FE4SPFSXXNL7FPE37KLTBGLDWAT7DNTIKVZVEQ
[Pipeline] [linux-jdk8] }
[linux-jdk8] Failed in branch linux-jdk8
[Pipeline] [linux-jdk9] {
[Pipeline] [linux-jdk9] stage
[Pipeline] [linux-jdk9] { (Checkout linux-jdk9)
[Pipeline] [linux-jdk9] dir
[linux-jdk9] Running in /home/jenkins/jenkins-slave/workspace/n-box_maven-resolver_master-L2RUGOEIK5O5H3FE4SPFSXXNL7FPE37KLTBGLDWAT7DNTIKVZVEQ/m
[Pipeline] [linux-jdk9] {
[Pipeline] [linux-jdk9] checkout
[linux-jdk9] Cloning the remote Git repository
[linux-jdk9] Cloning with configured refspecs honoured and without tags
[linux-jdk9] Cloning repository https://gitbox.apache.org/repos/asf/maven-resolver.git
[linux-jdk9]  > git init /home/jenkins/jenkins-slave/workspace/n-box_maven-resolver_master-L2RUGOEIK5O5H3FE4SPFSXXNL7FPE37KLTBGLDWAT7DNTIKVZVEQ/m # timeout=10
[linux-jdk9] Fetching upstream changes from https://gitbox.apache.org/repos/asf/maven-resolver.git
[linux-jdk9]  > git --version # timeout=10
[linux-jdk9]  > git fetch --no-tags --progress https://gitbox.apache.org/repos/asf/maven-resolver.git +refs/heads/*:refs/remotes/origin/*
[linux-jdk9]  > git config remote.origin.url https://gitbox.apache.org/repos/asf/maven-resolver.git # timeout=10
[linux-jdk9]  > git config --add remote.origin.fetch +refs/heads/*:refs/remotes/origin/* # timeout=10
[linux-jdk9]  > git config remote.origin.url https://gitbox.apache.org/repos/asf/maven-resolver.git # timeout=10
[linux-jdk9] Fetching without tags
[linux-jdk9] Fetching upstream changes from https://gitbox.apache.org/repos/asf/maven-resolver.git
[linux-jdk9]  > git fetch --no-tags --progress https://gitbox.apache.org/repos/asf/maven-resolver.git +refs/heads/*:refs/remotes/origin/*
[linux-jdk9] Checking out Revision e7d7b4a953c70c57bb358c1e1af31749c4da3b0f (master)
[linux-jdk9]  > git config core.sparsecheckout # timeout=10
[linux-jdk9]  > git checkout -f e7d7b4a953c70c57bb358c1e1af31749c4da3b0f
[Pipeline] [linux-jdk9] }
[Pipeline] [linux-jdk9] // dir
[Pipeline] [linux-jdk9] cleanWs
[linux-jdk9] [WS-CLEANUP] Deleting project workspace...[WS-CLEANUP] done
[Pipeline] [linux-jdk9] }
[Pipeline] [linux-jdk9] // stage
[Pipeline] [linux-jdk9] }
[Pipeline] [linux-jdk9] // node
[Pipeline] [linux-jdk9] }
[linux-jdk9] Failed in branch linux-jdk9
[linux-jdk10] Running on ubuntu-4 in /home/jenkins/jenkins-slave/workspace/n-box_maven-resolver_master-L2RUGOEIK5O5H3FE4SPFSXXNL7FPE37KLTBGLDWAT7DNTIKVZVEQ
[Pipeline] [linux-jdk10] {
[Pipeline] [linux-jdk10] stage
[Pipeline] [linux-jdk10] { (Checkout linux-jdk10)
[Pipeline] [linux-jdk10] dir
[linux-jdk10] Running in /home/jenkins/jenkins-slave/workspace/n-box_maven-resolver_master-L2RUGOEIK5O5H3FE4SPFSXXNL7FPE37KLTBGLDWAT7DNTIKVZVEQ/m
[Pipeline] [linux-jdk10] {
[Pipeline] [linux-jdk10] checkout
[linux-jdk10] Cloning the remote Git repository
[linux-jdk10] Cloning with configured refspecs honoured and without tags
[linux-jdk10] Cloning repository https://gitbox.apache.org/repos/asf/maven-resolver.git
[linux-jdk10]  > git init /home/jenkins/jenkins-slave/workspace/n-box_maven-resolver_master-L2RUGOEIK5O5H3FE4SPFSXXNL7FPE37KLTBGLDWAT7DNTIKVZVEQ/m # timeout=10
[linux-jdk10] Fetching upstream changes from https://gitbox.apache.org/repos/asf/maven-resolver.git
[linux-jdk10]  > git --version # timeout=10
[linux-jdk10]  > git fetch --no-tags --progress https://gitbox.apache.org/repos/asf/maven-resolver.git +refs/heads/*:refs/remotes/origin/*
[linux-jdk10]  > git config remote.origin.url https://gitbox.apache.org/repos/asf/maven-resolver.git # timeout=10
[linux-jdk10]  > git config --add remote.origin.fetch +refs/heads/*:refs/remotes/origin/* # timeout=10
[linux-jdk10]  > git config remote.origin.url https://gitbox.apache.org/repos/asf/maven-resolver.git # timeout=10
[linux-jdk10] Fetching without tags
[linux-jdk10] Fetching upstream changes from https://gitbox.apache.org/repos/asf/maven-resolver.git
[linux-jdk10]  > git fetch --no-tags --progress https://gitbox.apache.org/repos/asf/maven-resolver.git +refs/heads/*:refs/remotes/origin/*
[linux-jdk10] Checking out Revision e7d7b4a953c70c57bb358c1e1af31749c4da3b0f (master)
[linux-jdk10]  > git config core.sparsecheckout # timeout=10
[linux-jdk10]  > git checkout -f e7d7b4a953c70c57bb358c1e1af31749c4da3b0f
[Pipeline] [linux-jdk10] }
[Pipeline] [linux-jdk10] // dir
[Pipeline] [linux-jdk10] cleanWs
[linux-jdk10] [WS-CLEANUP] Deleting project workspace...[WS-CLEANUP] done
[Pipeline] [linux-jdk10] }
[Pipeline] [linux-jdk10] // stage
[Pipeline] [linux-jdk10] }
[Pipeline] [linux-jdk10] // node
[Pipeline] [linux-jdk10] }
[linux-jdk10] Failed in branch linux-jdk10
[Pipeline] // parallel
[Pipeline] stage
[Pipeline] { (Notifications)
[Pipeline] echo
Build result: FAILURE
[Pipeline] jiraIssueSelector
[Pipeline] emailext
Reply | Threaded
Open this post in threaded view
|

Build failed in Jenkins: Maven TLP » maven-resolver » master #33

Apache Jenkins Server-2
See https://builds.apache.org/job/maven-box/job/maven-resolver/job/master/33/

Changes:

* Revert "[maven-release-plugin] prepare for next development iteration"
* Revert "[maven-release-plugin] prepare release maven-resolver-1.3.1"
* Revert "[maven-release-plugin] prepare for next development iteration"
* Revert "[maven-release-plugin] prepare release maven-resolver-1.3.1"
* Revert "[maven-release-plugin] prepare for next development iteration"
* Revert "[maven-release-plugin] prepare release maven-resolver-1.3.1"

All tests passed

Build log:
[...truncated 1.93 MB...]
[windows-jdk9] [withMaven] junitPublisher - Archive test results for Maven artifact org.apache.maven.resolver:maven-resolver-transport-classpath:1.3.1-SNAPSHOT generated by maven-surefire-plugin:test (default-test): m\maven-resolver-transport-classpath\target\surefire-reports\*.xml
[windows-jdk9] Recording test results
[windows-jdk9] [withMaven] junitPublisher - Archive test results for Maven artifact org.apache.maven.resolver:maven-resolver-transport-file:1.3.1-SNAPSHOT generated by maven-surefire-plugin:test (default-test): m\maven-resolver-transport-file\target\surefire-reports\*.xml
[windows-jdk9] Recording test results
[windows-jdk9] [withMaven] junitPublisher - Archive test results for Maven artifact org.apache.maven.resolver:maven-resolver-transport-http:1.3.1-SNAPSHOT generated by maven-surefire-plugin:test (default-test): m\maven-resolver-transport-http\target\surefire-reports\*.xml
[windows-jdk9] Recording test results
[windows-jdk9] [withMaven] junitPublisher - Archive test results for Maven artifact org.apache.maven.resolver:maven-resolver-transport-wagon:1.3.1-SNAPSHOT generated by maven-surefire-plugin:test (default-test): m\maven-resolver-transport-wagon\target\surefire-reports\*.xml
[windows-jdk9] Recording test results
[windows-jdk9] [withMaven] junitPublisher - Archive test results for Maven artifact org.apache.maven.resolver:maven-resolver-demo-snippets:1.3.1-SNAPSHOT generated by maven-surefire-plugin:test (default-test): m\maven-resolver-demos\maven-resolver-demo-snippets\target\surefire-reports\*.xml
[windows-jdk9] Recording test results
[windows-jdk9] None of the test reports contained any result
[windows-jdk9] [withMaven] junitPublisher - Archive test results for Maven artifact org.apache.maven.resolver:maven-resolver-demo-maven-plugin:1.3.1-SNAPSHOT generated by maven-surefire-plugin:test (default-test): m\maven-resolver-demos\maven-resolver-demo-maven-plugin\target\surefire-reports\*.xml
[windows-jdk9] Recording test results
[windows-jdk9] None of the test reports contained any result
[Pipeline] [windows-jdk9] // withMaven
[Pipeline] [windows-jdk8] }
[Pipeline] [windows-jdk9] cleanWs
[Pipeline] [windows-jdk7] }
[Pipeline] [windows-jdk8] // dir
[Pipeline] [windows-jdk7] // dir
[windows-jdk9] [WS-CLEANUP] Deleting project workspace...[WS-CLEANUP] done
[Pipeline] [windows-jdk8] }
[windows-jdk8] [withMaven] invokerPublisher - Archive invoker results for Maven artifact MavenArtifact{org.apache.maven.resolver:maven-resolver-demo-maven-plugin::1.3.1-SNAPSHOT(version: 1.3.1-SNAPSHOT, snapshot:false) } generated by PluginInvocation{org.apache.maven.plugins:maven-invoker-plugin:3.0.1@run  integration-test}: m\maven-resolver-demos\maven-resolver-demo-maven-plugin\target\invoker-reports\*.xml
[windows-jdk8] performing MavenInvokerRecorder, reportsFilenamePattern:'**/m\maven-resolver-demos\maven-resolver-demo-maven-plugin\target\invoker-reports/BUILD*.xml', invokerBuildDir:'**/m\maven-resolver-demos\maven-resolver-demo-maven-plugin\target\it'
[windows-jdk8] Found reports:[f:\jenkins\jenkins-slave\workspace\n-box_maven-resolver_master-L2RUGOEIK5O5H3FE4SPFSXXNL7FPE37KLTBGLDWAT7DNTIKVZVEQ\m\maven-resolver-demos\maven-resolver-demo-maven-plugin\target\invoker-reports\BUILD-resolve-artifact.xml]
[windows-jdk8] Found logs:[f:\jenkins\jenkins-slave\workspace\n-box_maven-resolver_master-L2RUGOEIK5O5H3FE4SPFSXXNL7FPE37KLTBGLDWAT7DNTIKVZVEQ\m\maven-resolver-demos\maven-resolver-demo-maven-plugin\target\it\resolve-artifact\build.log]
[windows-jdk8] Finished parsing Maven Invoker results (found 1)
[windows-jdk8] [withMaven] junitPublisher - Archive test results for Maven artifact org.apache.maven.resolver:maven-resolver-api:1.3.1-SNAPSHOT generated by maven-surefire-plugin:test (default-test): m\maven-resolver-api\target\surefire-reports\*.xml
[windows-jdk8] Recording test results
[windows-jdk8] [withMaven] junitPublisher - Archive test results for Maven artifact org.apache.maven.resolver:maven-resolver-spi:1.3.1-SNAPSHOT generated by maven-surefire-plugin:test (default-test): m\maven-resolver-spi\target\surefire-reports\*.xml
[windows-jdk8] Recording test results
[windows-jdk8] [withMaven] junitPublisher - Archive test results for Maven artifact org.apache.maven.resolver:maven-resolver-test-util:1.3.1-SNAPSHOT generated by maven-surefire-plugin:test (default-test): m\maven-resolver-test-util\target\surefire-reports\*.xml
[windows-jdk8] Recording test results
[windows-jdk8] [withMaven] junitPublisher - Archive test results for Maven artifact org.apache.maven.resolver:maven-resolver-util:1.3.1-SNAPSHOT generated by maven-surefire-plugin:test (default-test): m\maven-resolver-util\target\surefire-reports\*.xml
[windows-jdk8] Recording test results
[windows-jdk8] [withMaven] junitPublisher - Archive test results for Maven artifact org.apache.maven.resolver:maven-resolver-impl:1.3.1-SNAPSHOT generated by maven-surefire-plugin:test (default-test): m\maven-resolver-impl\target\surefire-reports\*.xml
[windows-jdk8] Recording test results
[windows-jdk8] [withMaven] junitPublisher - Archive test results for Maven artifact org.apache.maven.resolver:maven-resolver-connector-basic:1.3.1-SNAPSHOT generated by maven-surefire-plugin:test (default-test): m\maven-resolver-connector-basic\target\surefire-reports\*.xml
[windows-jdk8] Recording test results
[windows-jdk8] [withMaven] junitPublisher - Archive test results for Maven artifact org.apache.maven.resolver:maven-resolver-transport-classpath:1.3.1-SNAPSHOT generated by maven-surefire-plugin:test (default-test): m\maven-resolver-transport-classpath\target\surefire-reports\*.xml
[windows-jdk8] Recording test results
[windows-jdk8] [withMaven] junitPublisher - Archive test results for Maven artifact org.apache.maven.resolver:maven-resolver-transport-file:1.3.1-SNAPSHOT generated by maven-surefire-plugin:test (default-test): m\maven-resolver-transport-file\target\surefire-reports\*.xml
[windows-jdk8] Recording test results
[windows-jdk8] [withMaven] junitPublisher - Archive test results for Maven artifact org.apache.maven.resolver:maven-resolver-transport-http:1.3.1-SNAPSHOT generated by maven-surefire-plugin:test (default-test): m\maven-resolver-transport-http\target\surefire-reports\*.xml
[windows-jdk8] Recording test results
[windows-jdk8] [withMaven] junitPublisher - Archive test results for Maven artifact org.apache.maven.resolver:maven-resolver-transport-wagon:1.3.1-SNAPSHOT generated by maven-surefire-plugin:test (default-test): m\maven-resolver-transport-wagon\target\surefire-reports\*.xml
[windows-jdk8] Recording test results
[windows-jdk8] [withMaven] junitPublisher - Archive test results for Maven artifact org.apache.maven.resolver:maven-resolver-demo-snippets:1.3.1-SNAPSHOT generated by maven-surefire-plugin:test (default-test): m\maven-resolver-demos\maven-resolver-demo-snippets\target\surefire-reports\*.xml
[windows-jdk8] Recording test results
[windows-jdk8] None of the test reports contained any result
[windows-jdk8] [withMaven] junitPublisher - Archive test results for Maven artifact org.apache.maven.resolver:maven-resolver-demo-maven-plugin:1.3.1-SNAPSHOT generated by maven-surefire-plugin:test (default-test): m\maven-resolver-demos\maven-resolver-demo-maven-plugin\target\surefire-reports\*.xml
[windows-jdk8] Recording test results
[windows-jdk8] None of the test reports contained any result
[Pipeline] [windows-jdk7] }
[windows-jdk7] [withMaven] invokerPublisher - Archive invoker results for Maven artifact MavenArtifact{org.apache.maven.resolver:maven-resolver-demo-maven-plugin::1.3.1-SNAPSHOT(version: 1.3.1-SNAPSHOT, snapshot:false) } generated by PluginInvocation{org.apache.maven.plugins:maven-invoker-plugin:3.0.1@run  integration-test}: m\maven-resolver-demos\maven-resolver-demo-maven-plugin\target\invoker-reports\*.xml
[windows-jdk7] performing MavenInvokerRecorder, reportsFilenamePattern:'**/m\maven-resolver-demos\maven-resolver-demo-maven-plugin\target\invoker-reports/BUILD*.xml', invokerBuildDir:'**/m\maven-resolver-demos\maven-resolver-demo-maven-plugin\target\it'
[windows-jdk7] Found reports:[f:\jenkins\jenkins-slave\workspace\n-box_maven-resolver_master-L2RUGOEIK5O5H3FE4SPFSXXNL7FPE37KLTBGLDWAT7DNTIKVZVEQ\m\maven-resolver-demos\maven-resolver-demo-maven-plugin\target\invoker-reports\BUILD-resolve-artifact.xml]
[windows-jdk7] Found logs:[f:\jenkins\jenkins-slave\workspace\n-box_maven-resolver_master-L2RUGOEIK5O5H3FE4SPFSXXNL7FPE37KLTBGLDWAT7DNTIKVZVEQ\m\maven-resolver-demos\maven-resolver-demo-maven-plugin\target\it\resolve-artifact\build.log]
[windows-jdk7] Finished parsing Maven Invoker results (found 1)
[windows-jdk7] [withMaven] junitPublisher - Archive test results for Maven artifact org.apache.maven.resolver:maven-resolver-api:1.3.1-SNAPSHOT generated by maven-surefire-plugin:test (default-test): m\maven-resolver-api\target\surefire-reports\*.xml
[windows-jdk7] Recording test results
[windows-jdk7] [withMaven] junitPublisher - Archive test results for Maven artifact org.apache.maven.resolver:maven-resolver-spi:1.3.1-SNAPSHOT generated by maven-surefire-plugin:test (default-test): m\maven-resolver-spi\target\surefire-reports\*.xml
[windows-jdk7] Recording test results
[windows-jdk7] [withMaven] junitPublisher - Archive test results for Maven artifact org.apache.maven.resolver:maven-resolver-test-util:1.3.1-SNAPSHOT generated by maven-surefire-plugin:test (default-test): m\maven-resolver-test-util\target\surefire-reports\*.xml
[windows-jdk7] Recording test results
[windows-jdk7] [withMaven] junitPublisher - Archive test results for Maven artifact org.apache.maven.resolver:maven-resolver-util:1.3.1-SNAPSHOT generated by maven-surefire-plugin:test (default-test): m\maven-resolver-util\target\surefire-reports\*.xml
[windows-jdk7] Recording test results
[windows-jdk7] [withMaven] junitPublisher - Archive test results for Maven artifact org.apache.maven.resolver:maven-resolver-impl:1.3.1-SNAPSHOT generated by maven-surefire-plugin:test (default-test): m\maven-resolver-impl\target\surefire-reports\*.xml
[windows-jdk7] Recording test results
[windows-jdk7] [withMaven] junitPublisher - Archive test results for Maven artifact org.apache.maven.resolver:maven-resolver-connector-basic:1.3.1-SNAPSHOT generated by maven-surefire-plugin:test (default-test): m\maven-resolver-connector-basic\target\surefire-reports\*.xml
[windows-jdk7] Recording test results
[windows-jdk7] [withMaven] junitPublisher - Archive test results for Maven artifact org.apache.maven.resolver:maven-resolver-transport-classpath:1.3.1-SNAPSHOT generated by maven-surefire-plugin:test (default-test): m\maven-resolver-transport-classpath\target\surefire-reports\*.xml
[windows-jdk7] Recording test results
[windows-jdk7] [withMaven] junitPublisher - Archive test results for Maven artifact org.apache.maven.resolver:maven-resolver-transport-file:1.3.1-SNAPSHOT generated by maven-surefire-plugin:test (default-test): m\maven-resolver-transport-file\target\surefire-reports\*.xml
[windows-jdk7] Recording test results
[windows-jdk7] [withMaven] junitPublisher - Archive test results for Maven artifact org.apache.maven.resolver:maven-resolver-transport-http:1.3.1-SNAPSHOT generated by maven-surefire-plugin:test (default-test): m\maven-resolver-transport-http\target\surefire-reports\*.xml
[windows-jdk7] Recording test results
[windows-jdk7] [withMaven] junitPublisher - Archive test results for Maven artifact org.apache.maven.resolver:maven-resolver-transport-wagon:1.3.1-SNAPSHOT generated by maven-surefire-plugin:test (default-test): m\maven-resolver-transport-wagon\target\surefire-reports\*.xml
[windows-jdk7] Recording test results
[windows-jdk7] [withMaven] junitPublisher - Archive test results for Maven artifact org.apache.maven.resolver:maven-resolver-demo-snippets:1.3.1-SNAPSHOT generated by maven-surefire-plugin:test (default-test): m\maven-resolver-demos\maven-resolver-demo-snippets\target\surefire-reports\*.xml
[windows-jdk7] Recording test results
[windows-jdk7] None of the test reports contained any result
[windows-jdk7] [withMaven] junitPublisher - Archive test results for Maven artifact org.apache.maven.resolver:maven-resolver-demo-maven-plugin:1.3.1-SNAPSHOT generated by maven-surefire-plugin:test (default-test): m\maven-resolver-demos\maven-resolver-demo-maven-plugin\target\surefire-reports\*.xml
[windows-jdk7] Recording test results
[windows-jdk7] None of the test reports contained any result
[Pipeline] [windows-jdk8] // withMaven
[Pipeline] [windows-jdk7] // withMaven
[Pipeline] [windows-jdk8] cleanWs
[Pipeline] [windows-jdk9] }
[Pipeline] [windows-jdk7] cleanWs
[Pipeline] [windows-jdk9] // stage
[Pipeline] [windows-jdk9] }
[Pipeline] [windows-jdk9] // node
[Pipeline] [windows-jdk9] }
[windows-jdk8] [WS-CLEANUP] Deleting project workspace...[WS-CLEANUP] done
[Pipeline] [windows-jdk8] }
[Pipeline] [windows-jdk8] // stage
[Pipeline] [windows-jdk8] }
[Pipeline] [windows-jdk8] // node
[Pipeline] [windows-jdk8] }
[windows-jdk7] [WS-CLEANUP] Deleting project workspace...[WS-CLEANUP] done
[Pipeline] [windows-jdk7] }
[Pipeline] [windows-jdk7] // stage
[Pipeline] [windows-jdk7] }
[Pipeline] [windows-jdk7] // node
[Pipeline] [windows-jdk7] }
[linux-jdk7] Running on H35 in /home/jenkins/jenkins-slave/workspace/n-box_maven-resolver_master-L2RUGOEIK5O5H3FE4SPFSXXNL7FPE37KLTBGLDWAT7DNTIKVZVEQ
[Pipeline] [linux-jdk7] {
[Pipeline] [linux-jdk7] stage
[Pipeline] [linux-jdk7] { (Checkout linux-jdk7)
[Pipeline] [linux-jdk7] dir
[linux-jdk7] Running in /home/jenkins/jenkins-slave/workspace/n-box_maven-resolver_master-L2RUGOEIK5O5H3FE4SPFSXXNL7FPE37KLTBGLDWAT7DNTIKVZVEQ/m
[Pipeline] [linux-jdk7] {
[Pipeline] [linux-jdk7] checkout
[linux-jdk7] Cloning the remote Git repository
[linux-jdk7] Cloning with configured refspecs honoured and without tags
[linux-jdk7] Cloning repository https://gitbox.apache.org/repos/asf/maven-resolver.git
[linux-jdk7]  > git init /home/jenkins/jenkins-slave/workspace/n-box_maven-resolver_master-L2RUGOEIK5O5H3FE4SPFSXXNL7FPE37KLTBGLDWAT7DNTIKVZVEQ/m # timeout=10
[linux-jdk7] Fetching upstream changes from https://gitbox.apache.org/repos/asf/maven-resolver.git
[linux-jdk7]  > git --version # timeout=10
[linux-jdk7]  > git fetch --no-tags --progress https://gitbox.apache.org/repos/asf/maven-resolver.git +refs/heads/*:refs/remotes/origin/*
[linux-jdk7]  > git config remote.origin.url https://gitbox.apache.org/repos/asf/maven-resolver.git # timeout=10
[linux-jdk7]  > git config --add remote.origin.fetch +refs/heads/*:refs/remotes/origin/* # timeout=10
[linux-jdk7]  > git config remote.origin.url https://gitbox.apache.org/repos/asf/maven-resolver.git # timeout=10
[linux-jdk7] Fetching without tags
[linux-jdk7] Fetching upstream changes from https://gitbox.apache.org/repos/asf/maven-resolver.git
[linux-jdk7]  > git fetch --no-tags --progress https://gitbox.apache.org/repos/asf/maven-resolver.git +refs/heads/*:refs/remotes/origin/*
[linux-jdk7] Checking out Revision 63c3a1e04900d8b7582d1b0aa4543204cd2256bc (master)
[linux-jdk7]  > git config core.sparsecheckout # timeout=10
[linux-jdk7]  > git checkout -f 63c3a1e04900d8b7582d1b0aa4543204cd2256bc
[Pipeline] [linux-jdk7] }
[Pipeline] [linux-jdk7] // dir
[Pipeline] [linux-jdk7] cleanWs
[linux-jdk7] [WS-CLEANUP] Deleting project workspace...[WS-CLEANUP] done
[Pipeline] [linux-jdk7] }
[Pipeline] [linux-jdk7] // stage
[Pipeline] [linux-jdk7] }
[Pipeline] [linux-jdk7] // node
[linux-jdk8] Running on H35 in /home/jenkins/jenkins-slave/workspace/n-box_maven-resolver_master-L2RUGOEIK5O5H3FE4SPFSXXNL7FPE37KLTBGLDWAT7DNTIKVZVEQ
[Pipeline] [linux-jdk7] }
[linux-jdk7] Failed in branch linux-jdk7
[Pipeline] [linux-jdk8] {
[Pipeline] [linux-jdk8] stage
[Pipeline] [linux-jdk8] { (Checkout linux-jdk8)
[Pipeline] [linux-jdk8] dir
[linux-jdk8] Running in /home/jenkins/jenkins-slave/workspace/n-box_maven-resolver_master-L2RUGOEIK5O5H3FE4SPFSXXNL7FPE37KLTBGLDWAT7DNTIKVZVEQ/m
[Pipeline] [linux-jdk8] {
[Pipeline] [linux-jdk8] checkout
[linux-jdk8] Cloning the remote Git repository
[linux-jdk8] Cloning with configured refspecs honoured and without tags
[linux-jdk8] Cloning repository https://gitbox.apache.org/repos/asf/maven-resolver.git
[linux-jdk8]  > git init /home/jenkins/jenkins-slave/workspace/n-box_maven-resolver_master-L2RUGOEIK5O5H3FE4SPFSXXNL7FPE37KLTBGLDWAT7DNTIKVZVEQ/m # timeout=10
[linux-jdk8] Fetching upstream changes from https://gitbox.apache.org/repos/asf/maven-resolver.git
[linux-jdk8]  > git --version # timeout=10
[linux-jdk8]  > git fetch --no-tags --progress https://gitbox.apache.org/repos/asf/maven-resolver.git +refs/heads/*:refs/remotes/origin/*
[linux-jdk8]  > git config remote.origin.url https://gitbox.apache.org/repos/asf/maven-resolver.git # timeout=10
[linux-jdk8]  > git config --add remote.origin.fetch +refs/heads/*:refs/remotes/origin/* # timeout=10
[linux-jdk8]  > git config remote.origin.url https://gitbox.apache.org/repos/asf/maven-resolver.git # timeout=10
[linux-jdk8] Fetching without tags
[linux-jdk8] Fetching upstream changes from https://gitbox.apache.org/repos/asf/maven-resolver.git
[linux-jdk8]  > git fetch --no-tags --progress https://gitbox.apache.org/repos/asf/maven-resolver.git +refs/heads/*:refs/remotes/origin/*
[linux-jdk8] Checking out Revision 63c3a1e04900d8b7582d1b0aa4543204cd2256bc (master)
[linux-jdk8]  > git config core.sparsecheckout # timeout=10
[linux-jdk8]  > git checkout -f 63c3a1e04900d8b7582d1b0aa4543204cd2256bc
[Pipeline] [linux-jdk8] }
[Pipeline] [linux-jdk8] // dir
[Pipeline] [linux-jdk8] cleanWs
[linux-jdk8] [WS-CLEANUP] Deleting project workspace...[WS-CLEANUP] done
[Pipeline] [linux-jdk8] }
[Pipeline] [linux-jdk8] // stage
[Pipeline] [linux-jdk8] }
[Pipeline] [linux-jdk8] // node
[Pipeline] [linux-jdk8] }
[linux-jdk8] Failed in branch linux-jdk8
[linux-jdk9] Running on H35 in /home/jenkins/jenkins-slave/workspace/n-box_maven-resolver_master-L2RUGOEIK5O5H3FE4SPFSXXNL7FPE37KLTBGLDWAT7DNTIKVZVEQ
[Pipeline] [linux-jdk9] {
[Pipeline] [linux-jdk9] stage
[Pipeline] [linux-jdk9] { (Checkout linux-jdk9)
[Pipeline] [linux-jdk9] dir
[linux-jdk9] Running in /home/jenkins/jenkins-slave/workspace/n-box_maven-resolver_master-L2RUGOEIK5O5H3FE4SPFSXXNL7FPE37KLTBGLDWAT7DNTIKVZVEQ/m
[Pipeline] [linux-jdk9] {
[Pipeline] [linux-jdk9] checkout
[linux-jdk9] Cloning the remote Git repository
[linux-jdk9] Cloning with configured refspecs honoured and without tags
[linux-jdk9] Cloning repository https://gitbox.apache.org/repos/asf/maven-resolver.git
[linux-jdk9]  > git init /home/jenkins/jenkins-slave/workspace/n-box_maven-resolver_master-L2RUGOEIK5O5H3FE4SPFSXXNL7FPE37KLTBGLDWAT7DNTIKVZVEQ/m # timeout=10
[linux-jdk9] Fetching upstream changes from https://gitbox.apache.org/repos/asf/maven-resolver.git
[linux-jdk9]  > git --version # timeout=10
[linux-jdk9]  > git fetch --no-tags --progress https://gitbox.apache.org/repos/asf/maven-resolver.git +refs/heads/*:refs/remotes/origin/*
[linux-jdk9]  > git config remote.origin.url https://gitbox.apache.org/repos/asf/maven-resolver.git # timeout=10
[linux-jdk9]  > git config --add remote.origin.fetch +refs/heads/*:refs/remotes/origin/* # timeout=10
[linux-jdk9]  > git config remote.origin.url https://gitbox.apache.org/repos/asf/maven-resolver.git # timeout=10
[linux-jdk9] Fetching without tags
[linux-jdk9] Fetching upstream changes from https://gitbox.apache.org/repos/asf/maven-resolver.git
[linux-jdk9]  > git fetch --no-tags --progress https://gitbox.apache.org/repos/asf/maven-resolver.git +refs/heads/*:refs/remotes/origin/*
[linux-jdk9] Checking out Revision 63c3a1e04900d8b7582d1b0aa4543204cd2256bc (master)
[linux-jdk9]  > git config core.sparsecheckout # timeout=10
[linux-jdk9]  > git checkout -f 63c3a1e04900d8b7582d1b0aa4543204cd2256bc
[Pipeline] [linux-jdk9] }
[Pipeline] [linux-jdk9] // dir
[Pipeline] [linux-jdk9] cleanWs
[linux-jdk9] [WS-CLEANUP] Deleting project workspace...[WS-CLEANUP] done
[Pipeline] [linux-jdk9] }
[Pipeline] [linux-jdk9] // stage
[Pipeline] [linux-jdk9] }
[Pipeline] [linux-jdk9] // node
[linux-jdk10] Running on H35 in /home/jenkins/jenkins-slave/workspace/n-box_maven-resolver_master-L2RUGOEIK5O5H3FE4SPFSXXNL7FPE37KLTBGLDWAT7DNTIKVZVEQ
[Pipeline] [linux-jdk9] }
[linux-jdk9] Failed in branch linux-jdk9
[Pipeline] [linux-jdk10] {
[Pipeline] [linux-jdk10] stage
[Pipeline] [linux-jdk10] { (Checkout linux-jdk10)
[Pipeline] [linux-jdk10] dir
[linux-jdk10] Running in /home/jenkins/jenkins-slave/workspace/n-box_maven-resolver_master-L2RUGOEIK5O5H3FE4SPFSXXNL7FPE37KLTBGLDWAT7DNTIKVZVEQ/m
[Pipeline] [linux-jdk10] {
[Pipeline] [linux-jdk10] checkout
[linux-jdk10] Cloning the remote Git repository
[linux-jdk10] Cloning with configured refspecs honoured and without tags
[linux-jdk10] Cloning repository https://gitbox.apache.org/repos/asf/maven-resolver.git
[linux-jdk10]  > git init /home/jenkins/jenkins-slave/workspace/n-box_maven-resolver_master-L2RUGOEIK5O5H3FE4SPFSXXNL7FPE37KLTBGLDWAT7DNTIKVZVEQ/m # timeout=10
[linux-jdk10] Fetching upstream changes from https://gitbox.apache.org/repos/asf/maven-resolver.git
[linux-jdk10]  > git --version # timeout=10
[linux-jdk10]  > git fetch --no-tags --progress https://gitbox.apache.org/repos/asf/maven-resolver.git +refs/heads/*:refs/remotes/origin/*
[linux-jdk10]  > git config remote.origin.url https://gitbox.apache.org/repos/asf/maven-resolver.git # timeout=10
[linux-jdk10]  > git config --add remote.origin.fetch +refs/heads/*:refs/remotes/origin/* # timeout=10
[linux-jdk10]  > git config remote.origin.url https://gitbox.apache.org/repos/asf/maven-resolver.git # timeout=10
[linux-jdk10] Fetching without tags
[linux-jdk10] Fetching upstream changes from https://gitbox.apache.org/repos/asf/maven-resolver.git
[linux-jdk10]  > git fetch --no-tags --progress https://gitbox.apache.org/repos/asf/maven-resolver.git +refs/heads/*:refs/remotes/origin/*
[linux-jdk10] Checking out Revision 63c3a1e04900d8b7582d1b0aa4543204cd2256bc (master)
[linux-jdk10]  > git config core.sparsecheckout # timeout=10
[linux-jdk10]  > git checkout -f 63c3a1e04900d8b7582d1b0aa4543204cd2256bc
[Pipeline] [linux-jdk10] }
[Pipeline] [linux-jdk10] // dir
[Pipeline] [linux-jdk10] cleanWs
[linux-jdk10] [WS-CLEANUP] Deleting project workspace...[WS-CLEANUP] done
[Pipeline] [linux-jdk10] }
[Pipeline] [linux-jdk10] // stage
[Pipeline] [linux-jdk10] }
[Pipeline] [linux-jdk10] // node
[Pipeline] [linux-jdk10] }
[linux-jdk10] Failed in branch linux-jdk10
[Pipeline] // parallel
[Pipeline] stage
[Pipeline] { (Notifications)
[Pipeline] echo
Build result: FAILURE
[Pipeline] jiraIssueSelector
[Pipeline] emailext
Reply | Threaded
Open this post in threaded view
|

Build failed in Jenkins: Maven TLP » maven-resolver » master #34

Apache Jenkins Server-2
See https://builds.apache.org/job/maven-box/job/maven-resolver/job/master/34/

Changes:

* [maven-release-plugin] prepare release maven-resolver-1.3.1
* [maven-release-plugin] prepare release maven-resolver-1.3.1
* [maven-release-plugin] prepare release maven-resolver-1.3.1
* [maven-release-plugin] prepare release maven-resolver-1.3.1

All tests passed

Build log:
[...truncated 1.93 MB...]
[windows-jdk9] [INFO] Reactor Summary:
[windows-jdk9] [INFO]
[windows-jdk9] [INFO] Maven Artifact Resolver ............................ SUCCESS [ 50.258 s]
[windows-jdk9] [INFO] Maven Artifact Resolver API ........................ SUCCESS [ 34.099 s]
[windows-jdk9] [INFO] Maven Artifact Resolver SPI ........................ SUCCESS [  6.629 s]
[windows-jdk9] [INFO] Maven Artifact Resolver Test Utilities ............. SUCCESS [  8.399 s]
[windows-jdk9] [INFO] Maven Artifact Resolver Utilities .................. SUCCESS [ 15.704 s]
[windows-jdk9] [INFO] Maven Artifact Resolver Implementation ............. SUCCESS [ 34.007 s]
[windows-jdk9] [INFO] Maven Artifact Resolver Connector Basic ............ SUCCESS [ 10.810 s]
[windows-jdk9] [INFO] Maven Artifact Resolver Transport Classpath ........ SUCCESS [  4.210 s]
[windows-jdk9] [INFO] Maven Artifact Resolver Transport File ............. SUCCESS [  5.052 s]
[windows-jdk9] [INFO] Maven Artifact Resolver Transport HTTP ............. SUCCESS [ 18.376 s]
[windows-jdk9] [INFO] Maven Artifact Resolver Transport Wagon ............ SUCCESS [ 10.572 s]
[windows-jdk9] [INFO] Maven Artifact Resolver Demos ...................... SUCCESS [  0.905 s]
[windows-jdk9] [INFO] Maven Artifact Resolver Demo Snippets .............. SUCCESS [  4.741 s]
[windows-jdk9] [INFO] Maven Artifact Resolver Demo Maven Plugin .......... SUCCESS [ 18.226 s]
[windows-jdk9] [INFO] ------------------------------------------------------------------------
[windows-jdk9] [INFO] BUILD SUCCESS
[windows-jdk9] [INFO] ------------------------------------------------------------------------
[windows-jdk9] [INFO] Total time: 03:44 min
[windows-jdk9] [INFO] Finished at: 2018-10-11T11:57:31-07:00
[windows-jdk9] [INFO] Final Memory: 49M/165M
[windows-jdk9] [INFO] ------------------------------------------------------------------------
[windows-jdk9] [INFO] [jenkins-event-spy] Generated F:\jenkins\jenkins-slave\workspace\n-box_maven-resolver_master-L2RUGOEIK5O5H3FE4SPFSXXNL7FPE37KLTBGLDWAT7DNTIKVZVEQ@tmp\withMaven76220fd9\maven-spy-20181011-115346-547584032939301261888.log
[Pipeline] [windows-jdk10] }
[windows-jdk10] [withMaven] invokerPublisher - Archive invoker results for Maven artifact MavenArtifact{org.apache.maven.resolver:maven-resolver-demo-maven-plugin::1.3.1(version: 1.3.1, snapshot:false) } generated by PluginInvocation{org.apache.maven.plugins:maven-invoker-plugin:3.0.1@run  integration-test}: m\maven-resolver-demos\maven-resolver-demo-maven-plugin\target\invoker-reports\*.xml
[windows-jdk10] performing MavenInvokerRecorder, reportsFilenamePattern:'**/m\maven-resolver-demos\maven-resolver-demo-maven-plugin\target\invoker-reports/BUILD*.xml', invokerBuildDir:'**/m\maven-resolver-demos\maven-resolver-demo-maven-plugin\target\it'
[windows-jdk10] Found reports:[f:\jenkins\jenkins-slave\workspace\n-box_maven-resolver_master-L2RUGOEIK5O5H3FE4SPFSXXNL7FPE37KLTBGLDWAT7DNTIKVZVEQ@2\m\maven-resolver-demos\maven-resolver-demo-maven-plugin\target\invoker-reports\BUILD-resolve-artifact.xml]
[windows-jdk10] Found logs:[f:\jenkins\jenkins-slave\workspace\n-box_maven-resolver_master-L2RUGOEIK5O5H3FE4SPFSXXNL7FPE37KLTBGLDWAT7DNTIKVZVEQ@2\m\maven-resolver-demos\maven-resolver-demo-maven-plugin\target\it\resolve-artifact\build.log]
[windows-jdk10] Finished parsing Maven Invoker results (found 1)
[windows-jdk10] [withMaven] junitPublisher - Archive test results for Maven artifact org.apache.maven.resolver:maven-resolver-api:1.3.1 generated by maven-surefire-plugin:test (default-test): m\maven-resolver-api\target\surefire-reports\*.xml
[windows-jdk10] Recording test results
[windows-jdk10] [withMaven] junitPublisher - Archive test results for Maven artifact org.apache.maven.resolver:maven-resolver-spi:1.3.1 generated by maven-surefire-plugin:test (default-test): m\maven-resolver-spi\target\surefire-reports\*.xml
[windows-jdk10] Recording test results
[windows-jdk10] [withMaven] junitPublisher - Archive test results for Maven artifact org.apache.maven.resolver:maven-resolver-test-util:1.3.1 generated by maven-surefire-plugin:test (default-test): m\maven-resolver-test-util\target\surefire-reports\*.xml
[windows-jdk10] Recording test results
[windows-jdk10] [withMaven] junitPublisher - Archive test results for Maven artifact org.apache.maven.resolver:maven-resolver-util:1.3.1 generated by maven-surefire-plugin:test (default-test): m\maven-resolver-util\target\surefire-reports\*.xml
[windows-jdk10] Recording test results
[windows-jdk10] [withMaven] junitPublisher - Archive test results for Maven artifact org.apache.maven.resolver:maven-resolver-impl:1.3.1 generated by maven-surefire-plugin:test (default-test): m\maven-resolver-impl\target\surefire-reports\*.xml
[windows-jdk10] Recording test results
[windows-jdk10] [withMaven] junitPublisher - Archive test results for Maven artifact org.apache.maven.resolver:maven-resolver-connector-basic:1.3.1 generated by maven-surefire-plugin:test (default-test): m\maven-resolver-connector-basic\target\surefire-reports\*.xml
[windows-jdk10] Recording test results
[windows-jdk10] [withMaven] junitPublisher - Archive test results for Maven artifact org.apache.maven.resolver:maven-resolver-transport-classpath:1.3.1 generated by maven-surefire-plugin:test (default-test): m\maven-resolver-transport-classpath\target\surefire-reports\*.xml
[windows-jdk10] Recording test results
[windows-jdk10] [withMaven] junitPublisher - Archive test results for Maven artifact org.apache.maven.resolver:maven-resolver-transport-file:1.3.1 generated by maven-surefire-plugin:test (default-test): m\maven-resolver-transport-file\target\surefire-reports\*.xml
[windows-jdk10] Recording test results
[windows-jdk10] [withMaven] junitPublisher - Archive test results for Maven artifact org.apache.maven.resolver:maven-resolver-transport-http:1.3.1 generated by maven-surefire-plugin:test (default-test): m\maven-resolver-transport-http\target\surefire-reports\*.xml
[windows-jdk10] Recording test results
[windows-jdk10] [withMaven] junitPublisher - Archive test results for Maven artifact org.apache.maven.resolver:maven-resolver-transport-wagon:1.3.1 generated by maven-surefire-plugin:test (default-test): m\maven-resolver-transport-wagon\target\surefire-reports\*.xml
[windows-jdk10] Recording test results
[windows-jdk10] [withMaven] junitPublisher - Archive test results for Maven artifact org.apache.maven.resolver:maven-resolver-demo-snippets:1.3.1 generated by maven-surefire-plugin:test (default-test): m\maven-resolver-demos\maven-resolver-demo-snippets\target\surefire-reports\*.xml
[windows-jdk10] Recording test results
[windows-jdk10] None of the test reports contained any result
[windows-jdk10] [withMaven] junitPublisher - Archive test results for Maven artifact org.apache.maven.resolver:maven-resolver-demo-maven-plugin:1.3.1 generated by maven-surefire-plugin:test (default-test): m\maven-resolver-demos\maven-resolver-demo-maven-plugin\target\surefire-reports\*.xml
[windows-jdk10] Recording test results
[windows-jdk10] None of the test reports contained any result
[Pipeline] [windows-jdk10] // withMaven
[Pipeline] [windows-jdk10] cleanWs
[Pipeline] [windows-jdk9] }
[Pipeline] [windows-jdk9] // dir
[windows-jdk10] [WS-CLEANUP] Deleting project workspace...[WS-CLEANUP] done
[Pipeline] [windows-jdk9] }
[windows-jdk9] [withMaven] invokerPublisher - Archive invoker results for Maven artifact MavenArtifact{org.apache.maven.resolver:maven-resolver-demo-maven-plugin::1.3.1(version: 1.3.1, snapshot:false) } generated by PluginInvocation{org.apache.maven.plugins:maven-invoker-plugin:3.0.1@run  integration-test}: m\maven-resolver-demos\maven-resolver-demo-maven-plugin\target\invoker-reports\*.xml
[windows-jdk9] performing MavenInvokerRecorder, reportsFilenamePattern:'**/m\maven-resolver-demos\maven-resolver-demo-maven-plugin\target\invoker-reports/BUILD*.xml', invokerBuildDir:'**/m\maven-resolver-demos\maven-resolver-demo-maven-plugin\target\it'
[windows-jdk9] Found reports:[f:\jenkins\jenkins-slave\workspace\n-box_maven-resolver_master-L2RUGOEIK5O5H3FE4SPFSXXNL7FPE37KLTBGLDWAT7DNTIKVZVEQ\m\maven-resolver-demos\maven-resolver-demo-maven-plugin\target\invoker-reports\BUILD-resolve-artifact.xml]
[windows-jdk9] Found logs:[f:\jenkins\jenkins-slave\workspace\n-box_maven-resolver_master-L2RUGOEIK5O5H3FE4SPFSXXNL7FPE37KLTBGLDWAT7DNTIKVZVEQ\m\maven-resolver-demos\maven-resolver-demo-maven-plugin\target\it\resolve-artifact\build.log]
[windows-jdk9] Finished parsing Maven Invoker results (found 1)
[windows-jdk9] [withMaven] junitPublisher - Archive test results for Maven artifact org.apache.maven.resolver:maven-resolver-api:1.3.1 generated by maven-surefire-plugin:test (default-test): m\maven-resolver-api\target\surefire-reports\*.xml
[windows-jdk9] Recording test results
[windows-jdk9] [withMaven] junitPublisher - Archive test results for Maven artifact org.apache.maven.resolver:maven-resolver-spi:1.3.1 generated by maven-surefire-plugin:test (default-test): m\maven-resolver-spi\target\surefire-reports\*.xml
[windows-jdk9] Recording test results
[windows-jdk9] [withMaven] junitPublisher - Archive test results for Maven artifact org.apache.maven.resolver:maven-resolver-test-util:1.3.1 generated by maven-surefire-plugin:test (default-test): m\maven-resolver-test-util\target\surefire-reports\*.xml
[windows-jdk9] Recording test results
[windows-jdk9] [withMaven] junitPublisher - Archive test results for Maven artifact org.apache.maven.resolver:maven-resolver-util:1.3.1 generated by maven-surefire-plugin:test (default-test): m\maven-resolver-util\target\surefire-reports\*.xml
[windows-jdk9] Recording test results
[windows-jdk9] [withMaven] junitPublisher - Archive test results for Maven artifact org.apache.maven.resolver:maven-resolver-impl:1.3.1 generated by maven-surefire-plugin:test (default-test): m\maven-resolver-impl\target\surefire-reports\*.xml
[windows-jdk9] Recording test results
[windows-jdk9] [withMaven] junitPublisher - Archive test results for Maven artifact org.apache.maven.resolver:maven-resolver-connector-basic:1.3.1 generated by maven-surefire-plugin:test (default-test): m\maven-resolver-connector-basic\target\surefire-reports\*.xml
[windows-jdk9] Recording test results
[windows-jdk9] [withMaven] junitPublisher - Archive test results for Maven artifact org.apache.maven.resolver:maven-resolver-transport-classpath:1.3.1 generated by maven-surefire-plugin:test (default-test): m\maven-resolver-transport-classpath\target\surefire-reports\*.xml
[windows-jdk9] Recording test results
[windows-jdk9] [withMaven] junitPublisher - Archive test results for Maven artifact org.apache.maven.resolver:maven-resolver-transport-file:1.3.1 generated by maven-surefire-plugin:test (default-test): m\maven-resolver-transport-file\target\surefire-reports\*.xml
[windows-jdk9] Recording test results
[windows-jdk9] [withMaven] junitPublisher - Archive test results for Maven artifact org.apache.maven.resolver:maven-resolver-transport-http:1.3.1 generated by maven-surefire-plugin:test (default-test): m\maven-resolver-transport-http\target\surefire-reports\*.xml
[windows-jdk9] Recording test results
[windows-jdk9] [withMaven] junitPublisher - Archive test results for Maven artifact org.apache.maven.resolver:maven-resolver-transport-wagon:1.3.1 generated by maven-surefire-plugin:test (default-test): m\maven-resolver-transport-wagon\target\surefire-reports\*.xml
[windows-jdk9] Recording test results
[windows-jdk9] [withMaven] junitPublisher - Archive test results for Maven artifact org.apache.maven.resolver:maven-resolver-demo-snippets:1.3.1 generated by maven-surefire-plugin:test (default-test): m\maven-resolver-demos\maven-resolver-demo-snippets\target\surefire-reports\*.xml
[windows-jdk9] Recording test results
[windows-jdk9] None of the test reports contained any result
[windows-jdk9] [withMaven] junitPublisher - Archive test results for Maven artifact org.apache.maven.resolver:maven-resolver-demo-maven-plugin:1.3.1 generated by maven-surefire-plugin:test (default-test): m\maven-resolver-demos\maven-resolver-demo-maven-plugin\target\surefire-reports\*.xml
[windows-jdk9] Recording test results
[windows-jdk9] None of the test reports contained any result
[Pipeline] [windows-jdk9] // withMaven
[Pipeline] [windows-jdk10] }
[Pipeline] [windows-jdk9] cleanWs
[Pipeline] [windows-jdk10] // stage
[Pipeline] [windows-jdk10] }
[Pipeline] [windows-jdk10] // node
[Pipeline] [windows-jdk10] }
[windows-jdk9] [WS-CLEANUP] Deleting project workspace...[WS-CLEANUP] done
[Pipeline] [windows-jdk9] }
[Pipeline] [windows-jdk9] // stage
[Pipeline] [windows-jdk9] }
[Pipeline] [windows-jdk9] // node
[Pipeline] [windows-jdk9] }
[linux-jdk7] Running on H33 in /home/jenkins/jenkins-slave/workspace/n-box_maven-resolver_master-L2RUGOEIK5O5H3FE4SPFSXXNL7FPE37KLTBGLDWAT7DNTIKVZVEQ
[Pipeline] [linux-jdk7] {
[Pipeline] [linux-jdk7] stage
[Pipeline] [linux-jdk7] { (Checkout linux-jdk7)
[Pipeline] [linux-jdk7] dir
[linux-jdk7] Running in /home/jenkins/jenkins-slave/workspace/n-box_maven-resolver_master-L2RUGOEIK5O5H3FE4SPFSXXNL7FPE37KLTBGLDWAT7DNTIKVZVEQ/m
[Pipeline] [linux-jdk7] {
[Pipeline] [linux-jdk7] checkout
[linux-jdk7] Cloning the remote Git repository
[linux-jdk7] Cloning with configured refspecs honoured and without tags
[linux-jdk7] Cloning repository https://gitbox.apache.org/repos/asf/maven-resolver.git
[linux-jdk7]  > git init /home/jenkins/jenkins-slave/workspace/n-box_maven-resolver_master-L2RUGOEIK5O5H3FE4SPFSXXNL7FPE37KLTBGLDWAT7DNTIKVZVEQ/m # timeout=10
[linux-jdk7] Fetching upstream changes from https://gitbox.apache.org/repos/asf/maven-resolver.git
[linux-jdk7]  > git --version # timeout=10
[linux-jdk7]  > git fetch --no-tags --progress https://gitbox.apache.org/repos/asf/maven-resolver.git +refs/heads/*:refs/remotes/origin/*
[linux-jdk7]  > git config remote.origin.url https://gitbox.apache.org/repos/asf/maven-resolver.git # timeout=10
[linux-jdk7]  > git config --add remote.origin.fetch +refs/heads/*:refs/remotes/origin/* # timeout=10
[linux-jdk7]  > git config remote.origin.url https://gitbox.apache.org/repos/asf/maven-resolver.git # timeout=10
[linux-jdk7] Fetching without tags
[linux-jdk7] Fetching upstream changes from https://gitbox.apache.org/repos/asf/maven-resolver.git
[linux-jdk7]  > git fetch --no-tags --progress https://gitbox.apache.org/repos/asf/maven-resolver.git +refs/heads/*:refs/remotes/origin/*
[linux-jdk7] Checking out Revision f6afa8a48400ae2024d35675f0b2e8c3a7a0d683 (master)
[linux-jdk7]  > git config core.sparsecheckout # timeout=10
[linux-jdk7]  > git checkout -f f6afa8a48400ae2024d35675f0b2e8c3a7a0d683
[Pipeline] [linux-jdk7] }
[Pipeline] [linux-jdk7] // dir
[Pipeline] [linux-jdk7] cleanWs
[linux-jdk7] [WS-CLEANUP] Deleting project workspace...[WS-CLEANUP] done
[Pipeline] [linux-jdk7] }
[Pipeline] [linux-jdk7] // stage
[Pipeline] [linux-jdk7] }
[Pipeline] [linux-jdk7] // node
[linux-jdk8] Running on H33 in /home/jenkins/jenkins-slave/workspace/n-box_maven-resolver_master-L2RUGOEIK5O5H3FE4SPFSXXNL7FPE37KLTBGLDWAT7DNTIKVZVEQ
[Pipeline] [linux-jdk7] }
[linux-jdk7] Failed in branch linux-jdk7
[Pipeline] [linux-jdk8] {
[Pipeline] [linux-jdk8] stage
[Pipeline] [linux-jdk8] { (Checkout linux-jdk8)
[Pipeline] [linux-jdk8] dir
[linux-jdk8] Running in /home/jenkins/jenkins-slave/workspace/n-box_maven-resolver_master-L2RUGOEIK5O5H3FE4SPFSXXNL7FPE37KLTBGLDWAT7DNTIKVZVEQ/m
[Pipeline] [linux-jdk8] {
[Pipeline] [linux-jdk8] checkout
[linux-jdk8] Cloning the remote Git repository
[linux-jdk8] Cloning with configured refspecs honoured and without tags
[linux-jdk8] Cloning repository https://gitbox.apache.org/repos/asf/maven-resolver.git
[linux-jdk8]  > git init /home/jenkins/jenkins-slave/workspace/n-box_maven-resolver_master-L2RUGOEIK5O5H3FE4SPFSXXNL7FPE37KLTBGLDWAT7DNTIKVZVEQ/m # timeout=10
[linux-jdk8] Fetching upstream changes from https://gitbox.apache.org/repos/asf/maven-resolver.git
[linux-jdk8]  > git --version # timeout=10
[linux-jdk8]  > git fetch --no-tags --progress https://gitbox.apache.org/repos/asf/maven-resolver.git +refs/heads/*:refs/remotes/origin/*
[linux-jdk8]  > git config remote.origin.url https://gitbox.apache.org/repos/asf/maven-resolver.git # timeout=10
[linux-jdk8]  > git config --add remote.origin.fetch +refs/heads/*:refs/remotes/origin/* # timeout=10
[linux-jdk8]  > git config remote.origin.url https://gitbox.apache.org/repos/asf/maven-resolver.git # timeout=10
[linux-jdk8] Fetching without tags
[linux-jdk8] Fetching upstream changes from https://gitbox.apache.org/repos/asf/maven-resolver.git
[linux-jdk8]  > git fetch --no-tags --progress https://gitbox.apache.org/repos/asf/maven-resolver.git +refs/heads/*:refs/remotes/origin/*
[linux-jdk8] Checking out Revision f6afa8a48400ae2024d35675f0b2e8c3a7a0d683 (master)
[linux-jdk8]  > git config core.sparsecheckout # timeout=10
[linux-jdk8]  > git checkout -f f6afa8a48400ae2024d35675f0b2e8c3a7a0d683
[Pipeline] [linux-jdk8] }
[Pipeline] [linux-jdk8] // dir
[Pipeline] [linux-jdk8] cleanWs
[linux-jdk8] [WS-CLEANUP] Deleting project workspace...[WS-CLEANUP] done
[Pipeline] [linux-jdk8] }
[Pipeline] [linux-jdk8] // stage
[Pipeline] [linux-jdk8] }
[Pipeline] [linux-jdk8] // node
[linux-jdk9] Running on H33 in /home/jenkins/jenkins-slave/workspace/n-box_maven-resolver_master-L2RUGOEIK5O5H3FE4SPFSXXNL7FPE37KLTBGLDWAT7DNTIKVZVEQ
[Pipeline] [linux-jdk8] }
[linux-jdk8] Failed in branch linux-jdk8
[Pipeline] [linux-jdk9] {
[Pipeline] [linux-jdk9] stage
[Pipeline] [linux-jdk9] { (Checkout linux-jdk9)
[Pipeline] [linux-jdk9] dir
[linux-jdk9] Running in /home/jenkins/jenkins-slave/workspace/n-box_maven-resolver_master-L2RUGOEIK5O5H3FE4SPFSXXNL7FPE37KLTBGLDWAT7DNTIKVZVEQ/m
[Pipeline] [linux-jdk9] {
[Pipeline] [linux-jdk9] checkout
[linux-jdk9] Cloning the remote Git repository
[linux-jdk9] Cloning with configured refspecs honoured and without tags
[linux-jdk9] Cloning repository https://gitbox.apache.org/repos/asf/maven-resolver.git
[linux-jdk9]  > git init /home/jenkins/jenkins-slave/workspace/n-box_maven-resolver_master-L2RUGOEIK5O5H3FE4SPFSXXNL7FPE37KLTBGLDWAT7DNTIKVZVEQ/m # timeout=10
[linux-jdk9] Fetching upstream changes from https://gitbox.apache.org/repos/asf/maven-resolver.git
[linux-jdk9]  > git --version # timeout=10
[linux-jdk9]  > git fetch --no-tags --progress https://gitbox.apache.org/repos/asf/maven-resolver.git +refs/heads/*:refs/remotes/origin/*
[linux-jdk9]  > git config remote.origin.url https://gitbox.apache.org/repos/asf/maven-resolver.git # timeout=10
[linux-jdk9]  > git config --add remote.origin.fetch +refs/heads/*:refs/remotes/origin/* # timeout=10
[linux-jdk9]  > git config remote.origin.url https://gitbox.apache.org/repos/asf/maven-resolver.git # timeout=10
[linux-jdk9] Fetching without tags
[linux-jdk9] Fetching upstream changes from https://gitbox.apache.org/repos/asf/maven-resolver.git
[linux-jdk9]  > git fetch --no-tags --progress https://gitbox.apache.org/repos/asf/maven-resolver.git +refs/heads/*:refs/remotes/origin/*
[linux-jdk9] Checking out Revision f6afa8a48400ae2024d35675f0b2e8c3a7a0d683 (master)
[linux-jdk9]  > git config core.sparsecheckout # timeout=10
[linux-jdk9]  > git checkout -f f6afa8a48400ae2024d35675f0b2e8c3a7a0d683
[Pipeline] [linux-jdk9] }
[Pipeline] [linux-jdk9] // dir
[Pipeline] [linux-jdk9] cleanWs
[linux-jdk9] [WS-CLEANUP] Deleting project workspace...[WS-CLEANUP] done
[Pipeline] [linux-jdk9] }
[Pipeline] [linux-jdk9] // stage
[Pipeline] [linux-jdk9] }
[Pipeline] [linux-jdk9] // node
[linux-jdk10] Running on H33 in /home/jenkins/jenkins-slave/workspace/n-box_maven-resolver_master-L2RUGOEIK5O5H3FE4SPFSXXNL7FPE37KLTBGLDWAT7DNTIKVZVEQ
[Pipeline] [linux-jdk9] }
[linux-jdk9] Failed in branch linux-jdk9
[Pipeline] [linux-jdk10] {
[Pipeline] [linux-jdk10] stage
[Pipeline] [linux-jdk10] { (Checkout linux-jdk10)
[Pipeline] [linux-jdk10] dir
[linux-jdk10] Running in /home/jenkins/jenkins-slave/workspace/n-box_maven-resolver_master-L2RUGOEIK5O5H3FE4SPFSXXNL7FPE37KLTBGLDWAT7DNTIKVZVEQ/m
[Pipeline] [linux-jdk10] {
[Pipeline] [linux-jdk10] checkout
[linux-jdk10] Cloning the remote Git repository
[linux-jdk10] Cloning with configured refspecs honoured and without tags
[linux-jdk10] Cloning repository https://gitbox.apache.org/repos/asf/maven-resolver.git
[linux-jdk10]  > git init /home/jenkins/jenkins-slave/workspace/n-box_maven-resolver_master-L2RUGOEIK5O5H3FE4SPFSXXNL7FPE37KLTBGLDWAT7DNTIKVZVEQ/m # timeout=10
[linux-jdk10] Fetching upstream changes from https://gitbox.apache.org/repos/asf/maven-resolver.git
[linux-jdk10]  > git --version # timeout=10
[linux-jdk10]  > git fetch --no-tags --progress https://gitbox.apache.org/repos/asf/maven-resolver.git +refs/heads/*:refs/remotes/origin/*
[linux-jdk10]  > git config remote.origin.url https://gitbox.apache.org/repos/asf/maven-resolver.git # timeout=10
[linux-jdk10]  > git config --add remote.origin.fetch +refs/heads/*:refs/remotes/origin/* # timeout=10
[linux-jdk10]  > git config remote.origin.url https://gitbox.apache.org/repos/asf/maven-resolver.git # timeout=10
[linux-jdk10] Fetching without tags
[linux-jdk10] Fetching upstream changes from https://gitbox.apache.org/repos/asf/maven-resolver.git
[linux-jdk10]  > git fetch --no-tags --progress https://gitbox.apache.org/repos/asf/maven-resolver.git +refs/heads/*:refs/remotes/origin/*
[linux-jdk10] Checking out Revision f6afa8a48400ae2024d35675f0b2e8c3a7a0d683 (master)
[linux-jdk10]  > git config core.sparsecheckout # timeout=10
[linux-jdk10]  > git checkout -f f6afa8a48400ae2024d35675f0b2e8c3a7a0d683
[Pipeline] [linux-jdk10] }
[Pipeline] [linux-jdk10] // dir
[Pipeline] [linux-jdk10] cleanWs
[linux-jdk10] [WS-CLEANUP] Deleting project workspace...[WS-CLEANUP] done
[Pipeline] [linux-jdk10] }
[Pipeline] [linux-jdk10] // stage
[Pipeline] [linux-jdk10] }
[Pipeline] [linux-jdk10] // node
[Pipeline] [linux-jdk10] }
[linux-jdk10] Failed in branch linux-jdk10
[Pipeline] // parallel
[Pipeline] stage
[Pipeline] { (Notifications)
[Pipeline] echo
Build result: FAILURE
[Pipeline] jiraIssueSelector
[Pipeline] emailext
Reply | Threaded
Open this post in threaded view
|

Build succeeded in Jenkins: Maven TLP » maven-resolver » master #35

Apache Jenkins Server-2