Build failed in Jenkins: Maven TLP » maven-resolver-ant-tasks » master #4

Previous Topic Next Topic
 
classic Classic list List threaded Threaded
1 message Options
Reply | Threaded
Open this post in threaded view
|

Build failed in Jenkins: Maven TLP » maven-resolver-ant-tasks » master #4

Apache Jenkins Server-2
See https://builds.apache.org/job/maven-box/job/maven-resolver-ant-tasks/job/master/4/

Changes:

* No need to collect findbugs etc on anything other than the first
* syntax
* syntax again
* Allow 'jdk' or 'jdks'
* Better report collection optimization
* syntax ftw
* syntax take 5
* build the command line in more extensible way
* Aha\! first was being evaluated after adding the task
* capture another

All tests passed

Build log:
[...truncated 1.53 MB...]
[linux-jdk9] [INFO] Downloading from central: https://repo.maven.apache.org/maven2/org/apache/maven/wagon/wagon-provider-api/1.0-beta-6/wagon-provider-api-1.0-beta-6.jar
[linux-jdk9] [INFO] Downloading from central: https://repo.maven.apache.org/maven2/org/ow2/asm/asm-commons/5.0.2/asm-commons-5.0.2.jar
[linux-jdk9] [INFO] Downloading from central: https://repo.maven.apache.org/maven2/org/ow2/asm/asm-tree/5.0.2/asm-tree-5.0.2.jar
[linux-jdk9] [INFO] Downloaded from central: https://repo.maven.apache.org/maven2/org/apache/maven/wagon/wagon-provider-api/1.0-beta-6/wagon-provider-api-1.0-beta-6.jar (53 kB at 4.1 MB/s)
[linux-jdk9] [INFO] Downloading from central: https://repo.maven.apache.org/maven2/org/jdom/jdom/1.1/jdom-1.1.jar
[linux-jdk9] [INFO] Downloaded from central: https://repo.maven.apache.org/maven2/org/ow2/asm/asm-tree/5.0.2/asm-tree-5.0.2.jar (29 kB at 2.1 MB/s)
[linux-jdk9] [INFO] Downloading from central: https://repo.maven.apache.org/maven2/org/vafer/jdependency/1.1/jdependency-1.1.jar
[linux-jdk9] [INFO] Downloaded from central: https://repo.maven.apache.org/maven2/org/ow2/asm/asm/5.0.2/asm-5.0.2.jar (53 kB at 3.8 MB/s)
[linux-jdk9] [INFO] Downloading from central: https://repo.maven.apache.org/maven2/org/ow2/asm/asm-analysis/5.0.4/asm-analysis-5.0.4.jar
[linux-jdk9] [INFO] Downloaded from central: https://repo.maven.apache.org/maven2/org/ow2/asm/asm-commons/5.0.2/asm-commons-5.0.2.jar (42 kB at 2.8 MB/s)
[linux-jdk9] [INFO] Downloading from central: https://repo.maven.apache.org/maven2/org/ow2/asm/asm-util/5.0.4/asm-util-5.0.4.jar
[linux-jdk9] [INFO] Downloaded from central: https://repo.maven.apache.org/maven2/org/apache/maven/maven-compat/3.0/maven-compat-3.0.jar (285 kB at 15 MB/s)
[linux-jdk9] [INFO] Downloading from central: https://repo.maven.apache.org/maven2/com/google/guava/guava/11.0.2/guava-11.0.2.jar
[linux-jdk9] [INFO] Downloaded from central: https://repo.maven.apache.org/maven2/org/ow2/asm/asm-analysis/5.0.4/asm-analysis-5.0.4.jar (20 kB at 818 kB/s)
[linux-jdk9] [INFO] Downloaded from central: https://repo.maven.apache.org/maven2/org/vafer/jdependency/1.1/jdependency-1.1.jar (22 kB at 881 kB/s)
[linux-jdk9] [INFO] Downloading from central: https://repo.maven.apache.org/maven2/com/google/code/findbugs/jsr305/1.3.9/jsr305-1.3.9.jar
[linux-jdk9] [INFO] Downloaded from central: https://repo.maven.apache.org/maven2/org/ow2/asm/asm-util/5.0.4/asm-util-5.0.4.jar (43 kB at 1.6 MB/s)
[linux-jdk9] [INFO] Downloaded from central: https://repo.maven.apache.org/maven2/org/jdom/jdom/1.1/jdom-1.1.jar (153 kB at 5.3 MB/s)
[linux-jdk9] [INFO] Downloaded from central: https://repo.maven.apache.org/maven2/com/google/code/findbugs/jsr305/1.3.9/jsr305-1.3.9.jar (33 kB at 892 kB/s)
[linux-jdk9] [INFO] Downloaded from central: https://repo.maven.apache.org/maven2/com/google/guava/guava/11.0.2/guava-11.0.2.jar (1.6 MB at 27 MB/s)
[linux-jdk9] [INFO] Including org.apache.maven.resolver:maven-resolver-api:jar:1.1.0 in the shaded jar.
[linux-jdk9] [INFO] Including org.apache.maven.resolver:maven-resolver-util:jar:1.1.0 in the shaded jar.
[linux-jdk9] [INFO] Including org.apache.maven.resolver:maven-resolver-impl:jar:1.1.0 in the shaded jar.
[linux-jdk9] [INFO] Including org.apache.maven.resolver:maven-resolver-spi:jar:1.1.0 in the shaded jar.
[linux-jdk9] [INFO] Including org.apache.maven.resolver:maven-resolver-connector-basic:jar:1.1.0 in the shaded jar.
[linux-jdk9] [INFO] Including org.apache.maven.resolver:maven-resolver-transport-classpath:jar:1.1.0 in the shaded jar.
[linux-jdk9] [INFO] Including org.apache.maven.resolver:maven-resolver-transport-file:jar:1.1.0 in the shaded jar.
[linux-jdk9] [INFO] Including org.apache.maven.resolver:maven-resolver-transport-http:jar:1.1.0 in the shaded jar.
[linux-jdk9] [INFO] Including org.apache.httpcomponents:httpclient:jar:4.5.3 in the shaded jar.
[linux-jdk9] [INFO] Including commons-codec:commons-codec:jar:1.9 in the shaded jar.
[linux-jdk9] [INFO] Including org.apache.httpcomponents:httpcore:jar:4.4.6 in the shaded jar.
[linux-jdk9] [INFO] Including org.slf4j:jcl-over-slf4j:jar:1.7.25 in the shaded jar.
[linux-jdk9] [INFO] Including org.slf4j:slf4j-nop:jar:1.6.2 in the shaded jar.
[linux-jdk9] [INFO] Including org.slf4j:slf4j-api:jar:1.6.2 in the shaded jar.
[linux-jdk9] [INFO] Including org.apache.maven:maven-resolver-provider:jar:3.5.0 in the shaded jar.
[linux-jdk9] [INFO] Including org.apache.maven:maven-model:jar:3.5.0 in the shaded jar.
[linux-jdk9] [INFO] Including org.apache.maven:maven-model-builder:jar:3.5.0 in the shaded jar.
[linux-jdk9] [INFO] Including org.apache.maven:maven-artifact:jar:3.5.0 in the shaded jar.
[linux-jdk9] [INFO] Including com.google.guava:guava:jar:20.0 in the shaded jar.
[linux-jdk9] [INFO] Including org.apache.maven:maven-repository-metadata:jar:3.5.0 in the shaded jar.
[linux-jdk9] [INFO] Including org.codehaus.plexus:plexus-utils:jar:3.0.24 in the shaded jar.
[linux-jdk9] [INFO] Including org.apache.commons:commons-lang3:jar:3.5 in the shaded jar.
[linux-jdk9] [INFO] Including org.apache.maven:maven-settings-builder:jar:3.5.0 in the shaded jar.
[linux-jdk9] [INFO] Including org.apache.maven:maven-builder-support:jar:3.5.0 in the shaded jar.
[linux-jdk9] [INFO] Including org.apache.maven:maven-settings:jar:3.5.0 in the shaded jar.
[linux-jdk9] [INFO] Including org.sonatype.plexus:plexus-sec-dispatcher:jar:1.4 in the shaded jar.
[linux-jdk9] [INFO] Including org.sonatype.plexus:plexus-cipher:jar:1.7 in the shaded jar.
[linux-jdk9] [INFO] Including org.codehaus.plexus:plexus-interpolation:jar:1.16 in the shaded jar.
[linux-jdk9] [INFO] Including org.eclipse.sisu:org.eclipse.sisu.plexus:jar:0.1.1 in the shaded jar.
[linux-jdk9] [INFO] Attaching shaded artifact.
[linux-jdk9] [INFO]
[linux-jdk9] [INFO] --- maven-antrun-plugin:1.6:run (smoke-test) @ maven-resolver-ant-tasks ---
[linux-jdk9] [INFO] Downloading from central: https://repo.maven.apache.org/maven2/org/apache/ant/ant-junit/1.8.2/ant-junit-1.8.2.pom
[linux-jdk9] [INFO] Downloaded from central: https://repo.maven.apache.org/maven2/org/apache/ant/ant-junit/1.8.2/ant-junit-1.8.2.pom (4.1 kB at 254 kB/s)
[linux-jdk9] [INFO] Downloading from central: https://repo.maven.apache.org/maven2/org/apache/maven/maven-plugin-api/2.0.11/maven-plugin-api-2.0.11.pom
[linux-jdk9] [INFO] Downloaded from central: https://repo.maven.apache.org/maven2/org/apache/maven/maven-plugin-api/2.0.11/maven-plugin-api-2.0.11.pom (1.5 kB at 133 kB/s)
[linux-jdk9] [INFO] Downloading from central: https://repo.maven.apache.org/maven2/org/apache/maven/maven/2.0.11/maven-2.0.11.pom
[linux-jdk9] [INFO] Downloaded from central: https://repo.maven.apache.org/maven2/org/apache/maven/maven/2.0.11/maven-2.0.11.pom (22 kB at 1.8 MB/s)
[linux-jdk9] [INFO] Downloading from central: https://repo.maven.apache.org/maven2/org/apache/maven/maven-parent/12/maven-parent-12.pom
[linux-jdk9] [INFO] Downloaded from central: https://repo.maven.apache.org/maven2/org/apache/maven/maven-parent/12/maven-parent-12.pom (22 kB at 1.8 MB/s)
[linux-jdk9] [INFO] Downloading from central: https://repo.maven.apache.org/maven2/org/apache/maven/maven-project/2.0.11/maven-project-2.0.11.pom
[linux-jdk9] [INFO] Downloaded from central: https://repo.maven.apache.org/maven2/org/apache/maven/maven-project/2.0.11/maven-project-2.0.11.pom (2.8 kB at 278 kB/s)
[linux-jdk9] [INFO] Downloading from central: https://repo.maven.apache.org/maven2/org/apache/maven/maven-settings/2.0.11/maven-settings-2.0.11.pom
[linux-jdk9] [INFO] Downloaded from central: https://repo.maven.apache.org/maven2/org/apache/maven/maven-settings/2.0.11/maven-settings-2.0.11.pom (2.2 kB at 218 kB/s)
[linux-jdk9] [INFO] Downloading from central: https://repo.maven.apache.org/maven2/org/apache/maven/maven-model/2.0.11/maven-model-2.0.11.pom
[linux-jdk9] [INFO] Downloaded from central: https://repo.maven.apache.org/maven2/org/apache/maven/maven-model/2.0.11/maven-model-2.0.11.pom (3.2 kB at 295 kB/s)
[linux-jdk9] [INFO] Downloading from central: https://repo.maven.apache.org/maven2/org/codehaus/plexus/plexus-utils/1.5.6/plexus-utils-1.5.6.pom
[linux-jdk9] [INFO] Downloaded from central: https://repo.maven.apache.org/maven2/org/codehaus/plexus/plexus-utils/1.5.6/plexus-utils-1.5.6.pom (5.3 kB at 482 kB/s)
[linux-jdk9] [INFO] Downloading from central: https://repo.maven.apache.org/maven2/org/codehaus/plexus/plexus/1.0.12/plexus-1.0.12.pom
[linux-jdk9] [INFO] Downloaded from central: https://repo.maven.apache.org/maven2/org/codehaus/plexus/plexus/1.0.12/plexus-1.0.12.pom (9.8 kB at 980 kB/s)
[linux-jdk9] [INFO] Downloading from central: https://repo.maven.apache.org/maven2/org/codehaus/plexus/plexus-interpolation/1.1/plexus-interpolation-1.1.pom
[linux-jdk9] [INFO] Downloaded from central: https://repo.maven.apache.org/maven2/org/codehaus/plexus/plexus-interpolation/1.1/plexus-interpolation-1.1.pom (1.4 kB at 144 kB/s)
[linux-jdk9] [INFO] Downloading from central: https://repo.maven.apache.org/maven2/org/apache/maven/maven-profile/2.0.11/maven-profile-2.0.11.pom
[linux-jdk9] [INFO] Downloaded from central: https://repo.maven.apache.org/maven2/org/apache/maven/maven-profile/2.0.11/maven-profile-2.0.11.pom (2.0 kB at 186 kB/s)
[linux-jdk9] [INFO] Downloading from central: https://repo.maven.apache.org/maven2/org/apache/maven/maven-artifact-manager/2.0.11/maven-artifact-manager-2.0.11.pom
[linux-jdk9] [INFO] Downloaded from central: https://repo.maven.apache.org/maven2/org/apache/maven/maven-artifact-manager/2.0.11/maven-artifact-manager-2.0.11.pom (2.6 kB at 239 kB/s)
[linux-jdk9] [INFO] Downloading from central: https://repo.maven.apache.org/maven2/org/apache/maven/maven-repository-metadata/2.0.11/maven-repository-metadata-2.0.11.pom
[linux-jdk9] [INFO] Downloaded from central: https://repo.maven.apache.org/maven2/org/apache/maven/maven-repository-metadata/2.0.11/maven-repository-metadata-2.0.11.pom (2.3 kB at 205 kB/s)
[linux-jdk9] [INFO] Downloading from central: https://repo.maven.apache.org/maven2/org/apache/maven/maven-artifact/2.0.11/maven-artifact-2.0.11.pom
[linux-jdk9] [INFO] Downloaded from central: https://repo.maven.apache.org/maven2/org/apache/maven/maven-artifact/2.0.11/maven-artifact-2.0.11.pom (1.6 kB at 144 kB/s)
[linux-jdk9] [INFO] Downloading from central: https://repo.maven.apache.org/maven2/org/apache/maven/maven-plugin-registry/2.0.11/maven-plugin-registry-2.0.11.pom
[linux-jdk9] [INFO] Downloaded from central: https://repo.maven.apache.org/maven2/org/apache/maven/maven-plugin-registry/2.0.11/maven-plugin-registry-2.0.11.pom (1.9 kB at 193 kB/s)
[linux-jdk9] [INFO] Downloading from central: https://repo.maven.apache.org/maven2/org/apache/ant/ant-nodeps/1.8.1/ant-nodeps-1.8.1.pom
[linux-jdk9] [INFO] Downloaded from central: https://repo.maven.apache.org/maven2/org/apache/ant/ant-nodeps/1.8.1/ant-nodeps-1.8.1.pom (4.8 kB at 482 kB/s)
[linux-jdk9] [INFO] Downloading from central: https://repo.maven.apache.org/maven2/org/apache/ant/ant-parent/1.8.1/ant-parent-1.8.1.pom
[linux-jdk9] [INFO] Downloaded from central: https://repo.maven.apache.org/maven2/org/apache/ant/ant-parent/1.8.1/ant-parent-1.8.1.pom (4.3 kB at 428 kB/s)
[linux-jdk9] [INFO] Downloading from central: https://repo.maven.apache.org/maven2/org/apache/ant/ant/1.8.1/ant-1.8.1.pom
[linux-jdk9] [INFO] Downloaded from central: https://repo.maven.apache.org/maven2/org/apache/ant/ant/1.8.1/ant-1.8.1.pom (8.8 kB at 800 kB/s)
[linux-jdk9] [INFO] Downloading from central: https://repo.maven.apache.org/maven2/org/apache/ant/ant-launcher/1.8.1/ant-launcher-1.8.1.pom
[linux-jdk9] [INFO] Downloaded from central: https://repo.maven.apache.org/maven2/org/apache/ant/ant-launcher/1.8.1/ant-launcher-1.8.1.pom (2.4 kB at 217 kB/s)
[linux-jdk9] [INFO] Downloading from central: https://repo.maven.apache.org/maven2/org/apache/ant/ant-junit/1.8.2/ant-junit-1.8.2.jar
[linux-jdk9] [INFO] Downloading from central: https://repo.maven.apache.org/maven2/org/apache/maven/maven-plugin-api/2.0.11/maven-plugin-api-2.0.11.jar
[linux-jdk9] [INFO] Downloading from central: https://repo.maven.apache.org/maven2/org/apache/maven/maven-project/2.0.11/maven-project-2.0.11.jar
[linux-jdk9] [INFO] Downloading from central: https://repo.maven.apache.org/maven2/org/apache/maven/maven-settings/2.0.11/maven-settings-2.0.11.jar
[linux-jdk9] [INFO] Downloading from central: https://repo.maven.apache.org/maven2/org/apache/maven/maven-profile/2.0.11/maven-profile-2.0.11.jar
[linux-jdk9] [INFO] Downloaded from central: https://repo.maven.apache.org/maven2/org/apache/ant/ant-junit/1.8.2/ant-junit-1.8.2.jar (102 kB at 6.8 MB/s)
[linux-jdk9] [INFO] Downloading from central: https://repo.maven.apache.org/maven2/org/apache/maven/maven-model/2.0.11/maven-model-2.0.11.jar
[linux-jdk9] [INFO] Downloaded from central: https://repo.maven.apache.org/maven2/org/apache/maven/maven-plugin-api/2.0.11/maven-plugin-api-2.0.11.jar (13 kB at 727 kB/s)
[linux-jdk9] [INFO] Downloading from central: https://repo.maven.apache.org/maven2/org/apache/maven/maven-artifact-manager/2.0.11/maven-artifact-manager-2.0.11.jar
[linux-jdk9] [INFO] Downloaded from central: https://repo.maven.apache.org/maven2/org/apache/maven/maven-project/2.0.11/maven-project-2.0.11.jar (123 kB at 6.9 MB/s)
[linux-jdk9] [INFO] Downloading from central: https://repo.maven.apache.org/maven2/org/apache/maven/maven-repository-metadata/2.0.11/maven-repository-metadata-2.0.11.jar
[linux-jdk9] [INFO] Downloaded from central: https://repo.maven.apache.org/maven2/org/apache/maven/maven-profile/2.0.11/maven-profile-2.0.11.jar (37 kB at 2.1 MB/s)
[linux-jdk9] [INFO] Downloading from central: https://repo.maven.apache.org/maven2/org/apache/maven/maven-plugin-registry/2.0.11/maven-plugin-registry-2.0.11.jar
[linux-jdk9] [INFO] Downloaded from central: https://repo.maven.apache.org/maven2/org/apache/maven/maven-settings/2.0.11/maven-settings-2.0.11.jar (51 kB at 2.6 MB/s)
[linux-jdk9] [INFO] Downloading from central: https://repo.maven.apache.org/maven2/org/codehaus/plexus/plexus-interpolation/1.1/plexus-interpolation-1.1.jar
[linux-jdk9] [INFO] Downloaded from central: https://repo.maven.apache.org/maven2/org/apache/maven/maven-model/2.0.11/maven-model-2.0.11.jar (97 kB at 3.9 MB/s)
[linux-jdk9] [INFO] Downloading from central: https://repo.maven.apache.org/maven2/org/apache/maven/maven-artifact/2.0.11/maven-artifact-2.0.11.jar
[linux-jdk9] [INFO] Downloaded from central: https://repo.maven.apache.org/maven2/org/apache/maven/maven-artifact-manager/2.0.11/maven-artifact-manager-2.0.11.jar (58 kB at 2.2 MB/s)
[linux-jdk9] [INFO] Downloading from central: https://repo.maven.apache.org/maven2/org/codehaus/plexus/plexus-utils/2.0.5/plexus-utils-2.0.5.jar
[linux-jdk9] [INFO] Downloaded from central: https://repo.maven.apache.org/maven2/org/apache/maven/maven-repository-metadata/2.0.11/maven-repository-metadata-2.0.11.jar (26 kB at 905 kB/s)
[linux-jdk9] [INFO] Downloading from central: https://repo.maven.apache.org/maven2/org/apache/ant/ant-nodeps/1.8.1/ant-nodeps-1.8.1.jar
[linux-jdk9] [INFO] Downloaded from central: https://repo.maven.apache.org/maven2/org/apache/maven/maven-plugin-registry/2.0.11/maven-plugin-registry-2.0.11.jar (31 kB at 1.1 MB/s)
[linux-jdk9] [INFO] Downloaded from central: https://repo.maven.apache.org/maven2/org/codehaus/plexus/plexus-interpolation/1.1/plexus-interpolation-1.1.jar (35 kB at 1.2 MB/s)
[linux-jdk9] [INFO] Downloaded from central: https://repo.maven.apache.org/maven2/org/apache/maven/maven-artifact/2.0.11/maven-artifact-2.0.11.jar (90 kB at 2.3 MB/s)
[linux-jdk9] [INFO] Downloaded from central: https://repo.maven.apache.org/maven2/org/codehaus/plexus/plexus-utils/2.0.5/plexus-utils-2.0.5.jar (223 kB at 5.0 MB/s)
[linux-jdk9] [INFO] Downloaded from central: https://repo.maven.apache.org/maven2/org/apache/ant/ant-nodeps/1.8.1/ant-nodeps-1.8.1.jar (409 kB at 7.9 MB/s)
[linux-jdk9] [INFO] Executing tasks
[linux-jdk9]
[linux-jdk9] main:
[linux-jdk9]   [taskdef] Could not load definitions from resource org/apache/maven/resolver/ant/antlib.xml. It could not be found.
[linux-jdk9] [INFO] ------------------------------------------------------------------------
[linux-jdk9] [INFO] BUILD FAILURE
[linux-jdk9] [INFO] ------------------------------------------------------------------------
[linux-jdk9] [INFO] Total time: 25.989 s
[linux-jdk9] [INFO] Finished at: 2017-12-02T11:44:08Z
[windows-jdk7] [INFO] Executing tasks
[windows-jdk7]
[windows-jdk7] main:
[windows-jdk7]   [taskdef] Could not load definitions from resource org/apache/maven/resolver/ant/antlib.xml. It could not be found.
[windows-jdk7] [INFO] ------------------------------------------------------------------------
[windows-jdk7] [INFO] BUILD FAILURE
[windows-jdk7] [INFO] ------------------------------------------------------------------------
[windows-jdk7] [INFO] Total time: 35.227 s
[windows-jdk7] [INFO] Finished at: 2017-12-02T11:44:07Z
[windows-jdk7] [INFO] Final Memory: 50M/1170M
[windows-jdk7] [INFO] ------------------------------------------------------------------------
[windows-jdk7] [jenkins-maven-event-spy] INFO generated F:\jenkins\jenkins-slave\workspace\n-resolver-ant-tasks_master-PZI36OPNRAJBXJOAPEQN5EKT3YVHZTR3KX72Y4FQGBMQE6GFTARQ@tmp\withMaven6e020a77\maven-spy-20171202-114331-8416967631427767155109.log
[windows-jdk7] [ERROR] Failed to execute goal org.apache.maven.plugins:maven-antrun-plugin:1.6:run (smoke-test) on project maven-resolver-ant-tasks: An Ant BuildException has occured: The following error occurred while executing this line:
[windows-jdk7] [ERROR] f:\jenkins\jenkins-slave\workspace\n-resolver-ant-tasks_master-PZI36OPNRAJBXJOAPEQN5EKT3YVHZTR3KX72Y4FQGBMQE6GFTARQ\m\build.xml:38: Problem: failed to create task or type antlib:org.apache.maven.resolver.ant:localrepo
[windows-jdk7] [ERROR] Cause: The name is undefined.
[windows-jdk7] [ERROR] Action: Check the spelling.
[windows-jdk7] [ERROR] Action: Check that any custom tasks/types have been declared.
[windows-jdk7] [ERROR] Action: Check that any <presetdef>/<macrodef> declarations have taken place.
[windows-jdk7] [ERROR] No types or tasks have been defined in this namespace yet
[windows-jdk7] [ERROR]
[windows-jdk7] [ERROR] This appears to be an antlib declaration.
[windows-jdk7] [ERROR] Action: Check that the implementing library exists in one of:
[windows-jdk7] [ERROR]         -ANT_HOME\lib
[windows-jdk7] [ERROR]         -the IDE Ant configuration dialogs
[windows-jdk7] [ERROR] -> [Help 1]
[windows-jdk7] [ERROR]
[windows-jdk7] [ERROR] To see the full stack trace of the errors, re-run Maven with the -e switch.
[windows-jdk7] [ERROR] Re-run Maven using the -X switch to enable full debug logging.
[windows-jdk7] [ERROR]
[windows-jdk7] [ERROR] For more information about the errors and possible solutions, please read the following articles:
[windows-jdk7] [ERROR] [Help 1] http://cwiki.apache.org/confluence/display/MAVEN/MojoExecutionException
[windows-jdk7] Picked up JAVA_TOOL_OPTIONS: -Dmaven.ext.class.path="f:\jenkins\jenkins-slave\workspace\n-resolver-ant-tasks_master-PZI36OPNRAJBXJOAPEQN5EKT3YVHZTR3KX72Y4FQGBMQE6GFTARQ@tmp\withMaven6e020a77\pipeline-maven-spy.jar" -Dorg.jenkinsci.plugins.pipeline.maven.reportsFolder="f:\jenkins\jenkins-slave\workspace\n-resolver-ant-tasks_master-PZI36OPNRAJBXJOAPEQN5EKT3YVHZTR3KX72Y4FQGBMQE6GFTARQ@tmp\withMaven6e020a77"
[linux-jdk8] Sending interrupt signal to process
[linux-jdk9] [INFO] Final Memory: 44M/144M
[linux-jdk9] [INFO] ------------------------------------------------------------------------
[linux-jdk9] [jenkins-maven-event-spy] INFO generated /home/jenkins/jenkins-slave/workspace/n-resolver-ant-tasks_master-PZI36OPNRAJBXJOAPEQN5EKT3YVHZTR3KX72Y4FQGBMQE6GFTARQ@tmp/withMavenc64e87d9/maven-spy-20171202-114342-46514381952326243038930.log
[linux-jdk9] [ERROR] Failed to execute goal org.apache.maven.plugins:maven-antrun-plugin:1.6:run (smoke-test) on project maven-resolver-ant-tasks: An Ant BuildException has occured: The following error occurred while executing this line:
[linux-jdk9] [ERROR] /home/jenkins/jenkins-slave/workspace/n-resolver-ant-tasks_master-PZI36OPNRAJBXJOAPEQN5EKT3YVHZTR3KX72Y4FQGBMQE6GFTARQ/m/build.xml:38: Problem: failed to create task or type antlib:org.apache.maven.resolver.ant:localrepo
[linux-jdk9] [ERROR] Cause: The name is undefined.
[linux-jdk9] [ERROR] Action: Check the spelling.
[linux-jdk9] [ERROR] Action: Check that any custom tasks/types have been declared.
[linux-jdk9] [ERROR] Action: Check that any <presetdef>/<macrodef> declarations have taken place.
[linux-jdk9] [ERROR] No types or tasks have been defined in this namespace yet
[linux-jdk9] [ERROR]
[linux-jdk9] [ERROR] This appears to be an antlib declaration.
[linux-jdk9] [ERROR] Action: Check that the implementing library exists in one of:
[linux-jdk9] [ERROR]         -ANT_HOME/lib
[linux-jdk9] [ERROR]         -the IDE Ant configuration dialogs
[linux-jdk9] [ERROR] -> [Help 1]
[linux-jdk9] [ERROR]
[linux-jdk9] [ERROR] To see the full stack trace of the errors, re-run Maven with the -e switch.
[linux-jdk9] [ERROR] Re-run Maven using the -X switch to enable full debug logging.
[linux-jdk9] [ERROR]
[linux-jdk9] [ERROR] For more information about the errors and possible solutions, please read the following articles:
[linux-jdk9] [ERROR] [Help 1] http://cwiki.apache.org/confluence/display/MAVEN/MojoExecutionException
[linux-jdk9] Sending interrupt signal to process
[windows-jdk7] Sending interrupt signal to process
[Pipeline] [windows-jdk9] }
[Pipeline] [windows-jdk9] // node
[Pipeline] [windows-jdk9] }
[windows-jdk9] Failed in branch windows-jdk9
[Pipeline] [windows-jdk7] }
[Pipeline] [linux-jdk7] }
[Pipeline] [linux-jdk8] }
[Pipeline] [linux-jdk9] }
[Pipeline] [windows-jdk7] // dir
[Pipeline] [linux-jdk7] // dir
[Pipeline] [linux-jdk8] // dir
[Pipeline] [linux-jdk9] // dir
[Pipeline] [windows-jdk7] }
[windows-jdk7] [withMaven] Skip 'Generated Artifacts Publisher' disabled by configuration
[windows-jdk7] [withMaven] junitPublisher - Archive test results for Maven artifact org.apache.maven.resolver:maven-resolver-ant-tasks:1.1.0-SNAPSHOT generated by maven-surefire-plugin:test (default-test): m\target\surefire-reports\*.xml
[windows-jdk7] [withMaven] junitPublisher - Jenkins JUnit Attachments Plugin not found, can't publish test attachments.Recording test results
[windows-jdk7] [withMaven] Skip 'Findbugs Publisher' disabled by configuration
[windows-jdk7] [withMaven] Skip 'Open Task Scanner Publisher' disabled by configuration
[Pipeline] [linux-jdk7] }
[linux-jdk7] [withMaven] One or multiple Maven executions have been ignored by the Jenkins Pipeline Maven Plugin because they have been interrupted before completion (1). See Pipeline Maven Plugin FAQ for more details.
[Pipeline] [linux-jdk8] }
[linux-jdk8] [withMaven] Skip 'Generated Artifacts Publisher' disabled by configuration
[linux-jdk8] [withMaven] junitPublisher - Archive test results for Maven artifact org.apache.maven.resolver:maven-resolver-ant-tasks:1.1.0-SNAPSHOT generated by maven-surefire-plugin:test (default-test): m/target/surefire-reports/*.xml
[linux-jdk8] [withMaven] junitPublisher - Jenkins JUnit Attachments Plugin not found, can't publish test attachments.Recording test results
[linux-jdk8] [withMaven] Skip 'Findbugs Publisher' disabled by configuration
[linux-jdk8] [withMaven] Skip 'Open Task Scanner Publisher' disabled by configuration
[Pipeline] [linux-jdk9] }
[linux-jdk9] [withMaven] Skip 'Generated Artifacts Publisher' disabled by configuration
[linux-jdk9] [withMaven] junitPublisher - Archive test results for Maven artifact org.apache.maven.resolver:maven-resolver-ant-tasks:1.1.0-SNAPSHOT generated by maven-surefire-plugin:test (default-test): m/target/surefire-reports/*.xml
[linux-jdk9] [withMaven] junitPublisher - Jenkins JUnit Attachments Plugin not found, can't publish test attachments.Recording test results
[linux-jdk9] [withMaven] Skip 'Findbugs Publisher' disabled by configuration
[linux-jdk9] [withMaven] Skip 'Open Task Scanner Publisher' disabled by configuration
[Pipeline] [windows-jdk7] // withMaven
[Pipeline] [linux-jdk7] // withMaven
[Pipeline] [linux-jdk8] // withMaven
[Pipeline] [linux-jdk9] // withMaven
[Pipeline] [windows-jdk7] }
[Pipeline] [linux-jdk7] }
[Pipeline] [linux-jdk8] }
[Pipeline] [linux-jdk9] }
[Pipeline] [windows-jdk7] // stage
[Pipeline] [linux-jdk7] // stage
[Pipeline] [linux-jdk8] // stage
[Pipeline] [linux-jdk9] // stage
[Pipeline] [linux-jdk7] }
[Pipeline] [linux-jdk8] }
[Pipeline] [linux-jdk9] }
[Pipeline] [windows-jdk7] }
[Pipeline] [linux-jdk7] // node
[Pipeline] [linux-jdk8] // node
[Pipeline] [linux-jdk9] // node
[Pipeline] [windows-jdk7] // node
[Pipeline] [linux-jdk7] }
[linux-jdk7] Failed in branch linux-jdk7
[Pipeline] [linux-jdk8] }
[linux-jdk8] Failed in branch linux-jdk8
[Pipeline] [linux-jdk9] }
[linux-jdk9] Failed in branch linux-jdk9
[Pipeline] [windows-jdk7] }
[windows-jdk7] Failed in branch windows-jdk7
[Pipeline] // parallel
[Pipeline] stage
[Pipeline] { (Notifications)
[Pipeline] echo
Build result: FAILURE
[Pipeline] jiraIssueSelector
[Pipeline] emailext