Build failed in Jenkins: Maven TLP » maven-resolver-ant-tasks » master #22

classic Classic list List threaded Threaded
3 messages Options
Reply | Threaded
Open this post in threaded view
|

Build failed in Jenkins: Maven TLP » maven-resolver-ant-tasks » master #22

Apache Jenkins Server-2
See https://builds.apache.org/job/maven-box/job/maven-resolver-ant-tasks/job/master/22/

No changes.

All tests passed

Build log:
[...truncated 2.89 MB...]
[windows-jdk9] [resolver:resolve] Downloading http://repo1.maven.org/maven2/org/apache/maven/resolver/maven-resolver-transport-http/1.1.1/maven-resolver-transport-http-1.1.1.pom
[windows-jdk9] [resolver:resolve] Downloaded http://repo1.maven.org/maven2/org/apache/maven/resolver/maven-resolver-transport-http/1.1.1/maven-resolver-transport-http-1.1.1.pom (5 KB at 138.2 KB/sec)
[windows-jdk9] [resolver:resolve] Downloading http://repo1.maven.org/maven2/org/apache/httpcomponents/httpclient/4.5.4/httpclient-4.5.4.pom
[linux-jdk7] [WS-CLEANUP] Deleting project workspace...[WS-CLEANUP] done
[Pipeline] [linux-jdk7] }
[Pipeline] [linux-jdk7] // stage
[Pipeline] [linux-jdk7] }
[Pipeline] [linux-jdk7] // node
[windows-jdk9] [resolver:resolve] Downloaded http://repo1.maven.org/maven2/org/apache/httpcomponents/httpclient/4.5.4/httpclient-4.5.4.pom (7 KB at 164.6 KB/sec)
[windows-jdk9] [resolver:resolve] Downloading http://repo1.maven.org/maven2/org/apache/httpcomponents/httpcomponents-client/4.5.4/httpcomponents-client-4.5.4.pom
[windows-jdk9] [resolver:resolve] Downloaded http://repo1.maven.org/maven2/org/apache/httpcomponents/httpcomponents-client/4.5.4/httpcomponents-client-4.5.4.pom (16 KB at 521.6 KB/sec)
[windows-jdk9] [resolver:resolve] Downloading http://repo1.maven.org/maven2/org/apache/httpcomponents/httpcomponents-parent/10/httpcomponents-parent-10.pom
[windows-jdk9] [resolver:resolve] Downloaded http://repo1.maven.org/maven2/org/apache/httpcomponents/httpcomponents-parent/10/httpcomponents-parent-10.pom (33 KB at 912.9 KB/sec)
[windows-jdk9] [resolver:resolve] Downloading http://repo1.maven.org/maven2/org/apache/httpcomponents/httpcore/4.4.7/httpcore-4.4.7.pom
[windows-jdk9] [resolver:resolve] Downloaded http://repo1.maven.org/maven2/org/apache/httpcomponents/httpcore/4.4.7/httpcore-4.4.7.pom (5 KB at 142.7 KB/sec)
[windows-jdk9] [resolver:resolve] Downloading http://repo1.maven.org/maven2/org/apache/httpcomponents/httpcomponents-core/4.4.7/httpcomponents-core-4.4.7.pom
[windows-jdk9] [resolver:resolve] Downloaded http://repo1.maven.org/maven2/org/apache/httpcomponents/httpcomponents-core/4.4.7/httpcomponents-core-4.4.7.pom (14 KB at 420.1 KB/sec)
[windows-jdk9] [resolver:resolve] Downloading http://repo1.maven.org/maven2/org/apache/httpcomponents/project/8/project-8.pom
[windows-jdk9] [resolver:resolve] Downloaded http://repo1.maven.org/maven2/org/apache/httpcomponents/project/8/project-8.pom (35 KB at 1082.6 KB/sec)
[windows-jdk9] [resolver:resolve] Downloading http://repo1.maven.org/maven2/commons-codec/commons-codec/1.10/commons-codec-1.10.pom
[Pipeline] [linux-jdk7] }
[linux-jdk7] Failed in branch linux-jdk7
[windows-jdk9] [resolver:resolve] Downloaded http://repo1.maven.org/maven2/commons-codec/commons-codec/1.10/commons-codec-1.10.pom (12 KB at 365.7 KB/sec)
[windows-jdk9] [resolver:resolve] Downloading http://repo1.maven.org/maven2/org/apache/commons/commons-parent/35/commons-parent-35.pom
[windows-jdk9] [resolver:resolve] Downloaded http://repo1.maven.org/maven2/org/apache/commons/commons-parent/35/commons-parent-35.pom (57 KB at 2014.9 KB/sec)
[windows-jdk9] [resolver:resolve] Downloading http://repo1.maven.org/maven2/org/apache/apache/15/apache-15.pom
[windows-jdk9] [resolver:resolve] Downloaded http://repo1.maven.org/maven2/org/apache/apache/15/apache-15.pom (15 KB at 465.0 KB/sec)
[windows-jdk9] [resolver:resolve] Downloading http://repo1.maven.org/maven2/org/apache/httpcomponents/httpcore/4.4.8/httpcore-4.4.8.pom
[windows-jdk9] [resolver:resolve] Downloaded http://repo1.maven.org/maven2/org/apache/httpcomponents/httpcore/4.4.8/httpcore-4.4.8.pom (5 KB at 183.7 KB/sec)
[windows-jdk9] [resolver:resolve] Downloading http://repo1.maven.org/maven2/org/apache/httpcomponents/httpcomponents-core/4.4.8/httpcomponents-core-4.4.8.pom
[windows-jdk9] [resolver:resolve] Downloaded http://repo1.maven.org/maven2/org/apache/httpcomponents/httpcomponents-core/4.4.8/httpcomponents-core-4.4.8.pom (14 KB at 454.1 KB/sec)
[windows-jdk9] [resolver:resolve] Downloading http://repo1.maven.org/maven2/org/apache/httpcomponents/httpcomponents-parent/9/httpcomponents-parent-9.pom
[windows-jdk9] [resolver:resolve] Downloaded http://repo1.maven.org/maven2/org/apache/httpcomponents/httpcomponents-parent/9/httpcomponents-parent-9.pom (34 KB at 1043.6 KB/sec)
[windows-jdk9] [resolver:resolve] Downloading http://repo1.maven.org/maven2/org/slf4j/jcl-over-slf4j/1.7.25/jcl-over-slf4j-1.7.25.pom
[windows-jdk9] [resolver:resolve] Downloaded http://repo1.maven.org/maven2/org/slf4j/jcl-over-slf4j/1.7.25/jcl-over-slf4j-1.7.25.pom (959 B at 36.0 KB/sec)
[windows-jdk9] [resolver:resolve] Downloading http://repo1.maven.org/maven2/org/slf4j/slf4j-parent/1.7.25/slf4j-parent-1.7.25.pom
[windows-jdk9] [resolver:resolve] Downloaded http://repo1.maven.org/maven2/org/slf4j/slf4j-parent/1.7.25/slf4j-parent-1.7.25.pom (14 KB at 549.7 KB/sec)
[windows-jdk9] [resolver:resolve] Downloading http://repo1.maven.org/maven2/org/slf4j/slf4j-api/1.7.25/slf4j-api-1.7.25.pom
[windows-jdk9] [resolver:resolve] Downloaded http://repo1.maven.org/maven2/org/slf4j/slf4j-api/1.7.25/slf4j-api-1.7.25.pom (4 KB at 129.1 KB/sec)
[windows-jdk9] [resolver:resolve] Downloading http://repo1.maven.org/maven2/org/slf4j/slf4j-nop/1.6.2/slf4j-nop-1.6.2.pom
[windows-jdk9] [resolver:resolve] Downloaded http://repo1.maven.org/maven2/org/slf4j/slf4j-nop/1.6.2/slf4j-nop-1.6.2.pom (2 KB at 55.3 KB/sec)
[windows-jdk9] [resolver:resolve] Downloading http://repo1.maven.org/maven2/org/slf4j/slf4j-parent/1.6.2/slf4j-parent-1.6.2.pom
[windows-jdk9] [resolver:resolve] Downloaded http://repo1.maven.org/maven2/org/slf4j/slf4j-parent/1.6.2/slf4j-parent-1.6.2.pom (10 KB at 339.0 KB/sec)
[windows-jdk9] [resolver:resolve] Downloading http://repo1.maven.org/maven2/org/slf4j/slf4j-api/1.6.2/slf4j-api-1.6.2.pom
[windows-jdk9] [resolver:resolve] Downloaded http://repo1.maven.org/maven2/org/slf4j/slf4j-api/1.6.2/slf4j-api-1.6.2.pom (3 KB at 108.3 KB/sec)
[windows-jdk9] [resolver:resolve] Downloading http://repo1.maven.org/maven2/org/apache/maven/maven-resolver-provider/3.5.0/maven-resolver-provider-3.5.0.pom
[windows-jdk9] [resolver:resolve] Downloaded http://repo1.maven.org/maven2/org/apache/maven/maven-resolver-provider/3.5.0/maven-resolver-provider-3.5.0.pom (5 KB at 129.5 KB/sec)
[windows-jdk9] [resolver:resolve] Downloading http://repo1.maven.org/maven2/org/apache/maven/maven/3.5.0/maven-3.5.0.pom
[windows-jdk9] [resolver:resolve] Downloaded http://repo1.maven.org/maven2/org/apache/maven/maven/3.5.0/maven-3.5.0.pom (25 KB at 806.5 KB/sec)
[windows-jdk9] [resolver:resolve] Downloading http://repo1.maven.org/maven2/org/apache/maven/maven-parent/27/maven-parent-27.pom
[windows-jdk9] [resolver:resolve] Downloaded http://repo1.maven.org/maven2/org/apache/maven/maven-parent/27/maven-parent-27.pom (40 KB at 1135.9 KB/sec)
[windows-jdk9] [resolver:resolve] Downloading http://repo1.maven.org/maven2/org/apache/apache/17/apache-17.pom
[windows-jdk9] [resolver:resolve] Downloaded http://repo1.maven.org/maven2/org/apache/apache/17/apache-17.pom (16 KB at 560.0 KB/sec)
[windows-jdk9] [resolver:resolve] Downloading http://repo1.maven.org/maven2/org/apache/maven/maven-model/3.5.0/maven-model-3.5.0.pom
[windows-jdk9] [resolver:resolve] Downloaded http://repo1.maven.org/maven2/org/apache/maven/maven-model/3.5.0/maven-model-3.5.0.pom (4 KB at 123.1 KB/sec)
[windows-jdk9] [resolver:resolve] Downloading http://repo1.maven.org/maven2/org/codehaus/plexus/plexus-utils/3.0.24/plexus-utils-3.0.24.pom
[windows-jdk9] [resolver:resolve] Downloaded http://repo1.maven.org/maven2/org/codehaus/plexus/plexus-utils/3.0.24/plexus-utils-3.0.24.pom (5 KB at 139.0 KB/sec)
[windows-jdk9] [resolver:resolve] Downloading http://repo1.maven.org/maven2/org/codehaus/plexus/plexus/4.0/plexus-4.0.pom
[windows-jdk9] [resolver:resolve] Downloaded http://repo1.maven.org/maven2/org/codehaus/plexus/plexus/4.0/plexus-4.0.pom (21 KB at 724.0 KB/sec)
[windows-jdk9] [resolver:resolve] Downloading http://repo1.maven.org/maven2/org/sonatype/forge/forge-parent/10/forge-parent-10.pom
[windows-jdk9] [resolver:resolve] Downloaded http://repo1.maven.org/maven2/org/sonatype/forge/forge-parent/10/forge-parent-10.pom (14 KB at 529.7 KB/sec)
[windows-jdk9] [resolver:resolve] Downloading http://repo1.maven.org/maven2/org/apache/commons/commons-lang3/3.5/commons-lang3-3.5.pom
[windows-jdk9] [resolver:resolve] Downloaded http://repo1.maven.org/maven2/org/apache/commons/commons-lang3/3.5/commons-lang3-3.5.pom (23 KB at 814.3 KB/sec)
[windows-jdk9] [resolver:resolve] Downloading http://repo1.maven.org/maven2/org/apache/commons/commons-parent/41/commons-parent-41.pom
[windows-jdk9] [resolver:resolve] Downloaded http://repo1.maven.org/maven2/org/apache/commons/commons-parent/41/commons-parent-41.pom (64 KB at 1711.3 KB/sec)
[windows-jdk9] [resolver:resolve] Downloading http://repo1.maven.org/maven2/org/apache/maven/maven-model-builder/3.5.0/maven-model-builder-3.5.0.pom
[windows-jdk9] [resolver:resolve] Downloaded http://repo1.maven.org/maven2/org/apache/maven/maven-model-builder/3.5.0/maven-model-builder-3.5.0.pom (4 KB at 50.7 KB/sec)
[windows-jdk9] [resolver:resolve] Downloading http://repo1.maven.org/maven2/org/codehaus/plexus/plexus-interpolation/1.24/plexus-interpolation-1.24.pom
[windows-jdk9] [resolver:resolve] Downloaded http://repo1.maven.org/maven2/org/codehaus/plexus/plexus-interpolation/1.24/plexus-interpolation-1.24.pom (3 KB at 94.8 KB/sec)
[windows-jdk9] [resolver:resolve] Downloading http://repo1.maven.org/maven2/org/apache/maven/maven-artifact/3.5.0/maven-artifact-3.5.0.pom
[windows-jdk9] [resolver:resolve] Downloaded http://repo1.maven.org/maven2/org/apache/maven/maven-artifact/3.5.0/maven-artifact-3.5.0.pom (3 KB at 64.5 KB/sec)
[windows-jdk9] [resolver:resolve] Downloading http://repo1.maven.org/maven2/org/apache/maven/maven-builder-support/3.5.0/maven-builder-support-3.5.0.pom
[windows-jdk9] [resolver:resolve] Downloaded http://repo1.maven.org/maven2/org/apache/maven/maven-builder-support/3.5.0/maven-builder-support-3.5.0.pom (2 KB at 59.7 KB/sec)
[windows-jdk9] [resolver:resolve] Downloading http://repo1.maven.org/maven2/com/google/guava/guava/20.0/guava-20.0.pom
[windows-jdk9] [resolver:resolve] Downloaded http://repo1.maven.org/maven2/com/google/guava/guava/20.0/guava-20.0.pom (7 KB at 222.5 KB/sec)
[windows-jdk9] [resolver:resolve] Downloading http://repo1.maven.org/maven2/com/google/guava/guava-parent/20.0/guava-parent-20.0.pom
[windows-jdk9] [resolver:resolve] Downloaded http://repo1.maven.org/maven2/com/google/guava/guava-parent/20.0/guava-parent-20.0.pom (10 KB at 371.7 KB/sec)
[windows-jdk9] [resolver:resolve] Downloading http://repo1.maven.org/maven2/org/sonatype/oss/oss-parent/7/oss-parent-7.pom
[windows-jdk9] [resolver:resolve] Downloaded http://repo1.maven.org/maven2/org/sonatype/oss/oss-parent/7/oss-parent-7.pom (5 KB at 174.5 KB/sec)
[windows-jdk9] [resolver:resolve] Downloading http://repo1.maven.org/maven2/org/apache/maven/maven-repository-metadata/3.5.0/maven-repository-metadata-3.5.0.pom
[windows-jdk9] [resolver:resolve] Downloaded http://repo1.maven.org/maven2/org/apache/maven/maven-repository-metadata/3.5.0/maven-repository-metadata-3.5.0.pom (2 KB at 59.6 KB/sec)
[windows-jdk9] [resolver:resolve] Downloading http://repo1.maven.org/maven2/org/apache/maven/resolver/maven-resolver-api/1.0.3/maven-resolver-api-1.0.3.pom
[windows-jdk9] [resolver:resolve] Downloaded http://repo1.maven.org/maven2/org/apache/maven/resolver/maven-resolver-api/1.0.3/maven-resolver-api-1.0.3.pom (2 KB at 45.8 KB/sec)
[windows-jdk9] [resolver:resolve] Downloading http://repo1.maven.org/maven2/org/apache/maven/resolver/maven-resolver/1.0.3/maven-resolver-1.0.3.pom
[windows-jdk9] [resolver:resolve] Downloaded http://repo1.maven.org/maven2/org/apache/maven/resolver/maven-resolver/1.0.3/maven-resolver-1.0.3.pom (15 KB at 488.8 KB/sec)
[windows-jdk9] [resolver:resolve] Downloading http://repo1.maven.org/maven2/org/apache/maven/resolver/maven-resolver-spi/1.0.3/maven-resolver-spi-1.0.3.pom
[windows-jdk9] [resolver:resolve] Downloaded http://repo1.maven.org/maven2/org/apache/maven/resolver/maven-resolver-spi/1.0.3/maven-resolver-spi-1.0.3.pom (2 KB at 51.6 KB/sec)
[windows-jdk9] [resolver:resolve] Downloading http://repo1.maven.org/maven2/org/apache/maven/resolver/maven-resolver-util/1.0.3/maven-resolver-util-1.0.3.pom
[windows-jdk9] [resolver:resolve] Downloaded http://repo1.maven.org/maven2/org/apache/maven/resolver/maven-resolver-util/1.0.3/maven-resolver-util-1.0.3.pom (3 KB at 59.0 KB/sec)
[windows-jdk9] [resolver:resolve] Downloading http://repo1.maven.org/maven2/org/apache/maven/resolver/maven-resolver-impl/1.0.3/maven-resolver-impl-1.0.3.pom
[windows-jdk9] [resolver:resolve] Downloaded http://repo1.maven.org/maven2/org/apache/maven/resolver/maven-resolver-impl/1.0.3/maven-resolver-impl-1.0.3.pom (4 KB at 113.2 KB/sec)
[windows-jdk9] [resolver:resolve] Downloading http://repo1.maven.org/maven2/org/apache/maven/maven-settings-builder/3.5.0/maven-settings-builder-3.5.0.pom
[windows-jdk9] [resolver:resolve] Downloaded http://repo1.maven.org/maven2/org/apache/maven/maven-settings-builder/3.5.0/maven-settings-builder-3.5.0.pom (3 KB at 59.5 KB/sec)
[windows-jdk9] [resolver:resolve] Downloading http://repo1.maven.org/maven2/org/apache/maven/maven-settings/3.5.0/maven-settings-3.5.0.pom
[windows-jdk9] [resolver:resolve] Downloaded http://repo1.maven.org/maven2/org/apache/maven/maven-settings/3.5.0/maven-settings-3.5.0.pom (2 KB at 61.7 KB/sec)
[windows-jdk9] [resolver:resolve] Downloading http://repo1.maven.org/maven2/org/sonatype/plexus/plexus-sec-dispatcher/1.4/plexus-sec-dispatcher-1.4.pom
[windows-jdk9] [resolver:resolve] Downloaded http://repo1.maven.org/maven2/org/sonatype/plexus/plexus-sec-dispatcher/1.4/plexus-sec-dispatcher-1.4.pom (3 KB at 87.6 KB/sec)
[windows-jdk9] [resolver:resolve] Downloading http://repo1.maven.org/maven2/org/sonatype/spice/spice-parent/12/spice-parent-12.pom
[windows-jdk9] [resolver:resolve] Downloaded http://repo1.maven.org/maven2/org/sonatype/spice/spice-parent/12/spice-parent-12.pom (7 KB at 237.1 KB/sec)
[windows-jdk9] [resolver:resolve] Downloading http://repo1.maven.org/maven2/org/sonatype/forge/forge-parent/4/forge-parent-4.pom
[windows-jdk9] [resolver:resolve] Downloaded http://repo1.maven.org/maven2/org/sonatype/forge/forge-parent/4/forge-parent-4.pom (9 KB at 328.0 KB/sec)
[windows-jdk9] [resolver:resolve] Downloading http://repo1.maven.org/maven2/org/codehaus/plexus/plexus-utils/1.5.5/plexus-utils-1.5.5.pom
[windows-jdk9] [resolver:resolve] Downloaded http://repo1.maven.org/maven2/org/codehaus/plexus/plexus-utils/1.5.5/plexus-utils-1.5.5.pom (6 KB at 218.5 KB/sec)
[windows-jdk9] [resolver:resolve] Downloading http://repo1.maven.org/maven2/org/codehaus/plexus/plexus/1.0.11/plexus-1.0.11.pom
[windows-jdk9] [resolver:resolve] Downloaded http://repo1.maven.org/maven2/org/codehaus/plexus/plexus/1.0.11/plexus-1.0.11.pom (9 KB at 292.0 KB/sec)
[windows-jdk9] [resolver:resolve] Downloading http://repo1.maven.org/maven2/org/sonatype/plexus/plexus-cipher/1.4/plexus-cipher-1.4.pom
[windows-jdk9] [resolver:resolve] Downloaded http://repo1.maven.org/maven2/org/sonatype/plexus/plexus-cipher/1.4/plexus-cipher-1.4.pom (3 KB at 56.0 KB/sec)
[windows-jdk9] [resolver:resolve] Downloading http://repo1.maven.org/maven2/org/codehaus/plexus/plexus-component-annotations/1.6/plexus-component-annotations-1.6.pom
[windows-jdk9] [resolver:resolve] Downloaded http://repo1.maven.org/maven2/org/codehaus/plexus/plexus-component-annotations/1.6/plexus-component-annotations-1.6.pom (748 B at 25.2 KB/sec)
[windows-jdk9] [resolver:resolve] Downloading http://repo1.maven.org/maven2/org/codehaus/plexus/plexus-containers/1.6/plexus-containers-1.6.pom
[windows-jdk9] [resolver:resolve] Downloaded http://repo1.maven.org/maven2/org/codehaus/plexus/plexus-containers/1.6/plexus-containers-1.6.pom (4 KB at 126.8 KB/sec)
[windows-jdk9] [resolver:resolve] Downloading http://repo1.maven.org/maven2/org/codehaus/plexus/plexus/3.3.2/plexus-3.3.2.pom
[windows-jdk9] [resolver:resolve] Downloaded http://repo1.maven.org/maven2/org/codehaus/plexus/plexus/3.3.2/plexus-3.3.2.pom (22 KB at 778.7 KB/sec)
[windows-jdk9] [resolver:resolve] Downloading http://repo1.maven.org/maven2/org/sonatype/spice/spice-parent/17/spice-parent-17.pom
[windows-jdk9] [resolver:resolve] Downloaded http://repo1.maven.org/maven2/org/sonatype/spice/spice-parent/17/spice-parent-17.pom (7 KB at 264.0 KB/sec)
[windows-jdk9] [resolver:resolve] Downloading http://repo1.maven.org/maven2/org/codehaus/plexus/plexus-interpolation/1.16/plexus-interpolation-1.16.pom
[windows-jdk9] [resolver:resolve] Downloaded http://repo1.maven.org/maven2/org/codehaus/plexus/plexus-interpolation/1.16/plexus-interpolation-1.16.pom (2 KB at 38.6 KB/sec)
[windows-jdk9] [resolver:resolve] Downloading http://repo1.maven.org/maven2/org/codehaus/plexus/plexus-components/1.3/plexus-components-1.3.pom
[windows-jdk9] [resolver:resolve] Downloaded http://repo1.maven.org/maven2/org/codehaus/plexus/plexus-components/1.3/plexus-components-1.3.pom (3 KB at 87.8 KB/sec)
[windows-jdk9] [resolver:resolve] Downloading http://repo1.maven.org/maven2/org/codehaus/plexus/plexus/3.3/plexus-3.3.pom
[windows-jdk9] [resolver:resolve] Downloaded http://repo1.maven.org/maven2/org/codehaus/plexus/plexus/3.3/plexus-3.3.pom (20 KB at 694.1 KB/sec)
[windows-jdk9] [resolver:resolve] Downloading http://repo1.maven.org/maven2/org/eclipse/sisu/org.eclipse.sisu.plexus/0.1.1/org.eclipse.sisu.plexus-0.1.1.pom
[windows-jdk9] [resolver:resolve] Downloaded http://repo1.maven.org/maven2/org/eclipse/sisu/org.eclipse.sisu.plexus/0.1.1/org.eclipse.sisu.plexus-0.1.1.pom (5 KB at 158.3 KB/sec)
[windows-jdk9] [resolver:resolve] Downloading http://repo1.maven.org/maven2/org/eclipse/sisu/sisu-plexus/0.1.1/sisu-plexus-0.1.1.pom
[windows-jdk9] [resolver:resolve] Downloaded http://repo1.maven.org/maven2/org/eclipse/sisu/sisu-plexus/0.1.1/sisu-plexus-0.1.1.pom (13 KB at 429.5 KB/sec)
[windows-jdk9] [resolver:resolve] Downloading http://repo1.maven.org/maven2/org/codehaus/plexus/plexus-component-annotations/1.5.5/plexus-component-annotations-1.5.5.pom
[windows-jdk9] [resolver:resolve] Downloaded http://repo1.maven.org/maven2/org/codehaus/plexus/plexus-component-annotations/1.5.5/plexus-component-annotations-1.5.5.pom (815 B at 41.9 KB/sec)
[windows-jdk9] [resolver:resolve] Downloading http://repo1.maven.org/maven2/org/codehaus/plexus/plexus-containers/1.5.5/plexus-containers-1.5.5.pom
[windows-jdk9] [resolver:resolve] Downloaded http://repo1.maven.org/maven2/org/codehaus/plexus/plexus-containers/1.5.5/plexus-containers-1.5.5.pom (5 KB at 133.6 KB/sec)
[windows-jdk9] [resolver:resolve] Downloading http://repo1.maven.org/maven2/org/codehaus/plexus/plexus/2.0.7/plexus-2.0.7.pom
[windows-jdk9] [resolver:resolve] Downloaded http://repo1.maven.org/maven2/org/codehaus/plexus/plexus/2.0.7/plexus-2.0.7.pom (17 KB at 563.0 KB/sec)
[windows-jdk9] [resolver:resolve] Downloading http://repo1.maven.org/maven2/junit/junit/4.11/junit-4.11.pom
[windows-jdk9] [resolver:resolve] Downloaded http://repo1.maven.org/maven2/junit/junit/4.11/junit-4.11.pom (3 KB at 78.9 KB/sec)
[windows-jdk9] [resolver:resolve] Downloading http://repo1.maven.org/maven2/org/hamcrest/hamcrest-core/1.3/hamcrest-core-1.3.pom
[windows-jdk9] [resolver:resolve] Downloaded http://repo1.maven.org/maven2/org/hamcrest/hamcrest-core/1.3/hamcrest-core-1.3.pom (766 B at 31.2 KB/sec)
[windows-jdk9] [resolver:resolve] Downloading http://repo1.maven.org/maven2/org/hamcrest/hamcrest-parent/1.3/hamcrest-parent-1.3.pom
[windows-jdk9] [resolver:resolve] Downloaded http://repo1.maven.org/maven2/org/hamcrest/hamcrest-parent/1.3/hamcrest-parent-1.3.pom (2 KB at 77.0 KB/sec)
[windows-jdk9] [resolver:resolve] Downloading http://repo1.maven.org/maven2/org/apache/ant/ant-testutil/1.8.2/ant-testutil-1.8.2.pom
[windows-jdk9] [resolver:resolve] Downloaded http://repo1.maven.org/maven2/org/apache/ant/ant-testutil/1.8.2/ant-testutil-1.8.2.pom (3 KB at 138.8 KB/sec)
[windows-jdk9] [resolver:resolve] Downloading http://repo1.maven.org/maven2/org/apache/ant/ant-launcher/1.8.2/ant-launcher-1.8.2.pom
[windows-jdk9] [resolver:resolve] Downloaded http://repo1.maven.org/maven2/org/apache/ant/ant-launcher/1.8.2/ant-launcher-1.8.2.pom (3 KB at 78.7 KB/sec)
[windows-jdk9] [resolver:resolve] Downloading http://repo1.maven.org/maven2/junit/junit/3.8.2/junit-3.8.2.pom
[windows-jdk9] [resolver:resolve] Downloaded http://repo1.maven.org/maven2/junit/junit/3.8.2/junit-3.8.2.pom (747 B at 24.3 KB/sec)
[windows-jdk9] [resolver:resolve] Downloading http://repo1.maven.org/maven2/org/hamcrest/hamcrest-library/1.3/hamcrest-library-1.3.pom
[windows-jdk9] [resolver:resolve] Downloaded http://repo1.maven.org/maven2/org/hamcrest/hamcrest-library/1.3/hamcrest-library-1.3.pom (820 B at 26.7 KB/sec)
[windows-jdk9] [resolver:resolve] Downloading http://repo1.maven.org/maven2/org/apache/maven/resolver/maven-resolver-test-util/1.1.1/maven-resolver-test-util-1.1.1.pom
[windows-jdk9] [resolver:resolve] Downloaded http://repo1.maven.org/maven2/org/apache/maven/resolver/maven-resolver-test-util/1.1.1/maven-resolver-test-util-1.1.1.pom (3 KB at 79.8 KB/sec)
[windows-jdk9] [resolver:resolve] Resolving artifacts
[windows-jdk9] [resolver:resolve] Downloading http://repo1.maven.org/maven2/org/apache/ant/ant/1.8.2/ant-1.8.2.jar
[windows-jdk9] [resolver:resolve] Downloading http://repo1.maven.org/maven2/org/apache/maven/resolver/maven-resolver-util/1.1.1/maven-resolver-util-1.1.1.jar
[windows-jdk9] [resolver:resolve] Downloading http://repo1.maven.org/maven2/org/apache/maven/resolver/maven-resolver-api/1.1.1/maven-resolver-api-1.1.1.jar
[windows-jdk9] [resolver:resolve] Downloading http://repo1.maven.org/maven2/org/apache/maven/resolver/maven-resolver-impl/1.1.1/maven-resolver-impl-1.1.1.jar
[windows-jdk9] [resolver:resolve] Downloading http://repo1.maven.org/maven2/org/apache/maven/resolver/maven-resolver-spi/1.1.1/maven-resolver-spi-1.1.1.jar
[windows-jdk9] [resolver:resolve] Downloaded http://repo1.maven.org/maven2/org/apache/maven/resolver/maven-resolver-api/1.1.1/maven-resolver-api-1.1.1.jar (143 KB at 2855.5 KB/sec)
[windows-jdk9] [resolver:resolve] Downloading http://repo1.maven.org/maven2/org/apache/maven/resolver/maven-resolver-connector-basic/1.1.1/maven-resolver-connector-basic-1.1.1.jar
[windows-jdk9] [resolver:resolve] Downloaded http://repo1.maven.org/maven2/org/apache/maven/resolver/maven-resolver-util/1.1.1/maven-resolver-util-1.1.1.jar (156 KB at 2927.9 KB/sec)
[windows-jdk9] [resolver:resolve] Downloading http://repo1.maven.org/maven2/org/apache/maven/resolver/maven-resolver-transport-classpath/1.1.1/maven-resolver-transport-classpath-1.1.1.jar
[windows-jdk9] [resolver:resolve] Downloaded http://repo1.maven.org/maven2/org/apache/maven/resolver/maven-resolver-impl/1.1.1/maven-resolver-impl-1.1.1.jar (181 KB at 3219.0 KB/sec)
[windows-jdk9] [resolver:resolve] Downloading http://repo1.maven.org/maven2/org/apache/maven/resolver/maven-resolver-transport-file/1.1.1/maven-resolver-transport-file-1.1.1.jar
[windows-jdk9] [resolver:resolve] Downloaded http://repo1.maven.org/maven2/org/apache/maven/resolver/maven-resolver-transport-classpath/1.1.1/maven-resolver-transport-classpath-1.1.1.jar (13 KB at 86.5 KB/sec)
[windows-jdk9] [resolver:resolve] Downloading http://repo1.maven.org/maven2/org/apache/maven/resolver/maven-resolver-transport-http/1.1.1/maven-resolver-transport-http-1.1.1.jar
[windows-jdk9] [resolver:resolve] Downloaded http://repo1.maven.org/maven2/org/apache/maven/resolver/maven-resolver-transport-file/1.1.1/maven-resolver-transport-file-1.1.1.jar (13 KB at 90.0 KB/sec)
[windows-jdk9] [resolver:resolve] Downloading http://repo1.maven.org/maven2/org/apache/httpcomponents/httpclient/4.5.4/httpclient-4.5.4.jar
[windows-jdk9] [resolver:resolve] Downloaded http://repo1.maven.org/maven2/org/apache/ant/ant/1.8.2/ant-1.8.2.jar (1889 KB at 12934.4 KB/sec)
[windows-jdk9] [resolver:resolve] Downloading http://repo1.maven.org/maven2/commons-codec/commons-codec/1.10/commons-codec-1.10.jar
[windows-jdk9] [resolver:resolve] Downloaded http://repo1.maven.org/maven2/commons-codec/commons-codec/1.10/commons-codec-1.10.jar (278 KB at 1059.2 KB/sec)
[windows-jdk9] [resolver:resolve] Downloading http://repo1.maven.org/maven2/org/apache/httpcomponents/httpcore/4.4.8/httpcore-4.4.8.jar
[windows-jdk9] [resolver:resolve] Downloaded http://repo1.maven.org/maven2/org/apache/maven/resolver/maven-resolver-spi/1.1.1/maven-resolver-spi-1.1.1.jar (35 KB at 128.6 KB/sec)
[windows-jdk9] [resolver:resolve] Downloading http://repo1.maven.org/maven2/org/apache/maven/maven-resolver-provider/3.5.0/maven-resolver-provider-3.5.0.jar
[windows-jdk9] [resolver:resolve] Downloaded http://repo1.maven.org/maven2/org/apache/httpcomponents/httpclient/4.5.4/httpclient-4.5.4.jar (764 KB at 2717.1 KB/sec)
[windows-jdk9] [resolver:resolve] Downloading http://repo1.maven.org/maven2/org/apache/maven/maven-model/3.5.0/maven-model-3.5.0.jar
[windows-jdk9] [resolver:resolve] Downloaded http://repo1.maven.org/maven2/org/apache/maven/resolver/maven-resolver-connector-basic/1.1.1/maven-resolver-connector-basic-1.1.1.jar (42 KB at 140.7 KB/sec)
[windows-jdk9] [resolver:resolve] Downloading http://repo1.maven.org/maven2/org/apache/maven/maven-model-builder/3.5.0/maven-model-builder-3.5.0.jar
[windows-jdk9] [resolver:resolve] Downloaded http://repo1.maven.org/maven2/org/apache/maven/maven-resolver-provider/3.5.0/maven-resolver-provider-3.5.0.jar (67 KB at 218.1 KB/sec)
[windows-jdk9] [resolver:resolve] Downloading http://repo1.maven.org/maven2/org/apache/maven/maven-artifact/3.5.0/maven-artifact-3.5.0.jar
[windows-jdk9] [resolver:resolve] Downloaded http://repo1.maven.org/maven2/org/apache/httpcomponents/httpcore/4.4.8/httpcore-4.4.8.jar (317 KB at 1029.1 KB/sec)
[windows-jdk9] [resolver:resolve] Downloading http://repo1.maven.org/maven2/com/google/guava/guava/20.0/guava-20.0.jar
[windows-jdk9] [resolver:resolve] Downloaded http://repo1.maven.org/maven2/org/apache/maven/maven-model/3.5.0/maven-model-3.5.0.jar (162 KB at 483.9 KB/sec)
[windows-jdk9] [resolver:resolve] Downloading http://repo1.maven.org/maven2/org/apache/maven/maven-repository-metadata/3.5.0/maven-repository-metadata-3.5.0.jar
[windows-jdk9] [resolver:resolve] Downloaded http://repo1.maven.org/maven2/org/apache/maven/maven-model-builder/3.5.0/maven-model-builder-3.5.0.jar (176 KB at 522.7 KB/sec)
[windows-jdk9] [resolver:resolve] Downloading http://repo1.maven.org/maven2/org/codehaus/plexus/plexus-utils/3.0.24/plexus-utils-3.0.24.jar
[windows-jdk9] [resolver:resolve] Downloaded http://repo1.maven.org/maven2/org/apache/maven/maven-artifact/3.5.0/maven-artifact-3.5.0.jar (54 KB at 156.1 KB/sec)
[windows-jdk9] [resolver:resolve] Downloading http://repo1.maven.org/maven2/org/apache/commons/commons-lang3/3.5/commons-lang3-3.5.jar
[windows-jdk9] [resolver:resolve] Downloaded http://repo1.maven.org/maven2/org/apache/maven/resolver/maven-resolver-transport-http/1.1.1/maven-resolver-transport-http-1.1.1.jar (41 KB at 112.3 KB/sec)
[windows-jdk9] [resolver:resolve] Downloading http://repo1.maven.org/maven2/org/apache/maven/maven-settings-builder/3.5.0/maven-settings-builder-3.5.0.jar
[windows-jdk9] [resolver:resolve] Downloaded http://repo1.maven.org/maven2/org/codehaus/plexus/plexus-utils/3.0.24/plexus-utils-3.0.24.jar (242 KB at 617.8 KB/sec)
[windows-jdk9] [resolver:resolve] Downloading http://repo1.maven.org/maven2/org/apache/maven/maven-builder-support/3.5.0/maven-builder-support-3.5.0.jar
[windows-jdk9] [resolver:resolve] Downloaded http://repo1.maven.org/maven2/com/google/guava/guava/20.0/guava-20.0.jar (2386 KB at 5963.4 KB/sec)
[windows-jdk9] [resolver:resolve] Downloading http://repo1.maven.org/maven2/org/apache/maven/maven-settings/3.5.0/maven-settings-3.5.0.jar
[windows-jdk9] [resolver:resolve] Downloaded http://repo1.maven.org/maven2/org/apache/commons/commons-lang3/3.5/commons-lang3-3.5.jar (469 KB at 1157.1 KB/sec)
[windows-jdk9] [resolver:resolve] Downloading http://repo1.maven.org/maven2/org/sonatype/plexus/plexus-sec-dispatcher/1.4/plexus-sec-dispatcher-1.4.jar
[windows-jdk9] [resolver:resolve] Downloaded http://repo1.maven.org/maven2/org/apache/maven/maven-repository-metadata/3.5.0/maven-repository-metadata-3.5.0.jar (27 KB at 55.1 KB/sec)
[windows-jdk9] [resolver:resolve] Downloading http://repo1.maven.org/maven2/org/sonatype/plexus/plexus-cipher/1.4/plexus-cipher-1.4.jar
[windows-jdk9] [resolver:resolve] Downloaded http://repo1.maven.org/maven2/org/sonatype/plexus/plexus-sec-dispatcher/1.4/plexus-sec-dispatcher-1.4.jar (28 KB at 51.0 KB/sec)
[windows-jdk9] [resolver:resolve] Downloading http://repo1.maven.org/maven2/org/codehaus/plexus/plexus-component-annotations/1.6/plexus-component-annotations-1.6.jar
[windows-jdk9] [resolver:resolve] Downloaded http://repo1.maven.org/maven2/org/apache/maven/maven-builder-support/3.5.0/maven-builder-support-3.5.0.jar (15 KB at 24.0 KB/sec)
[windows-jdk9] [resolver:resolve] Downloading http://repo1.maven.org/maven2/org/codehaus/plexus/plexus-interpolation/1.16/plexus-interpolation-1.16.jar
[windows-jdk9] [resolver:resolve] Downloaded http://repo1.maven.org/maven2/org/apache/maven/maven-settings/3.5.0/maven-settings-3.5.0.jar (44 KB at 71.8 KB/sec)
[windows-jdk9] [resolver:resolve] Downloading http://repo1.maven.org/maven2/org/eclipse/sisu/org.eclipse.sisu.plexus/0.1.1/org.eclipse.sisu.plexus-0.1.1.jar
[windows-jdk9] [resolver:resolve] Downloaded http://repo1.maven.org/maven2/org/codehaus/plexus/plexus-component-annotations/1.6/plexus-component-annotations-1.6.jar (5 KB at 6.8 KB/sec)
[windows-jdk9] [resolver:resolve] Downloaded http://repo1.maven.org/maven2/org/codehaus/plexus/plexus-interpolation/1.16/plexus-interpolation-1.16.jar (60 KB at 93.7 KB/sec)
[windows-jdk9] [resolver:resolve] Downloaded http://repo1.maven.org/maven2/org/sonatype/plexus/plexus-cipher/1.4/plexus-cipher-1.4.jar (14 KB at 20.4 KB/sec)
[windows-jdk9] [resolver:resolve] Downloaded http://repo1.maven.org/maven2/org/apache/maven/maven-settings-builder/3.5.0/maven-settings-builder-3.5.0.jar (43 KB at 65.1 KB/sec)
[windows-jdk9] [resolver:resolve] Downloaded http://repo1.maven.org/maven2/org/eclipse/sisu/org.eclipse.sisu.plexus/0.1.1/org.eclipse.sisu.plexus-0.1.1.jar (194 KB at 297.4 KB/sec)
[windows-jdk9]     [javac] Compiling 40 source files to f:\jenkins\jenkins-slave\workspace\n-resolver-ant-tasks_master-PZI36OPNRAJBXJOAPEQN5EKT3YVHZTR3KX72Y4FQGBMQE6GFTARQ\m\target\its\classes
[windows-jdk9]     [javac] Picked up JAVA_TOOL_OPTIONS: -Dmaven.ext.class.path="f:\jenkins\jenkins-slave\workspace\n-resolver-ant-tasks_master-PZI36OPNRAJBXJOAPEQN5EKT3YVHZTR3KX72Y4FQGBMQE6GFTARQ@tmp\withMaven5b286478\pipeline-maven-spy.jar" -Dorg.jenkinsci.plugins.pipeline.maven.reportsFolder="f:\jenkins\jenkins-slave\workspace\n-resolver-ant-tasks_master-PZI36OPNRAJBXJOAPEQN5EKT3YVHZTR3KX72Y4FQGBMQE6GFTARQ@tmp\withMaven5b286478"
[windows-jdk9]     [javac] warning: [options] bootstrap class path not set in conjunction with -source 1.5
[windows-jdk9]     [javac] error: Source option 1.5 is no longer supported. Use 1.6 or later.
[windows-jdk9]     [javac] error: Target option 1.5 is no longer supported. Use 1.6 or later.
[windows-jdk9] [INFO] ------------------------------------------------------------------------
[windows-jdk9] [INFO] BUILD FAILURE
[windows-jdk9] [INFO] ------------------------------------------------------------------------
[windows-jdk9] [INFO] Total time: 01:17 min
[windows-jdk9] [INFO] Finished at: 2018-09-11T11:39:42-07:00
[windows-jdk9] [INFO] Final Memory: 42M/141M
[windows-jdk9] [INFO] ------------------------------------------------------------------------
[windows-jdk9] [INFO] [jenkins-event-spy] Generated F:\jenkins\jenkins-slave\workspace\n-resolver-ant-tasks_master-PZI36OPNRAJBXJOAPEQN5EKT3YVHZTR3KX72Y4FQGBMQE6GFTARQ@tmp\withMaven5b286478\maven-spy-20180911-113824-3973349476525688301729.log
[windows-jdk9] [ERROR] Failed to execute goal org.apache.maven.plugins:maven-antrun-plugin:1.6:run (smoke-test) on project maven-resolver-ant-tasks: An Ant BuildException has occured: The following error occurred while executing this line:
[windows-jdk9] [ERROR] f:\jenkins\jenkins-slave\workspace\n-resolver-ant-tasks_master-PZI36OPNRAJBXJOAPEQN5EKT3YVHZTR3KX72Y4FQGBMQE6GFTARQ\m\build.xml:71: Compile failed; see the compiler error output for details.
[windows-jdk9] [ERROR] -> [Help 1]
[windows-jdk9] [ERROR]
[windows-jdk9] [ERROR] To see the full stack trace of the errors, re-run Maven with the -e switch.
[windows-jdk9] [ERROR] Re-run Maven using the -X switch to enable full debug logging.
[windows-jdk9] [ERROR]
[windows-jdk9] [ERROR] For more information about the errors and possible solutions, please read the following articles:
[windows-jdk9] [ERROR] [Help 1] http://cwiki.apache.org/confluence/display/MAVEN/MojoExecutionException
[Pipeline] [windows-jdk9] }
[Pipeline] [windows-jdk9] // dir
[Pipeline] [windows-jdk9] }
[windows-jdk9] [withMaven] junitPublisher - Archive test results for Maven artifact org.apache.maven.resolver:maven-resolver-ant-tasks:1.1.2-SNAPSHOT generated by maven-surefire-plugin:test (default-test): m\target\surefire-reports\*.xml
[windows-jdk9] Recording test results
[Pipeline] [windows-jdk9] // withMaven
[Pipeline] [windows-jdk9] cleanWs
[windows-jdk9] [WS-CLEANUP] Deleting project workspace...[WS-CLEANUP] done
[Pipeline] [windows-jdk9] cleanWs
[windows-jdk9] [WS-CLEANUP] Deleting project workspace...[WS-CLEANUP] done
[Pipeline] [windows-jdk9] }
[Pipeline] [windows-jdk9] // stage
[Pipeline] [windows-jdk9] }
[Pipeline] [windows-jdk9] // node
[Pipeline] [windows-jdk9] }
[windows-jdk9] Failed in branch windows-jdk9
[Pipeline] // parallel
[Pipeline] stage
[Pipeline] { (Notifications)
[Pipeline] echo
Build result: FAILURE
[Pipeline] jiraIssueSelector
[Pipeline] emailext
Reply | Threaded
Open this post in threaded view
|

Build failed in Jenkins: Maven TLP » maven-resolver-ant-tasks » master #23

Apache Jenkins Server-2
See https://builds.apache.org/job/maven-box/job/maven-resolver-ant-tasks/job/master/23/

No changes.

All tests passed

Build log:
[...truncated 2.89 MB...]
[windows-jdk7] [resolver:resolve] Downloaded http://repo1.maven.org/maven2/org/sonatype/plexus/plexus-cipher/1.4/plexus-cipher-1.4.jar (14 KB at 27.0 KB/sec)
[windows-jdk7] [resolver:resolve] Downloaded http://repo1.maven.org/maven2/org/codehaus/plexus/plexus-interpolation/1.16/plexus-interpolation-1.16.jar (60 KB at 120.5 KB/sec)
[windows-jdk7] [resolver:resolve] Downloaded http://repo1.maven.org/maven2/org/apache/maven/maven-settings-builder/3.5.0/maven-settings-builder-3.5.0.jar (43 KB at 83.5 KB/sec)
[windows-jdk7] [resolver:resolve] Downloaded http://repo1.maven.org/maven2/org/eclipse/sisu/org.eclipse.sisu.plexus/0.1.1/org.eclipse.sisu.plexus-0.1.1.jar (194 KB at 379.2 KB/sec)
[windows-jdk7] [resolver:resolve] Downloaded http://repo1.maven.org/maven2/org/codehaus/plexus/plexus-component-annotations/1.6/plexus-component-annotations-1.6.jar (5 KB at 8.1 KB/sec)
[windows-jdk7]     [javac] Compiling 40 source files to f:\jenkins\jenkins-slave\workspace\n-resolver-ant-tasks_master-PZI36OPNRAJBXJOAPEQN5EKT3YVHZTR3KX72Y4FQGBMQE6GFTARQ\m\target\its\classes
[linux-jdk10] [WS-CLEANUP] Deleting project workspace...[WS-CLEANUP] done
[Pipeline] [linux-jdk10] }
[Pipeline] [linux-jdk10] // stage
[Pipeline] [linux-jdk10] }
[Pipeline] [linux-jdk10] // node
[Pipeline] [linux-jdk10] }
[linux-jdk7]     [javac] warning: [options] bootstrap class path not set in conjunction with -source 1.5
[linux-jdk10] Failed in branch linux-jdk10
[linux-jdk7]     [javac] 1 warning
[linux-jdk7]
[linux-jdk7] test:
[windows-jdk7]     [javac] warning: [options] bootstrap class path not set in conjunction with -source 1.5
[linux-jdk7]     [junit] Picked up JAVA_TOOL_OPTIONS: -Dmaven.ext.class.path="/home/jenkins/jenkins-slave/workspace/n-resolver-ant-tasks_master-PZI36OPNRAJBXJOAPEQN5EKT3YVHZTR3KX72Y4FQGBMQE6GFTARQ@tmp/withMaven73750ded/pipeline-maven-spy.jar" -Dorg.jenkinsci.plugins.pipeline.maven.reportsFolder="/home/jenkins/jenkins-slave/workspace/n-resolver-ant-tasks_master-PZI36OPNRAJBXJOAPEQN5EKT3YVHZTR3KX72Y4FQGBMQE6GFTARQ@tmp/withMaven73750ded"
[linux-jdk7]     [junit] Testsuite: org.apache.maven.resolver.internal.ant.DeployTest
[windows-jdk7]     [javac] f:\jenkins\jenkins-slave\workspace\n-resolver-ant-tasks_master-PZI36OPNRAJBXJOAPEQN5EKT3YVHZTR3KX72Y4FQGBMQE6GFTARQ\m\target\its\local-repo\org\apache\maven\resolver\maven-resolver-connector-basic\1.1.1\maven-resolver-connector-basic-1.1.1.jar(org/eclipse/aether/connector/basic/BasicRepositoryConnectorFactory.class): warning: Cannot find annotation method 'value()' in type 'Named': class file for javax.inject.Named not found
[windows-jdk7]     [javac] f:\jenkins\jenkins-slave\workspace\n-resolver-ant-tasks_master-PZI36OPNRAJBXJOAPEQN5EKT3YVHZTR3KX72Y4FQGBMQE6GFTARQ\m\target\its\local-repo\org\apache\maven\resolver\maven-resolver-transport-classpath\1.1.1\maven-resolver-transport-classpath-1.1.1.jar(org/eclipse/aether/transport/classpath/ClasspathTransporterFactory.class): warning: Cannot find annotation method 'value()' in type 'Named'
[windows-jdk7]     [javac] f:\jenkins\jenkins-slave\workspace\n-resolver-ant-tasks_master-PZI36OPNRAJBXJOAPEQN5EKT3YVHZTR3KX72Y4FQGBMQE6GFTARQ\m\target\its\local-repo\org\apache\maven\resolver\maven-resolver-transport-file\1.1.1\maven-resolver-transport-file-1.1.1.jar(org/eclipse/aether/transport/file/FileTransporterFactory.class): warning: Cannot find annotation method 'value()' in type 'Named'
[windows-jdk7]     [javac] f:\jenkins\jenkins-slave\workspace\n-resolver-ant-tasks_master-PZI36OPNRAJBXJOAPEQN5EKT3YVHZTR3KX72Y4FQGBMQE6GFTARQ\m\target\its\local-repo\org\apache\maven\resolver\maven-resolver-transport-http\1.1.1\maven-resolver-transport-http-1.1.1.jar(org/eclipse/aether/transport/http/HttpTransporterFactory.class): warning: Cannot find annotation method 'value()' in type 'Named'
[windows-jdk7]     [javac] Note: f:\jenkins\jenkins-slave\workspace\n-resolver-ant-tasks_master-PZI36OPNRAJBXJOAPEQN5EKT3YVHZTR3KX72Y4FQGBMQE6GFTARQ\m\src\main\java\org\apache\maven\resolver\internal\ant\AntModelResolver.java uses or overrides a deprecated API.
[windows-jdk7]     [javac] Note: Recompile with -Xlint:deprecation for details.
[windows-jdk7]     [javac] 5 warnings
[windows-jdk7]     [javac] Picked up JAVA_TOOL_OPTIONS: -Dmaven.ext.class.path="f:\jenkins\jenkins-slave\workspace\n-resolver-ant-tasks_master-PZI36OPNRAJBXJOAPEQN5EKT3YVHZTR3KX72Y4FQGBMQE6GFTARQ@tmp\withMaven16384c35\pipeline-maven-spy.jar" -Dorg.jenkinsci.plugins.pipeline.maven.reportsFolder="f:\jenkins\jenkins-slave\workspace\n-resolver-ant-tasks_master-PZI36OPNRAJBXJOAPEQN5EKT3YVHZTR3KX72Y4FQGBMQE6GFTARQ@tmp\withMaven16384c35"
[windows-jdk7]
[windows-jdk7] process-test-resources:
[windows-jdk7]
[windows-jdk7] test-compile:
[windows-jdk7]     [mkdir] Created dir: f:\jenkins\jenkins-slave\workspace\n-resolver-ant-tasks_master-PZI36OPNRAJBXJOAPEQN5EKT3YVHZTR3KX72Y4FQGBMQE6GFTARQ\m\target\its\test-classes
[linux-jdk7]     [junit] Tests run: 4, Failures: 0, Errors: 0, Time elapsed: 1.984 sec
[linux-jdk7]     [junit]
[linux-jdk7]     [junit] Testsuite: org.apache.maven.resolver.internal.ant.InstallTest
[linux-jdk7]     [junit] Tests run: 5, Failures: 0, Errors: 0, Time elapsed: 0.598 sec
[linux-jdk7]     [junit]
[linux-jdk7]     [junit] Testsuite: org.apache.maven.resolver.internal.ant.ProjectWorkspaceReaderTest
[linux-jdk7]     [junit] Tests run: 3, Failures: 0, Errors: 0, Time elapsed: 0.039 sec
[linux-jdk7]     [junit]
[linux-jdk7]     [junit] Testsuite: org.apache.maven.resolver.internal.ant.ReactorTest
[windows-jdk7] [resolver:resolve] Resolving artifacts
[windows-jdk7] [resolver:resolve] Downloading http://repo1.maven.org/maven2/org/slf4j/jcl-over-slf4j/1.7.25/jcl-over-slf4j-1.7.25.jar
[windows-jdk7] [resolver:resolve] Downloading http://repo1.maven.org/maven2/junit/junit/4.11/junit-4.11.jar
[windows-jdk7] [resolver:resolve] Downloading http://repo1.maven.org/maven2/org/apache/ant/ant-testutil/1.8.2/ant-testutil-1.8.2.jar
[windows-jdk7] [resolver:resolve] Downloading http://repo1.maven.org/maven2/org/slf4j/slf4j-nop/1.6.2/slf4j-nop-1.6.2.jar
[windows-jdk7] [resolver:resolve] Downloading http://repo1.maven.org/maven2/org/slf4j/slf4j-api/1.6.2/slf4j-api-1.6.2.jar
[windows-jdk7] [resolver:resolve] Downloaded http://repo1.maven.org/maven2/org/apache/ant/ant-testutil/1.8.2/ant-testutil-1.8.2.jar (15 KB at 170.6 KB/sec)
[windows-jdk7] [resolver:resolve] Downloading http://repo1.maven.org/maven2/org/apache/ant/ant-launcher/1.8.2/ant-launcher-1.8.2.jar
[windows-jdk7] [resolver:resolve] Downloaded http://repo1.maven.org/maven2/org/slf4j/slf4j-nop/1.6.2/slf4j-nop-1.6.2.jar (5 KB at 50.5 KB/sec)
[windows-jdk7] [resolver:resolve] Downloading http://repo1.maven.org/maven2/org/hamcrest/hamcrest-library/1.3/hamcrest-library-1.3.jar
[windows-jdk7] [resolver:resolve] Downloaded http://repo1.maven.org/maven2/org/slf4j/jcl-over-slf4j/1.7.25/jcl-over-slf4j-1.7.25.jar (17 KB at 96.6 KB/sec)
[windows-jdk7] [resolver:resolve] Downloading http://repo1.maven.org/maven2/org/hamcrest/hamcrest-core/1.3/hamcrest-core-1.3.jar
[windows-jdk7] [resolver:resolve] Downloaded http://repo1.maven.org/maven2/org/hamcrest/hamcrest-library/1.3/hamcrest-library-1.3.jar (52 KB at 301.3 KB/sec)
[windows-jdk7] [resolver:resolve] Downloading http://repo1.maven.org/maven2/org/apache/maven/resolver/maven-resolver-test-util/1.1.1/maven-resolver-test-util-1.1.1.jar
[windows-jdk7] [resolver:resolve] Downloaded http://repo1.maven.org/maven2/junit/junit/4.11/junit-4.11.jar (240 KB at 1202.5 KB/sec)
[windows-jdk7] [resolver:resolve] Downloaded http://repo1.maven.org/maven2/org/apache/maven/resolver/maven-resolver-test-util/1.1.1/maven-resolver-test-util-1.1.1.jar (53 KB at 259.4 KB/sec)
[windows-jdk7] [resolver:resolve] Downloaded http://repo1.maven.org/maven2/org/apache/ant/ant-launcher/1.8.2/ant-launcher-1.8.2.jar (13 KB at 59.0 KB/sec)
[windows-jdk7] [resolver:resolve] Downloaded http://repo1.maven.org/maven2/org/slf4j/slf4j-api/1.6.2/slf4j-api-1.6.2.jar (26 KB at 105.0 KB/sec)
[windows-jdk7] [resolver:resolve] Downloaded http://repo1.maven.org/maven2/org/hamcrest/hamcrest-core/1.3/hamcrest-core-1.3.jar (44 KB at 108.8 KB/sec)
[windows-jdk7]     [javac] Compiling 11 source files to f:\jenkins\jenkins-slave\workspace\n-resolver-ant-tasks_master-PZI36OPNRAJBXJOAPEQN5EKT3YVHZTR3KX72Y4FQGBMQE6GFTARQ\m\target\its\test-classes
[linux-jdk7]     [junit] Tests run: 6, Failures: 0, Errors: 1, Time elapsed: 0.442 sec
[linux-jdk7]     [junit]
[linux-jdk7]     [junit] Testcase: testResolveVersionRange(org.apache.maven.resolver.internal.ant.ReactorTest): Caused an ERROR
[linux-jdk7]     [junit] java.lang.NoClassDefFoundError: org/apache/commons/logging/LogFactory
[linux-jdk7]     [junit] /home/jenkins/jenkins-slave/workspace/n-resolver-ant-tasks_master-PZI36OPNRAJBXJOAPEQN5EKT3YVHZTR3KX72Y4FQGBMQE6GFTARQ/m/src/test/resources/ant/Reactor/ant.xml:70: java.lang.NoClassDefFoundError: org/apache/commons/logging/LogFactory
[linux-jdk7]     [junit] at org.apache.maven.resolver.internal.ant.ReactorTest.testResolveVersionRange(Unknown Source)
[linux-jdk7]     [junit] Caused by: java.lang.NoClassDefFoundError: org/apache/commons/logging/LogFactory
[linux-jdk7]     [junit] at org.apache.http.conn.ssl.AbstractVerifier.<init>(AbstractVerifier.java:61)
[linux-jdk7]     [junit] at org.apache.http.conn.ssl.AllowAllHostnameVerifier.<init>(AllowAllHostnameVerifier.java:44)
[linux-jdk7]     [junit] at org.apache.http.conn.ssl.AllowAllHostnameVerifier.<clinit>(AllowAllHostnameVerifier.java:46)
[linux-jdk7]     [junit] at org.apache.http.conn.ssl.SSLSocketFactory.<clinit>(SSLSocketFactory.java:153)
[linux-jdk7]     [junit] at org.eclipse.aether.transport.http.GlobalState.newConnectionManager(GlobalState.java:175)
[linux-jdk7]     [junit] at org.eclipse.aether.transport.http.GlobalState.getConnectionManager(GlobalState.java:157)
[linux-jdk7]     [junit] at org.eclipse.aether.transport.http.LocalState.<init>(LocalState.java:70)
[linux-jdk7]     [junit] at org.eclipse.aether.transport.http.HttpTransporter.<init>(HttpTransporter.java:137)
[linux-jdk7]     [junit] at org.eclipse.aether.transport.http.HttpTransporterFactory.newInstance(HttpTransporterFactory.java:102)
[linux-jdk7]     [junit] at org.eclipse.aether.internal.impl.DefaultTransporterProvider.newTransporter(DefaultTransporterProvider.java:113)
[linux-jdk7]     [junit] at org.eclipse.aether.connector.basic.BasicRepositoryConnector.<init>(BasicRepositoryConnector.java:125)
[linux-jdk7]     [junit] at org.eclipse.aether.connector.basic.BasicRepositoryConnectorFactory.newInstance(BasicRepositoryConnectorFactory.java:175)
[linux-jdk7]     [junit] at org.eclipse.aether.internal.impl.DefaultRepositoryConnectorProvider.newRepositoryConnector(DefaultRepositoryConnectorProvider.java:116)
[linux-jdk7]     [junit] at org.eclipse.aether.internal.impl.DefaultMetadataResolver$ResolveTask.run(DefaultMetadataResolver.java:589)
[linux-jdk7]     [junit] at org.eclipse.aether.util.concurrency.RunnableErrorForwarder$1.run(RunnableErrorForwarder.java:75)
[linux-jdk7]     [junit] at org.eclipse.aether.internal.impl.DefaultMetadataResolver$1.execute(DefaultMetadataResolver.java:513)
[linux-jdk7]     [junit] at org.eclipse.aether.internal.impl.DefaultMetadataResolver.resolve(DefaultMetadataResolver.java:368)
[linux-jdk7]     [junit] at org.eclipse.aether.internal.impl.DefaultMetadataResolver.resolveMetadata(DefaultMetadataResolver.java:191)
[linux-jdk7]     [junit] at org.apache.maven.repository.internal.DefaultVersionRangeResolver.getVersions(DefaultVersionRangeResolver.java:223)
[linux-jdk7]     [junit] at org.apache.maven.repository.internal.DefaultVersionRangeResolver.resolveVersionRange(DefaultVersionRangeResolver.java:173)
[linux-jdk7]     [junit] at org.eclipse.aether.internal.impl.DefaultDependencyCollector.cachedResolveRangeResult(DefaultDependencyCollector.java:619)
[linux-jdk7]     [junit] at org.eclipse.aether.internal.impl.DefaultDependencyCollector.processDependency(DefaultDependencyCollector.java:394)
[linux-jdk7]     [junit] at org.eclipse.aether.internal.impl.DefaultDependencyCollector.processDependency(DefaultDependencyCollector.java:365)
[linux-jdk7]     [junit] at org.eclipse.aether.internal.impl.DefaultDependencyCollector.process(DefaultDependencyCollector.java:353)
[linux-jdk7]     [junit] at org.eclipse.aether.internal.impl.DefaultDependencyCollector.collectDependencies(DefaultDependencyCollector.java:256)
[linux-jdk7]     [junit] at org.eclipse.aether.internal.impl.DefaultRepositorySystem.collectDependencies(DefaultRepositorySystem.java:282)
[linux-jdk7]     [junit] at org.apache.maven.resolver.internal.ant.AntRepoSys.collectDependencies(Unknown Source)
[linux-jdk7]     [junit] at org.apache.maven.resolver.internal.ant.tasks.AbstractResolvingTask.collectDependencies(Unknown Source)
[linux-jdk7]     [junit] at org.apache.maven.resolver.internal.ant.tasks.Resolve.execute(Unknown Source)
[linux-jdk7]     [junit] Caused by: java.lang.ClassNotFoundException: org.apache.commons.logging.LogFactory
[linux-jdk7]     [junit] at java.net.URLClassLoader$1.run(URLClassLoader.java:366)
[linux-jdk7]     [junit] at java.net.URLClassLoader$1.run(URLClassLoader.java:355)
[linux-jdk7]     [junit] at java.security.AccessController.doPrivileged(Native Method)
[linux-jdk7]     [junit] at java.net.URLClassLoader.findClass(URLClassLoader.java:354)
[linux-jdk7]     [junit] at java.lang.ClassLoader.loadClass(ClassLoader.java:425)
[linux-jdk7]     [junit] at sun.misc.Launcher$AppClassLoader.loadClass(Launcher.java:308)
[linux-jdk7]     [junit] at java.lang.ClassLoader.loadClass(ClassLoader.java:358)
[linux-jdk7]     [junit]
[linux-jdk7]     [junit]
[linux-jdk7] [INFO] ------------------------------------------------------------------------
[linux-jdk7] [INFO] BUILD FAILURE
[linux-jdk7] [INFO] ------------------------------------------------------------------------
[linux-jdk7] [INFO] Total time: 01:15 min
[linux-jdk7] [INFO] Finished at: 2018-09-13T18:39:33Z
[linux-jdk7] [INFO] ------------------------------------------------------------------------
[linux-jdk7] [INFO] [jenkins-event-spy] Generated /home/jenkins/jenkins-slave/workspace/n-resolver-ant-tasks_master-PZI36OPNRAJBXJOAPEQN5EKT3YVHZTR3KX72Y4FQGBMQE6GFTARQ@tmp/withMaven73750ded/maven-spy-20180913-183818-4008841916391354744423.log
[linux-jdk7] [ERROR] Failed to execute goal org.apache.maven.plugins:maven-antrun-plugin:1.6:run (smoke-test) on project maven-resolver-ant-tasks: An Ant BuildException has occured: The following error occurred while executing this line:
[linux-jdk7] [ERROR] /home/jenkins/jenkins-slave/workspace/n-resolver-ant-tasks_master-PZI36OPNRAJBXJOAPEQN5EKT3YVHZTR3KX72Y4FQGBMQE6GFTARQ/m/build.xml:98: Tests failed
[linux-jdk7] [ERROR] -> [Help 1]
[linux-jdk7] [ERROR]
[linux-jdk7] [ERROR] To see the full stack trace of the errors, re-run Maven with the -e switch.
[linux-jdk7] [ERROR] Re-run Maven using the -X switch to enable full debug logging.
[linux-jdk7] [ERROR]
[linux-jdk7] [ERROR] For more information about the errors and possible solutions, please read the following articles:
[linux-jdk7] [ERROR] [Help 1] http://cwiki.apache.org/confluence/display/MAVEN/MojoExecutionException
[windows-jdk7]     [javac] warning: [options] bootstrap class path not set in conjunction with -source 1.5
[Pipeline] [linux-jdk7] }
[Pipeline] [linux-jdk7] // dir
[windows-jdk7]     [javac] 1 warning
[windows-jdk7]     [javac] Picked up JAVA_TOOL_OPTIONS: -Dmaven.ext.class.path="f:\jenkins\jenkins-slave\workspace\n-resolver-ant-tasks_master-PZI36OPNRAJBXJOAPEQN5EKT3YVHZTR3KX72Y4FQGBMQE6GFTARQ@tmp\withMaven16384c35\pipeline-maven-spy.jar" -Dorg.jenkinsci.plugins.pipeline.maven.reportsFolder="f:\jenkins\jenkins-slave\workspace\n-resolver-ant-tasks_master-PZI36OPNRAJBXJOAPEQN5EKT3YVHZTR3KX72Y4FQGBMQE6GFTARQ@tmp\withMaven16384c35"
[windows-jdk7]
[windows-jdk7] test:
[windows-jdk7]     [junit] Testsuite: org.apache.maven.resolver.internal.ant.DeployTest
[windows-jdk7]     [junit] Tests run: 4, Failures: 0, Errors: 0, Time elapsed: 2.304 sec
[windows-jdk7]     [junit]
[windows-jdk7]     [junit] Testsuite: org.apache.maven.resolver.internal.ant.InstallTest
[windows-jdk7]     [junit] Tests run: 5, Failures: 0, Errors: 0, Time elapsed: 0.626 sec
[windows-jdk7]     [junit]
[windows-jdk7]     [junit] Testsuite: org.apache.maven.resolver.internal.ant.ProjectWorkspaceReaderTest
[windows-jdk7]     [junit] Tests run: 3, Failures: 0, Errors: 0, Time elapsed: 0.052 sec
[windows-jdk7]     [junit]
[windows-jdk7]     [junit] Testsuite: org.apache.maven.resolver.internal.ant.ReactorTest
[windows-jdk7]     [junit] Tests run: 6, Failures: 0, Errors: 1, Time elapsed: 0.508 sec
[windows-jdk7]     [junit]
[windows-jdk7]     [junit] Testcase: testResolveVersionRange(org.apache.maven.resolver.internal.ant.ReactorTest): Caused an ERROR
[windows-jdk7]     [junit] java.lang.NoClassDefFoundError: org/apache/commons/logging/LogFactory
[windows-jdk7]     [junit] f:\jenkins\jenkins-slave\workspace\n-resolver-ant-tasks_master-PZI36OPNRAJBXJOAPEQN5EKT3YVHZTR3KX72Y4FQGBMQE6GFTARQ\m\src\test\resources\ant\Reactor\ant.xml:70: java.lang.NoClassDefFoundError: org/apache/commons/logging/LogFactory
[windows-jdk7]     [junit] at org.apache.maven.resolver.internal.ant.ReactorTest.testResolveVersionRange(Unknown Source)
[windows-jdk7]     [junit] Caused by: java.lang.NoClassDefFoundError: org/apache/commons/logging/LogFactory
[windows-jdk7]     [junit] at org.apache.http.conn.ssl.AbstractVerifier.<init>(AbstractVerifier.java:61)
[windows-jdk7]     [junit] at org.apache.http.conn.ssl.AllowAllHostnameVerifier.<init>(AllowAllHostnameVerifier.java:44)
[windows-jdk7]     [junit] at org.apache.http.conn.ssl.AllowAllHostnameVerifier.<clinit>(AllowAllHostnameVerifier.java:46)
[windows-jdk7]     [junit] at org.apache.http.conn.ssl.SSLSocketFactory.<clinit>(SSLSocketFactory.java:153)
[windows-jdk7]     [junit] at org.eclipse.aether.transport.http.GlobalState.newConnectionManager(GlobalState.java:175)
[windows-jdk7]     [junit] at org.eclipse.aether.transport.http.GlobalState.getConnectionManager(GlobalState.java:157)
[windows-jdk7]     [junit] at org.eclipse.aether.transport.http.LocalState.<init>(LocalState.java:70)
[windows-jdk7]     [junit] at org.eclipse.aether.transport.http.HttpTransporter.<init>(HttpTransporter.java:137)
[windows-jdk7]     [junit] at org.eclipse.aether.transport.http.HttpTransporterFactory.newInstance(HttpTransporterFactory.java:102)
[windows-jdk7]     [junit] at org.eclipse.aether.internal.impl.DefaultTransporterProvider.newTransporter(DefaultTransporterProvider.java:113)
[windows-jdk7]     [junit] at org.eclipse.aether.connector.basic.BasicRepositoryConnector.<init>(BasicRepositoryConnector.java:125)
[windows-jdk7]     [junit] at org.eclipse.aether.connector.basic.BasicRepositoryConnectorFactory.newInstance(BasicRepositoryConnectorFactory.java:175)
[windows-jdk7]     [junit] at org.eclipse.aether.internal.impl.DefaultRepositoryConnectorProvider.newRepositoryConnector(DefaultRepositoryConnectorProvider.java:116)
[windows-jdk7]     [junit] at org.eclipse.aether.internal.impl.DefaultMetadataResolver$ResolveTask.run(DefaultMetadataResolver.java:589)
[windows-jdk7]     [junit] at org.eclipse.aether.util.concurrency.RunnableErrorForwarder$1.run(RunnableErrorForwarder.java:75)
[windows-jdk7]     [junit] at org.eclipse.aether.internal.impl.DefaultMetadataResolver$1.execute(DefaultMetadataResolver.java:513)
[windows-jdk7]     [junit] at org.eclipse.aether.internal.impl.DefaultMetadataResolver.resolve(DefaultMetadataResolver.java:368)
[windows-jdk7]     [junit] at org.eclipse.aether.internal.impl.DefaultMetadataResolver.resolveMetadata(DefaultMetadataResolver.java:191)
[windows-jdk7]     [junit] at org.apache.maven.repository.internal.DefaultVersionRangeResolver.getVersions(DefaultVersionRangeResolver.java:223)
[windows-jdk7]     [junit] at org.apache.maven.repository.internal.DefaultVersionRangeResolver.resolveVersionRange(DefaultVersionRangeResolver.java:173)
[windows-jdk7]     [junit] at org.eclipse.aether.internal.impl.DefaultDependencyCollector.cachedResolveRangeResult(DefaultDependencyCollector.java:619)
[windows-jdk7]     [junit] at org.eclipse.aether.internal.impl.DefaultDependencyCollector.processDependency(DefaultDependencyCollector.java:394)
[windows-jdk7]     [junit] at org.eclipse.aether.internal.impl.DefaultDependencyCollector.processDependency(DefaultDependencyCollector.java:365)
[windows-jdk7]     [junit] at org.eclipse.aether.internal.impl.DefaultDependencyCollector.process(DefaultDependencyCollector.java:353)
[windows-jdk7]     [junit] at org.eclipse.aether.internal.impl.DefaultDependencyCollector.collectDependencies(DefaultDependencyCollector.java:256)
[windows-jdk7]     [junit] at org.eclipse.aether.internal.impl.DefaultRepositorySystem.collectDependencies(DefaultRepositorySystem.java:282)
[windows-jdk7]     [junit] at org.apache.maven.resolver.internal.ant.AntRepoSys.collectDependencies(Unknown Source)
[windows-jdk7]     [junit] at org.apache.maven.resolver.internal.ant.tasks.AbstractResolvingTask.collectDependencies(Unknown Source)
[windows-jdk7]     [junit] at org.apache.maven.resolver.internal.ant.tasks.Resolve.execute(Unknown Source)
[windows-jdk7]     [junit] Caused by: java.lang.ClassNotFoundException: org.apache.commons.logging.LogFactory
[windows-jdk7]     [junit] at java.net.URLClassLoader$1.run(URLClassLoader.java:366)
[windows-jdk7]     [junit] at java.net.URLClassLoader$1.run(URLClassLoader.java:355)
[windows-jdk7]     [junit] at java.security.AccessController.doPrivileged(Native Method)
[windows-jdk7]     [junit] at java.net.URLClassLoader.findClass(URLClassLoader.java:354)
[windows-jdk7]     [junit] at java.lang.ClassLoader.loadClass(ClassLoader.java:425)
[windows-jdk7]     [junit] at sun.misc.Launcher$AppClassLoader.loadClass(Launcher.java:308)
[windows-jdk7]     [junit] at java.lang.ClassLoader.loadClass(ClassLoader.java:358)
[windows-jdk7]     [junit]
[windows-jdk7]     [junit]
[windows-jdk7]     [junit] Picked up JAVA_TOOL_OPTIONS: -Dmaven.ext.class.path="f:\jenkins\jenkins-slave\workspace\n-resolver-ant-tasks_master-PZI36OPNRAJBXJOAPEQN5EKT3YVHZTR3KX72Y4FQGBMQE6GFTARQ@tmp\withMaven16384c35\pipeline-maven-spy.jar" -Dorg.jenkinsci.plugins.pipeline.maven.reportsFolder="f:\jenkins\jenkins-slave\workspace\n-resolver-ant-tasks_master-PZI36OPNRAJBXJOAPEQN5EKT3YVHZTR3KX72Y4FQGBMQE6GFTARQ@tmp\withMaven16384c35"
[windows-jdk7] [INFO] ------------------------------------------------------------------------
[windows-jdk7] [INFO] BUILD FAILURE
[windows-jdk7] [INFO] ------------------------------------------------------------------------
[windows-jdk7] [INFO] Total time: 01:18 min
[windows-jdk7] [INFO] Finished at: 2018-09-13T11:39:39-07:00
[windows-jdk7] [INFO] Final Memory: 53M/870M
[windows-jdk7] [INFO] ------------------------------------------------------------------------
[windows-jdk7] [INFO] [jenkins-event-spy] Generated F:\jenkins\jenkins-slave\workspace\n-resolver-ant-tasks_master-PZI36OPNRAJBXJOAPEQN5EKT3YVHZTR3KX72Y4FQGBMQE6GFTARQ@tmp\withMaven16384c35\maven-spy-20180913-113820-2963309702750732926913.log
[windows-jdk7] [ERROR] Failed to execute goal org.apache.maven.plugins:maven-antrun-plugin:1.6:run (smoke-test) on project maven-resolver-ant-tasks: An Ant BuildException has occured: The following error occurred while executing this line:
[windows-jdk7] [ERROR] f:\jenkins\jenkins-slave\workspace\n-resolver-ant-tasks_master-PZI36OPNRAJBXJOAPEQN5EKT3YVHZTR3KX72Y4FQGBMQE6GFTARQ\m\build.xml:98: Tests failed
[windows-jdk7] [ERROR] -> [Help 1]
[windows-jdk7] [ERROR]
[windows-jdk7] [ERROR] To see the full stack trace of the errors, re-run Maven with the -e switch.
[windows-jdk7] [ERROR] Re-run Maven using the -X switch to enable full debug logging.
[windows-jdk7] [ERROR]
[windows-jdk7] [ERROR] For more information about the errors and possible solutions, please read the following articles:
[windows-jdk7] [ERROR] [Help 1] http://cwiki.apache.org/confluence/display/MAVEN/MojoExecutionException
[windows-jdk7] Picked up JAVA_TOOL_OPTIONS: -Dmaven.ext.class.path="f:\jenkins\jenkins-slave\workspace\n-resolver-ant-tasks_master-PZI36OPNRAJBXJOAPEQN5EKT3YVHZTR3KX72Y4FQGBMQE6GFTARQ@tmp\withMaven16384c35\pipeline-maven-spy.jar" -Dorg.jenkinsci.plugins.pipeline.maven.reportsFolder="f:\jenkins\jenkins-slave\workspace\n-resolver-ant-tasks_master-PZI36OPNRAJBXJOAPEQN5EKT3YVHZTR3KX72Y4FQGBMQE6GFTARQ@tmp\withMaven16384c35"
[Pipeline] [linux-jdk7] }
[linux-jdk7] [withMaven] junitPublisher - Archive test results for Maven artifact org.apache.maven.resolver:maven-resolver-ant-tasks:1.1.2-SNAPSHOT generated by maven-surefire-plugin:test (default-test): m/target/surefire-reports/*.xml
[linux-jdk7] Recording test results
[linux-jdk7] [withMaven] openTasksPublisher - Scan Tasks for Maven artifact org.apache.maven.resolver:maven-resolver-ant-tasks:1.1.2-SNAPSHOT in source directory m/src/main/java
[linux-jdk7] [TASKS] Scanning folder '/home/jenkins/jenkins-slave/workspace/n-resolver-ant-tasks_master-PZI36OPNRAJBXJOAPEQN5EKT3YVHZTR3KX72Y4FQGBMQE6GFTARQ' for files matching the pattern 'm/src/main/java/**/*' - excludes: null
[linux-jdk7] [TASKS] Found 40 files to scan for tasks
[linux-jdk7] [TASKS] Found 0 open tasks.
[linux-jdk7] Skipping warnings blame since pipelines do not have an SCM link.%n
[linux-jdk7] [TASKS] Computing warning deltas based on reference build #3
[Pipeline] [linux-jdk7] // withMaven
[Pipeline] [linux-jdk7] cleanWs
[Pipeline] [windows-jdk7] }
[Pipeline] [windows-jdk7] // dir
[linux-jdk7] [WS-CLEANUP] Deleting project workspace...[WS-CLEANUP] done
[Pipeline] [windows-jdk7] }
[windows-jdk7] [withMaven] junitPublisher - Archive test results for Maven artifact org.apache.maven.resolver:maven-resolver-ant-tasks:1.1.2-SNAPSHOT generated by maven-surefire-plugin:test (default-test): m\target\surefire-reports\*.xml
[windows-jdk7] Recording test results
[Pipeline] [windows-jdk7] // withMaven
[Pipeline] [linux-jdk7] cleanWs
[Pipeline] [windows-jdk7] cleanWs
[windows-jdk7] [WS-CLEANUP] Deleting project workspace...[WS-CLEANUP] done
[Pipeline] [windows-jdk7] cleanWs
[windows-jdk7] [WS-CLEANUP] Deleting project workspace...[WS-CLEANUP] done
[Pipeline] [windows-jdk7] }
[Pipeline] [windows-jdk7] // stage
[Pipeline] [windows-jdk7] }
[Pipeline] [windows-jdk7] // node
[Pipeline] [windows-jdk7] }
[linux-jdk7] [WS-CLEANUP] Deleting project workspace...[WS-CLEANUP] done
[windows-jdk7] Failed in branch windows-jdk7
[Pipeline] [linux-jdk7] }
[Pipeline] [linux-jdk7] // stage
[Pipeline] [linux-jdk7] }
[Pipeline] [linux-jdk7] // node
[Pipeline] [linux-jdk7] }
[linux-jdk7] Failed in branch linux-jdk7
[Pipeline] // parallel
[Pipeline] stage
[Pipeline] { (Notifications)
[Pipeline] echo
Build result: FAILURE
[Pipeline] jiraIssueSelector
[Pipeline] emailext
Reply | Threaded
Open this post in threaded view
|

Build failed in Jenkins: Maven TLP » maven-resolver-ant-tasks » master #24

Apache Jenkins Server-2
See https://builds.apache.org/job/maven-box/job/maven-resolver-ant-tasks/job/master/24/

Changes:

* Exclude H25
* Exclude H31 cause master is failing constantly.
* no need to test anymore with '3.0.x'
* Add Java 11 to defaults
* Try to shorten path for Windows by using tempDir
* Fix arguments
* Add option for temp workspace
* disable tmpWs
* enable tmpWs
* Use def
* Try to shorten wsDir

All tests passed

Build log:
[...truncated 2.89 MB...]
[windows-jdk10] [resolver:resolve] Downloading http://repo1.maven.org/maven2/org/codehaus/plexus/plexus/1.0.11/plexus-1.0.11.pom
[Pipeline] [windows-jdk9] }
[Pipeline] [windows-jdk9] // dir
[windows-jdk8]     [junit] Tests run: 4, Failures: 0, Errors: 0, Time elapsed: 1.528 sec
[windows-jdk8]     [junit]
[windows-jdk8]     [junit] Testsuite: org.apache.maven.resolver.internal.ant.InstallTest
[windows-jdk10] [resolver:resolve] Downloaded http://repo1.maven.org/maven2/org/codehaus/plexus/plexus/1.0.11/plexus-1.0.11.pom (9 KB at 973.2 KB/sec)
[windows-jdk10] [resolver:resolve] Downloading http://repo1.maven.org/maven2/org/sonatype/plexus/plexus-cipher/1.4/plexus-cipher-1.4.pom
[windows-jdk10] [resolver:resolve] Downloaded http://repo1.maven.org/maven2/org/sonatype/plexus/plexus-cipher/1.4/plexus-cipher-1.4.pom (3 KB at 201.7 KB/sec)
[windows-jdk10] [resolver:resolve] Downloading http://repo1.maven.org/maven2/org/codehaus/plexus/plexus-component-annotations/1.6/plexus-component-annotations-1.6.pom
[windows-jdk10] [resolver:resolve] Downloaded http://repo1.maven.org/maven2/org/codehaus/plexus/plexus-component-annotations/1.6/plexus-component-annotations-1.6.pom (748 B at 81.2 KB/sec)
[windows-jdk10] [resolver:resolve] Downloading http://repo1.maven.org/maven2/org/codehaus/plexus/plexus-containers/1.6/plexus-containers-1.6.pom
[windows-jdk10] [resolver:resolve] Downloaded http://repo1.maven.org/maven2/org/codehaus/plexus/plexus-containers/1.6/plexus-containers-1.6.pom (4 KB at 459.7 KB/sec)
[windows-jdk10] [resolver:resolve] Downloading http://repo1.maven.org/maven2/org/codehaus/plexus/plexus/3.3.2/plexus-3.3.2.pom
[windows-jdk10] [resolver:resolve] Downloaded http://repo1.maven.org/maven2/org/codehaus/plexus/plexus/3.3.2/plexus-3.3.2.pom (22 KB at 2102.4 KB/sec)
[windows-jdk10] [resolver:resolve] Downloading http://repo1.maven.org/maven2/org/sonatype/spice/spice-parent/17/spice-parent-17.pom
[windows-jdk10] [resolver:resolve] Downloaded http://repo1.maven.org/maven2/org/sonatype/spice/spice-parent/17/spice-parent-17.pom (7 KB at 600.1 KB/sec)
[windows-jdk10] [resolver:resolve] Downloading http://repo1.maven.org/maven2/org/codehaus/plexus/plexus-interpolation/1.16/plexus-interpolation-1.16.pom
[windows-jdk10] [resolver:resolve] Downloaded http://repo1.maven.org/maven2/org/codehaus/plexus/plexus-interpolation/1.16/plexus-interpolation-1.16.pom (2 KB at 91.2 KB/sec)
[windows-jdk10] [resolver:resolve] Downloading http://repo1.maven.org/maven2/org/codehaus/plexus/plexus-components/1.3/plexus-components-1.3.pom
[windows-jdk10] [resolver:resolve] Downloaded http://repo1.maven.org/maven2/org/codehaus/plexus/plexus-components/1.3/plexus-components-1.3.pom (3 KB at 271.5 KB/sec)
[windows-jdk10] [resolver:resolve] Downloading http://repo1.maven.org/maven2/org/codehaus/plexus/plexus/3.3/plexus-3.3.pom
[windows-jdk10] [resolver:resolve] Downloaded http://repo1.maven.org/maven2/org/codehaus/plexus/plexus/3.3/plexus-3.3.pom (20 KB at 2429.2 KB/sec)
[windows-jdk10] [resolver:resolve] Downloading http://repo1.maven.org/maven2/org/eclipse/sisu/org.eclipse.sisu.plexus/0.1.1/org.eclipse.sisu.plexus-0.1.1.pom
[windows-jdk10] [resolver:resolve] Downloaded http://repo1.maven.org/maven2/org/eclipse/sisu/org.eclipse.sisu.plexus/0.1.1/org.eclipse.sisu.plexus-0.1.1.pom (5 KB at 417.3 KB/sec)
[windows-jdk10] [resolver:resolve] Downloading http://repo1.maven.org/maven2/org/eclipse/sisu/sisu-plexus/0.1.1/sisu-plexus-0.1.1.pom
[windows-jdk10] [resolver:resolve] Downloaded http://repo1.maven.org/maven2/org/eclipse/sisu/sisu-plexus/0.1.1/sisu-plexus-0.1.1.pom (13 KB at 1610.6 KB/sec)
[windows-jdk10] [resolver:resolve] Downloading http://repo1.maven.org/maven2/org/codehaus/plexus/plexus-component-annotations/1.5.5/plexus-component-annotations-1.5.5.pom
[windows-jdk10] [resolver:resolve] Downloaded http://repo1.maven.org/maven2/org/codehaus/plexus/plexus-component-annotations/1.5.5/plexus-component-annotations-1.5.5.pom (815 B at 99.5 KB/sec)
[windows-jdk10] [resolver:resolve] Downloading http://repo1.maven.org/maven2/org/codehaus/plexus/plexus-containers/1.5.5/plexus-containers-1.5.5.pom
[windows-jdk10] [resolver:resolve] Downloaded http://repo1.maven.org/maven2/org/codehaus/plexus/plexus-containers/1.5.5/plexus-containers-1.5.5.pom (5 KB at 376.4 KB/sec)
[windows-jdk10] [resolver:resolve] Downloading http://repo1.maven.org/maven2/org/codehaus/plexus/plexus/2.0.7/plexus-2.0.7.pom
[windows-jdk10] [resolver:resolve] Downloaded http://repo1.maven.org/maven2/org/codehaus/plexus/plexus/2.0.7/plexus-2.0.7.pom (17 KB at 2412.8 KB/sec)
[windows-jdk10] [resolver:resolve] Downloading http://repo1.maven.org/maven2/junit/junit/4.11/junit-4.11.pom
[windows-jdk10] [resolver:resolve] Downloaded http://repo1.maven.org/maven2/junit/junit/4.11/junit-4.11.pom (3 KB at 228.9 KB/sec)
[windows-jdk10] [resolver:resolve] Downloading http://repo1.maven.org/maven2/org/hamcrest/hamcrest-core/1.3/hamcrest-core-1.3.pom
[windows-jdk10] [resolver:resolve] Downloaded http://repo1.maven.org/maven2/org/hamcrest/hamcrest-core/1.3/hamcrest-core-1.3.pom (766 B at 106.9 KB/sec)
[windows-jdk10] [resolver:resolve] Downloading http://repo1.maven.org/maven2/org/hamcrest/hamcrest-parent/1.3/hamcrest-parent-1.3.pom
[windows-jdk10] [resolver:resolve] Downloaded http://repo1.maven.org/maven2/org/hamcrest/hamcrest-parent/1.3/hamcrest-parent-1.3.pom (2 KB at 240.7 KB/sec)
[windows-jdk10] [resolver:resolve] Downloading http://repo1.maven.org/maven2/org/apache/ant/ant-testutil/1.8.2/ant-testutil-1.8.2.pom
[windows-jdk10] [resolver:resolve] Downloaded http://repo1.maven.org/maven2/org/apache/ant/ant-testutil/1.8.2/ant-testutil-1.8.2.pom (3 KB at 291.5 KB/sec)
[windows-jdk10] [resolver:resolve] Downloading http://repo1.maven.org/maven2/org/apache/ant/ant-launcher/1.8.2/ant-launcher-1.8.2.pom
[windows-jdk10] [resolver:resolve] Downloaded http://repo1.maven.org/maven2/org/apache/ant/ant-launcher/1.8.2/ant-launcher-1.8.2.pom (3 KB at 295.3 KB/sec)
[windows-jdk10] [resolver:resolve] Downloading http://repo1.maven.org/maven2/junit/junit/3.8.2/junit-3.8.2.pom
[windows-jdk10] [resolver:resolve] Downloaded http://repo1.maven.org/maven2/junit/junit/3.8.2/junit-3.8.2.pom (747 B at 104.2 KB/sec)
[windows-jdk10] [resolver:resolve] Downloading http://repo1.maven.org/maven2/org/hamcrest/hamcrest-library/1.3/hamcrest-library-1.3.pom
[windows-jdk10] [resolver:resolve] Downloaded http://repo1.maven.org/maven2/org/hamcrest/hamcrest-library/1.3/hamcrest-library-1.3.pom (820 B at 72.8 KB/sec)
[windows-jdk10] [resolver:resolve] Downloading http://repo1.maven.org/maven2/org/apache/maven/resolver/maven-resolver-test-util/1.1.1/maven-resolver-test-util-1.1.1.pom
[windows-jdk10] [resolver:resolve] Downloaded http://repo1.maven.org/maven2/org/apache/maven/resolver/maven-resolver-test-util/1.1.1/maven-resolver-test-util-1.1.1.pom (3 KB at 239.4 KB/sec)
[windows-jdk10] [resolver:resolve] Resolving artifacts
[windows-jdk10] [resolver:resolve] Downloading http://repo1.maven.org/maven2/org/apache/maven/resolver/maven-resolver-api/1.1.1/maven-resolver-api-1.1.1.jar
[windows-jdk10] [resolver:resolve] Downloading http://repo1.maven.org/maven2/org/apache/maven/resolver/maven-resolver-util/1.1.1/maven-resolver-util-1.1.1.jar
[windows-jdk10] [resolver:resolve] Downloading http://repo1.maven.org/maven2/org/apache/maven/resolver/maven-resolver-impl/1.1.1/maven-resolver-impl-1.1.1.jar
[windows-jdk10] [resolver:resolve] Downloading http://repo1.maven.org/maven2/org/apache/ant/ant/1.8.2/ant-1.8.2.jar
[windows-jdk10] [resolver:resolve] Downloading http://repo1.maven.org/maven2/org/apache/maven/resolver/maven-resolver-spi/1.1.1/maven-resolver-spi-1.1.1.jar
[windows-jdk10] [resolver:resolve] Downloaded http://repo1.maven.org/maven2/org/apache/maven/resolver/maven-resolver-spi/1.1.1/maven-resolver-spi-1.1.1.jar (35 KB at 1748.6 KB/sec)
[windows-jdk10] [resolver:resolve] Downloading http://repo1.maven.org/maven2/org/apache/maven/resolver/maven-resolver-connector-basic/1.1.1/maven-resolver-connector-basic-1.1.1.jar
[windows-jdk10] [resolver:resolve] Downloaded http://repo1.maven.org/maven2/org/apache/maven/resolver/maven-resolver-api/1.1.1/maven-resolver-api-1.1.1.jar (143 KB at 5287.9 KB/sec)
[windows-jdk10] [resolver:resolve] Downloading http://repo1.maven.org/maven2/org/apache/maven/resolver/maven-resolver-transport-classpath/1.1.1/maven-resolver-transport-classpath-1.1.1.jar
[windows-jdk10] [resolver:resolve] Downloaded http://repo1.maven.org/maven2/org/apache/maven/resolver/maven-resolver-impl/1.1.1/maven-resolver-impl-1.1.1.jar (181 KB at 6676.5 KB/sec)
[windows-jdk10] [resolver:resolve] Downloading http://repo1.maven.org/maven2/org/apache/maven/resolver/maven-resolver-transport-file/1.1.1/maven-resolver-transport-file-1.1.1.jar
[windows-jdk10] [resolver:resolve] Downloaded http://repo1.maven.org/maven2/org/apache/maven/resolver/maven-resolver-util/1.1.1/maven-resolver-util-1.1.1.jar (156 KB at 5351.0 KB/sec)
[windows-jdk10] [resolver:resolve] Downloading http://repo1.maven.org/maven2/org/apache/maven/resolver/maven-resolver-transport-http/1.1.1/maven-resolver-transport-http-1.1.1.jar
[windows-jdk10] [resolver:resolve] Downloaded http://repo1.maven.org/maven2/org/apache/maven/resolver/maven-resolver-connector-basic/1.1.1/maven-resolver-connector-basic-1.1.1.jar (42 KB at 1161.1 KB/sec)
[windows-jdk10] [resolver:resolve] Downloading http://repo1.maven.org/maven2/org/apache/httpcomponents/httpclient/4.5.4/httpclient-4.5.4.jar
[windows-jdk10] [resolver:resolve] Downloaded http://repo1.maven.org/maven2/org/apache/maven/resolver/maven-resolver-transport-file/1.1.1/maven-resolver-transport-file-1.1.1.jar (13 KB at 314.1 KB/sec)
[windows-jdk10] [resolver:resolve] Downloading http://repo1.maven.org/maven2/commons-codec/commons-codec/1.10/commons-codec-1.10.jar
[windows-jdk10] [resolver:resolve] Downloaded http://repo1.maven.org/maven2/org/apache/maven/resolver/maven-resolver-transport-classpath/1.1.1/maven-resolver-transport-classpath-1.1.1.jar (13 KB at 281.8 KB/sec)
[windows-jdk10] [resolver:resolve] Downloading http://repo1.maven.org/maven2/org/apache/httpcomponents/httpcore/4.4.8/httpcore-4.4.8.jar
[windows-jdk10] [resolver:resolve] Downloaded http://repo1.maven.org/maven2/org/apache/maven/resolver/maven-resolver-transport-http/1.1.1/maven-resolver-transport-http-1.1.1.jar (41 KB at 918.9 KB/sec)
[windows-jdk10] [resolver:resolve] Downloading http://repo1.maven.org/maven2/org/apache/maven/maven-resolver-provider/3.5.0/maven-resolver-provider-3.5.0.jar
[windows-jdk10] [resolver:resolve] Downloaded http://repo1.maven.org/maven2/org/apache/maven/maven-resolver-provider/3.5.0/maven-resolver-provider-3.5.0.jar (67 KB at 1112.1 KB/sec)
[windows-jdk10] [resolver:resolve] Downloading http://repo1.maven.org/maven2/org/apache/maven/maven-model/3.5.0/maven-model-3.5.0.jar
[windows-jdk10] [resolver:resolve] Downloaded http://repo1.maven.org/maven2/commons-codec/commons-codec/1.10/commons-codec-1.10.jar (278 KB at 4204.9 KB/sec)
[windows-jdk10] [resolver:resolve] Downloading http://repo1.maven.org/maven2/org/apache/maven/maven-model-builder/3.5.0/maven-model-builder-3.5.0.jar
[windows-jdk10] [resolver:resolve] Downloaded http://repo1.maven.org/maven2/org/apache/httpcomponents/httpcore/4.4.8/httpcore-4.4.8.jar (317 KB at 4730.7 KB/sec)
[windows-jdk10] [resolver:resolve] Downloading http://repo1.maven.org/maven2/org/apache/maven/maven-artifact/3.5.0/maven-artifact-3.5.0.jar
[windows-jdk10] [resolver:resolve] Downloaded http://repo1.maven.org/maven2/org/apache/maven/maven-artifact/3.5.0/maven-artifact-3.5.0.jar (54 KB at 679.9 KB/sec)
[windows-jdk10] [resolver:resolve] Downloading http://repo1.maven.org/maven2/com/google/guava/guava/20.0/guava-20.0.jar
[windows-jdk10] [resolver:resolve] Downloaded http://repo1.maven.org/maven2/org/apache/maven/maven-model/3.5.0/maven-model-3.5.0.jar (162 KB at 2014.3 KB/sec)
[windows-jdk10] [resolver:resolve] Downloading http://repo1.maven.org/maven2/org/apache/maven/maven-repository-metadata/3.5.0/maven-repository-metadata-3.5.0.jar
[windows-jdk10] [resolver:resolve] Downloaded http://repo1.maven.org/maven2/org/apache/httpcomponents/httpclient/4.5.4/httpclient-4.5.4.jar (764 KB at 9311.1 KB/sec)
[windows-jdk10] [resolver:resolve] Downloading http://repo1.maven.org/maven2/org/codehaus/plexus/plexus-utils/3.0.24/plexus-utils-3.0.24.jar
[windows-jdk10] [resolver:resolve] Downloaded http://repo1.maven.org/maven2/org/apache/maven/maven-model-builder/3.5.0/maven-model-builder-3.5.0.jar (176 KB at 2084.5 KB/sec)
[windows-jdk10] [resolver:resolve] Downloading http://repo1.maven.org/maven2/org/apache/commons/commons-lang3/3.5/commons-lang3-3.5.jar
[windows-jdk10] [resolver:resolve] Downloaded http://repo1.maven.org/maven2/org/apache/ant/ant/1.8.2/ant-1.8.2.jar (1889 KB at 21958.4 KB/sec)
[windows-jdk10] [resolver:resolve] Downloading http://repo1.maven.org/maven2/org/apache/maven/maven-settings-builder/3.5.0/maven-settings-builder-3.5.0.jar
[windows-jdk10] [resolver:resolve] Downloaded http://repo1.maven.org/maven2/org/apache/maven/maven-repository-metadata/3.5.0/maven-repository-metadata-3.5.0.jar (27 KB at 291.7 KB/sec)
[windows-jdk10] [resolver:resolve] Downloading http://repo1.maven.org/maven2/org/apache/maven/maven-builder-support/3.5.0/maven-builder-support-3.5.0.jar
[windows-jdk10] [resolver:resolve] Downloaded http://repo1.maven.org/maven2/org/apache/maven/maven-settings-builder/3.5.0/maven-settings-builder-3.5.0.jar (43 KB at 418.2 KB/sec)
[windows-jdk10] [resolver:resolve] Downloading http://repo1.maven.org/maven2/org/apache/maven/maven-settings/3.5.0/maven-settings-3.5.0.jar
[windows-jdk10] [resolver:resolve] Downloaded http://repo1.maven.org/maven2/org/codehaus/plexus/plexus-utils/3.0.24/plexus-utils-3.0.24.jar (242 KB at 2236.6 KB/sec)
[windows-jdk10] [resolver:resolve] Downloading http://repo1.maven.org/maven2/org/sonatype/plexus/plexus-sec-dispatcher/1.4/plexus-sec-dispatcher-1.4.jar
[windows-jdk10] [resolver:resolve] Downloaded http://repo1.maven.org/maven2/org/apache/maven/maven-builder-support/3.5.0/maven-builder-support-3.5.0.jar (15 KB at 127.5 KB/sec)
[windows-jdk10] [resolver:resolve] Downloading http://repo1.maven.org/maven2/org/sonatype/plexus/plexus-cipher/1.4/plexus-cipher-1.4.jar
[windows-jdk10] [resolver:resolve] Downloaded http://repo1.maven.org/maven2/org/apache/commons/commons-lang3/3.5/commons-lang3-3.5.jar (469 KB at 3971.5 KB/sec)
[windows-jdk10] [resolver:resolve] Downloading http://repo1.maven.org/maven2/org/codehaus/plexus/plexus-component-annotations/1.6/plexus-component-annotations-1.6.jar
[windows-jdk10] [resolver:resolve] Downloaded http://repo1.maven.org/maven2/org/apache/maven/maven-settings/3.5.0/maven-settings-3.5.0.jar (44 KB at 359.8 KB/sec)
[windows-jdk10] [resolver:resolve] Downloading http://repo1.maven.org/maven2/org/codehaus/plexus/plexus-interpolation/1.16/plexus-interpolation-1.16.jar
[windows-jdk10] [resolver:resolve] Downloaded http://repo1.maven.org/maven2/org/sonatype/plexus/plexus-sec-dispatcher/1.4/plexus-sec-dispatcher-1.4.jar (28 KB at 214.7 KB/sec)
[windows-jdk10] [resolver:resolve] Downloading http://repo1.maven.org/maven2/org/eclipse/sisu/org.eclipse.sisu.plexus/0.1.1/org.eclipse.sisu.plexus-0.1.1.jar
[windows-jdk10] [resolver:resolve] Downloaded http://repo1.maven.org/maven2/org/sonatype/plexus/plexus-cipher/1.4/plexus-cipher-1.4.jar (14 KB at 99.1 KB/sec)
[windows-jdk10] [resolver:resolve] Downloaded http://repo1.maven.org/maven2/org/codehaus/plexus/plexus-component-annotations/1.6/plexus-component-annotations-1.6.jar (5 KB at 30.0 KB/sec)
[windows-jdk10] [resolver:resolve] Downloaded http://repo1.maven.org/maven2/org/codehaus/plexus/plexus-interpolation/1.16/plexus-interpolation-1.16.jar (60 KB at 430.7 KB/sec)
[windows-jdk10] [resolver:resolve] Downloaded http://repo1.maven.org/maven2/org/eclipse/sisu/org.eclipse.sisu.plexus/0.1.1/org.eclipse.sisu.plexus-0.1.1.jar (194 KB at 1368.9 KB/sec)
[windows-jdk10] [resolver:resolve] Downloaded http://repo1.maven.org/maven2/com/google/guava/guava/20.0/guava-20.0.jar (2386 KB at 16450.9 KB/sec)
[windows-jdk10]     [javac] Compiling 40 source files to f:\jenkins\jenkins-slave\workspace\n-resolver-ant-tasks_master-PZI36OPNRAJBXJOAPEQN5EKT3YVHZTR3KX72Y4FQGBMQE6GFTARQ@2\m\target\its\classes
[windows-jdk10]     [javac] Picked up JAVA_TOOL_OPTIONS: -Dmaven.ext.class.path="f:\jenkins\jenkins-slave\workspace\n-resolver-ant-tasks_master-PZI36OPNRAJBXJOAPEQN5EKT3YVHZTR3KX72Y4FQGBMQE6GFTARQ@2@tmp\withMaven7f5483b7\pipeline-maven-spy.jar" -Dorg.jenkinsci.plugins.pipeline.maven.reportsFolder="f:\jenkins\jenkins-slave\workspace\n-resolver-ant-tasks_master-PZI36OPNRAJBXJOAPEQN5EKT3YVHZTR3KX72Y4FQGBMQE6GFTARQ@2@tmp\withMaven7f5483b7"
[Pipeline] [windows-jdk9] }
[windows-jdk9] [withMaven] junitPublisher - Archive test results for Maven artifact org.apache.maven.resolver:maven-resolver-ant-tasks:1.1.2-SNAPSHOT generated by maven-surefire-plugin:test (default-test): m\target\surefire-reports\*.xml
[windows-jdk9] Recording test results
[Pipeline] [windows-jdk9] // withMaven
[Pipeline] [windows-jdk9] cleanWs
[windows-jdk10]     [javac] warning: [options] bootstrap class path not set in conjunction with -source 5
[windows-jdk10]     [javac] error: Source option 5 is no longer supported. Use 6 or later.
[windows-jdk10]     [javac] error: Target option 1.5 is no longer supported. Use 1.6 or later.
[windows-jdk9] [WS-CLEANUP] Deleting project workspace...[WS-CLEANUP] done
[Pipeline] [windows-jdk9] cleanWs
[windows-jdk8]     [junit] Tests run: 5, Failures: 0, Errors: 0, Time elapsed: 0.401 sec
[windows-jdk8]     [junit]
[windows-jdk8]     [junit] Testsuite: org.apache.maven.resolver.internal.ant.ProjectWorkspaceReaderTest
[windows-jdk8]     [junit] Tests run: 3, Failures: 0, Errors: 0, Time elapsed: 0.052 sec
[windows-jdk8]     [junit]
[windows-jdk8]     [junit] Testsuite: org.apache.maven.resolver.internal.ant.ReactorTest
[windows-jdk9] [WS-CLEANUP] Deleting project workspace...[WS-CLEANUP] done
[Pipeline] [windows-jdk9] }
[Pipeline] [windows-jdk9] // stage
[Pipeline] [windows-jdk9] }
[Pipeline] [windows-jdk9] // node
[Pipeline] [windows-jdk9] }
[windows-jdk10] [INFO] ------------------------------------------------------------------------
[windows-jdk10] [INFO] BUILD FAILURE
[windows-jdk10] [INFO] ------------------------------------------------------------------------
[windows-jdk10] [INFO] Total time: 33.144 s
[windows-jdk10] [INFO] Finished at: 2018-10-10T18:40:13Z
[windows-jdk10] [INFO] Final Memory: 36M/127M
[windows-jdk10] [INFO] ------------------------------------------------------------------------
[windows-jdk10] [INFO] [jenkins-event-spy] Generated F:\jenkins\jenkins-slave\workspace\n-resolver-ant-tasks_master-PZI36OPNRAJBXJOAPEQN5EKT3YVHZTR3KX72Y4FQGBMQE6GFTARQ@2@tmp\withMaven7f5483b7\maven-spy-20181010-183940-1189576432306078524059.log
[windows-jdk10] [ERROR] Failed to execute goal org.apache.maven.plugins:maven-antrun-plugin:1.6:run (smoke-test) on project maven-resolver-ant-tasks: An Ant BuildException has occured: The following error occurred while executing this line:
[windows-jdk10] [ERROR] f:\jenkins\jenkins-slave\workspace\n-resolver-ant-tasks_master-PZI36OPNRAJBXJOAPEQN5EKT3YVHZTR3KX72Y4FQGBMQE6GFTARQ@2\m\build.xml:71: Compile failed; see the compiler error output for details.
[windows-jdk10] [ERROR] -> [Help 1]
[windows-jdk10] [ERROR]
[windows-jdk10] [ERROR] To see the full stack trace of the errors, re-run Maven with the -e switch.
[windows-jdk10] [ERROR] Re-run Maven using the -X switch to enable full debug logging.
[windows-jdk10] [ERROR]
[windows-jdk10] [ERROR] For more information about the errors and possible solutions, please read the following articles:
[windows-jdk10] [ERROR] [Help 1] http://cwiki.apache.org/confluence/display/MAVEN/MojoExecutionException
[windows-jdk9] Failed in branch windows-jdk9
[Pipeline] [windows-jdk10] }
[Pipeline] [windows-jdk10] // dir
[windows-jdk8]     [junit] Picked up JAVA_TOOL_OPTIONS: -Dmaven.ext.class.path="f:\jenkins\jenkins-slave\workspace\n-resolver-ant-tasks_master-PZI36OPNRAJBXJOAPEQN5EKT3YVHZTR3KX72Y4FQGBMQE6GFTARQ@tmp\withMavenb14afc94\pipeline-maven-spy.jar" -Dorg.jenkinsci.plugins.pipeline.maven.reportsFolder="f:\jenkins\jenkins-slave\workspace\n-resolver-ant-tasks_master-PZI36OPNRAJBXJOAPEQN5EKT3YVHZTR3KX72Y4FQGBMQE6GFTARQ@tmp\withMavenb14afc94"
[windows-jdk8]     [junit] Tests run: 6, Failures: 0, Errors: 1, Time elapsed: 0.588 sec
[windows-jdk8]     [junit]
[windows-jdk8]     [junit] Testcase: testResolveVersionRange(org.apache.maven.resolver.internal.ant.ReactorTest): Caused an ERROR
[windows-jdk8]     [junit] java.lang.NoClassDefFoundError: org/apache/commons/logging/LogFactory
[windows-jdk8]     [junit] f:\jenkins\jenkins-slave\workspace\n-resolver-ant-tasks_master-PZI36OPNRAJBXJOAPEQN5EKT3YVHZTR3KX72Y4FQGBMQE6GFTARQ\m\src\test\resources\ant\Reactor\ant.xml:70: java.lang.NoClassDefFoundError: org/apache/commons/logging/LogFactory
[windows-jdk8]     [junit] at org.apache.maven.resolver.internal.ant.ReactorTest.testResolveVersionRange(Unknown Source)
[windows-jdk8]     [junit] Caused by: java.lang.NoClassDefFoundError: org/apache/commons/logging/LogFactory
[windows-jdk8]     [junit] at org.apache.http.conn.ssl.AbstractVerifier.<init>(AbstractVerifier.java:61)
[windows-jdk8]     [junit] at org.apache.http.conn.ssl.AllowAllHostnameVerifier.<init>(AllowAllHostnameVerifier.java:44)
[windows-jdk8]     [junit] at org.apache.http.conn.ssl.AllowAllHostnameVerifier.<clinit>(AllowAllHostnameVerifier.java:46)
[windows-jdk8]     [junit] at org.apache.http.conn.ssl.SSLSocketFactory.<clinit>(SSLSocketFactory.java:153)
[windows-jdk8]     [junit] at org.eclipse.aether.transport.http.GlobalState.newConnectionManager(GlobalState.java:175)
[windows-jdk8]     [junit] at org.eclipse.aether.transport.http.GlobalState.getConnectionManager(GlobalState.java:157)
[windows-jdk8]     [junit] at org.eclipse.aether.transport.http.LocalState.<init>(LocalState.java:70)
[windows-jdk8]     [junit] at org.eclipse.aether.transport.http.HttpTransporter.<init>(HttpTransporter.java:137)
[windows-jdk8]     [junit] at org.eclipse.aether.transport.http.HttpTransporterFactory.newInstance(HttpTransporterFactory.java:102)
[windows-jdk8]     [junit] at org.eclipse.aether.internal.impl.DefaultTransporterProvider.newTransporter(DefaultTransporterProvider.java:113)
[windows-jdk8]     [junit] at org.eclipse.aether.connector.basic.BasicRepositoryConnector.<init>(BasicRepositoryConnector.java:125)
[windows-jdk8]     [junit] at org.eclipse.aether.connector.basic.BasicRepositoryConnectorFactory.newInstance(BasicRepositoryConnectorFactory.java:175)
[windows-jdk8]     [junit] at org.eclipse.aether.internal.impl.DefaultRepositoryConnectorProvider.newRepositoryConnector(DefaultRepositoryConnectorProvider.java:116)
[windows-jdk8]     [junit] at org.eclipse.aether.internal.impl.DefaultMetadataResolver$ResolveTask.run(DefaultMetadataResolver.java:589)
[windows-jdk8]     [junit] at org.eclipse.aether.util.concurrency.RunnableErrorForwarder$1.run(RunnableErrorForwarder.java:75)
[windows-jdk8]     [junit] at org.eclipse.aether.internal.impl.DefaultMetadataResolver$1.execute(DefaultMetadataResolver.java:513)
[windows-jdk8]     [junit] at org.eclipse.aether.internal.impl.DefaultMetadataResolver.resolve(DefaultMetadataResolver.java:368)
[windows-jdk8]     [junit] at org.eclipse.aether.internal.impl.DefaultMetadataResolver.resolveMetadata(DefaultMetadataResolver.java:191)
[windows-jdk8]     [junit] at org.apache.maven.repository.internal.DefaultVersionRangeResolver.getVersions(DefaultVersionRangeResolver.java:223)
[windows-jdk8]     [junit] at org.apache.maven.repository.internal.DefaultVersionRangeResolver.resolveVersionRange(DefaultVersionRangeResolver.java:173)
[windows-jdk8]     [junit] at org.eclipse.aether.internal.impl.DefaultDependencyCollector.cachedResolveRangeResult(DefaultDependencyCollector.java:619)
[windows-jdk8]     [junit] at org.eclipse.aether.internal.impl.DefaultDependencyCollector.processDependency(DefaultDependencyCollector.java:394)
[windows-jdk8]     [junit] at org.eclipse.aether.internal.impl.DefaultDependencyCollector.processDependency(DefaultDependencyCollector.java:365)
[windows-jdk8]     [junit] at org.eclipse.aether.internal.impl.DefaultDependencyCollector.process(DefaultDependencyCollector.java:353)
[windows-jdk8]     [junit] at org.eclipse.aether.internal.impl.DefaultDependencyCollector.collectDependencies(DefaultDependencyCollector.java:256)
[windows-jdk8]     [junit] at org.eclipse.aether.internal.impl.DefaultRepositorySystem.collectDependencies(DefaultRepositorySystem.java:282)
[windows-jdk8]     [junit] at org.apache.maven.resolver.internal.ant.AntRepoSys.collectDependencies(Unknown Source)
[windows-jdk8]     [junit] at org.apache.maven.resolver.internal.ant.tasks.AbstractResolvingTask.collectDependencies(Unknown Source)
[windows-jdk8]     [junit] at org.apache.maven.resolver.internal.ant.tasks.Resolve.execute(Unknown Source)
[windows-jdk8]     [junit] Caused by: java.lang.ClassNotFoundException: org.apache.commons.logging.LogFactory
[windows-jdk8]     [junit] at java.net.URLClassLoader.findClass(URLClassLoader.java:381)
[windows-jdk8]     [junit] at java.lang.ClassLoader.loadClass(ClassLoader.java:424)
[windows-jdk8]     [junit] at sun.misc.Launcher$AppClassLoader.loadClass(Launcher.java:338)
[windows-jdk8]     [junit] at java.lang.ClassLoader.loadClass(ClassLoader.java:357)
[windows-jdk8]     [junit]
[windows-jdk8]     [junit]
[windows-jdk8] [INFO] ------------------------------------------------------------------------
[windows-jdk8] [INFO] BUILD FAILURE
[windows-jdk8] [INFO] ------------------------------------------------------------------------
[windows-jdk8] [INFO] Total time: 51.056 s
[windows-jdk8] [INFO] Finished at: 2018-10-10T18:40:14Z
[windows-jdk8] [INFO] Final Memory: 49M/1011M
[windows-jdk8] [INFO] ------------------------------------------------------------------------
[windows-jdk8] [INFO] [jenkins-event-spy] Generated F:\jenkins\jenkins-slave\workspace\n-resolver-ant-tasks_master-PZI36OPNRAJBXJOAPEQN5EKT3YVHZTR3KX72Y4FQGBMQE6GFTARQ@tmp\withMavenb14afc94\maven-spy-20181010-183922-5825922828427675883701.log
[windows-jdk8] [ERROR] Failed to execute goal org.apache.maven.plugins:maven-antrun-plugin:1.6:run (smoke-test) on project maven-resolver-ant-tasks: An Ant BuildException has occured: The following error occurred while executing this line:
[windows-jdk8] [ERROR] f:\jenkins\jenkins-slave\workspace\n-resolver-ant-tasks_master-PZI36OPNRAJBXJOAPEQN5EKT3YVHZTR3KX72Y4FQGBMQE6GFTARQ\m\build.xml:98: Tests failed
[windows-jdk8] [ERROR] -> [Help 1]
[windows-jdk8] [ERROR]
[windows-jdk8] [ERROR] To see the full stack trace of the errors, re-run Maven with the -e switch.
[windows-jdk8] [ERROR] Re-run Maven using the -X switch to enable full debug logging.
[windows-jdk8] [ERROR]
[windows-jdk8] [ERROR] For more information about the errors and possible solutions, please read the following articles:
[windows-jdk8] [ERROR] [Help 1] http://cwiki.apache.org/confluence/display/MAVEN/MojoExecutionException
[Pipeline] [windows-jdk10] }
[windows-jdk8] Picked up JAVA_TOOL_OPTIONS: -Dmaven.ext.class.path="f:\jenkins\jenkins-slave\workspace\n-resolver-ant-tasks_master-PZI36OPNRAJBXJOAPEQN5EKT3YVHZTR3KX72Y4FQGBMQE6GFTARQ@tmp\withMavenb14afc94\pipeline-maven-spy.jar" -Dorg.jenkinsci.plugins.pipeline.maven.reportsFolder="f:\jenkins\jenkins-slave\workspace\n-resolver-ant-tasks_master-PZI36OPNRAJBXJOAPEQN5EKT3YVHZTR3KX72Y4FQGBMQE6GFTARQ@tmp\withMavenb14afc94"
[windows-jdk10] [withMaven] junitPublisher - Archive test results for Maven artifact org.apache.maven.resolver:maven-resolver-ant-tasks:1.1.2-SNAPSHOT generated by maven-surefire-plugin:test (default-test): m\target\surefire-reports\*.xml
[windows-jdk10] Recording test results
[Pipeline] [windows-jdk10] // withMaven
[Pipeline] [windows-jdk8] }
[Pipeline] [windows-jdk10] cleanWs
[Pipeline] [windows-jdk8] // dir
[windows-jdk10] [WS-CLEANUP] Deleting project workspace...[WS-CLEANUP] done
[Pipeline] [windows-jdk8] }
[windows-jdk8] [withMaven] junitPublisher - Archive test results for Maven artifact org.apache.maven.resolver:maven-resolver-ant-tasks:1.1.2-SNAPSHOT generated by maven-surefire-plugin:test (default-test): m\target\surefire-reports\*.xml
[windows-jdk8] Recording test results
[Pipeline] [windows-jdk8] // withMaven
[Pipeline] [windows-jdk8] cleanWs
[Pipeline] [windows-jdk10] cleanWs
[windows-jdk8] [WS-CLEANUP] Deleting project workspace...[WS-CLEANUP] done
[windows-jdk10] [WS-CLEANUP] Deleting project workspace...[WS-CLEANUP] done
[Pipeline] [windows-jdk8] cleanWs
[Pipeline] [windows-jdk10] }
[Pipeline] [windows-jdk10] // stage
[windows-jdk8] [WS-CLEANUP] Deleting project workspace...[WS-CLEANUP] done
[Pipeline] [windows-jdk10] }
[Pipeline] [windows-jdk10] // node
[Pipeline] [windows-jdk10] }
[windows-jdk10] Failed in branch windows-jdk10
[Pipeline] [windows-jdk8] }
[Pipeline] [windows-jdk8] // stage
[Pipeline] [windows-jdk8] }
[Pipeline] [windows-jdk8] // node
[Pipeline] [windows-jdk8] }
[windows-jdk8] Failed in branch windows-jdk8
[Pipeline] // parallel
[Pipeline] stage
[Pipeline] { (Notifications)
[Pipeline] echo
Build result: FAILURE
[Pipeline] jiraIssueSelector
[Pipeline] emailext