Build failed in Jenkins: Maven TLP » maven-resolver » MRESOLVER-8 #15

classic Classic list List threaded Threaded
4 messages Options
Reply | Threaded
Open this post in threaded view
|

Build failed in Jenkins: Maven TLP » maven-resolver » MRESOLVER-8 #15

Apache Jenkins Server-2
See https://builds.apache.org/job/maven-box/job/maven-resolver/job/MRESOLVER-8/15/

Changes:

* H30 is having issues

All tests passed

Build log:
[...truncated 30158 lines...]
[INFO] Downloaded from central: https://repo.maven.apache.org/maven2/org/ow2/asm/asm-commons/6.1.1/asm-commons-6.1.1.jar (78 kB at 1.9 MB/s)
[INFO] Downloading from central: https://repo.maven.apache.org/maven2/com/thoughtworks/qdox/qdox/2.0-M5/qdox-2.0-M5.jar
[INFO] Downloading from central: https://repo.maven.apache.org/maven2/org/apache/maven/plugin-tools/maven-plugin-tools-annotations/3.5.2/maven-plugin-tools-annotations-3.5.2.jar
[INFO] Downloaded from central: https://repo.maven.apache.org/maven2/org/apache/maven/plugin-tools/maven-plugin-tools-java/3.5.2/maven-plugin-tools-java-3.5.2.jar (18 kB at 292 kB/s)
[INFO] Downloading from central: https://repo.maven.apache.org/maven2/org/codehaus/plexus/plexus-archiver/3.4.1/plexus-archiver-3.4.1.jar
[INFO] Downloaded from central: https://repo.maven.apache.org/maven2/org/apache/maven/plugin-tools/maven-plugin-tools-annotations/3.5.2/maven-plugin-tools-annotations-3.5.2.jar (43 kB at 606 kB/s)
[INFO] Downloaded from central: https://repo.maven.apache.org/maven2/net/sf/jtidy/jtidy/r938/jtidy-r938.jar (250 kB at 3.5 MB/s)
[INFO] Downloading from central: https://repo.maven.apache.org/maven2/org/apache/maven/doxia/doxia-core/1.4/doxia-core-1.4.jar
[INFO] Downloading from central: https://repo.maven.apache.org/maven2/javax/servlet/servlet-api/2.3/servlet-api-2.3.jar
[INFO] Downloaded from central: https://repo.maven.apache.org/maven2/com/thoughtworks/qdox/qdox/2.0-M5/qdox-2.0-M5.jar (313 kB at 3.7 MB/s)
[INFO] Downloading from central: https://repo.maven.apache.org/maven2/org/codehaus/plexus/plexus-utils/3.0.20/plexus-utils-3.0.20.jar
[INFO] Downloaded from central: https://repo.maven.apache.org/maven2/org/codehaus/plexus/plexus-archiver/3.4.1/plexus-archiver-3.4.1.jar (187 kB at 1.8 MB/s)
[INFO] Downloading from central: https://repo.maven.apache.org/maven2/org/apache/maven/surefire/maven-surefire-common/2.19.1/maven-surefire-common-2.19.1.jar
[INFO] Downloaded from central: https://repo.maven.apache.org/maven2/org/apache/maven/doxia/doxia-core/1.4/doxia-core-1.4.jar (165 kB at 1.5 MB/s)
[INFO] Downloading from central: https://repo.maven.apache.org/maven2/org/apache/maven/surefire/surefire-api/2.19.1/surefire-api-2.19.1.jar
[INFO] Downloaded from central: https://repo.maven.apache.org/maven2/javax/servlet/servlet-api/2.3/servlet-api-2.3.jar (78 kB at 690 kB/s)
[INFO] Downloading from central: https://repo.maven.apache.org/maven2/org/apache/maven/surefire/surefire-booter/2.19.1/surefire-booter-2.19.1.jar
[INFO] Downloaded from central: https://repo.maven.apache.org/maven2/org/codehaus/plexus/plexus-utils/3.0.20/plexus-utils-3.0.20.jar (243 kB at 2.1 MB/s)
[INFO] Downloading from central: https://repo.maven.apache.org/maven2/org/apache/commons/commons-lang3/3.1/commons-lang3-3.1.jar
[INFO] Downloaded from central: https://repo.maven.apache.org/maven2/org/apache/maven/surefire/maven-surefire-common/2.19.1/maven-surefire-common-2.19.1.jar (293 kB at 2.1 MB/s)
[INFO] Downloaded from central: https://repo.maven.apache.org/maven2/org/apache/maven/surefire/surefire-booter/2.19.1/surefire-booter-2.19.1.jar (46 kB at 323 kB/s)
[INFO] Downloaded from central: https://repo.maven.apache.org/maven2/org/apache/maven/surefire/surefire-api/2.19.1/surefire-api-2.19.1.jar (196 kB at 1.3 MB/s)
[INFO] Downloaded from central: https://repo.maven.apache.org/maven2/org/apache/commons/commons-lang3/3.1/commons-lang3-3.1.jar (316 kB at 2.1 MB/s)
[INFO] Downloaded from central: https://repo.maven.apache.org/maven2/org/ow2/asm/asm-analysis/6.1.1/asm-analysis-6.1.1.jar (32 kB at 175 kB/s)
[ERROR]

Artifact Ids of the format maven-___-plugin are reserved for
plugins in the Group Id org.apache.maven.plugins
Please change your artifactId to the format ___-maven-plugin
In the future this error will break the build.


[INFO] Using 'UTF-8' encoding to read mojo source files.
[INFO] java-javadoc mojo extractor found 0 mojo descriptor.
[INFO] java-annotations mojo extractor found 1 mojo descriptor.
[INFO]
[INFO] --- maven-resources-plugin:3.1.0:testResources (default-testResources) @ maven-resolver-demo-maven-plugin ---
[INFO] Using 'UTF-8' encoding to copy filtered resources.
[INFO] skip non existing resourceDirectory F:\jenkins\jenkins-slave\workspace\n-box_maven-resolver_MRESOLVER-8\m\maven-resolver-demos\maven-resolver-demo-maven-plugin\src\test\resources
[INFO] Copying 3 resources
[INFO]
[INFO] --- maven-compiler-plugin:3.7.0:testCompile (default-testCompile) @ maven-resolver-demo-maven-plugin ---
[INFO] No sources to compile
[INFO]
[INFO] --- maven-surefire-plugin:2.22.0:test (default-test) @ maven-resolver-demo-maven-plugin ---
[INFO]
[INFO] --- maven-jar-plugin:3.1.0:jar (default-jar) @ maven-resolver-demo-maven-plugin ---
[INFO] Building jar: F:\jenkins\jenkins-slave\workspace\n-box_maven-resolver_MRESOLVER-8\m\maven-resolver-demos\maven-resolver-demo-maven-plugin\target\maven-resolver-demo-maven-plugin-1.4.0-SNAPSHOT.jar
[INFO]
[INFO] --- maven-plugin-plugin:3.5.2:addPluginArtifactMetadata (default-addPluginArtifactMetadata) @ maven-resolver-demo-maven-plugin ---
[INFO]
[INFO] --- maven-site-plugin:3.7.1:attach-descriptor (attach-descriptor) @ maven-resolver-demo-maven-plugin ---
[INFO] Skipping because packaging 'maven-plugin' is not pom.
[INFO]
[INFO] --- maven-invoker-plugin:3.0.1:install (integration-test) @ maven-resolver-demo-maven-plugin ---
[INFO] Downloading from central: https://repo.maven.apache.org/maven2/org/apache/maven/shared/maven-invoker/3.0.0/maven-invoker-3.0.0.pom
[INFO] Downloaded from central: https://repo.maven.apache.org/maven2/org/apache/maven/shared/maven-invoker/3.0.0/maven-invoker-3.0.0.pom (5.0 kB at 148 kB/s)
[INFO] Downloading from central: https://repo.maven.apache.org/maven2/org/apache/maven/reporting/maven-reporting-impl/2.4/maven-reporting-impl-2.4.pom
[INFO] Downloaded from central: https://repo.maven.apache.org/maven2/org/apache/maven/reporting/maven-reporting-impl/2.4/maven-reporting-impl-2.4.pom (6.1 kB at 178 kB/s)
[INFO] Downloading from central: https://repo.maven.apache.org/maven2/commons-validator/commons-validator/1.4.1/commons-validator-1.4.1.pom
[INFO] Downloaded from central: https://repo.maven.apache.org/maven2/commons-validator/commons-validator/1.4.1/commons-validator-1.4.1.pom (13 kB at 362 kB/s)
[INFO] Downloading from central: https://repo.maven.apache.org/maven2/org/apache/commons/commons-parent/36/commons-parent-36.pom
[INFO] Downloaded from central: https://repo.maven.apache.org/maven2/org/apache/commons/commons-parent/36/commons-parent-36.pom (58 kB at 1.3 MB/s)
[INFO] Downloading from central: https://repo.maven.apache.org/maven2/commons-beanutils/commons-beanutils/1.8.3/commons-beanutils-1.8.3.pom
[INFO] Downloaded from central: https://repo.maven.apache.org/maven2/commons-beanutils/commons-beanutils/1.8.3/commons-beanutils-1.8.3.pom (11 kB at 350 kB/s)
[INFO] Downloading from central: https://repo.maven.apache.org/maven2/org/apache/commons/commons-parent/14/commons-parent-14.pom
[INFO] Downloaded from central: https://repo.maven.apache.org/maven2/org/apache/commons/commons-parent/14/commons-parent-14.pom (31 kB at 766 kB/s)
[INFO] Downloading from central: https://repo.maven.apache.org/maven2/commons-digester/commons-digester/1.8.1/commons-digester-1.8.1.pom
[INFO] Downloaded from central: https://repo.maven.apache.org/maven2/commons-digester/commons-digester/1.8.1/commons-digester-1.8.1.pom (10 kB at 287 kB/s)
[INFO] Downloading from central: https://repo.maven.apache.org/maven2/org/apache/maven/shared/maven-script-interpreter/1.2/maven-script-interpreter-1.2.pom
[INFO] Downloaded from central: https://repo.maven.apache.org/maven2/org/apache/maven/shared/maven-script-interpreter/1.2/maven-script-interpreter-1.2.pom (4.0 kB at 108 kB/s)
[INFO] Downloading from central: https://repo.maven.apache.org/maven2/org/apache/ant/ant/1.8.1/ant-1.8.1.pom
[INFO] Downloaded from central: https://repo.maven.apache.org/maven2/org/apache/ant/ant/1.8.1/ant-1.8.1.pom (8.8 kB at 169 kB/s)
[INFO] Downloading from central: https://repo.maven.apache.org/maven2/org/apache/ant/ant-parent/1.8.1/ant-parent-1.8.1.pom
[INFO] Downloaded from central: https://repo.maven.apache.org/maven2/org/apache/ant/ant-parent/1.8.1/ant-parent-1.8.1.pom (4.3 kB at 122 kB/s)
[INFO] Downloading from central: https://repo.maven.apache.org/maven2/org/apache/maven/shared/maven-artifact-transfer/0.9.1/maven-artifact-transfer-0.9.1.pom
[INFO] Downloaded from central: https://repo.maven.apache.org/maven2/org/apache/maven/shared/maven-artifact-transfer/0.9.1/maven-artifact-transfer-0.9.1.pom (7.6 kB at 224 kB/s)
[INFO] Downloading from central: https://repo.maven.apache.org/maven2/org/apache/maven/shared/maven-common-artifact-filters/3.0.1/maven-common-artifact-filters-3.0.1.pom
[INFO] Downloaded from central: https://repo.maven.apache.org/maven2/org/apache/maven/shared/maven-common-artifact-filters/3.0.1/maven-common-artifact-filters-3.0.1.pom (4.8 kB at 147 kB/s)
[INFO] Downloading from central: https://repo.maven.apache.org/maven2/commons-codec/commons-codec/1.6/commons-codec-1.6.pom
[INFO] Downloaded from central: https://repo.maven.apache.org/maven2/commons-codec/commons-codec/1.6/commons-codec-1.6.pom (11 kB at 338 kB/s)
[INFO] Downloading from central: https://repo.maven.apache.org/maven2/org/slf4j/slf4j-api/1.7.5/slf4j-api-1.7.5.pom
[INFO] Downloaded from central: https://repo.maven.apache.org/maven2/org/slf4j/slf4j-api/1.7.5/slf4j-api-1.7.5.pom (2.7 kB at 84 kB/s)
[INFO] Downloading from central: https://repo.maven.apache.org/maven2/org/slf4j/slf4j-parent/1.7.5/slf4j-parent-1.7.5.pom
[INFO] Downloaded from central: https://repo.maven.apache.org/maven2/org/slf4j/slf4j-parent/1.7.5/slf4j-parent-1.7.5.pom (12 kB at 347 kB/s)
[INFO] Downloading from central: https://repo.maven.apache.org/maven2/org/apache/maven/doxia/doxia-sink-api/1.7/doxia-sink-api-1.7.pom
[INFO] Downloaded from central: https://repo.maven.apache.org/maven2/org/apache/maven/doxia/doxia-sink-api/1.7/doxia-sink-api-1.7.pom (1.5 kB at 46 kB/s)
[INFO] Downloading from central: https://repo.maven.apache.org/maven2/org/apache/maven/doxia/doxia/1.7/doxia-1.7.pom
[INFO] Downloaded from central: https://repo.maven.apache.org/maven2/org/apache/maven/doxia/doxia/1.7/doxia-1.7.pom (15 kB at 424 kB/s)
[INFO] Downloading from central: https://repo.maven.apache.org/maven2/org/apache/maven/doxia/doxia-logging-api/1.7/doxia-logging-api-1.7.pom
[INFO] Downloaded from central: https://repo.maven.apache.org/maven2/org/apache/maven/doxia/doxia-logging-api/1.7/doxia-logging-api-1.7.pom (1.5 kB at 48 kB/s)
[INFO] Downloading from central: https://repo.maven.apache.org/maven2/org/apache/maven/doxia/doxia-site-renderer/1.7.4/doxia-site-renderer-1.7.4.pom
[INFO] Downloaded from central: https://repo.maven.apache.org/maven2/org/apache/maven/doxia/doxia-site-renderer/1.7.4/doxia-site-renderer-1.7.4.pom (6.7 kB at 191 kB/s)
[INFO] Downloading from central: https://repo.maven.apache.org/maven2/org/apache/maven/doxia/doxia-sitetools/1.7.4/doxia-sitetools-1.7.4.pom
[INFO] Downloaded from central: https://repo.maven.apache.org/maven2/org/apache/maven/doxia/doxia-sitetools/1.7.4/doxia-sitetools-1.7.4.pom (14 kB at 302 kB/s)
[INFO] Downloading from central: https://repo.maven.apache.org/maven2/org/apache/maven/doxia/doxia-core/1.7/doxia-core-1.7.pom
[INFO] Downloaded from central: https://repo.maven.apache.org/maven2/org/apache/maven/doxia/doxia-core/1.7/doxia-core-1.7.pom (4.1 kB at 123 kB/s)
[INFO] Downloading from central: https://repo.maven.apache.org/maven2/org/apache/maven/doxia/doxia-decoration-model/1.7.4/doxia-decoration-model-1.7.4.pom
[INFO] Downloaded from central: https://repo.maven.apache.org/maven2/org/apache/maven/doxia/doxia-decoration-model/1.7.4/doxia-decoration-model-1.7.4.pom (3.4 kB at 97 kB/s)
[INFO] Downloading from central: https://repo.maven.apache.org/maven2/org/apache/maven/doxia/doxia-skin-model/1.7.4/doxia-skin-model-1.7.4.pom
[INFO] Downloaded from central: https://repo.maven.apache.org/maven2/org/apache/maven/doxia/doxia-skin-model/1.7.4/doxia-skin-model-1.7.4.pom (3.0 kB at 89 kB/s)
[INFO] Downloading from central: https://repo.maven.apache.org/maven2/org/apache/maven/doxia/doxia-module-xhtml/1.7/doxia-module-xhtml-1.7.pom
[INFO] Downloaded from central: https://repo.maven.apache.org/maven2/org/apache/maven/doxia/doxia-module-xhtml/1.7/doxia-module-xhtml-1.7.pom (1.6 kB at 49 kB/s)
[INFO] Downloading from central: https://repo.maven.apache.org/maven2/org/apache/maven/doxia/doxia-modules/1.7/doxia-modules-1.7.pom
[INFO] Downloaded from central: https://repo.maven.apache.org/maven2/org/apache/maven/doxia/doxia-modules/1.7/doxia-modules-1.7.pom (2.6 kB at 79 kB/s)
[INFO] Downloading from central: https://repo.maven.apache.org/maven2/org/codehaus/groovy/groovy-all/2.4.8/groovy-all-2.4.8.pom
[INFO] Downloaded from central: https://repo.maven.apache.org/maven2/org/codehaus/groovy/groovy-all/2.4.8/groovy-all-2.4.8.pom (21 kB at 611 kB/s)
[INFO] Downloading from central: https://repo.maven.apache.org/maven2/org/apache/maven/shared/maven-invoker/3.0.0/maven-invoker-3.0.0.jar
[INFO] Downloading from central: https://repo.maven.apache.org/maven2/commons-digester/commons-digester/1.8.1/commons-digester-1.8.1.jar
[INFO] Downloading from central: https://repo.maven.apache.org/maven2/commons-beanutils/commons-beanutils/1.8.3/commons-beanutils-1.8.3.jar
[INFO] Downloading from central: https://repo.maven.apache.org/maven2/commons-validator/commons-validator/1.4.1/commons-validator-1.4.1.jar
[INFO] Downloading from central: https://repo.maven.apache.org/maven2/org/apache/maven/reporting/maven-reporting-impl/2.4/maven-reporting-impl-2.4.jar
[INFO] Downloaded from central: https://repo.maven.apache.org/maven2/org/apache/maven/reporting/maven-reporting-impl/2.4/maven-reporting-impl-2.4.jar (20 kB at 643 kB/s)
[INFO] Downloading from central: https://repo.maven.apache.org/maven2/commons-logging/commons-logging/1.2/commons-logging-1.2.jar
[INFO] Downloaded from central: https://repo.maven.apache.org/maven2/commons-beanutils/commons-beanutils/1.8.3/commons-beanutils-1.8.3.jar (232 kB at 6.3 MB/s)
[INFO] Downloading from central: https://repo.maven.apache.org/maven2/org/apache/maven/shared/maven-script-interpreter/1.2/maven-script-interpreter-1.2.jar
[INFO] Downloaded from central: https://repo.maven.apache.org/maven2/commons-validator/commons-validator/1.4.1/commons-validator-1.4.1.jar (190 kB at 4.1 MB/s)
[INFO] Downloading from central: https://repo.maven.apache.org/maven2/org/apache/ant/ant/1.8.1/ant-1.8.1.jar
[INFO] Downloaded from central: https://repo.maven.apache.org/maven2/commons-digester/commons-digester/1.8.1/commons-digester-1.8.1.jar (146 kB at 3.0 MB/s)
[INFO] Downloading from central: https://repo.maven.apache.org/maven2/org/apache/maven/shared/maven-artifact-transfer/0.9.1/maven-artifact-transfer-0.9.1.jar
[INFO] Downloaded from central: https://repo.maven.apache.org/maven2/commons-logging/commons-logging/1.2/commons-logging-1.2.jar (62 kB at 937 kB/s)
[INFO] Downloading from central: https://repo.maven.apache.org/maven2/org/apache/maven/shared/maven-common-artifact-filters/3.0.1/maven-common-artifact-filters-3.0.1.jar
[INFO] Downloaded from central: https://repo.maven.apache.org/maven2/org/apache/maven/shared/maven-script-interpreter/1.2/maven-script-interpreter-1.2.jar (22 kB at 324 kB/s)
[INFO] Downloading from central: https://repo.maven.apache.org/maven2/commons-codec/commons-codec/1.6/commons-codec-1.6.jar
[INFO] Downloaded from central: https://repo.maven.apache.org/maven2/org/apache/maven/shared/maven-artifact-transfer/0.9.1/maven-artifact-transfer-0.9.1.jar (123 kB at 1.3 MB/s)
[INFO] Downloading from central: https://repo.maven.apache.org/maven2/org/slf4j/slf4j-api/1.7.5/slf4j-api-1.7.5.jar
[INFO] Downloaded from central: https://repo.maven.apache.org/maven2/commons-codec/commons-codec/1.6/commons-codec-1.6.jar (233 kB at 2.3 MB/s)
[INFO] Downloading from central: https://repo.maven.apache.org/maven2/org/apache/maven/doxia/doxia-sink-api/1.7/doxia-sink-api-1.7.jar
[INFO] Downloaded from central: https://repo.maven.apache.org/maven2/org/apache/maven/shared/maven-common-artifact-filters/3.0.1/maven-common-artifact-filters-3.0.1.jar (61 kB at 559 kB/s)
[INFO] Downloading from central: https://repo.maven.apache.org/maven2/org/apache/maven/doxia/doxia-logging-api/1.7/doxia-logging-api-1.7.jar
[INFO] Downloaded from central: https://repo.maven.apache.org/maven2/org/apache/ant/ant/1.8.1/ant-1.8.1.jar (1.5 MB at 12 MB/s)
[INFO] Downloading from central: https://repo.maven.apache.org/maven2/org/apache/maven/doxia/doxia-site-renderer/1.7.4/doxia-site-renderer-1.7.4.jar
[INFO] Downloaded from central: https://repo.maven.apache.org/maven2/org/apache/maven/doxia/doxia-site-renderer/1.7.4/doxia-site-renderer-1.7.4.jar (64 kB at 346 kB/s)
[INFO] Downloading from central: https://repo.maven.apache.org/maven2/org/apache/maven/doxia/doxia-decoration-model/1.7.4/doxia-decoration-model-1.7.4.jar
[INFO] Downloaded from central: https://repo.maven.apache.org/maven2/org/apache/maven/doxia/doxia-sink-api/1.7/doxia-sink-api-1.7.jar (11 kB at 58 kB/s)
[INFO] Downloading from central: https://repo.maven.apache.org/maven2/org/apache/maven/doxia/doxia-skin-model/1.7.4/doxia-skin-model-1.7.4.jar
[INFO] Downloaded from central: https://repo.maven.apache.org/maven2/org/apache/maven/shared/maven-invoker/3.0.0/maven-invoker-3.0.0.jar (33 kB at 156 kB/s)
[INFO] Downloading from central: https://repo.maven.apache.org/maven2/org/apache/maven/doxia/doxia-module-xhtml/1.7/doxia-module-xhtml-1.7.jar
[INFO] Downloaded from central: https://repo.maven.apache.org/maven2/org/apache/maven/doxia/doxia-decoration-model/1.7.4/doxia-decoration-model-1.7.4.jar (61 kB at 285 kB/s)
[INFO] Downloading from central: https://repo.maven.apache.org/maven2/org/codehaus/groovy/groovy-all/2.4.8/groovy-all-2.4.8.jar
[INFO] Downloaded from central: https://repo.maven.apache.org/maven2/org/apache/maven/doxia/doxia-logging-api/1.7/doxia-logging-api-1.7.jar (12 kB at 52 kB/s)
[INFO] Downloaded from central: https://repo.maven.apache.org/maven2/org/apache/maven/doxia/doxia-skin-model/1.7.4/doxia-skin-model-1.7.4.jar (16 kB at 72 kB/s)
[INFO] Downloaded from central: https://repo.maven.apache.org/maven2/org/apache/maven/doxia/doxia-module-xhtml/1.7/doxia-module-xhtml-1.7.jar (17 kB at 74 kB/s)
[INFO] Downloaded from central: https://repo.maven.apache.org/maven2/org/slf4j/slf4j-api/1.7.5/slf4j-api-1.7.5.jar (26 kB at 95 kB/s)
[INFO] Downloaded from central: https://repo.maven.apache.org/maven2/org/codehaus/groovy/groovy-all/2.4.8/groovy-all-2.4.8.jar (7.0 MB at 17 MB/s)
[INFO] Installing f:\jenkins\jenkins-slave\workspace\n-box_maven-resolver_MRESOLVER-8\m\pom.xml to F:\jenkins\jenkins-slave\workspace\n-box_maven-resolver_MRESOLVER-8\m\maven-resolver-demos\maven-resolver-demo-maven-plugin\target\local-repo\org\apache\maven\resolver\maven-resolver\1.4.0-SNAPSHOT\maven-resolver-1.4.0-SNAPSHOT.pom
[INFO] Installing f:\jenkins\jenkins-slave\workspace\n-box_maven-resolver_MRESOLVER-8\m\target\maven-resolver-1.4.0-SNAPSHOT-site.xml to F:\jenkins\jenkins-slave\workspace\n-box_maven-resolver_MRESOLVER-8\m\maven-resolver-demos\maven-resolver-demo-maven-plugin\target\local-repo\org\apache\maven\resolver\maven-resolver\1.4.0-SNAPSHOT\maven-resolver-1.4.0-SNAPSHOT-site.xml
[INFO] Installing F:\jenkins\jenkins-slave\workspace\n-box_maven-resolver_MRESOLVER-8\m\maven-resolver-api\pom.xml to F:\jenkins\jenkins-slave\workspace\n-box_maven-resolver_MRESOLVER-8\m\maven-resolver-demos\maven-resolver-demo-maven-plugin\target\local-repo\org\apache\maven\resolver\maven-resolver-api\1.4.0-SNAPSHOT\maven-resolver-api-1.4.0-SNAPSHOT.pom
[INFO] Installing F:\jenkins\jenkins-slave\workspace\n-box_maven-resolver_MRESOLVER-8\m\maven-resolver-api\target\maven-resolver-api-1.4.0-SNAPSHOT.jar to F:\jenkins\jenkins-slave\workspace\n-box_maven-resolver_MRESOLVER-8\m\maven-resolver-demos\maven-resolver-demo-maven-plugin\target\local-repo\org\apache\maven\resolver\maven-resolver-api\1.4.0-SNAPSHOT\maven-resolver-api-1.4.0-SNAPSHOT.jar
[INFO] Installing F:\jenkins\jenkins-slave\workspace\n-box_maven-resolver_MRESOLVER-8\m\maven-resolver-spi\pom.xml to F:\jenkins\jenkins-slave\workspace\n-box_maven-resolver_MRESOLVER-8\m\maven-resolver-demos\maven-resolver-demo-maven-plugin\target\local-repo\org\apache\maven\resolver\maven-resolver-spi\1.4.0-SNAPSHOT\maven-resolver-spi-1.4.0-SNAPSHOT.pom
[INFO] Installing F:\jenkins\jenkins-slave\workspace\n-box_maven-resolver_MRESOLVER-8\m\maven-resolver-spi\target\maven-resolver-spi-1.4.0-SNAPSHOT.jar to F:\jenkins\jenkins-slave\workspace\n-box_maven-resolver_MRESOLVER-8\m\maven-resolver-demos\maven-resolver-demo-maven-plugin\target\local-repo\org\apache\maven\resolver\maven-resolver-spi\1.4.0-SNAPSHOT\maven-resolver-spi-1.4.0-SNAPSHOT.jar
[INFO] Installing F:\jenkins\jenkins-slave\workspace\n-box_maven-resolver_MRESOLVER-8\m\maven-resolver-test-util\pom.xml to F:\jenkins\jenkins-slave\workspace\n-box_maven-resolver_MRESOLVER-8\m\maven-resolver-demos\maven-resolver-demo-maven-plugin\target\local-repo\org\apache\maven\resolver\maven-resolver-test-util\1.4.0-SNAPSHOT\maven-resolver-test-util-1.4.0-SNAPSHOT.pom
[INFO] Installing F:\jenkins\jenkins-slave\workspace\n-box_maven-resolver_MRESOLVER-8\m\maven-resolver-test-util\target\maven-resolver-test-util-1.4.0-SNAPSHOT.jar to F:\jenkins\jenkins-slave\workspace\n-box_maven-resolver_MRESOLVER-8\m\maven-resolver-demos\maven-resolver-demo-maven-plugin\target\local-repo\org\apache\maven\resolver\maven-resolver-test-util\1.4.0-SNAPSHOT\maven-resolver-test-util-1.4.0-SNAPSHOT.jar
[INFO] Installing F:\jenkins\jenkins-slave\workspace\n-box_maven-resolver_MRESOLVER-8\m\maven-resolver-util\pom.xml to F:\jenkins\jenkins-slave\workspace\n-box_maven-resolver_MRESOLVER-8\m\maven-resolver-demos\maven-resolver-demo-maven-plugin\target\local-repo\org\apache\maven\resolver\maven-resolver-util\1.4.0-SNAPSHOT\maven-resolver-util-1.4.0-SNAPSHOT.pom
[INFO] Installing F:\jenkins\jenkins-slave\workspace\n-box_maven-resolver_MRESOLVER-8\m\maven-resolver-util\target\maven-resolver-util-1.4.0-SNAPSHOT.jar to F:\jenkins\jenkins-slave\workspace\n-box_maven-resolver_MRESOLVER-8\m\maven-resolver-demos\maven-resolver-demo-maven-plugin\target\local-repo\org\apache\maven\resolver\maven-resolver-util\1.4.0-SNAPSHOT\maven-resolver-util-1.4.0-SNAPSHOT.jar
[INFO] Installing F:\jenkins\jenkins-slave\workspace\n-box_maven-resolver_MRESOLVER-8\m\maven-resolver-impl\pom.xml to F:\jenkins\jenkins-slave\workspace\n-box_maven-resolver_MRESOLVER-8\m\maven-resolver-demos\maven-resolver-demo-maven-plugin\target\local-repo\org\apache\maven\resolver\maven-resolver-impl\1.4.0-SNAPSHOT\maven-resolver-impl-1.4.0-SNAPSHOT.pom
[INFO] Installing F:\jenkins\jenkins-slave\workspace\n-box_maven-resolver_MRESOLVER-8\m\maven-resolver-impl\target\maven-resolver-impl-1.4.0-SNAPSHOT.jar to F:\jenkins\jenkins-slave\workspace\n-box_maven-resolver_MRESOLVER-8\m\maven-resolver-demos\maven-resolver-demo-maven-plugin\target\local-repo\org\apache\maven\resolver\maven-resolver-impl\1.4.0-SNAPSHOT\maven-resolver-impl-1.4.0-SNAPSHOT.jar
[INFO] Installing F:\jenkins\jenkins-slave\workspace\n-box_maven-resolver_MRESOLVER-8\m\maven-resolver-connector-basic\pom.xml to F:\jenkins\jenkins-slave\workspace\n-box_maven-resolver_MRESOLVER-8\m\maven-resolver-demos\maven-resolver-demo-maven-plugin\target\local-repo\org\apache\maven\resolver\maven-resolver-connector-basic\1.4.0-SNAPSHOT\maven-resolver-connector-basic-1.4.0-SNAPSHOT.pom
[INFO] Installing F:\jenkins\jenkins-slave\workspace\n-box_maven-resolver_MRESOLVER-8\m\maven-resolver-connector-basic\target\maven-resolver-connector-basic-1.4.0-SNAPSHOT.jar to F:\jenkins\jenkins-slave\workspace\n-box_maven-resolver_MRESOLVER-8\m\maven-resolver-demos\maven-resolver-demo-maven-plugin\target\local-repo\org\apache\maven\resolver\maven-resolver-connector-basic\1.4.0-SNAPSHOT\maven-resolver-connector-basic-1.4.0-SNAPSHOT.jar
[INFO] Installing F:\jenkins\jenkins-slave\workspace\n-box_maven-resolver_MRESOLVER-8\m\maven-resolver-transport-classpath\pom.xml to F:\jenkins\jenkins-slave\workspace\n-box_maven-resolver_MRESOLVER-8\m\maven-resolver-demos\maven-resolver-demo-maven-plugin\target\local-repo\org\apache\maven\resolver\maven-resolver-transport-classpath\1.4.0-SNAPSHOT\maven-resolver-transport-classpath-1.4.0-SNAPSHOT.pom
[INFO] Installing F:\jenkins\jenkins-slave\workspace\n-box_maven-resolver_MRESOLVER-8\m\maven-resolver-transport-classpath\target\maven-resolver-transport-classpath-1.4.0-SNAPSHOT.jar to F:\jenkins\jenkins-slave\workspace\n-box_maven-resolver_MRESOLVER-8\m\maven-resolver-demos\maven-resolver-demo-maven-plugin\target\local-repo\org\apache\maven\resolver\maven-resolver-transport-classpath\1.4.0-SNAPSHOT\maven-resolver-transport-classpath-1.4.0-SNAPSHOT.jar
[INFO] Installing F:\jenkins\jenkins-slave\workspace\n-box_maven-resolver_MRESOLVER-8\m\maven-resolver-transport-file\pom.xml to F:\jenkins\jenkins-slave\workspace\n-box_maven-resolver_MRESOLVER-8\m\maven-resolver-demos\maven-resolver-demo-maven-plugin\target\local-repo\org\apache\maven\resolver\maven-resolver-transport-file\1.4.0-SNAPSHOT\maven-resolver-transport-file-1.4.0-SNAPSHOT.pom
[INFO] Installing F:\jenkins\jenkins-slave\workspace\n-box_maven-resolver_MRESOLVER-8\m\maven-resolver-transport-file\target\maven-resolver-transport-file-1.4.0-SNAPSHOT.jar to F:\jenkins\jenkins-slave\workspace\n-box_maven-resolver_MRESOLVER-8\m\maven-resolver-demos\maven-resolver-demo-maven-plugin\target\local-repo\org\apache\maven\resolver\maven-resolver-transport-file\1.4.0-SNAPSHOT\maven-resolver-transport-file-1.4.0-SNAPSHOT.jar
[INFO] Installing F:\jenkins\jenkins-slave\workspace\n-box_maven-resolver_MRESOLVER-8\m\maven-resolver-transport-http\pom.xml to F:\jenkins\jenkins-slave\workspace\n-box_maven-resolver_MRESOLVER-8\m\maven-resolver-demos\maven-resolver-demo-maven-plugin\target\local-repo\org\apache\maven\resolver\maven-resolver-transport-http\1.4.0-SNAPSHOT\maven-resolver-transport-http-1.4.0-SNAPSHOT.pom
[INFO] Installing F:\jenkins\jenkins-slave\workspace\n-box_maven-resolver_MRESOLVER-8\m\maven-resolver-transport-http\target\maven-resolver-transport-http-1.4.0-SNAPSHOT.jar to F:\jenkins\jenkins-slave\workspace\n-box_maven-resolver_MRESOLVER-8\m\maven-resolver-demos\maven-resolver-demo-maven-plugin\target\local-repo\org\apache\maven\resolver\maven-resolver-transport-http\1.4.0-SNAPSHOT\maven-resolver-transport-http-1.4.0-SNAPSHOT.jar
[INFO] Installing F:\jenkins\jenkins-slave\workspace\n-box_maven-resolver_MRESOLVER-8\m\maven-resolver-transport-wagon\pom.xml to F:\jenkins\jenkins-slave\workspace\n-box_maven-resolver_MRESOLVER-8\m\maven-resolver-demos\maven-resolver-demo-maven-plugin\target\local-repo\org\apache\maven\resolver\maven-resolver-transport-wagon\1.4.0-SNAPSHOT\maven-resolver-transport-wagon-1.4.0-SNAPSHOT.pom
[INFO] Installing F:\jenkins\jenkins-slave\workspace\n-box_maven-resolver_MRESOLVER-8\m\maven-resolver-transport-wagon\target\maven-resolver-transport-wagon-1.4.0-SNAPSHOT.jar to F:\jenkins\jenkins-slave\workspace\n-box_maven-resolver_MRESOLVER-8\m\maven-resolver-demos\maven-resolver-demo-maven-plugin\target\local-repo\org\apache\maven\resolver\maven-resolver-transport-wagon\1.4.0-SNAPSHOT\maven-resolver-transport-wagon-1.4.0-SNAPSHOT.jar
[INFO] Installing F:\jenkins\jenkins-slave\workspace\n-box_maven-resolver_MRESOLVER-8\m\maven-resolver-demos\pom.xml to F:\jenkins\jenkins-slave\workspace\n-box_maven-resolver_MRESOLVER-8\m\maven-resolver-demos\maven-resolver-demo-maven-plugin\target\local-repo\org\apache\maven\resolver\maven-resolver-demos\1.4.0-SNAPSHOT\maven-resolver-demos-1.4.0-SNAPSHOT.pom
[INFO] Installing F:\jenkins\jenkins-slave\workspace\n-box_maven-resolver_MRESOLVER-8\m\maven-resolver-demos\target\maven-resolver-demos-1.4.0-SNAPSHOT-site.xml to F:\jenkins\jenkins-slave\workspace\n-box_maven-resolver_MRESOLVER-8\m\maven-resolver-demos\maven-resolver-demo-maven-plugin\target\local-repo\org\apache\maven\resolver\maven-resolver-demos\1.4.0-SNAPSHOT\maven-resolver-demos-1.4.0-SNAPSHOT-site.xml
[INFO] Installing F:\jenkins\jenkins-slave\workspace\n-box_maven-resolver_MRESOLVER-8\m\maven-resolver-demos\maven-resolver-demo-snippets\pom.xml to F:\jenkins\jenkins-slave\workspace\n-box_maven-resolver_MRESOLVER-8\m\maven-resolver-demos\maven-resolver-demo-maven-plugin\target\local-repo\org\apache\maven\resolver\maven-resolver-demo-snippets\1.4.0-SNAPSHOT\maven-resolver-demo-snippets-1.4.0-SNAPSHOT.pom
[INFO] Installing F:\jenkins\jenkins-slave\workspace\n-box_maven-resolver_MRESOLVER-8\m\maven-resolver-demos\maven-resolver-demo-snippets\target\maven-resolver-demo-snippets-1.4.0-SNAPSHOT.jar to F:\jenkins\jenkins-slave\workspace\n-box_maven-resolver_MRESOLVER-8\m\maven-resolver-demos\maven-resolver-demo-maven-plugin\target\local-repo\org\apache\maven\resolver\maven-resolver-demo-snippets\1.4.0-SNAPSHOT\maven-resolver-demo-snippets-1.4.0-SNAPSHOT.jar
[INFO] Installing F:\jenkins\jenkins-slave\workspace\n-box_maven-resolver_MRESOLVER-8\m\maven-resolver-demos\maven-resolver-demo-maven-plugin\pom.xml to F:\jenkins\jenkins-slave\workspace\n-box_maven-resolver_MRESOLVER-8\m\maven-resolver-demos\maven-resolver-demo-maven-plugin\target\local-repo\org\apache\maven\resolver\maven-resolver-demo-maven-plugin\1.4.0-SNAPSHOT\maven-resolver-demo-maven-plugin-1.4.0-SNAPSHOT.pom
[INFO] Installing F:\jenkins\jenkins-slave\workspace\n-box_maven-resolver_MRESOLVER-8\m\maven-resolver-demos\maven-resolver-demo-maven-plugin\target\maven-resolver-demo-maven-plugin-1.4.0-SNAPSHOT.jar to F:\jenkins\jenkins-slave\workspace\n-box_maven-resolver_MRESOLVER-8\m\maven-resolver-demos\maven-resolver-demo-maven-plugin\target\local-repo\org\apache\maven\resolver\maven-resolver-demo-maven-plugin\1.4.0-SNAPSHOT\maven-resolver-demo-maven-plugin-1.4.0-SNAPSHOT.jar
[INFO]
[INFO] --- maven-invoker-plugin:3.0.1:run (integration-test) @ maven-resolver-demo-maven-plugin ---
[INFO] Running Setup Jobs
[INFO] Building: resolve-artifact\pom.xml
[INFO]           resolve-artifact\pom.xml ......................... SUCCESS (4.4 s)
[INFO] -------------------------------------------------
[INFO] Build Summary:
[INFO]   Passed: 1, Failed: 0, Errors: 0, Skipped: 0
[INFO] -------------------------------------------------
[INFO]
[INFO] --- maven-checkstyle-plugin:3.0.0:check (checkstyle-check) @ maven-resolver-demo-maven-plugin ---
[INFO] ------------------------------------------------------------------------
[INFO] Reactor Summary for Maven Artifact Resolver 1.4.0-SNAPSHOT:
[INFO]
[INFO] Maven Artifact Resolver ............................ SUCCESS [ 36.914 s]
[INFO] Maven Artifact Resolver API ........................ SUCCESS [ 21.390 s]
[INFO] Maven Artifact Resolver SPI ........................ SUCCESS [  3.738 s]
[INFO] Maven Artifact Resolver Test Utilities ............. SUCCESS [  4.181 s]
[INFO] Maven Artifact Resolver Utilities .................. SUCCESS [  9.330 s]
[INFO] Maven Artifact Resolver Implementation ............. SUCCESS [ 24.609 s]
[INFO] Maven Artifact Resolver Connector Basic ............ SUCCESS [  9.043 s]
[INFO] Maven Artifact Resolver Transport Classpath ........ SUCCESS [  3.191 s]
[INFO] Maven Artifact Resolver Transport File ............. SUCCESS [  3.464 s]
[INFO] Maven Artifact Resolver Transport HTTP ............. SUCCESS [ 10.810 s]
[INFO] Maven Artifact Resolver Transport Wagon ............ SUCCESS [  5.893 s]
[INFO] Maven Artifact Resolver Demos ...................... SUCCESS [  0.424 s]
[INFO] Maven Artifact Resolver Demo Snippets .............. SUCCESS [  2.745 s]
[INFO] Maven Artifact Resolver Demo Maven Plugin .......... SUCCESS [ 11.984 s]
[INFO] ------------------------------------------------------------------------
[INFO] BUILD SUCCESS
[INFO] ------------------------------------------------------------------------
[INFO] Total time:  02:29 min
[INFO] Finished at: 2020-01-12T07:35:39-08:00
[INFO] ------------------------------------------------------------------------
[INFO] [jenkins-event-spy] Generated F:\jenkins\jenkins-slave\workspace\n-box_maven-resolver_MRESOLVER-8@tmp\withMaven02189320\maven-spy-20200112-073310-47612203489714202321279.log
[Pipeline] }
[Pipeline] // dir
[Pipeline] }
[withMaven] invokerPublisher - Archive invoker results for Maven artifact MavenArtifact{org.apache.maven.resolver:maven-resolver-demo-maven-plugin:maven-plugin:1.4.0-SNAPSHOT(version: 1.4.0-SNAPSHOT, snapshot:false) } generated by PluginInvocation{org.apache.maven.plugins:maven-invoker-plugin:3.0.1@run  integration-test}: m\maven-resolver-demos\maven-resolver-demo-maven-plugin\target\invoker-reports\*.xml
[withMaven] junitPublisher - Archive test results for Maven artifact org.apache.maven.resolver:maven-resolver-api:jar:1.4.0-SNAPSHOT generated by maven-surefire-plugin:test (default-test): m\maven-resolver-api\target\surefire-reports\*.xml
[withMaven] junitPublisher - Archive test results for Maven artifact org.apache.maven.resolver:maven-resolver-spi:jar:1.4.0-SNAPSHOT generated by maven-surefire-plugin:test (default-test): m\maven-resolver-spi\target\surefire-reports\*.xml
[withMaven] junitPublisher - Archive test results for Maven artifact org.apache.maven.resolver:maven-resolver-test-util:jar:1.4.0-SNAPSHOT generated by maven-surefire-plugin:test (default-test): m\maven-resolver-test-util\target\surefire-reports\*.xml
[withMaven] junitPublisher - Archive test results for Maven artifact org.apache.maven.resolver:maven-resolver-util:jar:1.4.0-SNAPSHOT generated by maven-surefire-plugin:test (default-test): m\maven-resolver-util\target\surefire-reports\*.xml
[withMaven] junitPublisher - Archive test results for Maven artifact org.apache.maven.resolver:maven-resolver-impl:jar:1.4.0-SNAPSHOT generated by maven-surefire-plugin:test (default-test): m\maven-resolver-impl\target\surefire-reports\*.xml
[withMaven] junitPublisher - Archive test results for Maven artifact org.apache.maven.resolver:maven-resolver-connector-basic:jar:1.4.0-SNAPSHOT generated by maven-surefire-plugin:test (default-test): m\maven-resolver-connector-basic\target\surefire-reports\*.xml
[withMaven] junitPublisher - Archive test results for Maven artifact org.apache.maven.resolver:maven-resolver-transport-classpath:jar:1.4.0-SNAPSHOT generated by maven-surefire-plugin:test (default-test): m\maven-resolver-transport-classpath\target\surefire-reports\*.xml
[withMaven] junitPublisher - Archive test results for Maven artifact org.apache.maven.resolver:maven-resolver-transport-file:jar:1.4.0-SNAPSHOT generated by maven-surefire-plugin:test (default-test): m\maven-resolver-transport-file\target\surefire-reports\*.xml
[withMaven] junitPublisher - Archive test results for Maven artifact org.apache.maven.resolver:maven-resolver-transport-http:jar:1.4.0-SNAPSHOT generated by maven-surefire-plugin:test (default-test): m\maven-resolver-transport-http\target\surefire-reports\*.xml
[withMaven] junitPublisher - Archive test results for Maven artifact org.apache.maven.resolver:maven-resolver-transport-wagon:jar:1.4.0-SNAPSHOT generated by maven-surefire-plugin:test (default-test): m\maven-resolver-transport-wagon\target\surefire-reports\*.xml
[withMaven] junitPublisher - Archive test results for Maven artifact org.apache.maven.resolver:maven-resolver-demo-snippets:jar:1.4.0-SNAPSHOT generated by maven-surefire-plugin:test (default-test): m\maven-resolver-demos\maven-resolver-demo-snippets\target\surefire-reports\*.xml
[withMaven] junitPublisher - Archive test results for Maven artifact org.apache.maven.resolver:maven-resolver-demo-maven-plugin:maven-plugin:1.4.0-SNAPSHOT generated by maven-surefire-plugin:test (default-test): m\maven-resolver-demos\maven-resolver-demo-maven-plugin\target\surefire-reports\*.xml
Recording test results
[withMaven] Publishers: Pipeline Graph Publisher: 4 ms, Invoker Publisher: 621 ms, Junit Publisher: 3112 ms, Concordion Publisher: 1 ms, Dependencies Fingerprint Publisher: 446 ms
[Pipeline] // withMaven
[Pipeline] cleanWs
[WS-CLEANUP] Deleting project workspace...
[WS-CLEANUP] Deferred wipeout is used...
[WS-CLEANUP] done
[Pipeline] }
[Pipeline] // stage
[Pipeline] }
[Pipeline] // node
[Pipeline] }
[Pipeline] // parallel
[Pipeline] echo
[FAILURE-003] AbortException hudson.AbortException: Error cloning remote repo 'origin'
[Pipeline] stage
[Pipeline] { (Notifications)
[Pipeline] echo
Build result: FAILURE
[Pipeline] jiraIssueSelector
[Pipeline] echo
The authors of changes [rfscholte].
[Pipeline] echo
Sending email ...
[Pipeline] emailext
Reply | Threaded
Open this post in threaded view
|

Build failed in Jenkins: Maven TLP » maven-resolver » MRESOLVER-8 #16

Apache Jenkins Server-2
See https://builds.apache.org/job/maven-box/job/maven-resolver/job/MRESOLVER-8/16/

Changes:

* Add JDK 15
* Add Maven 3.6.3

All tests passed

Build log:
[...truncated 16689 lines...]
[INFO] Downloading from central: https://repo.maven.apache.org/maven2/org/apache/maven/shared/maven-invoker/3.0.0/maven-invoker-3.0.0.jar
[INFO] Downloading from central: https://repo.maven.apache.org/maven2/commons-beanutils/commons-beanutils/1.8.3/commons-beanutils-1.8.3.jar
[INFO] Downloading from central: https://repo.maven.apache.org/maven2/commons-validator/commons-validator/1.4.1/commons-validator-1.4.1.jar
[INFO] Downloading from central: https://repo.maven.apache.org/maven2/org/apache/maven/reporting/maven-reporting-impl/2.4/maven-reporting-impl-2.4.jar
[INFO] Downloading from central: https://repo.maven.apache.org/maven2/commons-digester/commons-digester/1.8.1/commons-digester-1.8.1.jar
[INFO] Downloaded from central: https://repo.maven.apache.org/maven2/org/apache/maven/shared/maven-invoker/3.0.0/maven-invoker-3.0.0.jar (33 kB at 2.1 MB/s)
[INFO] Downloaded from central: https://repo.maven.apache.org/maven2/org/apache/maven/reporting/maven-reporting-impl/2.4/maven-reporting-impl-2.4.jar (20 kB at 1.2 MB/s)
[INFO] Downloading from central: https://repo.maven.apache.org/maven2/commons-logging/commons-logging/1.2/commons-logging-1.2.jar
[INFO] Downloading from central: https://repo.maven.apache.org/maven2/org/apache/maven/shared/maven-script-interpreter/1.2/maven-script-interpreter-1.2.jar
[INFO] Downloaded from central: https://repo.maven.apache.org/maven2/commons-beanutils/commons-beanutils/1.8.3/commons-beanutils-1.8.3.jar (232 kB at 12 MB/s)
[INFO] Downloading from central: https://repo.maven.apache.org/maven2/org/apache/ant/ant/1.8.1/ant-1.8.1.jar
[INFO] Downloaded from central: https://repo.maven.apache.org/maven2/commons-digester/commons-digester/1.8.1/commons-digester-1.8.1.jar (146 kB at 6.6 MB/s)
[INFO] Downloading from central: https://repo.maven.apache.org/maven2/org/apache/maven/shared/maven-artifact-transfer/0.9.1/maven-artifact-transfer-0.9.1.jar
[INFO] Downloaded from central: https://repo.maven.apache.org/maven2/commons-validator/commons-validator/1.4.1/commons-validator-1.4.1.jar (190 kB at 7.6 MB/s)
[INFO] Downloading from central: https://repo.maven.apache.org/maven2/org/apache/maven/shared/maven-common-artifact-filters/3.0.1/maven-common-artifact-filters-3.0.1.jar
[INFO] Downloaded from central: https://repo.maven.apache.org/maven2/commons-logging/commons-logging/1.2/commons-logging-1.2.jar (62 kB at 2.0 MB/s)
[INFO] Downloading from central: https://repo.maven.apache.org/maven2/commons-codec/commons-codec/1.6/commons-codec-1.6.jar
[INFO] Downloaded from central: https://repo.maven.apache.org/maven2/org/apache/maven/shared/maven-script-interpreter/1.2/maven-script-interpreter-1.2.jar (22 kB at 689 kB/s)
[INFO] Downloading from central: https://repo.maven.apache.org/maven2/org/slf4j/slf4j-api/1.7.5/slf4j-api-1.7.5.jar
[INFO] Downloaded from central: https://repo.maven.apache.org/maven2/org/apache/maven/shared/maven-artifact-transfer/0.9.1/maven-artifact-transfer-0.9.1.jar (123 kB at 3.1 MB/s)
[INFO] Downloading from central: https://repo.maven.apache.org/maven2/org/apache/maven/doxia/doxia-sink-api/1.7/doxia-sink-api-1.7.jar
[INFO] Downloaded from central: https://repo.maven.apache.org/maven2/org/apache/maven/shared/maven-common-artifact-filters/3.0.1/maven-common-artifact-filters-3.0.1.jar (61 kB at 1.5 MB/s)
[INFO] Downloading from central: https://repo.maven.apache.org/maven2/org/apache/maven/doxia/doxia-logging-api/1.7/doxia-logging-api-1.7.jar
[INFO] Downloaded from central: https://repo.maven.apache.org/maven2/org/slf4j/slf4j-api/1.7.5/slf4j-api-1.7.5.jar (26 kB at 532 kB/s)
[INFO] Downloading from central: https://repo.maven.apache.org/maven2/org/apache/maven/doxia/doxia-site-renderer/1.7.4/doxia-site-renderer-1.7.4.jar
[INFO] Downloaded from central: https://repo.maven.apache.org/maven2/commons-codec/commons-codec/1.6/commons-codec-1.6.jar (233 kB at 4.6 MB/s)
[INFO] Downloading from central: https://repo.maven.apache.org/maven2/org/apache/maven/doxia/doxia-decoration-model/1.7.4/doxia-decoration-model-1.7.4.jar
[INFO] Downloaded from central: https://repo.maven.apache.org/maven2/org/apache/maven/doxia/doxia-sink-api/1.7/doxia-sink-api-1.7.jar (11 kB at 207 kB/s)
[INFO] Downloading from central: https://repo.maven.apache.org/maven2/org/apache/maven/doxia/doxia-skin-model/1.7.4/doxia-skin-model-1.7.4.jar
[INFO] Downloaded from central: https://repo.maven.apache.org/maven2/org/apache/maven/doxia/doxia-logging-api/1.7/doxia-logging-api-1.7.jar (12 kB at 196 kB/s)
[INFO] Downloading from central: https://repo.maven.apache.org/maven2/org/apache/maven/doxia/doxia-module-xhtml/1.7/doxia-module-xhtml-1.7.jar
[INFO] Downloaded from central: https://repo.maven.apache.org/maven2/org/apache/maven/doxia/doxia-site-renderer/1.7.4/doxia-site-renderer-1.7.4.jar (64 kB at 969 kB/s)
[INFO] Downloaded from central: https://repo.maven.apache.org/maven2/org/apache/maven/doxia/doxia-decoration-model/1.7.4/doxia-decoration-model-1.7.4.jar (61 kB at 905 kB/s)
[INFO] Downloading from central: https://repo.maven.apache.org/maven2/org/codehaus/groovy/groovy-all/2.4.8/groovy-all-2.4.8.jar
[INFO] Downloaded from central: https://repo.maven.apache.org/maven2/org/apache/maven/doxia/doxia-skin-model/1.7.4/doxia-skin-model-1.7.4.jar (16 kB at 229 kB/s)
[INFO] Downloaded from central: https://repo.maven.apache.org/maven2/org/apache/maven/doxia/doxia-module-xhtml/1.7/doxia-module-xhtml-1.7.jar (17 kB at 236 kB/s)
[INFO] Downloaded from central: https://repo.maven.apache.org/maven2/org/apache/ant/ant/1.8.1/ant-1.8.1.jar (1.5 MB at 18 MB/s)
[withMaven] artifactsPublisher - Archive artifact m/maven-resolver-demos/target/maven-resolver-demos-1.4.0-SNAPSHOT-site.xml under org/apache/maven/resolver/maven-resolver-demos/1.4.0-SNAPSHOT/maven-resolver-demos-1.4.0-SNAPSHOT-site.xml
[withMaven] artifactsPublisher - Archive artifact m/maven-resolver-demos/maven-resolver-demo-snippets/pom.xml under org/apache/maven/resolver/maven-resolver-demo-snippets/1.4.0-SNAPSHOT/maven-resolver-demo-snippets-1.4.0-SNAPSHOT.pom
[INFO] Downloaded from central: https://repo.maven.apache.org/maven2/org/codehaus/groovy/groovy-all/2.4.8/groovy-all-2.4.8.jar (7.0 MB at 21 MB/s)
[INFO] Installing /home/jenkins/jenkins-slave/workspace/n-box_maven-resolver_MRESOLVER-8/m/pom.xml to /home/jenkins/jenkins-slave/workspace/n-box_maven-resolver_MRESOLVER-8/m/maven-resolver-demos/maven-resolver-demo-maven-plugin/target/local-repo/org/apache/maven/resolver/maven-resolver/1.4.0-SNAPSHOT/maven-resolver-1.4.0-SNAPSHOT.pom
[INFO] Installing /home/jenkins/jenkins-slave/workspace/n-box_maven-resolver_MRESOLVER-8/m/target/maven-resolver-1.4.0-SNAPSHOT-site.xml to /home/jenkins/jenkins-slave/workspace/n-box_maven-resolver_MRESOLVER-8/m/maven-resolver-demos/maven-resolver-demo-maven-plugin/target/local-repo/org/apache/maven/resolver/maven-resolver/1.4.0-SNAPSHOT/maven-resolver-1.4.0-SNAPSHOT-site.xml
[INFO] Installing /home/jenkins/jenkins-slave/workspace/n-box_maven-resolver_MRESOLVER-8/m/maven-resolver-api/pom.xml to /home/jenkins/jenkins-slave/workspace/n-box_maven-resolver_MRESOLVER-8/m/maven-resolver-demos/maven-resolver-demo-maven-plugin/target/local-repo/org/apache/maven/resolver/maven-resolver-api/1.4.0-SNAPSHOT/maven-resolver-api-1.4.0-SNAPSHOT.pom
[INFO] Installing /home/jenkins/jenkins-slave/workspace/n-box_maven-resolver_MRESOLVER-8/m/maven-resolver-api/target/maven-resolver-api-1.4.0-SNAPSHOT.jar to /home/jenkins/jenkins-slave/workspace/n-box_maven-resolver_MRESOLVER-8/m/maven-resolver-demos/maven-resolver-demo-maven-plugin/target/local-repo/org/apache/maven/resolver/maven-resolver-api/1.4.0-SNAPSHOT/maven-resolver-api-1.4.0-SNAPSHOT.jar
[INFO] Installing /home/jenkins/jenkins-slave/workspace/n-box_maven-resolver_MRESOLVER-8/m/maven-resolver-spi/pom.xml to /home/jenkins/jenkins-slave/workspace/n-box_maven-resolver_MRESOLVER-8/m/maven-resolver-demos/maven-resolver-demo-maven-plugin/target/local-repo/org/apache/maven/resolver/maven-resolver-spi/1.4.0-SNAPSHOT/maven-resolver-spi-1.4.0-SNAPSHOT.pom
[INFO] Installing /home/jenkins/jenkins-slave/workspace/n-box_maven-resolver_MRESOLVER-8/m/maven-resolver-spi/target/maven-resolver-spi-1.4.0-SNAPSHOT.jar to /home/jenkins/jenkins-slave/workspace/n-box_maven-resolver_MRESOLVER-8/m/maven-resolver-demos/maven-resolver-demo-maven-plugin/target/local-repo/org/apache/maven/resolver/maven-resolver-spi/1.4.0-SNAPSHOT/maven-resolver-spi-1.4.0-SNAPSHOT.jar
[INFO] Installing /home/jenkins/jenkins-slave/workspace/n-box_maven-resolver_MRESOLVER-8/m/maven-resolver-test-util/pom.xml to /home/jenkins/jenkins-slave/workspace/n-box_maven-resolver_MRESOLVER-8/m/maven-resolver-demos/maven-resolver-demo-maven-plugin/target/local-repo/org/apache/maven/resolver/maven-resolver-test-util/1.4.0-SNAPSHOT/maven-resolver-test-util-1.4.0-SNAPSHOT.pom
[INFO] Installing /home/jenkins/jenkins-slave/workspace/n-box_maven-resolver_MRESOLVER-8/m/maven-resolver-test-util/target/maven-resolver-test-util-1.4.0-SNAPSHOT.jar to /home/jenkins/jenkins-slave/workspace/n-box_maven-resolver_MRESOLVER-8/m/maven-resolver-demos/maven-resolver-demo-maven-plugin/target/local-repo/org/apache/maven/resolver/maven-resolver-test-util/1.4.0-SNAPSHOT/maven-resolver-test-util-1.4.0-SNAPSHOT.jar
[INFO] Installing /home/jenkins/jenkins-slave/workspace/n-box_maven-resolver_MRESOLVER-8/m/maven-resolver-util/pom.xml to /home/jenkins/jenkins-slave/workspace/n-box_maven-resolver_MRESOLVER-8/m/maven-resolver-demos/maven-resolver-demo-maven-plugin/target/local-repo/org/apache/maven/resolver/maven-resolver-util/1.4.0-SNAPSHOT/maven-resolver-util-1.4.0-SNAPSHOT.pom
[INFO] Installing /home/jenkins/jenkins-slave/workspace/n-box_maven-resolver_MRESOLVER-8/m/maven-resolver-util/target/maven-resolver-util-1.4.0-SNAPSHOT.jar to /home/jenkins/jenkins-slave/workspace/n-box_maven-resolver_MRESOLVER-8/m/maven-resolver-demos/maven-resolver-demo-maven-plugin/target/local-repo/org/apache/maven/resolver/maven-resolver-util/1.4.0-SNAPSHOT/maven-resolver-util-1.4.0-SNAPSHOT.jar
[INFO] Installing /home/jenkins/jenkins-slave/workspace/n-box_maven-resolver_MRESOLVER-8/m/maven-resolver-impl/pom.xml to /home/jenkins/jenkins-slave/workspace/n-box_maven-resolver_MRESOLVER-8/m/maven-resolver-demos/maven-resolver-demo-maven-plugin/target/local-repo/org/apache/maven/resolver/maven-resolver-impl/1.4.0-SNAPSHOT/maven-resolver-impl-1.4.0-SNAPSHOT.pom
[INFO] Installing /home/jenkins/jenkins-slave/workspace/n-box_maven-resolver_MRESOLVER-8/m/maven-resolver-impl/target/maven-resolver-impl-1.4.0-SNAPSHOT.jar to /home/jenkins/jenkins-slave/workspace/n-box_maven-resolver_MRESOLVER-8/m/maven-resolver-demos/maven-resolver-demo-maven-plugin/target/local-repo/org/apache/maven/resolver/maven-resolver-impl/1.4.0-SNAPSHOT/maven-resolver-impl-1.4.0-SNAPSHOT.jar
[INFO] Installing /home/jenkins/jenkins-slave/workspace/n-box_maven-resolver_MRESOLVER-8/m/maven-resolver-connector-basic/pom.xml to /home/jenkins/jenkins-slave/workspace/n-box_maven-resolver_MRESOLVER-8/m/maven-resolver-demos/maven-resolver-demo-maven-plugin/target/local-repo/org/apache/maven/resolver/maven-resolver-connector-basic/1.4.0-SNAPSHOT/maven-resolver-connector-basic-1.4.0-SNAPSHOT.pom
[INFO] Installing /home/jenkins/jenkins-slave/workspace/n-box_maven-resolver_MRESOLVER-8/m/maven-resolver-connector-basic/target/maven-resolver-connector-basic-1.4.0-SNAPSHOT.jar to /home/jenkins/jenkins-slave/workspace/n-box_maven-resolver_MRESOLVER-8/m/maven-resolver-demos/maven-resolver-demo-maven-plugin/target/local-repo/org/apache/maven/resolver/maven-resolver-connector-basic/1.4.0-SNAPSHOT/maven-resolver-connector-basic-1.4.0-SNAPSHOT.jar
[INFO] Installing /home/jenkins/jenkins-slave/workspace/n-box_maven-resolver_MRESOLVER-8/m/maven-resolver-transport-classpath/pom.xml to /home/jenkins/jenkins-slave/workspace/n-box_maven-resolver_MRESOLVER-8/m/maven-resolver-demos/maven-resolver-demo-maven-plugin/target/local-repo/org/apache/maven/resolver/maven-resolver-transport-classpath/1.4.0-SNAPSHOT/maven-resolver-transport-classpath-1.4.0-SNAPSHOT.pom
[INFO] Installing /home/jenkins/jenkins-slave/workspace/n-box_maven-resolver_MRESOLVER-8/m/maven-resolver-transport-classpath/target/maven-resolver-transport-classpath-1.4.0-SNAPSHOT.jar to /home/jenkins/jenkins-slave/workspace/n-box_maven-resolver_MRESOLVER-8/m/maven-resolver-demos/maven-resolver-demo-maven-plugin/target/local-repo/org/apache/maven/resolver/maven-resolver-transport-classpath/1.4.0-SNAPSHOT/maven-resolver-transport-classpath-1.4.0-SNAPSHOT.jar
[INFO] Installing /home/jenkins/jenkins-slave/workspace/n-box_maven-resolver_MRESOLVER-8/m/maven-resolver-transport-file/pom.xml to /home/jenkins/jenkins-slave/workspace/n-box_maven-resolver_MRESOLVER-8/m/maven-resolver-demos/maven-resolver-demo-maven-plugin/target/local-repo/org/apache/maven/resolver/maven-resolver-transport-file/1.4.0-SNAPSHOT/maven-resolver-transport-file-1.4.0-SNAPSHOT.pom
[INFO] Installing /home/jenkins/jenkins-slave/workspace/n-box_maven-resolver_MRESOLVER-8/m/maven-resolver-transport-file/target/maven-resolver-transport-file-1.4.0-SNAPSHOT.jar to /home/jenkins/jenkins-slave/workspace/n-box_maven-resolver_MRESOLVER-8/m/maven-resolver-demos/maven-resolver-demo-maven-plugin/target/local-repo/org/apache/maven/resolver/maven-resolver-transport-file/1.4.0-SNAPSHOT/maven-resolver-transport-file-1.4.0-SNAPSHOT.jar
[INFO] Installing /home/jenkins/jenkins-slave/workspace/n-box_maven-resolver_MRESOLVER-8/m/maven-resolver-transport-http/pom.xml to /home/jenkins/jenkins-slave/workspace/n-box_maven-resolver_MRESOLVER-8/m/maven-resolver-demos/maven-resolver-demo-maven-plugin/target/local-repo/org/apache/maven/resolver/maven-resolver-transport-http/1.4.0-SNAPSHOT/maven-resolver-transport-http-1.4.0-SNAPSHOT.pom
[INFO] Installing /home/jenkins/jenkins-slave/workspace/n-box_maven-resolver_MRESOLVER-8/m/maven-resolver-transport-http/target/maven-resolver-transport-http-1.4.0-SNAPSHOT.jar to /home/jenkins/jenkins-slave/workspace/n-box_maven-resolver_MRESOLVER-8/m/maven-resolver-demos/maven-resolver-demo-maven-plugin/target/local-repo/org/apache/maven/resolver/maven-resolver-transport-http/1.4.0-SNAPSHOT/maven-resolver-transport-http-1.4.0-SNAPSHOT.jar
[withMaven] artifactsPublisher - Archive artifact m/maven-resolver-demos/maven-resolver-demo-snippets/target/maven-resolver-demo-snippets-1.4.0-SNAPSHOT.jar under org/apache/maven/resolver/maven-resolver-demo-snippets/1.4.0-SNAPSHOT/maven-resolver-demo-snippets-1.4.0-SNAPSHOT.jar
[INFO] Installing /home/jenkins/jenkins-slave/workspace/n-box_maven-resolver_MRESOLVER-8/m/maven-resolver-transport-wagon/pom.xml to /home/jenkins/jenkins-slave/workspace/n-box_maven-resolver_MRESOLVER-8/m/maven-resolver-demos/maven-resolver-demo-maven-plugin/target/local-repo/org/apache/maven/resolver/maven-resolver-transport-wagon/1.4.0-SNAPSHOT/maven-resolver-transport-wagon-1.4.0-SNAPSHOT.pom
[INFO] Installing /home/jenkins/jenkins-slave/workspace/n-box_maven-resolver_MRESOLVER-8/m/maven-resolver-transport-wagon/target/maven-resolver-transport-wagon-1.4.0-SNAPSHOT.jar to /home/jenkins/jenkins-slave/workspace/n-box_maven-resolver_MRESOLVER-8/m/maven-resolver-demos/maven-resolver-demo-maven-plugin/target/local-repo/org/apache/maven/resolver/maven-resolver-transport-wagon/1.4.0-SNAPSHOT/maven-resolver-transport-wagon-1.4.0-SNAPSHOT.jar
[INFO] Installing /home/jenkins/jenkins-slave/workspace/n-box_maven-resolver_MRESOLVER-8/m/maven-resolver-demos/pom.xml to /home/jenkins/jenkins-slave/workspace/n-box_maven-resolver_MRESOLVER-8/m/maven-resolver-demos/maven-resolver-demo-maven-plugin/target/local-repo/org/apache/maven/resolver/maven-resolver-demos/1.4.0-SNAPSHOT/maven-resolver-demos-1.4.0-SNAPSHOT.pom
[INFO] Installing /home/jenkins/jenkins-slave/workspace/n-box_maven-resolver_MRESOLVER-8/m/maven-resolver-demos/target/maven-resolver-demos-1.4.0-SNAPSHOT-site.xml to /home/jenkins/jenkins-slave/workspace/n-box_maven-resolver_MRESOLVER-8/m/maven-resolver-demos/maven-resolver-demo-maven-plugin/target/local-repo/org/apache/maven/resolver/maven-resolver-demos/1.4.0-SNAPSHOT/maven-resolver-demos-1.4.0-SNAPSHOT-site.xml
[INFO] Installing /home/jenkins/jenkins-slave/workspace/n-box_maven-resolver_MRESOLVER-8/m/maven-resolver-demos/maven-resolver-demo-snippets/pom.xml to /home/jenkins/jenkins-slave/workspace/n-box_maven-resolver_MRESOLVER-8/m/maven-resolver-demos/maven-resolver-demo-maven-plugin/target/local-repo/org/apache/maven/resolver/maven-resolver-demo-snippets/1.4.0-SNAPSHOT/maven-resolver-demo-snippets-1.4.0-SNAPSHOT.pom
[INFO] Installing /home/jenkins/jenkins-slave/workspace/n-box_maven-resolver_MRESOLVER-8/m/maven-resolver-demos/maven-resolver-demo-snippets/target/maven-resolver-demo-snippets-1.4.0-SNAPSHOT.jar to /home/jenkins/jenkins-slave/workspace/n-box_maven-resolver_MRESOLVER-8/m/maven-resolver-demos/maven-resolver-demo-maven-plugin/target/local-repo/org/apache/maven/resolver/maven-resolver-demo-snippets/1.4.0-SNAPSHOT/maven-resolver-demo-snippets-1.4.0-SNAPSHOT.jar
[INFO] Installing /home/jenkins/jenkins-slave/workspace/n-box_maven-resolver_MRESOLVER-8/m/maven-resolver-demos/maven-resolver-demo-maven-plugin/pom.xml to /home/jenkins/jenkins-slave/workspace/n-box_maven-resolver_MRESOLVER-8/m/maven-resolver-demos/maven-resolver-demo-maven-plugin/target/local-repo/org/apache/maven/resolver/maven-resolver-demo-maven-plugin/1.4.0-SNAPSHOT/maven-resolver-demo-maven-plugin-1.4.0-SNAPSHOT.pom
[INFO] Installing /home/jenkins/jenkins-slave/workspace/n-box_maven-resolver_MRESOLVER-8/m/maven-resolver-demos/maven-resolver-demo-maven-plugin/target/maven-resolver-demo-maven-plugin-1.4.0-SNAPSHOT.jar to /home/jenkins/jenkins-slave/workspace/n-box_maven-resolver_MRESOLVER-8/m/maven-resolver-demos/maven-resolver-demo-maven-plugin/target/local-repo/org/apache/maven/resolver/maven-resolver-demo-maven-plugin/1.4.0-SNAPSHOT/maven-resolver-demo-maven-plugin-1.4.0-SNAPSHOT.jar
[INFO]
[INFO] --- maven-invoker-plugin:3.0.1:run (integration-test) @ maven-resolver-demo-maven-plugin ---
[INFO] Running Setup Jobs
[INFO] Building: resolve-artifact/pom.xml
[withMaven] artifactsPublisher - Archive artifact m/maven-resolver-demos/maven-resolver-demo-maven-plugin/pom.xml under org/apache/maven/resolver/maven-resolver-demo-maven-plugin/1.4.0-SNAPSHOT/maven-resolver-demo-maven-plugin-1.4.0-SNAPSHOT.pom
[withMaven] artifactsPublisher - Archive artifact m/maven-resolver-demos/maven-resolver-demo-maven-plugin/target/maven-resolver-demo-maven-plugin-1.4.0-SNAPSHOT.jar under org/apache/maven/resolver/maven-resolver-demo-maven-plugin/1.4.0-SNAPSHOT/maven-resolver-demo-maven-plugin-1.4.0-SNAPSHOT.jar
[withMaven] invokerPublisher - Archive invoker results for Maven artifact MavenArtifact{org.apache.maven.resolver:maven-resolver-demo-maven-plugin:maven-plugin:1.4.0-SNAPSHOT(version: 1.4.0-SNAPSHOT, snapshot:false) } generated by PluginInvocation{org.apache.maven.plugins:maven-invoker-plugin:3.0.1@run  integration-test}: m/maven-resolver-demos/maven-resolver-demo-maven-plugin/target/invoker-reports/*.xml
[INFO]           resolve-artifact/pom.xml ......................... SUCCESS (4.3 s)
[INFO] -------------------------------------------------
[INFO] Build Summary:
[INFO]   Passed: 1, Failed: 0, Errors: 0, Skipped: 0
[INFO] -------------------------------------------------
[INFO]
[INFO] --- maven-checkstyle-plugin:3.0.0:check (checkstyle-check) @ maven-resolver-demo-maven-plugin ---
[INFO] ------------------------------------------------------------------------
[INFO] Reactor Summary for Maven Artifact Resolver 1.4.0-SNAPSHOT:
[INFO]
[INFO] Maven Artifact Resolver ............................ SUCCESS [ 16.354 s]
[INFO] Maven Artifact Resolver API ........................ SUCCESS [ 13.739 s]
[INFO] Maven Artifact Resolver SPI ........................ SUCCESS [  2.264 s]
[INFO] Maven Artifact Resolver Test Utilities ............. SUCCESS [  2.886 s]
[INFO] Maven Artifact Resolver Utilities .................. SUCCESS [  6.056 s]
[INFO] Maven Artifact Resolver Implementation ............. SUCCESS [  9.382 s]
[INFO] Maven Artifact Resolver Connector Basic ............ SUCCESS [  7.845 s]
[INFO] Maven Artifact Resolver Transport Classpath ........ SUCCESS [  2.136 s]
[INFO] Maven Artifact Resolver Transport File ............. SUCCESS [  2.150 s]
[INFO] Maven Artifact Resolver Transport HTTP ............. SUCCESS [  7.387 s]
[INFO] Maven Artifact Resolver Transport Wagon ............ SUCCESS [  4.377 s]
[INFO] Maven Artifact Resolver Demos ...................... SUCCESS [  0.441 s]
[INFO] Maven Artifact Resolver Demo Snippets .............. SUCCESS [  1.781 s]
[INFO] Maven Artifact Resolver Demo Maven Plugin .......... SUCCESS [  7.544 s]
[INFO] ------------------------------------------------------------------------
[INFO] BUILD SUCCESS
[INFO] ------------------------------------------------------------------------
[INFO] Total time:  01:25 min
[INFO] Finished at: 2020-01-16T04:59:26Z
[INFO] ------------------------------------------------------------------------
[INFO] [jenkins-event-spy] Generated /home/jenkins/jenkins-slave/workspace/n-box_maven-resolver_MRESOLVER-8@tmp/withMaven6b32f0a7/maven-spy-20200116-045800-6634622758373735811312.log
[Pipeline] cleanWs
[Pipeline] }
[Pipeline] // dir
[Pipeline] }
[withMaven] junitPublisher - Archive test results for Maven artifact org.apache.maven.resolver:maven-resolver-api:jar:1.4.0-SNAPSHOT generated by maven-surefire-plugin:test (default-test): m/maven-resolver-api/target/surefire-reports/*.xml
[withMaven] junitPublisher - Archive test results for Maven artifact org.apache.maven.resolver:maven-resolver-spi:jar:1.4.0-SNAPSHOT generated by maven-surefire-plugin:test (default-test): m/maven-resolver-spi/target/surefire-reports/*.xml
[withMaven] junitPublisher - Archive test results for Maven artifact org.apache.maven.resolver:maven-resolver-test-util:jar:1.4.0-SNAPSHOT generated by maven-surefire-plugin:test (default-test): m/maven-resolver-test-util/target/surefire-reports/*.xml
[withMaven] junitPublisher - Archive test results for Maven artifact org.apache.maven.resolver:maven-resolver-util:jar:1.4.0-SNAPSHOT generated by maven-surefire-plugin:test (default-test): m/maven-resolver-util/target/surefire-reports/*.xml
[withMaven] junitPublisher - Archive test results for Maven artifact org.apache.maven.resolver:maven-resolver-impl:jar:1.4.0-SNAPSHOT generated by maven-surefire-plugin:test (default-test): m/maven-resolver-impl/target/surefire-reports/*.xml
[withMaven] junitPublisher - Archive test results for Maven artifact org.apache.maven.resolver:maven-resolver-connector-basic:jar:1.4.0-SNAPSHOT generated by maven-surefire-plugin:test (default-test): m/maven-resolver-connector-basic/target/surefire-reports/*.xml
[withMaven] junitPublisher - Archive test results for Maven artifact org.apache.maven.resolver:maven-resolver-transport-classpath:jar:1.4.0-SNAPSHOT generated by maven-surefire-plugin:test (default-test): m/maven-resolver-transport-classpath/target/surefire-reports/*.xml
[withMaven] junitPublisher - Archive test results for Maven artifact org.apache.maven.resolver:maven-resolver-transport-file:jar:1.4.0-SNAPSHOT generated by maven-surefire-plugin:test (default-test): m/maven-resolver-transport-file/target/surefire-reports/*.xml
[withMaven] junitPublisher - Archive test results for Maven artifact org.apache.maven.resolver:maven-resolver-transport-http:jar:1.4.0-SNAPSHOT generated by maven-surefire-plugin:test (default-test): m/maven-resolver-transport-http/target/surefire-reports/*.xml
[withMaven] junitPublisher - Archive test results for Maven artifact org.apache.maven.resolver:maven-resolver-transport-wagon:jar:1.4.0-SNAPSHOT generated by maven-surefire-plugin:test (default-test): m/maven-resolver-transport-wagon/target/surefire-reports/*.xml
[withMaven] junitPublisher - Archive test results for Maven artifact org.apache.maven.resolver:maven-resolver-demo-snippets:jar:1.4.0-SNAPSHOT generated by maven-surefire-plugin:test (default-test): m/maven-resolver-demos/maven-resolver-demo-snippets/target/surefire-reports/*.xml
[withMaven] junitPublisher - Archive test results for Maven artifact org.apache.maven.resolver:maven-resolver-demo-maven-plugin:maven-plugin:1.4.0-SNAPSHOT generated by maven-surefire-plugin:test (default-test): m/maven-resolver-demos/maven-resolver-demo-maven-plugin/target/surefire-reports/*.xml
Recording test results
[withMaven] junitPublisher - Archive test results for Maven artifact org.apache.maven.resolver:maven-resolver-api:jar:1.4.0-SNAPSHOT generated by maven-surefire-plugin:test (default-test): m/maven-resolver-api/target/surefire-reports/*.xml
[withMaven] junitPublisher - Archive test results for Maven artifact org.apache.maven.resolver:maven-resolver-spi:jar:1.4.0-SNAPSHOT generated by maven-surefire-plugin:test (default-test): m/maven-resolver-spi/target/surefire-reports/*.xml
[withMaven] junitPublisher - Archive test results for Maven artifact org.apache.maven.resolver:maven-resolver-test-util:jar:1.4.0-SNAPSHOT generated by maven-surefire-plugin:test (default-test): m/maven-resolver-test-util/target/surefire-reports/*.xml
[withMaven] junitPublisher - Archive test results for Maven artifact org.apache.maven.resolver:maven-resolver-util:jar:1.4.0-SNAPSHOT generated by maven-surefire-plugin:test (default-test): m/maven-resolver-util/target/surefire-reports/*.xml
[withMaven] junitPublisher - Archive test results for Maven artifact org.apache.maven.resolver:maven-resolver-impl:jar:1.4.0-SNAPSHOT generated by maven-surefire-plugin:test (default-test): m/maven-resolver-impl/target/surefire-reports/*.xml
[withMaven] junitPublisher - Archive test results for Maven artifact org.apache.maven.resolver:maven-resolver-connector-basic:jar:1.4.0-SNAPSHOT generated by maven-surefire-plugin:test (default-test): m/maven-resolver-connector-basic/target/surefire-reports/*.xml
[withMaven] junitPublisher - Archive test results for Maven artifact org.apache.maven.resolver:maven-resolver-transport-classpath:jar:1.4.0-SNAPSHOT generated by maven-surefire-plugin:test (default-test): m/maven-resolver-transport-classpath/target/surefire-reports/*.xml
[withMaven] junitPublisher - Archive test results for Maven artifact org.apache.maven.resolver:maven-resolver-transport-file:jar:1.4.0-SNAPSHOT generated by maven-surefire-plugin:test (default-test): m/maven-resolver-transport-file/target/surefire-reports/*.xml
[withMaven] junitPublisher - Archive test results for Maven artifact org.apache.maven.resolver:maven-resolver-transport-http:jar:1.4.0-SNAPSHOT generated by maven-surefire-plugin:test (default-test): m/maven-resolver-transport-http/target/surefire-reports/*.xml
[withMaven] junitPublisher - Archive test results for Maven artifact org.apache.maven.resolver:maven-resolver-transport-wagon:jar:1.4.0-SNAPSHOT generated by maven-surefire-plugin:test (default-test): m/maven-resolver-transport-wagon/target/surefire-reports/*.xml
[withMaven] junitPublisher - Archive test results for Maven artifact org.apache.maven.resolver:maven-resolver-demo-snippets:jar:1.4.0-SNAPSHOT generated by maven-surefire-plugin:test (default-test): m/maven-resolver-demos/maven-resolver-demo-snippets/target/surefire-reports/*.xml
[withMaven] junitPublisher - Archive test results for Maven artifact org.apache.maven.resolver:maven-resolver-demo-maven-plugin:maven-plugin:1.4.0-SNAPSHOT generated by maven-surefire-plugin:test (default-test): m/maven-resolver-demos/maven-resolver-demo-maven-plugin/target/surefire-reports/*.xml
Recording test results
[WS-CLEANUP] Deleting project workspace...
[WS-CLEANUP] Deferred wipeout is used...
[WS-CLEANUP] done
[Pipeline] }
[withMaven] invokerPublisher - Archive invoker results for Maven artifact MavenArtifact{org.apache.maven.resolver:maven-resolver-demo-maven-plugin:maven-plugin:1.4.0-SNAPSHOT(version: 1.4.0-SNAPSHOT, snapshot:false) } generated by PluginInvocation{org.apache.maven.plugins:maven-invoker-plugin:3.0.1@run  integration-test}: m/maven-resolver-demos/maven-resolver-demo-maven-plugin/target/invoker-reports/*.xml
[withMaven] Publishers: Pipeline Graph Publisher: 12 ms, Invoker Publisher: 1194 ms, Junit Publisher: 47704 ms, Concordion Publisher: 1 ms, Dependencies Fingerprint Publisher: 9112 ms, JGiven Publisher: 1 ms
[withMaven] junitPublisher - Archive test results for Maven artifact org.apache.maven.resolver:maven-resolver-api:jar:1.4.0-SNAPSHOT generated by maven-surefire-plugin:test (default-test): m/maven-resolver-api/target/surefire-reports/*.xml
[withMaven] junitPublisher - Archive test results for Maven artifact org.apache.maven.resolver:maven-resolver-spi:jar:1.4.0-SNAPSHOT generated by maven-surefire-plugin:test (default-test): m/maven-resolver-spi/target/surefire-reports/*.xml
[withMaven] junitPublisher - Archive test results for Maven artifact org.apache.maven.resolver:maven-resolver-test-util:jar:1.4.0-SNAPSHOT generated by maven-surefire-plugin:test (default-test): m/maven-resolver-test-util/target/surefire-reports/*.xml
[withMaven] junitPublisher - Archive test results for Maven artifact org.apache.maven.resolver:maven-resolver-util:jar:1.4.0-SNAPSHOT generated by maven-surefire-plugin:test (default-test): m/maven-resolver-util/target/surefire-reports/*.xml
[withMaven] junitPublisher - Archive test results for Maven artifact org.apache.maven.resolver:maven-resolver-impl:jar:1.4.0-SNAPSHOT generated by maven-surefire-plugin:test (default-test): m/maven-resolver-impl/target/surefire-reports/*.xml
[withMaven] junitPublisher - Archive test results for Maven artifact org.apache.maven.resolver:maven-resolver-connector-basic:jar:1.4.0-SNAPSHOT generated by maven-surefire-plugin:test (default-test): m/maven-resolver-connector-basic/target/surefire-reports/*.xml
[withMaven] junitPublisher - Archive test results for Maven artifact org.apache.maven.resolver:maven-resolver-transport-classpath:jar:1.4.0-SNAPSHOT generated by maven-surefire-plugin:test (default-test): m/maven-resolver-transport-classpath/target/surefire-reports/*.xml
[withMaven] junitPublisher - Archive test results for Maven artifact org.apache.maven.resolver:maven-resolver-transport-file:jar:1.4.0-SNAPSHOT generated by maven-surefire-plugin:test (default-test): m/maven-resolver-transport-file/target/surefire-reports/*.xml
[withMaven] junitPublisher - Archive test results for Maven artifact org.apache.maven.resolver:maven-resolver-transport-http:jar:1.4.0-SNAPSHOT generated by maven-surefire-plugin:test (default-test): m/maven-resolver-transport-http/target/surefire-reports/*.xml
[withMaven] junitPublisher - Archive test results for Maven artifact org.apache.maven.resolver:maven-resolver-transport-wagon:jar:1.4.0-SNAPSHOT generated by maven-surefire-plugin:test (default-test): m/maven-resolver-transport-wagon/target/surefire-reports/*.xml
[withMaven] junitPublisher - Archive test results for Maven artifact org.apache.maven.resolver:maven-resolver-demo-snippets:jar:1.4.0-SNAPSHOT generated by maven-surefire-plugin:test (default-test): m/maven-resolver-demos/maven-resolver-demo-snippets/target/surefire-reports/*.xml
[withMaven] junitPublisher - Archive test results for Maven artifact org.apache.maven.resolver:maven-resolver-demo-maven-plugin:maven-plugin:1.4.0-SNAPSHOT generated by maven-surefire-plugin:test (default-test): m/maven-resolver-demos/maven-resolver-demo-maven-plugin/target/surefire-reports/*.xml
Recording test results
[withMaven] Publishers: Pipeline Graph Publisher: 11 ms, Invoker Publisher: 48618 ms, Junit Publisher: 47872 ms, Concordion Publisher: 1 ms, Dependencies Fingerprint Publisher: 9108 ms, SpotBugs Publisher: 1 ms
[Pipeline] // stage
[Pipeline] // withMaven
[Pipeline] // withMaven
[withMaven] openTasksPublisher - Scan Tasks for Maven artifact org.apache.maven.resolver:maven-resolver-api:jar:1.4.0-SNAPSHOT in source directory m/maven-resolver-api/src/main/java
[withMaven] openTasksPublisher - Scan Tasks for Maven artifact org.apache.maven.resolver:maven-resolver-spi:jar:1.4.0-SNAPSHOT in source directory m/maven-resolver-spi/src/main/java
[withMaven] openTasksPublisher - Scan Tasks for Maven artifact org.apache.maven.resolver:maven-resolver-test-util:jar:1.4.0-SNAPSHOT in source directory m/maven-resolver-test-util/src/main/java
[withMaven] openTasksPublisher - Scan Tasks for Maven artifact org.apache.maven.resolver:maven-resolver-util:jar:1.4.0-SNAPSHOT in source directory m/maven-resolver-util/src/main/java
[withMaven] openTasksPublisher - Scan Tasks for Maven artifact org.apache.maven.resolver:maven-resolver-impl:jar:1.4.0-SNAPSHOT in source directory m/maven-resolver-impl/src/main/java
[withMaven] openTasksPublisher - Scan Tasks for Maven artifact org.apache.maven.resolver:maven-resolver-connector-basic:jar:1.4.0-SNAPSHOT in source directory m/maven-resolver-connector-basic/src/main/java
[withMaven] openTasksPublisher - Scan Tasks for Maven artifact org.apache.maven.resolver:maven-resolver-transport-classpath:jar:1.4.0-SNAPSHOT in source directory m/maven-resolver-transport-classpath/src/main/java
[withMaven] openTasksPublisher - Scan Tasks for Maven artifact org.apache.maven.resolver:maven-resolver-transport-file:jar:1.4.0-SNAPSHOT in source directory m/maven-resolver-transport-file/src/main/java
[withMaven] openTasksPublisher - Scan Tasks for Maven artifact org.apache.maven.resolver:maven-resolver-transport-http:jar:1.4.0-SNAPSHOT in source directory m/maven-resolver-transport-http/src/main/java
[withMaven] openTasksPublisher - Scan Tasks for Maven artifact org.apache.maven.resolver:maven-resolver-transport-wagon:jar:1.4.0-SNAPSHOT in source directory m/maven-resolver-transport-wagon/src/main/java
[withMaven] openTasksPublisher - Scan Tasks for Maven artifact org.apache.maven.resolver:maven-resolver-demo-snippets:jar:1.4.0-SNAPSHOT in source directory m/maven-resolver-demos/maven-resolver-demo-snippets/src/main/java
[withMaven] openTasksPublisher - Scan Tasks for Maven artifact org.apache.maven.resolver:maven-resolver-demo-maven-plugin:maven-plugin:1.4.0-SNAPSHOT in source directory m/maven-resolver-demos/maven-resolver-demo-maven-plugin/src/main/java
[TASKS] Scanning folder '/home/jenkins/jenkins-slave/workspace/n-box_maven-resolver_MRESOLVER-8' for files matching the pattern 'm/maven-resolver-api/src/main/java/**/*,m/maven-resolver-spi/src/main/java/**/*,m/maven-resolver-test-util/src/main/java/**/*,m/maven-resolver-util/src/main/java/**/*,m/maven-resolver-impl/src/main/java/**/*,m/maven-resolver-connector-basic/src/main/java/**/*,m/maven-resolver-transport-classpath/src/main/java/**/*,m/maven-resolver-transport-file/src/main/java/**/*,m/maven-resolver-transport-http/src/main/java/**/*,m/maven-resolver-transport-wagon/src/main/java/**/*,m/maven-resolver-demos/maven-resolver-demo-snippets/src/main/java/**/*,m/maven-resolver-demos/maven-resolver-demo-maven-plugin/src/main/java/**/*' - excludes: null
[TASKS] Found 416 files to scan for tasks
[TASKS] Found 0 open tasks.
Skipping warnings blame since pipelines do not have an SCM link.%n
[TASKS] Computing warning deltas based on reference build #14
[withMaven] Publishers: Pipeline Graph Publisher: 12 ms, Generated Artifacts Publisher: 11492 ms, Invoker Publisher: 37477 ms, Junit Publisher: 95706 ms, Concordion Publisher: 1 ms, Dependencies Fingerprint Publisher: 9007 ms, JGiven Publisher: 1 ms, Open Task Scanner Publisher: 2652 ms
[Pipeline] }
[Pipeline] cleanWs
[Pipeline] cleanWs
[Pipeline] // withMaven
[Pipeline] // node
[Pipeline] }
[Pipeline] cleanWs
[WS-CLEANUP] Deleting project workspace...
[WS-CLEANUP] Deferred wipeout is used...
[WS-CLEANUP] Deleting project workspace...
[WS-CLEANUP] Deferred wipeout is used...
[WS-CLEANUP] Deleting project workspace...
[WS-CLEANUP] Deferred wipeout is used...
[WS-CLEANUP] done
[Pipeline] }
[WS-CLEANUP] done
[Pipeline] // stage
[Pipeline] }
[Pipeline] }
[WS-CLEANUP] done
[Pipeline] // node
[Pipeline] // stage
[Pipeline] }
[Pipeline] }
[Pipeline] }
[Pipeline] // stage
[Pipeline] // node
[Pipeline] }
[Pipeline] }
[Pipeline] // node
[Pipeline] }
[withMaven] Publishers: Pipeline Graph Publisher: 13 ms, Invoker Publisher: 41434 ms, Junit Publisher: 98254 ms, Concordion Publisher: 1 ms, Dependencies Fingerprint Publisher: 9110 ms
[Pipeline] // withMaven
[Pipeline] cleanWs
[WS-CLEANUP] Deleting project workspace...
[WS-CLEANUP] Deferred wipeout is used...
[WS-CLEANUP] done
[Pipeline] }
[Pipeline] // stage
[Pipeline] }
[Pipeline] // node
[Pipeline] }
Aborted by slachiewicz
[Pipeline] // node
[Pipeline] // node
[Pipeline] // node
[Pipeline] // node
[Pipeline] // node
[Pipeline] }
Failed in branch windows-jdk7
[Pipeline] }
Failed in branch windows-jdk8
[Pipeline] }
Failed in branch windows-jdk11
[Pipeline] }
Failed in branch windows-jdk13
[Pipeline] }
Failed in branch windows-jdk14
[Pipeline] // parallel
[Pipeline] echo
[FAILURE-002] FlowInterruptedException org.jenkinsci.plugins.workflow.steps.FlowInterruptedException
[Pipeline] stage
[Pipeline] { (Notifications)
[Pipeline] echo
Build result: FAILURE
[Pipeline] jiraIssueSelector
[Pipeline] echo
The authors of changes [slachiewicz].
[Pipeline] echo
Sending email ...
[Pipeline] emailext
Reply | Threaded
Open this post in threaded view
|

Build failed in Jenkins: Maven TLP » maven-resolver » MRESOLVER-8 #17

Apache Jenkins Server-2
See https://builds.apache.org/job/maven-box/job/maven-resolver/job/MRESOLVER-8/17/

Changes:

* H30 is having issues
* H23 has issues.
* GitHub emails should not trigger notifier which otherwise breaks the
* Revert "GitHub emails should not trigger notifier which otherwise breaks
* H40 is unstable
* GitHub emails should not trigger notifier which otherwise breaks the
* send email if authors exist
* fixed Scripts not permitted to use staticMethod
* H24 in unstable

All tests passed

Build log:
[...truncated 32494 lines...]
[INFO] Downloading from central: https://repo.maven.apache.org/maven2/org/apache/maven/doxia/doxia-decoration-model/1.7.4/doxia-decoration-model-1.7.4.pom
[INFO] Downloaded from central: https://repo.maven.apache.org/maven2/org/apache/maven/doxia/doxia-decoration-model/1.7.4/doxia-decoration-model-1.7.4.pom (3.4 kB at 103 kB/s)
[INFO] Downloading from central: https://repo.maven.apache.org/maven2/org/apache/maven/doxia/doxia-skin-model/1.7.4/doxia-skin-model-1.7.4.pom
[INFO] Downloaded from central: https://repo.maven.apache.org/maven2/org/apache/maven/doxia/doxia-skin-model/1.7.4/doxia-skin-model-1.7.4.pom (3.0 kB at 92 kB/s)
[INFO] Downloading from central: https://repo.maven.apache.org/maven2/org/apache/maven/doxia/doxia-module-xhtml/1.7/doxia-module-xhtml-1.7.pom
[INFO] Downloaded from central: https://repo.maven.apache.org/maven2/org/apache/maven/doxia/doxia-module-xhtml/1.7/doxia-module-xhtml-1.7.pom (1.6 kB at 48 kB/s)
[INFO] Downloading from central: https://repo.maven.apache.org/maven2/org/apache/maven/doxia/doxia-modules/1.7/doxia-modules-1.7.pom
[INFO] Installing F:\jenkins\jenkins-slave\workspace\n-box_maven-resolver_MRESOLVER-8\m\maven-resolver-demos\pom.xml to F:\jenkins\jenkins-slave\workspace\n-box_maven-resolver_MRESOLVER-8\m\maven-resolver-demos\maven-resolver-demo-maven-plugin\target\local-repo\org\apache\maven\resolver\maven-resolver-demos\1.4.0-SNAPSHOT\maven-resolver-demos-1.4.0-SNAPSHOT.pom
[INFO] Downloaded from central: https://repo.maven.apache.org/maven2/org/apache/maven/doxia/doxia-modules/1.7/doxia-modules-1.7.pom (2.6 kB at 77 kB/s)
[INFO] Downloading from central: https://repo.maven.apache.org/maven2/org/codehaus/groovy/groovy-all/2.4.8/groovy-all-2.4.8.pom
[INFO] Downloaded from central: https://repo.maven.apache.org/maven2/org/codehaus/groovy/groovy-all/2.4.8/groovy-all-2.4.8.pom (21 kB at 611 kB/s)
[INFO] Installing F:\jenkins\jenkins-slave\workspace\n-box_maven-resolver_MRESOLVER-8\m\maven-resolver-demos\target\maven-resolver-demos-1.4.0-SNAPSHOT-site.xml to F:\jenkins\jenkins-slave\workspace\n-box_maven-resolver_MRESOLVER-8\m\maven-resolver-demos\maven-resolver-demo-maven-plugin\target\local-repo\org\apache\maven\resolver\maven-resolver-demos\1.4.0-SNAPSHOT\maven-resolver-demos-1.4.0-SNAPSHOT-site.xml
[INFO] Installing F:\jenkins\jenkins-slave\workspace\n-box_maven-resolver_MRESOLVER-8\m\maven-resolver-demos\maven-resolver-demo-snippets\pom.xml to F:\jenkins\jenkins-slave\workspace\n-box_maven-resolver_MRESOLVER-8\m\maven-resolver-demos\maven-resolver-demo-maven-plugin\target\local-repo\org\apache\maven\resolver\maven-resolver-demo-snippets\1.4.0-SNAPSHOT\maven-resolver-demo-snippets-1.4.0-SNAPSHOT.pom
[INFO] Installing F:\jenkins\jenkins-slave\workspace\n-box_maven-resolver_MRESOLVER-8\m\maven-resolver-demos\maven-resolver-demo-snippets\target\maven-resolver-demo-snippets-1.4.0-SNAPSHOT.jar to F:\jenkins\jenkins-slave\workspace\n-box_maven-resolver_MRESOLVER-8\m\maven-resolver-demos\maven-resolver-demo-maven-plugin\target\local-repo\org\apache\maven\resolver\maven-resolver-demo-snippets\1.4.0-SNAPSHOT\maven-resolver-demo-snippets-1.4.0-SNAPSHOT.jar
[INFO] Installing F:\jenkins\jenkins-slave\workspace\n-box_maven-resolver_MRESOLVER-8\m\maven-resolver-demos\maven-resolver-demo-maven-plugin\pom.xml to F:\jenkins\jenkins-slave\workspace\n-box_maven-resolver_MRESOLVER-8\m\maven-resolver-demos\maven-resolver-demo-maven-plugin\target\local-repo\org\apache\maven\resolver\maven-resolver-demo-maven-plugin\1.4.0-SNAPSHOT\maven-resolver-demo-maven-plugin-1.4.0-SNAPSHOT.pom
[INFO] Installing F:\jenkins\jenkins-slave\workspace\n-box_maven-resolver_MRESOLVER-8\m\maven-resolver-demos\maven-resolver-demo-maven-plugin\target\maven-resolver-demo-maven-plugin-1.4.0-SNAPSHOT.jar to F:\jenkins\jenkins-slave\workspace\n-box_maven-resolver_MRESOLVER-8\m\maven-resolver-demos\maven-resolver-demo-maven-plugin\target\local-repo\org\apache\maven\resolver\maven-resolver-demo-maven-plugin\1.4.0-SNAPSHOT\maven-resolver-demo-maven-plugin-1.4.0-SNAPSHOT.jar
[INFO]
[INFO] --- maven-invoker-plugin:3.0.1:run (integration-test) @ maven-resolver-demo-maven-plugin ---
[INFO] Downloading from central: https://repo.maven.apache.org/maven2/org/apache/maven/shared/maven-invoker/3.0.0/maven-invoker-3.0.0.jar
[INFO] Downloading from central: https://repo.maven.apache.org/maven2/commons-digester/commons-digester/1.8.1/commons-digester-1.8.1.jar
[INFO] Downloading from central: https://repo.maven.apache.org/maven2/commons-beanutils/commons-beanutils/1.8.3/commons-beanutils-1.8.3.jar
[INFO] Downloading from central: https://repo.maven.apache.org/maven2/commons-validator/commons-validator/1.4.1/commons-validator-1.4.1.jar
[INFO] Downloading from central: https://repo.maven.apache.org/maven2/org/apache/maven/reporting/maven-reporting-impl/2.4/maven-reporting-impl-2.4.jar
[INFO] Downloaded from central: https://repo.maven.apache.org/maven2/org/apache/maven/reporting/maven-reporting-impl/2.4/maven-reporting-impl-2.4.jar (20 kB at 539 kB/s)
[INFO] Downloading from central: https://repo.maven.apache.org/maven2/commons-logging/commons-logging/1.2/commons-logging-1.2.jar
[INFO] Downloaded from central: https://repo.maven.apache.org/maven2/commons-beanutils/commons-beanutils/1.8.3/commons-beanutils-1.8.3.jar (232 kB at 5.3 MB/s)
[INFO] Downloading from central: https://repo.maven.apache.org/maven2/org/apache/maven/shared/maven-script-interpreter/1.2/maven-script-interpreter-1.2.jar
[INFO] Downloaded from central: https://repo.maven.apache.org/maven2/commons-digester/commons-digester/1.8.1/commons-digester-1.8.1.jar (146 kB at 2.8 MB/s)
[INFO] Downloading from central: https://repo.maven.apache.org/maven2/org/apache/ant/ant/1.8.1/ant-1.8.1.jar
[INFO] Downloaded from central: https://repo.maven.apache.org/maven2/commons-validator/commons-validator/1.4.1/commons-validator-1.4.1.jar (190 kB at 3.3 MB/s)
[INFO] Downloading from central: https://repo.maven.apache.org/maven2/org/apache/maven/shared/maven-artifact-transfer/0.9.1/maven-artifact-transfer-0.9.1.jar
[INFO] Downloaded from central: https://repo.maven.apache.org/maven2/commons-logging/commons-logging/1.2/commons-logging-1.2.jar (62 kB at 951 kB/s)
[INFO] Downloading from central: https://repo.maven.apache.org/maven2/org/apache/maven/shared/maven-common-artifact-filters/3.0.1/maven-common-artifact-filters-3.0.1.jar
[INFO] Downloaded from central: https://repo.maven.apache.org/maven2/org/apache/maven/shared/maven-script-interpreter/1.2/maven-script-interpreter-1.2.jar (22 kB at 290 kB/s)
[INFO] Downloading from central: https://repo.maven.apache.org/maven2/commons-codec/commons-codec/1.6/commons-codec-1.6.jar
[INFO] Downloaded from central: https://repo.maven.apache.org/maven2/org/apache/maven/shared/maven-artifact-transfer/0.9.1/maven-artifact-transfer-0.9.1.jar (123 kB at 1.2 MB/s)
[INFO] Downloading from central: https://repo.maven.apache.org/maven2/org/slf4j/slf4j-api/1.7.5/slf4j-api-1.7.5.jar
[INFO] Downloaded from central: https://repo.maven.apache.org/maven2/org/apache/maven/shared/maven-common-artifact-filters/3.0.1/maven-common-artifact-filters-3.0.1.jar (61 kB at 591 kB/s)
[INFO] Downloading from central: https://repo.maven.apache.org/maven2/org/apache/maven/doxia/doxia-sink-api/1.7/doxia-sink-api-1.7.jar
[INFO] Downloaded from central: https://repo.maven.apache.org/maven2/commons-codec/commons-codec/1.6/commons-codec-1.6.jar (233 kB at 2.0 MB/s)
[INFO] Downloading from central: https://repo.maven.apache.org/maven2/org/apache/maven/doxia/doxia-logging-api/1.7/doxia-logging-api-1.7.jar
[INFO] Downloaded from central: https://repo.maven.apache.org/maven2/org/apache/ant/ant/1.8.1/ant-1.8.1.jar (1.5 MB at 12 MB/s)
[INFO] Downloading from central: https://repo.maven.apache.org/maven2/org/apache/maven/doxia/doxia-site-renderer/1.7.4/doxia-site-renderer-1.7.4.jar
[INFO] Downloaded from central: https://repo.maven.apache.org/maven2/org/apache/maven/doxia/doxia-site-renderer/1.7.4/doxia-site-renderer-1.7.4.jar (64 kB at 342 kB/s)
[INFO] Downloading from central: https://repo.maven.apache.org/maven2/org/apache/maven/doxia/doxia-decoration-model/1.7.4/doxia-decoration-model-1.7.4.jar
[INFO] Downloaded from central: https://repo.maven.apache.org/maven2/org/apache/maven/doxia/doxia-sink-api/1.7/doxia-sink-api-1.7.jar (11 kB at 60 kB/s)
[INFO] Downloading from central: https://repo.maven.apache.org/maven2/org/apache/maven/doxia/doxia-skin-model/1.7.4/doxia-skin-model-1.7.4.jar
[INFO] Downloaded from central: https://repo.maven.apache.org/maven2/org/apache/maven/shared/maven-invoker/3.0.0/maven-invoker-3.0.0.jar (33 kB at 162 kB/s)
[INFO] Downloading from central: https://repo.maven.apache.org/maven2/org/apache/maven/doxia/doxia-module-xhtml/1.7/doxia-module-xhtml-1.7.jar
[INFO] Running Setup Jobs
[INFO] Building: resolve-artifact\pom.xml
[INFO] Downloaded from central: https://repo.maven.apache.org/maven2/org/apache/maven/doxia/doxia-decoration-model/1.7.4/doxia-decoration-model-1.7.4.jar (61 kB at 279 kB/s)
[INFO] Downloading from central: https://repo.maven.apache.org/maven2/org/codehaus/groovy/groovy-all/2.4.8/groovy-all-2.4.8.jar
[INFO] Downloaded from central: https://repo.maven.apache.org/maven2/org/apache/maven/doxia/doxia-skin-model/1.7.4/doxia-skin-model-1.7.4.jar (16 kB at 73 kB/s)
[INFO] Downloaded from central: https://repo.maven.apache.org/maven2/org/apache/maven/doxia/doxia-logging-api/1.7/doxia-logging-api-1.7.jar (12 kB at 52 kB/s)
[INFO] Downloaded from central: https://repo.maven.apache.org/maven2/org/apache/maven/doxia/doxia-module-xhtml/1.7/doxia-module-xhtml-1.7.jar (17 kB at 76 kB/s)
[INFO] Downloaded from central: https://repo.maven.apache.org/maven2/org/slf4j/slf4j-api/1.7.5/slf4j-api-1.7.5.jar (26 kB at 89 kB/s)
[INFO] Downloaded from central: https://repo.maven.apache.org/maven2/org/codehaus/groovy/groovy-all/2.4.8/groovy-all-2.4.8.jar (7.0 MB at 18 MB/s)
[INFO] Installing f:\jenkins\jenkins-slave\workspace\n-box_maven-resolver_MRESOLVER-8\m\pom.xml to F:\jenkins\jenkins-slave\workspace\n-box_maven-resolver_MRESOLVER-8\m\maven-resolver-demos\maven-resolver-demo-maven-plugin\target\local-repo\org\apache\maven\resolver\maven-resolver\1.4.0-SNAPSHOT\maven-resolver-1.4.0-SNAPSHOT.pom
[INFO] Installing f:\jenkins\jenkins-slave\workspace\n-box_maven-resolver_MRESOLVER-8\m\target\maven-resolver-1.4.0-SNAPSHOT-site.xml to F:\jenkins\jenkins-slave\workspace\n-box_maven-resolver_MRESOLVER-8\m\maven-resolver-demos\maven-resolver-demo-maven-plugin\target\local-repo\org\apache\maven\resolver\maven-resolver\1.4.0-SNAPSHOT\maven-resolver-1.4.0-SNAPSHOT-site.xml
[INFO] Installing F:\jenkins\jenkins-slave\workspace\n-box_maven-resolver_MRESOLVER-8\m\maven-resolver-api\pom.xml to F:\jenkins\jenkins-slave\workspace\n-box_maven-resolver_MRESOLVER-8\m\maven-resolver-demos\maven-resolver-demo-maven-plugin\target\local-repo\org\apache\maven\resolver\maven-resolver-api\1.4.0-SNAPSHOT\maven-resolver-api-1.4.0-SNAPSHOT.pom
[INFO] Installing F:\jenkins\jenkins-slave\workspace\n-box_maven-resolver_MRESOLVER-8\m\maven-resolver-api\target\maven-resolver-api-1.4.0-SNAPSHOT.jar to F:\jenkins\jenkins-slave\workspace\n-box_maven-resolver_MRESOLVER-8\m\maven-resolver-demos\maven-resolver-demo-maven-plugin\target\local-repo\org\apache\maven\resolver\maven-resolver-api\1.4.0-SNAPSHOT\maven-resolver-api-1.4.0-SNAPSHOT.jar
[INFO] Installing F:\jenkins\jenkins-slave\workspace\n-box_maven-resolver_MRESOLVER-8\m\maven-resolver-spi\pom.xml to F:\jenkins\jenkins-slave\workspace\n-box_maven-resolver_MRESOLVER-8\m\maven-resolver-demos\maven-resolver-demo-maven-plugin\target\local-repo\org\apache\maven\resolver\maven-resolver-spi\1.4.0-SNAPSHOT\maven-resolver-spi-1.4.0-SNAPSHOT.pom
[INFO] Installing F:\jenkins\jenkins-slave\workspace\n-box_maven-resolver_MRESOLVER-8\m\maven-resolver-spi\target\maven-resolver-spi-1.4.0-SNAPSHOT.jar to F:\jenkins\jenkins-slave\workspace\n-box_maven-resolver_MRESOLVER-8\m\maven-resolver-demos\maven-resolver-demo-maven-plugin\target\local-repo\org\apache\maven\resolver\maven-resolver-spi\1.4.0-SNAPSHOT\maven-resolver-spi-1.4.0-SNAPSHOT.jar
[INFO] Installing F:\jenkins\jenkins-slave\workspace\n-box_maven-resolver_MRESOLVER-8\m\maven-resolver-test-util\pom.xml to F:\jenkins\jenkins-slave\workspace\n-box_maven-resolver_MRESOLVER-8\m\maven-resolver-demos\maven-resolver-demo-maven-plugin\target\local-repo\org\apache\maven\resolver\maven-resolver-test-util\1.4.0-SNAPSHOT\maven-resolver-test-util-1.4.0-SNAPSHOT.pom
[INFO] Installing F:\jenkins\jenkins-slave\workspace\n-box_maven-resolver_MRESOLVER-8\m\maven-resolver-test-util\target\maven-resolver-test-util-1.4.0-SNAPSHOT.jar to F:\jenkins\jenkins-slave\workspace\n-box_maven-resolver_MRESOLVER-8\m\maven-resolver-demos\maven-resolver-demo-maven-plugin\target\local-repo\org\apache\maven\resolver\maven-resolver-test-util\1.4.0-SNAPSHOT\maven-resolver-test-util-1.4.0-SNAPSHOT.jar
[INFO] Installing F:\jenkins\jenkins-slave\workspace\n-box_maven-resolver_MRESOLVER-8\m\maven-resolver-util\pom.xml to F:\jenkins\jenkins-slave\workspace\n-box_maven-resolver_MRESOLVER-8\m\maven-resolver-demos\maven-resolver-demo-maven-plugin\target\local-repo\org\apache\maven\resolver\maven-resolver-util\1.4.0-SNAPSHOT\maven-resolver-util-1.4.0-SNAPSHOT.pom
[INFO] Installing F:\jenkins\jenkins-slave\workspace\n-box_maven-resolver_MRESOLVER-8\m\maven-resolver-util\target\maven-resolver-util-1.4.0-SNAPSHOT.jar to F:\jenkins\jenkins-slave\workspace\n-box_maven-resolver_MRESOLVER-8\m\maven-resolver-demos\maven-resolver-demo-maven-plugin\target\local-repo\org\apache\maven\resolver\maven-resolver-util\1.4.0-SNAPSHOT\maven-resolver-util-1.4.0-SNAPSHOT.jar
[INFO] Installing F:\jenkins\jenkins-slave\workspace\n-box_maven-resolver_MRESOLVER-8\m\maven-resolver-impl\pom.xml to F:\jenkins\jenkins-slave\workspace\n-box_maven-resolver_MRESOLVER-8\m\maven-resolver-demos\maven-resolver-demo-maven-plugin\target\local-repo\org\apache\maven\resolver\maven-resolver-impl\1.4.0-SNAPSHOT\maven-resolver-impl-1.4.0-SNAPSHOT.pom
[INFO] Installing F:\jenkins\jenkins-slave\workspace\n-box_maven-resolver_MRESOLVER-8\m\maven-resolver-impl\target\maven-resolver-impl-1.4.0-SNAPSHOT.jar to F:\jenkins\jenkins-slave\workspace\n-box_maven-resolver_MRESOLVER-8\m\maven-resolver-demos\maven-resolver-demo-maven-plugin\target\local-repo\org\apache\maven\resolver\maven-resolver-impl\1.4.0-SNAPSHOT\maven-resolver-impl-1.4.0-SNAPSHOT.jar
[INFO] Installing F:\jenkins\jenkins-slave\workspace\n-box_maven-resolver_MRESOLVER-8\m\maven-resolver-connector-basic\pom.xml to F:\jenkins\jenkins-slave\workspace\n-box_maven-resolver_MRESOLVER-8\m\maven-resolver-demos\maven-resolver-demo-maven-plugin\target\local-repo\org\apache\maven\resolver\maven-resolver-connector-basic\1.4.0-SNAPSHOT\maven-resolver-connector-basic-1.4.0-SNAPSHOT.pom
[INFO] Installing F:\jenkins\jenkins-slave\workspace\n-box_maven-resolver_MRESOLVER-8\m\maven-resolver-connector-basic\target\maven-resolver-connector-basic-1.4.0-SNAPSHOT.jar to F:\jenkins\jenkins-slave\workspace\n-box_maven-resolver_MRESOLVER-8\m\maven-resolver-demos\maven-resolver-demo-maven-plugin\target\local-repo\org\apache\maven\resolver\maven-resolver-connector-basic\1.4.0-SNAPSHOT\maven-resolver-connector-basic-1.4.0-SNAPSHOT.jar
[INFO] Installing F:\jenkins\jenkins-slave\workspace\n-box_maven-resolver_MRESOLVER-8\m\maven-resolver-transport-classpath\pom.xml to F:\jenkins\jenkins-slave\workspace\n-box_maven-resolver_MRESOLVER-8\m\maven-resolver-demos\maven-resolver-demo-maven-plugin\target\local-repo\org\apache\maven\resolver\maven-resolver-transport-classpath\1.4.0-SNAPSHOT\maven-resolver-transport-classpath-1.4.0-SNAPSHOT.pom
[INFO] Installing F:\jenkins\jenkins-slave\workspace\n-box_maven-resolver_MRESOLVER-8\m\maven-resolver-transport-classpath\target\maven-resolver-transport-classpath-1.4.0-SNAPSHOT.jar to F:\jenkins\jenkins-slave\workspace\n-box_maven-resolver_MRESOLVER-8\m\maven-resolver-demos\maven-resolver-demo-maven-plugin\target\local-repo\org\apache\maven\resolver\maven-resolver-transport-classpath\1.4.0-SNAPSHOT\maven-resolver-transport-classpath-1.4.0-SNAPSHOT.jar
[INFO] Installing F:\jenkins\jenkins-slave\workspace\n-box_maven-resolver_MRESOLVER-8\m\maven-resolver-transport-file\pom.xml to F:\jenkins\jenkins-slave\workspace\n-box_maven-resolver_MRESOLVER-8\m\maven-resolver-demos\maven-resolver-demo-maven-plugin\target\local-repo\org\apache\maven\resolver\maven-resolver-transport-file\1.4.0-SNAPSHOT\maven-resolver-transport-file-1.4.0-SNAPSHOT.pom
[INFO] Installing F:\jenkins\jenkins-slave\workspace\n-box_maven-resolver_MRESOLVER-8\m\maven-resolver-transport-file\target\maven-resolver-transport-file-1.4.0-SNAPSHOT.jar to F:\jenkins\jenkins-slave\workspace\n-box_maven-resolver_MRESOLVER-8\m\maven-resolver-demos\maven-resolver-demo-maven-plugin\target\local-repo\org\apache\maven\resolver\maven-resolver-transport-file\1.4.0-SNAPSHOT\maven-resolver-transport-file-1.4.0-SNAPSHOT.jar
[INFO] Installing F:\jenkins\jenkins-slave\workspace\n-box_maven-resolver_MRESOLVER-8\m\maven-resolver-transport-http\pom.xml to F:\jenkins\jenkins-slave\workspace\n-box_maven-resolver_MRESOLVER-8\m\maven-resolver-demos\maven-resolver-demo-maven-plugin\target\local-repo\org\apache\maven\resolver\maven-resolver-transport-http\1.4.0-SNAPSHOT\maven-resolver-transport-http-1.4.0-SNAPSHOT.pom
[INFO] Installing F:\jenkins\jenkins-slave\workspace\n-box_maven-resolver_MRESOLVER-8\m\maven-resolver-transport-http\target\maven-resolver-transport-http-1.4.0-SNAPSHOT.jar to F:\jenkins\jenkins-slave\workspace\n-box_maven-resolver_MRESOLVER-8\m\maven-resolver-demos\maven-resolver-demo-maven-plugin\target\local-repo\org\apache\maven\resolver\maven-resolver-transport-http\1.4.0-SNAPSHOT\maven-resolver-transport-http-1.4.0-SNAPSHOT.jar
[INFO] Installing F:\jenkins\jenkins-slave\workspace\n-box_maven-resolver_MRESOLVER-8\m\maven-resolver-transport-wagon\pom.xml to F:\jenkins\jenkins-slave\workspace\n-box_maven-resolver_MRESOLVER-8\m\maven-resolver-demos\maven-resolver-demo-maven-plugin\target\local-repo\org\apache\maven\resolver\maven-resolver-transport-wagon\1.4.0-SNAPSHOT\maven-resolver-transport-wagon-1.4.0-SNAPSHOT.pom
[INFO] Installing F:\jenkins\jenkins-slave\workspace\n-box_maven-resolver_MRESOLVER-8\m\maven-resolver-transport-wagon\target\maven-resolver-transport-wagon-1.4.0-SNAPSHOT.jar to F:\jenkins\jenkins-slave\workspace\n-box_maven-resolver_MRESOLVER-8\m\maven-resolver-demos\maven-resolver-demo-maven-plugin\target\local-repo\org\apache\maven\resolver\maven-resolver-transport-wagon\1.4.0-SNAPSHOT\maven-resolver-transport-wagon-1.4.0-SNAPSHOT.jar
[INFO] Installing F:\jenkins\jenkins-slave\workspace\n-box_maven-resolver_MRESOLVER-8\m\maven-resolver-demos\pom.xml to F:\jenkins\jenkins-slave\workspace\n-box_maven-resolver_MRESOLVER-8\m\maven-resolver-demos\maven-resolver-demo-maven-plugin\target\local-repo\org\apache\maven\resolver\maven-resolver-demos\1.4.0-SNAPSHOT\maven-resolver-demos-1.4.0-SNAPSHOT.pom
[INFO] Installing F:\jenkins\jenkins-slave\workspace\n-box_maven-resolver_MRESOLVER-8\m\maven-resolver-demos\target\maven-resolver-demos-1.4.0-SNAPSHOT-site.xml to F:\jenkins\jenkins-slave\workspace\n-box_maven-resolver_MRESOLVER-8\m\maven-resolver-demos\maven-resolver-demo-maven-plugin\target\local-repo\org\apache\maven\resolver\maven-resolver-demos\1.4.0-SNAPSHOT\maven-resolver-demos-1.4.0-SNAPSHOT-site.xml
[INFO] Installing F:\jenkins\jenkins-slave\workspace\n-box_maven-resolver_MRESOLVER-8\m\maven-resolver-demos\maven-resolver-demo-snippets\pom.xml to F:\jenkins\jenkins-slave\workspace\n-box_maven-resolver_MRESOLVER-8\m\maven-resolver-demos\maven-resolver-demo-maven-plugin\target\local-repo\org\apache\maven\resolver\maven-resolver-demo-snippets\1.4.0-SNAPSHOT\maven-resolver-demo-snippets-1.4.0-SNAPSHOT.pom
[INFO] Installing F:\jenkins\jenkins-slave\workspace\n-box_maven-resolver_MRESOLVER-8\m\maven-resolver-demos\maven-resolver-demo-snippets\target\maven-resolver-demo-snippets-1.4.0-SNAPSHOT.jar to F:\jenkins\jenkins-slave\workspace\n-box_maven-resolver_MRESOLVER-8\m\maven-resolver-demos\maven-resolver-demo-maven-plugin\target\local-repo\org\apache\maven\resolver\maven-resolver-demo-snippets\1.4.0-SNAPSHOT\maven-resolver-demo-snippets-1.4.0-SNAPSHOT.jar
[INFO] Installing F:\jenkins\jenkins-slave\workspace\n-box_maven-resolver_MRESOLVER-8\m\maven-resolver-demos\maven-resolver-demo-maven-plugin\pom.xml to F:\jenkins\jenkins-slave\workspace\n-box_maven-resolver_MRESOLVER-8\m\maven-resolver-demos\maven-resolver-demo-maven-plugin\target\local-repo\org\apache\maven\resolver\maven-resolver-demo-maven-plugin\1.4.0-SNAPSHOT\maven-resolver-demo-maven-plugin-1.4.0-SNAPSHOT.pom
[INFO] Installing F:\jenkins\jenkins-slave\workspace\n-box_maven-resolver_MRESOLVER-8\m\maven-resolver-demos\maven-resolver-demo-maven-plugin\target\maven-resolver-demo-maven-plugin-1.4.0-SNAPSHOT.jar to F:\jenkins\jenkins-slave\workspace\n-box_maven-resolver_MRESOLVER-8\m\maven-resolver-demos\maven-resolver-demo-maven-plugin\target\local-repo\org\apache\maven\resolver\maven-resolver-demo-maven-plugin\1.4.0-SNAPSHOT\maven-resolver-demo-maven-plugin-1.4.0-SNAPSHOT.jar
[INFO]
[INFO] --- maven-invoker-plugin:3.0.1:run (integration-test) @ maven-resolver-demo-maven-plugin ---
[INFO] Running Setup Jobs
[INFO] Building: resolve-artifact\pom.xml
[INFO]           resolve-artifact\pom.xml ......................... SUCCESS (4.4 s)
[INFO] -------------------------------------------------
[INFO] Build Summary:
[INFO]   Passed: 1, Failed: 0, Errors: 0, Skipped: 0
[INFO] -------------------------------------------------
[INFO]
[INFO] --- maven-checkstyle-plugin:3.0.0:check (checkstyle-check) @ maven-resolver-demo-maven-plugin ---
[INFO] ------------------------------------------------------------------------
[INFO] Reactor Summary for Maven Artifact Resolver 1.4.0-SNAPSHOT:
[INFO]
[INFO] Maven Artifact Resolver ............................ SUCCESS [ 58.961 s]
[INFO] Maven Artifact Resolver API ........................ SUCCESS [ 22.124 s]
[INFO] Maven Artifact Resolver SPI ........................ SUCCESS [  3.777 s]
[INFO] Maven Artifact Resolver Test Utilities ............. SUCCESS [  3.631 s]
[INFO] Maven Artifact Resolver Utilities .................. SUCCESS [ 10.246 s]
[INFO] Maven Artifact Resolver Implementation ............. SUCCESS [ 25.551 s]
[INFO] Maven Artifact Resolver Connector Basic ............ SUCCESS [  8.949 s]
[INFO] Maven Artifact Resolver Transport Classpath ........ SUCCESS [  3.035 s]
[INFO] Maven Artifact Resolver Transport File ............. SUCCESS [  4.124 s]
[INFO] Maven Artifact Resolver Transport HTTP ............. SUCCESS [ 14.715 s]
[INFO] Maven Artifact Resolver Transport Wagon ............ SUCCESS [  6.189 s]
[INFO] Maven Artifact Resolver Demos ...................... SUCCESS [  0.837 s]
[INFO] Maven Artifact Resolver Demo Snippets .............. SUCCESS [  3.426 s]
[INFO] Maven Artifact Resolver Demo Maven Plugin .......... SUCCESS [ 15.110 s]
[INFO] ------------------------------------------------------------------------
[INFO] BUILD SUCCESS
[INFO] ------------------------------------------------------------------------
[INFO] Total time:  03:02 min
[INFO] Finished at: 2020-02-08T21:07:21-08:00
[INFO] ------------------------------------------------------------------------
[INFO] [jenkins-event-spy] Generated F:\jenkins\jenkins-slave\workspace\n-box_maven-resolver_MRESOLVER-8@tmp\withMaven8fab307b\maven-spy-20200208-210418-2692344743056238188959.log
Picked up JAVA_TOOL_OPTIONS: -Dmaven.ext.class.path="f:\jenkins\jenkins-slave\workspace\n-box_maven-resolver_MRESOLVER-8@tmp\withMaven8fab307b\pipeline-maven-spy.jar" -Dorg.jenkinsci.plugins.pipeline.maven.reportsFolder="f:\jenkins\jenkins-slave\workspace\n-box_maven-resolver_MRESOLVER-8@tmp\withMaven8fab307b"
[Pipeline] }
[Pipeline] // dir
[Pipeline] }
[withMaven] invokerPublisher - Archive invoker results for Maven artifact MavenArtifact{org.apache.maven.resolver:maven-resolver-demo-maven-plugin:maven-plugin:1.4.0-SNAPSHOT(version: 1.4.0-SNAPSHOT, snapshot:false) } generated by PluginInvocation{org.apache.maven.plugins:maven-invoker-plugin:3.0.1@run  integration-test}: m\maven-resolver-demos\maven-resolver-demo-maven-plugin\target\invoker-reports\*.xml
[withMaven] junitPublisher - Archive test results for Maven artifact org.apache.maven.resolver:maven-resolver-api:jar:1.4.0-SNAPSHOT generated by maven-surefire-plugin:test (default-test): m\maven-resolver-api\target\surefire-reports\*.xml
[withMaven] junitPublisher - Archive test results for Maven artifact org.apache.maven.resolver:maven-resolver-spi:jar:1.4.0-SNAPSHOT generated by maven-surefire-plugin:test (default-test): m\maven-resolver-spi\target\surefire-reports\*.xml
[withMaven] junitPublisher - Archive test results for Maven artifact org.apache.maven.resolver:maven-resolver-test-util:jar:1.4.0-SNAPSHOT generated by maven-surefire-plugin:test (default-test): m\maven-resolver-test-util\target\surefire-reports\*.xml
[withMaven] junitPublisher - Archive test results for Maven artifact org.apache.maven.resolver:maven-resolver-util:jar:1.4.0-SNAPSHOT generated by maven-surefire-plugin:test (default-test): m\maven-resolver-util\target\surefire-reports\*.xml
[withMaven] junitPublisher - Archive test results for Maven artifact org.apache.maven.resolver:maven-resolver-impl:jar:1.4.0-SNAPSHOT generated by maven-surefire-plugin:test (default-test): m\maven-resolver-impl\target\surefire-reports\*.xml
[withMaven] junitPublisher - Archive test results for Maven artifact org.apache.maven.resolver:maven-resolver-connector-basic:jar:1.4.0-SNAPSHOT generated by maven-surefire-plugin:test (default-test): m\maven-resolver-connector-basic\target\surefire-reports\*.xml
[withMaven] junitPublisher - Archive test results for Maven artifact org.apache.maven.resolver:maven-resolver-transport-classpath:jar:1.4.0-SNAPSHOT generated by maven-surefire-plugin:test (default-test): m\maven-resolver-transport-classpath\target\surefire-reports\*.xml
[withMaven] junitPublisher - Archive test results for Maven artifact org.apache.maven.resolver:maven-resolver-transport-file:jar:1.4.0-SNAPSHOT generated by maven-surefire-plugin:test (default-test): m\maven-resolver-transport-file\target\surefire-reports\*.xml
[withMaven] junitPublisher - Archive test results for Maven artifact org.apache.maven.resolver:maven-resolver-transport-http:jar:1.4.0-SNAPSHOT generated by maven-surefire-plugin:test (default-test): m\maven-resolver-transport-http\target\surefire-reports\*.xml
[withMaven] junitPublisher - Archive test results for Maven artifact org.apache.maven.resolver:maven-resolver-transport-wagon:jar:1.4.0-SNAPSHOT generated by maven-surefire-plugin:test (default-test): m\maven-resolver-transport-wagon\target\surefire-reports\*.xml
[withMaven] junitPublisher - Archive test results for Maven artifact org.apache.maven.resolver:maven-resolver-demo-snippets:jar:1.4.0-SNAPSHOT generated by maven-surefire-plugin:test (default-test): m\maven-resolver-demos\maven-resolver-demo-snippets\target\surefire-reports\*.xml
[withMaven] junitPublisher - Archive test results for Maven artifact org.apache.maven.resolver:maven-resolver-demo-maven-plugin:maven-plugin:1.4.0-SNAPSHOT generated by maven-surefire-plugin:test (default-test): m\maven-resolver-demos\maven-resolver-demo-maven-plugin\target\surefire-reports\*.xml
Recording test results
[INFO]           resolve-artifact\pom.xml ......................... SUCCESS (4.7 s)
[INFO] -------------------------------------------------
[INFO] Build Summary:
[INFO]   Passed: 1, Failed: 0, Errors: 0, Skipped: 0
[INFO] -------------------------------------------------
[INFO]
[INFO] --- maven-checkstyle-plugin:3.0.0:check (checkstyle-check) @ maven-resolver-demo-maven-plugin ---
[INFO] ------------------------------------------------------------------------
[INFO] Reactor Summary for Maven Artifact Resolver 1.4.0-SNAPSHOT:
[INFO]
[INFO] Maven Artifact Resolver ............................ SUCCESS [ 39.238 s]
[INFO] Maven Artifact Resolver API ........................ SUCCESS [ 23.204 s]
[INFO] Maven Artifact Resolver SPI ........................ SUCCESS [  3.412 s]
[INFO] Maven Artifact Resolver Test Utilities ............. SUCCESS [  3.850 s]
[INFO] Maven Artifact Resolver Utilities .................. SUCCESS [  9.926 s]
[INFO] Maven Artifact Resolver Implementation ............. SUCCESS [ 25.927 s]
[INFO] Maven Artifact Resolver Connector Basic ............ SUCCESS [  8.900 s]
[INFO] Maven Artifact Resolver Transport Classpath ........ SUCCESS [  2.857 s]
[INFO] Maven Artifact Resolver Transport File ............. SUCCESS [  3.581 s]
[INFO] Maven Artifact Resolver Transport HTTP ............. SUCCESS [ 11.147 s]
[INFO] Maven Artifact Resolver Transport Wagon ............ SUCCESS [  6.161 s]
[INFO] Maven Artifact Resolver Demos ...................... SUCCESS [  0.330 s]
[INFO] Maven Artifact Resolver Demo Snippets .............. SUCCESS [  2.977 s]
[INFO] Maven Artifact Resolver Demo Maven Plugin .......... SUCCESS [ 12.675 s]
[INFO] ------------------------------------------------------------------------
[INFO] BUILD SUCCESS
[INFO] ------------------------------------------------------------------------
[INFO] Total time:  02:35 min
[INFO] Finished at: 2020-02-08T21:07:24-08:00
[INFO] ------------------------------------------------------------------------
[INFO] [jenkins-event-spy] Generated F:\jenkins\jenkins-slave\workspace\n-box_maven-resolver_MRESOLVER-8@tmp\withMaven0a793375\maven-spy-20200208-210448-13014017696524762269929.log
[Pipeline] }
[Pipeline] // dir
[Pipeline] }
[withMaven] invokerPublisher - Archive invoker results for Maven artifact MavenArtifact{org.apache.maven.resolver:maven-resolver-demo-maven-plugin:maven-plugin:1.4.0-SNAPSHOT(version: 1.4.0-SNAPSHOT, snapshot:false) } generated by PluginInvocation{org.apache.maven.plugins:maven-invoker-plugin:3.0.1@run  integration-test}: m\maven-resolver-demos\maven-resolver-demo-maven-plugin\target\invoker-reports\*.xml
[withMaven] Publishers: Pipeline Graph Publisher: 4 ms, Invoker Publisher: 633 ms, Junit Publisher: 2658 ms, Concordion Publisher: 1 ms, Dependencies Fingerprint Publisher: 437 ms
[Pipeline] // withMaven
[Pipeline] cleanWs
[WS-CLEANUP] Deleting project workspace...
[WS-CLEANUP] Deferred wipeout is used...
[withMaven] junitPublisher - Archive test results for Maven artifact org.apache.maven.resolver:maven-resolver-api:jar:1.4.0-SNAPSHOT generated by maven-surefire-plugin:test (default-test): m\maven-resolver-api\target\surefire-reports\*.xml
[withMaven] junitPublisher - Archive test results for Maven artifact org.apache.maven.resolver:maven-resolver-spi:jar:1.4.0-SNAPSHOT generated by maven-surefire-plugin:test (default-test): m\maven-resolver-spi\target\surefire-reports\*.xml
[withMaven] junitPublisher - Archive test results for Maven artifact org.apache.maven.resolver:maven-resolver-test-util:jar:1.4.0-SNAPSHOT generated by maven-surefire-plugin:test (default-test): m\maven-resolver-test-util\target\surefire-reports\*.xml
[withMaven] junitPublisher - Archive test results for Maven artifact org.apache.maven.resolver:maven-resolver-util:jar:1.4.0-SNAPSHOT generated by maven-surefire-plugin:test (default-test): m\maven-resolver-util\target\surefire-reports\*.xml
[withMaven] junitPublisher - Archive test results for Maven artifact org.apache.maven.resolver:maven-resolver-impl:jar:1.4.0-SNAPSHOT generated by maven-surefire-plugin:test (default-test): m\maven-resolver-impl\target\surefire-reports\*.xml
[withMaven] junitPublisher - Archive test results for Maven artifact org.apache.maven.resolver:maven-resolver-connector-basic:jar:1.4.0-SNAPSHOT generated by maven-surefire-plugin:test (default-test): m\maven-resolver-connector-basic\target\surefire-reports\*.xml
[withMaven] junitPublisher - Archive test results for Maven artifact org.apache.maven.resolver:maven-resolver-transport-classpath:jar:1.4.0-SNAPSHOT generated by maven-surefire-plugin:test (default-test): m\maven-resolver-transport-classpath\target\surefire-reports\*.xml
[withMaven] junitPublisher - Archive test results for Maven artifact org.apache.maven.resolver:maven-resolver-transport-file:jar:1.4.0-SNAPSHOT generated by maven-surefire-plugin:test (default-test): m\maven-resolver-transport-file\target\surefire-reports\*.xml
[withMaven] junitPublisher - Archive test results for Maven artifact org.apache.maven.resolver:maven-resolver-transport-http:jar:1.4.0-SNAPSHOT generated by maven-surefire-plugin:test (default-test): m\maven-resolver-transport-http\target\surefire-reports\*.xml
[withMaven] junitPublisher - Archive test results for Maven artifact org.apache.maven.resolver:maven-resolver-transport-wagon:jar:1.4.0-SNAPSHOT generated by maven-surefire-plugin:test (default-test): m\maven-resolver-transport-wagon\target\surefire-reports\*.xml
[withMaven] junitPublisher - Archive test results for Maven artifact org.apache.maven.resolver:maven-resolver-demo-snippets:jar:1.4.0-SNAPSHOT generated by maven-surefire-plugin:test (default-test): m\maven-resolver-demos\maven-resolver-demo-snippets\target\surefire-reports\*.xml
[withMaven] junitPublisher - Archive test results for Maven artifact org.apache.maven.resolver:maven-resolver-demo-maven-plugin:maven-plugin:1.4.0-SNAPSHOT generated by maven-surefire-plugin:test (default-test): m\maven-resolver-demos\maven-resolver-demo-maven-plugin\target\surefire-reports\*.xml
Recording test results
[WS-CLEANUP] done
[Pipeline] }
[Pipeline] // stage
[Pipeline] }
[Pipeline] // node
[Pipeline] }
[withMaven] Publishers: Pipeline Graph Publisher: 5 ms, Invoker Publisher: 837 ms, Junit Publisher: 3133 ms, Concordion Publisher: 1 ms, Dependencies Fingerprint Publisher: 447 ms
[Pipeline] // withMaven
[Pipeline] cleanWs
[WS-CLEANUP] Deleting project workspace...
[WS-CLEANUP] Deferred wipeout is used...
[WS-CLEANUP] done
[Pipeline] }
[Pipeline] // stage
[Pipeline] }
[Pipeline] // node
[Pipeline] }
Aborted by tibordigana
Sending interrupt signal to process
Sending interrupt signal to process
Picked up JAVA_TOOL_OPTIONS: -Dmaven.ext.class.path="f:\jenkins\jenkins-slave\workspace\n-box_maven-resolver_MRESOLVER-8@tmp\withMavena4ab4863\pipeline-maven-spy.jar" -Dorg.jenkinsci.plugins.pipeline.maven.reportsFolder="f:\jenkins\jenkins-slave\workspace\n-box_maven-resolver_MRESOLVER-8@tmp\withMavena4ab4863"
Terminate batch job (Y/N)?
script returned exit code 1
[Pipeline] }
[Pipeline] // dir
[Pipeline] }
[withMaven] One or multiple Maven executions have been ignored by the Jenkins Pipeline Maven Plugin because they have been interrupted before completion (1). See Pipeline Maven Plugin FAQ for more details.
[Pipeline] // withMaven
[Pipeline] echo
[FAILURE-004] org.jenkinsci.plugins.workflow.steps.FlowInterruptedException
[Pipeline] cleanWs
[WS-CLEANUP] Deleting project workspace...
[WS-CLEANUP] Deferred wipeout is used...
[WS-CLEANUP] done
[Pipeline] cleanWs
[WS-CLEANUP] Deleting project workspace...
[WS-CLEANUP] Deferred wipeout is used...
[WS-CLEANUP] done
[Pipeline] }
[Pipeline] // stage
[Pipeline] }
[Pipeline] // node
[Pipeline] }
Failed in branch windows-jdk7
[Pipeline] // parallel
[Pipeline] echo
[FAILURE-002] FlowInterruptedException org.jenkinsci.plugins.workflow.steps.FlowInterruptedException
[Pipeline] stage
[Pipeline] { (Notifications)
[Pipeline] echo
Build result: FAILURE
[Pipeline] jiraIssueSelector
[Pipeline] echo
The authors of changes [rfscholte, khmarbaise, tibordigana].
[Pipeline] echo
Sending email ...
[Pipeline] emailext
Reply | Threaded
Open this post in threaded view
|

Build succeeded in Jenkins: Maven TLP » maven-resolver » MRESOLVER-8 #18

Apache Jenkins Server-2
See https://builds.apache.org/job/maven-box/job/maven-resolver/job/MRESOLVER-8/18/

Changes:

* add Maven 3.1.1
* [INFRA-19861] Configure Maven before 3.2.3 to use https
* Back to all ubuntu nodes
* [INFRA-19861] Test with node H22
* [INFRA-19861] fix typo
* [INFRA-19861] Fix confirmed, restoring original label
* [INFRA-19861] Analyzing...

All tests passed