Build failed in Jenkins: Maven TLP » maven-resolver » MRESOLVER-62_tests #16

classic Classic list List threaded Threaded
3 messages Options
Reply | Threaded
Open this post in threaded view
|

Build failed in Jenkins: Maven TLP » maven-resolver » MRESOLVER-62_tests #16

Apache Jenkins Server-2
See https://builds.apache.org/job/maven-box/job/maven-resolver/job/MRESOLVER-62_tests/16/

Changes:

* H30 is having issues

All tests passed

Build log:
[...truncated 31179 lines...]
[INFO] Downloading from central: https://repo.maven.apache.org/maven2/com/thoughtworks/qdox/qdox/2.0-M5/qdox-2.0-M5.jar
[INFO] Downloaded from central: https://repo.maven.apache.org/maven2/org/ow2/asm/asm-tree/6.1.1/asm-tree-6.1.1.jar (50 kB at 634 kB/s)
[INFO] Downloading from central: https://repo.maven.apache.org/maven2/org/apache/maven/plugin-tools/maven-plugin-tools-annotations/3.5.2/maven-plugin-tools-annotations-3.5.2.jar
[INFO] Downloaded from central: https://repo.maven.apache.org/maven2/org/apache/maven/plugin-tools/maven-plugin-tools-java/3.5.2/maven-plugin-tools-java-3.5.2.jar (18 kB at 208 kB/s)
[INFO] Downloading from central: https://repo.maven.apache.org/maven2/org/codehaus/plexus/plexus-archiver/3.4.1/plexus-archiver-3.4.1.jar
[INFO] Downloaded from central: https://repo.maven.apache.org/maven2/net/sf/jtidy/jtidy/r938/jtidy-r938.jar (250 kB at 2.6 MB/s)
[INFO] Downloading from central: https://repo.maven.apache.org/maven2/org/apache/maven/doxia/doxia-core/1.4/doxia-core-1.4.jar
[INFO] Downloaded from central: https://repo.maven.apache.org/maven2/org/apache/maven/plugin-tools/maven-plugin-tools-annotations/3.5.2/maven-plugin-tools-annotations-3.5.2.jar (43 kB at 305 kB/s)
[INFO] Downloading from central: https://repo.maven.apache.org/maven2/javax/servlet/servlet-api/2.3/servlet-api-2.3.jar
[INFO] Downloaded from central: https://repo.maven.apache.org/maven2/com/thoughtworks/qdox/qdox/2.0-M5/qdox-2.0-M5.jar (313 kB at 2.2 MB/s)
[INFO] Downloading from central: https://repo.maven.apache.org/maven2/org/codehaus/plexus/plexus-utils/3.0.20/plexus-utils-3.0.20.jar
[INFO] Downloaded from central: https://repo.maven.apache.org/maven2/org/apache/maven/doxia/doxia-core/1.4/doxia-core-1.4.jar (165 kB at 1.1 MB/s)
[INFO] Downloading from central: https://repo.maven.apache.org/maven2/org/apache/maven/surefire/maven-surefire-common/2.19.1/maven-surefire-common-2.19.1.jar
[INFO] Downloaded from central: https://repo.maven.apache.org/maven2/org/codehaus/plexus/plexus-archiver/3.4.1/plexus-archiver-3.4.1.jar (187 kB at 1.2 MB/s)
[INFO] Downloading from central: https://repo.maven.apache.org/maven2/org/apache/maven/surefire/surefire-api/2.19.1/surefire-api-2.19.1.jar
[INFO] Downloaded from central: https://repo.maven.apache.org/maven2/org/codehaus/plexus/plexus-utils/3.0.20/plexus-utils-3.0.20.jar (243 kB at 1.3 MB/s)
[INFO] Downloading from central: https://repo.maven.apache.org/maven2/org/apache/maven/surefire/surefire-booter/2.19.1/surefire-booter-2.19.1.jar
[INFO] Downloaded from central: https://repo.maven.apache.org/maven2/javax/servlet/servlet-api/2.3/servlet-api-2.3.jar (78 kB at 424 kB/s)
[INFO] Downloading from central: https://repo.maven.apache.org/maven2/org/apache/commons/commons-lang3/3.1/commons-lang3-3.1.jar
[INFO] Downloaded from central: https://repo.maven.apache.org/maven2/org/apache/maven/surefire/surefire-api/2.19.1/surefire-api-2.19.1.jar (196 kB at 1.0 MB/s)
[INFO] Downloaded from central: https://repo.maven.apache.org/maven2/org/apache/maven/surefire/maven-surefire-common/2.19.1/maven-surefire-common-2.19.1.jar (293 kB at 1.5 MB/s)
[INFO] Downloaded from central: https://repo.maven.apache.org/maven2/org/apache/maven/surefire/surefire-booter/2.19.1/surefire-booter-2.19.1.jar (46 kB at 224 kB/s)
[INFO] Downloaded from central: https://repo.maven.apache.org/maven2/org/apache/commons/commons-lang3/3.1/commons-lang3-3.1.jar (316 kB at 1.4 MB/s)
[INFO] Downloaded from central: https://repo.maven.apache.org/maven2/org/ow2/asm/asm-analysis/6.1.1/asm-analysis-6.1.1.jar (32 kB at 138 kB/s)
[ERROR]

Artifact Ids of the format maven-___-plugin are reserved for
plugins in the Group Id org.apache.maven.plugins
Please change your artifactId to the format ___-maven-plugin
In the future this error will break the build.


[INFO] Using 'UTF-8' encoding to read mojo source files.
[INFO] java-javadoc mojo extractor found 0 mojo descriptor.
[INFO] java-annotations mojo extractor found 1 mojo descriptor.
[INFO]
[INFO] --- maven-resources-plugin:3.1.0:testResources (default-testResources) @ maven-resolver-demo-maven-plugin ---
[INFO] Using 'UTF-8' encoding to copy filtered resources.
[INFO] skip non existing resourceDirectory F:\jenkins\jenkins-slave\workspace\aven-resolver_MRESOLVER-62_tests\m\maven-resolver-demos\maven-resolver-demo-maven-plugin\src\test\resources
[INFO] Copying 3 resources
[INFO]
[INFO] --- maven-compiler-plugin:3.7.0:testCompile (default-testCompile) @ maven-resolver-demo-maven-plugin ---
[INFO] No sources to compile
[INFO]
[INFO] --- maven-surefire-plugin:2.22.0:test (default-test) @ maven-resolver-demo-maven-plugin ---
[INFO]
[INFO] --- maven-jar-plugin:3.1.0:jar (default-jar) @ maven-resolver-demo-maven-plugin ---
[INFO] Building jar: F:\jenkins\jenkins-slave\workspace\aven-resolver_MRESOLVER-62_tests\m\maven-resolver-demos\maven-resolver-demo-maven-plugin\target\maven-resolver-demo-maven-plugin-1.4.0-SNAPSHOT.jar
[INFO]
[INFO] --- maven-plugin-plugin:3.5.2:addPluginArtifactMetadata (default-addPluginArtifactMetadata) @ maven-resolver-demo-maven-plugin ---
[INFO]
[INFO] --- maven-site-plugin:3.7.1:attach-descriptor (attach-descriptor) @ maven-resolver-demo-maven-plugin ---
[INFO] Skipping because packaging 'maven-plugin' is not pom.
[INFO]
[INFO] --- maven-invoker-plugin:3.0.1:install (integration-test) @ maven-resolver-demo-maven-plugin ---
[INFO] Downloading from central: https://repo.maven.apache.org/maven2/org/apache/maven/shared/maven-invoker/3.0.0/maven-invoker-3.0.0.pom
[INFO] Downloaded from central: https://repo.maven.apache.org/maven2/org/apache/maven/shared/maven-invoker/3.0.0/maven-invoker-3.0.0.pom (5.0 kB at 129 kB/s)
[INFO] Downloading from central: https://repo.maven.apache.org/maven2/org/apache/maven/reporting/maven-reporting-impl/2.4/maven-reporting-impl-2.4.pom
[INFO] Downloaded from central: https://repo.maven.apache.org/maven2/org/apache/maven/reporting/maven-reporting-impl/2.4/maven-reporting-impl-2.4.pom (6.1 kB at 195 kB/s)
[INFO] Downloading from central: https://repo.maven.apache.org/maven2/commons-validator/commons-validator/1.4.1/commons-validator-1.4.1.pom
[INFO] Downloaded from central: https://repo.maven.apache.org/maven2/commons-validator/commons-validator/1.4.1/commons-validator-1.4.1.pom (13 kB at 396 kB/s)
[INFO] Downloading from central: https://repo.maven.apache.org/maven2/org/apache/commons/commons-parent/36/commons-parent-36.pom
[INFO] Downloaded from central: https://repo.maven.apache.org/maven2/org/apache/commons/commons-parent/36/commons-parent-36.pom (58 kB at 1.4 MB/s)
[INFO] Downloading from central: https://repo.maven.apache.org/maven2/commons-beanutils/commons-beanutils/1.8.3/commons-beanutils-1.8.3.pom
[INFO] Downloaded from central: https://repo.maven.apache.org/maven2/commons-beanutils/commons-beanutils/1.8.3/commons-beanutils-1.8.3.pom (11 kB at 386 kB/s)
[INFO] Downloading from central: https://repo.maven.apache.org/maven2/org/apache/commons/commons-parent/14/commons-parent-14.pom
[INFO] Downloaded from central: https://repo.maven.apache.org/maven2/org/apache/commons/commons-parent/14/commons-parent-14.pom (31 kB at 872 kB/s)
[INFO] Downloading from central: https://repo.maven.apache.org/maven2/commons-digester/commons-digester/1.8.1/commons-digester-1.8.1.pom
[INFO] Downloaded from central: https://repo.maven.apache.org/maven2/commons-digester/commons-digester/1.8.1/commons-digester-1.8.1.pom (10 kB at 323 kB/s)
[INFO] Downloading from central: https://repo.maven.apache.org/maven2/org/apache/maven/shared/maven-script-interpreter/1.2/maven-script-interpreter-1.2.pom
[INFO] Downloaded from central: https://repo.maven.apache.org/maven2/org/apache/maven/shared/maven-script-interpreter/1.2/maven-script-interpreter-1.2.pom (4.0 kB at 133 kB/s)
[INFO] Downloading from central: https://repo.maven.apache.org/maven2/org/apache/ant/ant/1.8.1/ant-1.8.1.pom
[INFO] Downloaded from central: https://repo.maven.apache.org/maven2/org/apache/ant/ant/1.8.1/ant-1.8.1.pom (8.8 kB at 293 kB/s)
[INFO] Downloading from central: https://repo.maven.apache.org/maven2/org/apache/ant/ant-parent/1.8.1/ant-parent-1.8.1.pom
[INFO] Downloaded from central: https://repo.maven.apache.org/maven2/org/apache/ant/ant-parent/1.8.1/ant-parent-1.8.1.pom (4.3 kB at 153 kB/s)
[INFO] Downloading from central: https://repo.maven.apache.org/maven2/org/apache/maven/shared/maven-artifact-transfer/0.9.1/maven-artifact-transfer-0.9.1.pom
[INFO] Downloaded from central: https://repo.maven.apache.org/maven2/org/apache/maven/shared/maven-artifact-transfer/0.9.1/maven-artifact-transfer-0.9.1.pom (7.6 kB at 272 kB/s)
[INFO] Downloading from central: https://repo.maven.apache.org/maven2/org/apache/maven/shared/maven-common-artifact-filters/3.0.1/maven-common-artifact-filters-3.0.1.pom
[INFO] Downloaded from central: https://repo.maven.apache.org/maven2/org/apache/maven/shared/maven-common-artifact-filters/3.0.1/maven-common-artifact-filters-3.0.1.pom (4.8 kB at 173 kB/s)
[INFO] Downloading from central: https://repo.maven.apache.org/maven2/commons-codec/commons-codec/1.6/commons-codec-1.6.pom
[INFO] Downloaded from central: https://repo.maven.apache.org/maven2/commons-codec/commons-codec/1.6/commons-codec-1.6.pom (11 kB at 446 kB/s)
[INFO] Downloading from central: https://repo.maven.apache.org/maven2/org/slf4j/slf4j-api/1.7.5/slf4j-api-1.7.5.pom
[INFO] Downloaded from central: https://repo.maven.apache.org/maven2/org/slf4j/slf4j-api/1.7.5/slf4j-api-1.7.5.pom (2.7 kB at 108 kB/s)
[INFO] Downloading from central: https://repo.maven.apache.org/maven2/org/slf4j/slf4j-parent/1.7.5/slf4j-parent-1.7.5.pom
[INFO] Downloaded from central: https://repo.maven.apache.org/maven2/org/slf4j/slf4j-parent/1.7.5/slf4j-parent-1.7.5.pom (12 kB at 492 kB/s)
[INFO] Downloading from central: https://repo.maven.apache.org/maven2/org/apache/maven/doxia/doxia-sink-api/1.7/doxia-sink-api-1.7.pom
[INFO] Downloaded from central: https://repo.maven.apache.org/maven2/org/apache/maven/doxia/doxia-sink-api/1.7/doxia-sink-api-1.7.pom (1.5 kB at 45 kB/s)
[INFO] Downloading from central: https://repo.maven.apache.org/maven2/org/apache/maven/doxia/doxia/1.7/doxia-1.7.pom
[INFO] Downloaded from central: https://repo.maven.apache.org/maven2/org/apache/maven/doxia/doxia/1.7/doxia-1.7.pom (15 kB at 424 kB/s)
[INFO] Downloading from central: https://repo.maven.apache.org/maven2/org/apache/maven/doxia/doxia-logging-api/1.7/doxia-logging-api-1.7.pom
[INFO] Downloaded from central: https://repo.maven.apache.org/maven2/org/apache/maven/doxia/doxia-logging-api/1.7/doxia-logging-api-1.7.pom (1.5 kB at 45 kB/s)
[INFO] Downloading from central: https://repo.maven.apache.org/maven2/org/apache/maven/doxia/doxia-site-renderer/1.7.4/doxia-site-renderer-1.7.4.pom
[INFO] Downloaded from central: https://repo.maven.apache.org/maven2/org/apache/maven/doxia/doxia-site-renderer/1.7.4/doxia-site-renderer-1.7.4.pom (6.7 kB at 191 kB/s)
[INFO] Downloading from central: https://repo.maven.apache.org/maven2/org/apache/maven/doxia/doxia-sitetools/1.7.4/doxia-sitetools-1.7.4.pom
[INFO] Downloaded from central: https://repo.maven.apache.org/maven2/org/apache/maven/doxia/doxia-sitetools/1.7.4/doxia-sitetools-1.7.4.pom (14 kB at 402 kB/s)
[INFO] Downloading from central: https://repo.maven.apache.org/maven2/org/apache/maven/doxia/doxia-core/1.7/doxia-core-1.7.pom
[INFO] Downloaded from central: https://repo.maven.apache.org/maven2/org/apache/maven/doxia/doxia-core/1.7/doxia-core-1.7.pom (4.1 kB at 113 kB/s)
[INFO] Downloading from central: https://repo.maven.apache.org/maven2/org/apache/maven/doxia/doxia-decoration-model/1.7.4/doxia-decoration-model-1.7.4.pom
[INFO] Downloaded from central: https://repo.maven.apache.org/maven2/org/apache/maven/doxia/doxia-decoration-model/1.7.4/doxia-decoration-model-1.7.4.pom (3.4 kB at 94 kB/s)
[INFO] Downloading from central: https://repo.maven.apache.org/maven2/org/apache/maven/doxia/doxia-skin-model/1.7.4/doxia-skin-model-1.7.4.pom
[INFO] Downloaded from central: https://repo.maven.apache.org/maven2/org/apache/maven/doxia/doxia-skin-model/1.7.4/doxia-skin-model-1.7.4.pom (3.0 kB at 86 kB/s)
[INFO] Downloading from central: https://repo.maven.apache.org/maven2/org/apache/maven/doxia/doxia-module-xhtml/1.7/doxia-module-xhtml-1.7.pom
[INFO] Downloaded from central: https://repo.maven.apache.org/maven2/org/apache/maven/doxia/doxia-module-xhtml/1.7/doxia-module-xhtml-1.7.pom (1.6 kB at 47 kB/s)
[INFO] Downloading from central: https://repo.maven.apache.org/maven2/org/apache/maven/doxia/doxia-modules/1.7/doxia-modules-1.7.pom
[INFO] Downloaded from central: https://repo.maven.apache.org/maven2/org/apache/maven/doxia/doxia-modules/1.7/doxia-modules-1.7.pom (2.6 kB at 75 kB/s)
[INFO] Downloading from central: https://repo.maven.apache.org/maven2/org/codehaus/groovy/groovy-all/2.4.8/groovy-all-2.4.8.pom
[INFO] Downloaded from central: https://repo.maven.apache.org/maven2/org/codehaus/groovy/groovy-all/2.4.8/groovy-all-2.4.8.pom (21 kB at 562 kB/s)
[INFO] Downloading from central: https://repo.maven.apache.org/maven2/org/apache/maven/shared/maven-invoker/3.0.0/maven-invoker-3.0.0.jar
[INFO] Downloading from central: https://repo.maven.apache.org/maven2/commons-digester/commons-digester/1.8.1/commons-digester-1.8.1.jar
[INFO] Downloading from central: https://repo.maven.apache.org/maven2/commons-beanutils/commons-beanutils/1.8.3/commons-beanutils-1.8.3.jar
[INFO] Downloading from central: https://repo.maven.apache.org/maven2/commons-validator/commons-validator/1.4.1/commons-validator-1.4.1.jar
[INFO] Downloading from central: https://repo.maven.apache.org/maven2/org/apache/maven/reporting/maven-reporting-impl/2.4/maven-reporting-impl-2.4.jar
[INFO] Downloaded from central: https://repo.maven.apache.org/maven2/org/apache/maven/reporting/maven-reporting-impl/2.4/maven-reporting-impl-2.4.jar (20 kB at 524 kB/s)
[INFO] Downloading from central: https://repo.maven.apache.org/maven2/commons-logging/commons-logging/1.2/commons-logging-1.2.jar
[INFO] Downloaded from central: https://repo.maven.apache.org/maven2/commons-beanutils/commons-beanutils/1.8.3/commons-beanutils-1.8.3.jar (232 kB at 4.5 MB/s)
[INFO] Downloading from central: https://repo.maven.apache.org/maven2/org/apache/maven/shared/maven-script-interpreter/1.2/maven-script-interpreter-1.2.jar
[INFO] Downloaded from central: https://repo.maven.apache.org/maven2/commons-digester/commons-digester/1.8.1/commons-digester-1.8.1.jar (146 kB at 2.7 MB/s)
[INFO] Downloading from central: https://repo.maven.apache.org/maven2/org/apache/ant/ant/1.8.1/ant-1.8.1.jar
[INFO] Downloaded from central: https://repo.maven.apache.org/maven2/commons-validator/commons-validator/1.4.1/commons-validator-1.4.1.jar (190 kB at 3.1 MB/s)
[INFO] Downloading from central: https://repo.maven.apache.org/maven2/org/apache/maven/shared/maven-artifact-transfer/0.9.1/maven-artifact-transfer-0.9.1.jar
[INFO] Downloaded from central: https://repo.maven.apache.org/maven2/commons-logging/commons-logging/1.2/commons-logging-1.2.jar (62 kB at 859 kB/s)
[INFO] Downloading from central: https://repo.maven.apache.org/maven2/org/apache/maven/shared/maven-common-artifact-filters/3.0.1/maven-common-artifact-filters-3.0.1.jar
[INFO] Downloaded from central: https://repo.maven.apache.org/maven2/org/apache/maven/shared/maven-script-interpreter/1.2/maven-script-interpreter-1.2.jar (22 kB at 269 kB/s)
[INFO] Downloading from central: https://repo.maven.apache.org/maven2/commons-codec/commons-codec/1.6/commons-codec-1.6.jar
[INFO] Downloaded from central: https://repo.maven.apache.org/maven2/org/apache/maven/shared/maven-artifact-transfer/0.9.1/maven-artifact-transfer-0.9.1.jar (123 kB at 1.1 MB/s)
[INFO] Downloading from central: https://repo.maven.apache.org/maven2/org/slf4j/slf4j-api/1.7.5/slf4j-api-1.7.5.jar
[INFO] Downloaded from central: https://repo.maven.apache.org/maven2/commons-codec/commons-codec/1.6/commons-codec-1.6.jar (233 kB at 2.0 MB/s)
[INFO] Downloading from central: https://repo.maven.apache.org/maven2/org/apache/maven/doxia/doxia-sink-api/1.7/doxia-sink-api-1.7.jar
[INFO] Downloaded from central: https://repo.maven.apache.org/maven2/org/apache/maven/shared/maven-common-artifact-filters/3.0.1/maven-common-artifact-filters-3.0.1.jar (61 kB at 484 kB/s)
[INFO] Downloading from central: https://repo.maven.apache.org/maven2/org/apache/maven/doxia/doxia-logging-api/1.7/doxia-logging-api-1.7.jar
[INFO] Downloaded from central: https://repo.maven.apache.org/maven2/org/apache/ant/ant/1.8.1/ant-1.8.1.jar (1.5 MB at 11 MB/s)
[INFO] Downloading from central: https://repo.maven.apache.org/maven2/org/apache/maven/doxia/doxia-site-renderer/1.7.4/doxia-site-renderer-1.7.4.jar
[INFO] Downloaded from central: https://repo.maven.apache.org/maven2/org/apache/maven/doxia/doxia-site-renderer/1.7.4/doxia-site-renderer-1.7.4.jar (64 kB at 326 kB/s)
[INFO] Downloading from central: https://repo.maven.apache.org/maven2/org/apache/maven/doxia/doxia-decoration-model/1.7.4/doxia-decoration-model-1.7.4.jar
[INFO] Downloaded from central: https://repo.maven.apache.org/maven2/org/apache/maven/doxia/doxia-sink-api/1.7/doxia-sink-api-1.7.jar (11 kB at 49 kB/s)
[INFO] Downloading from central: https://repo.maven.apache.org/maven2/org/apache/maven/doxia/doxia-skin-model/1.7.4/doxia-skin-model-1.7.4.jar
[INFO] Downloaded from central: https://repo.maven.apache.org/maven2/org/apache/maven/doxia/doxia-decoration-model/1.7.4/doxia-decoration-model-1.7.4.jar (61 kB at 257 kB/s)
[INFO] Downloading from central: https://repo.maven.apache.org/maven2/org/apache/maven/doxia/doxia-module-xhtml/1.7/doxia-module-xhtml-1.7.jar
[INFO] Downloaded from central: https://repo.maven.apache.org/maven2/org/apache/maven/shared/maven-invoker/3.0.0/maven-invoker-3.0.0.jar (33 kB at 131 kB/s)
[INFO] Downloading from central: https://repo.maven.apache.org/maven2/org/codehaus/groovy/groovy-all/2.4.8/groovy-all-2.4.8.jar
[INFO] Downloaded from central: https://repo.maven.apache.org/maven2/org/apache/maven/doxia/doxia-logging-api/1.7/doxia-logging-api-1.7.jar (12 kB at 46 kB/s)
[INFO] Downloaded from central: https://repo.maven.apache.org/maven2/org/apache/maven/doxia/doxia-skin-model/1.7.4/doxia-skin-model-1.7.4.jar (16 kB at 61 kB/s)
[INFO] Downloaded from central: https://repo.maven.apache.org/maven2/org/apache/maven/doxia/doxia-module-xhtml/1.7/doxia-module-xhtml-1.7.jar (17 kB at 66 kB/s)
[INFO] Downloaded from central: https://repo.maven.apache.org/maven2/org/slf4j/slf4j-api/1.7.5/slf4j-api-1.7.5.jar (26 kB at 85 kB/s)
[INFO] Downloaded from central: https://repo.maven.apache.org/maven2/org/codehaus/groovy/groovy-all/2.4.8/groovy-all-2.4.8.jar (7.0 MB at 14 MB/s)
[INFO] Installing f:\jenkins\jenkins-slave\workspace\aven-resolver_MRESOLVER-62_tests\m\pom.xml to F:\jenkins\jenkins-slave\workspace\aven-resolver_MRESOLVER-62_tests\m\maven-resolver-demos\maven-resolver-demo-maven-plugin\target\local-repo\org\apache\maven\resolver\maven-resolver\1.4.0-SNAPSHOT\maven-resolver-1.4.0-SNAPSHOT.pom
[INFO] Installing f:\jenkins\jenkins-slave\workspace\aven-resolver_MRESOLVER-62_tests\m\target\maven-resolver-1.4.0-SNAPSHOT-site.xml to F:\jenkins\jenkins-slave\workspace\aven-resolver_MRESOLVER-62_tests\m\maven-resolver-demos\maven-resolver-demo-maven-plugin\target\local-repo\org\apache\maven\resolver\maven-resolver\1.4.0-SNAPSHOT\maven-resolver-1.4.0-SNAPSHOT-site.xml
[INFO] Installing F:\jenkins\jenkins-slave\workspace\aven-resolver_MRESOLVER-62_tests\m\maven-resolver-api\pom.xml to F:\jenkins\jenkins-slave\workspace\aven-resolver_MRESOLVER-62_tests\m\maven-resolver-demos\maven-resolver-demo-maven-plugin\target\local-repo\org\apache\maven\resolver\maven-resolver-api\1.4.0-SNAPSHOT\maven-resolver-api-1.4.0-SNAPSHOT.pom
[INFO] Installing F:\jenkins\jenkins-slave\workspace\aven-resolver_MRESOLVER-62_tests\m\maven-resolver-api\target\maven-resolver-api-1.4.0-SNAPSHOT.jar to F:\jenkins\jenkins-slave\workspace\aven-resolver_MRESOLVER-62_tests\m\maven-resolver-demos\maven-resolver-demo-maven-plugin\target\local-repo\org\apache\maven\resolver\maven-resolver-api\1.4.0-SNAPSHOT\maven-resolver-api-1.4.0-SNAPSHOT.jar
[INFO] Installing F:\jenkins\jenkins-slave\workspace\aven-resolver_MRESOLVER-62_tests\m\maven-resolver-spi\pom.xml to F:\jenkins\jenkins-slave\workspace\aven-resolver_MRESOLVER-62_tests\m\maven-resolver-demos\maven-resolver-demo-maven-plugin\target\local-repo\org\apache\maven\resolver\maven-resolver-spi\1.4.0-SNAPSHOT\maven-resolver-spi-1.4.0-SNAPSHOT.pom
[INFO] Installing F:\jenkins\jenkins-slave\workspace\aven-resolver_MRESOLVER-62_tests\m\maven-resolver-spi\target\maven-resolver-spi-1.4.0-SNAPSHOT.jar to F:\jenkins\jenkins-slave\workspace\aven-resolver_MRESOLVER-62_tests\m\maven-resolver-demos\maven-resolver-demo-maven-plugin\target\local-repo\org\apache\maven\resolver\maven-resolver-spi\1.4.0-SNAPSHOT\maven-resolver-spi-1.4.0-SNAPSHOT.jar
[INFO] Installing F:\jenkins\jenkins-slave\workspace\aven-resolver_MRESOLVER-62_tests\m\maven-resolver-test-util\pom.xml to F:\jenkins\jenkins-slave\workspace\aven-resolver_MRESOLVER-62_tests\m\maven-resolver-demos\maven-resolver-demo-maven-plugin\target\local-repo\org\apache\maven\resolver\maven-resolver-test-util\1.4.0-SNAPSHOT\maven-resolver-test-util-1.4.0-SNAPSHOT.pom
[INFO] Installing F:\jenkins\jenkins-slave\workspace\aven-resolver_MRESOLVER-62_tests\m\maven-resolver-test-util\target\maven-resolver-test-util-1.4.0-SNAPSHOT.jar to F:\jenkins\jenkins-slave\workspace\aven-resolver_MRESOLVER-62_tests\m\maven-resolver-demos\maven-resolver-demo-maven-plugin\target\local-repo\org\apache\maven\resolver\maven-resolver-test-util\1.4.0-SNAPSHOT\maven-resolver-test-util-1.4.0-SNAPSHOT.jar
[INFO] Installing F:\jenkins\jenkins-slave\workspace\aven-resolver_MRESOLVER-62_tests\m\maven-resolver-util\pom.xml to F:\jenkins\jenkins-slave\workspace\aven-resolver_MRESOLVER-62_tests\m\maven-resolver-demos\maven-resolver-demo-maven-plugin\target\local-repo\org\apache\maven\resolver\maven-resolver-util\1.4.0-SNAPSHOT\maven-resolver-util-1.4.0-SNAPSHOT.pom
[INFO] Installing F:\jenkins\jenkins-slave\workspace\aven-resolver_MRESOLVER-62_tests\m\maven-resolver-util\target\maven-resolver-util-1.4.0-SNAPSHOT.jar to F:\jenkins\jenkins-slave\workspace\aven-resolver_MRESOLVER-62_tests\m\maven-resolver-demos\maven-resolver-demo-maven-plugin\target\local-repo\org\apache\maven\resolver\maven-resolver-util\1.4.0-SNAPSHOT\maven-resolver-util-1.4.0-SNAPSHOT.jar
[INFO] Installing F:\jenkins\jenkins-slave\workspace\aven-resolver_MRESOLVER-62_tests\m\maven-resolver-impl\pom.xml to F:\jenkins\jenkins-slave\workspace\aven-resolver_MRESOLVER-62_tests\m\maven-resolver-demos\maven-resolver-demo-maven-plugin\target\local-repo\org\apache\maven\resolver\maven-resolver-impl\1.4.0-SNAPSHOT\maven-resolver-impl-1.4.0-SNAPSHOT.pom
[INFO] Installing F:\jenkins\jenkins-slave\workspace\aven-resolver_MRESOLVER-62_tests\m\maven-resolver-impl\target\maven-resolver-impl-1.4.0-SNAPSHOT.jar to F:\jenkins\jenkins-slave\workspace\aven-resolver_MRESOLVER-62_tests\m\maven-resolver-demos\maven-resolver-demo-maven-plugin\target\local-repo\org\apache\maven\resolver\maven-resolver-impl\1.4.0-SNAPSHOT\maven-resolver-impl-1.4.0-SNAPSHOT.jar
[INFO] Installing F:\jenkins\jenkins-slave\workspace\aven-resolver_MRESOLVER-62_tests\m\maven-resolver-connector-basic\pom.xml to F:\jenkins\jenkins-slave\workspace\aven-resolver_MRESOLVER-62_tests\m\maven-resolver-demos\maven-resolver-demo-maven-plugin\target\local-repo\org\apache\maven\resolver\maven-resolver-connector-basic\1.4.0-SNAPSHOT\maven-resolver-connector-basic-1.4.0-SNAPSHOT.pom
[INFO] Installing F:\jenkins\jenkins-slave\workspace\aven-resolver_MRESOLVER-62_tests\m\maven-resolver-connector-basic\target\maven-resolver-connector-basic-1.4.0-SNAPSHOT.jar to F:\jenkins\jenkins-slave\workspace\aven-resolver_MRESOLVER-62_tests\m\maven-resolver-demos\maven-resolver-demo-maven-plugin\target\local-repo\org\apache\maven\resolver\maven-resolver-connector-basic\1.4.0-SNAPSHOT\maven-resolver-connector-basic-1.4.0-SNAPSHOT.jar
[INFO] Installing F:\jenkins\jenkins-slave\workspace\aven-resolver_MRESOLVER-62_tests\m\maven-resolver-transport-classpath\pom.xml to F:\jenkins\jenkins-slave\workspace\aven-resolver_MRESOLVER-62_tests\m\maven-resolver-demos\maven-resolver-demo-maven-plugin\target\local-repo\org\apache\maven\resolver\maven-resolver-transport-classpath\1.4.0-SNAPSHOT\maven-resolver-transport-classpath-1.4.0-SNAPSHOT.pom
[INFO] Installing F:\jenkins\jenkins-slave\workspace\aven-resolver_MRESOLVER-62_tests\m\maven-resolver-transport-classpath\target\maven-resolver-transport-classpath-1.4.0-SNAPSHOT.jar to F:\jenkins\jenkins-slave\workspace\aven-resolver_MRESOLVER-62_tests\m\maven-resolver-demos\maven-resolver-demo-maven-plugin\target\local-repo\org\apache\maven\resolver\maven-resolver-transport-classpath\1.4.0-SNAPSHOT\maven-resolver-transport-classpath-1.4.0-SNAPSHOT.jar
[INFO] Installing F:\jenkins\jenkins-slave\workspace\aven-resolver_MRESOLVER-62_tests\m\maven-resolver-transport-file\pom.xml to F:\jenkins\jenkins-slave\workspace\aven-resolver_MRESOLVER-62_tests\m\maven-resolver-demos\maven-resolver-demo-maven-plugin\target\local-repo\org\apache\maven\resolver\maven-resolver-transport-file\1.4.0-SNAPSHOT\maven-resolver-transport-file-1.4.0-SNAPSHOT.pom
[INFO] Installing F:\jenkins\jenkins-slave\workspace\aven-resolver_MRESOLVER-62_tests\m\maven-resolver-transport-file\target\maven-resolver-transport-file-1.4.0-SNAPSHOT.jar to F:\jenkins\jenkins-slave\workspace\aven-resolver_MRESOLVER-62_tests\m\maven-resolver-demos\maven-resolver-demo-maven-plugin\target\local-repo\org\apache\maven\resolver\maven-resolver-transport-file\1.4.0-SNAPSHOT\maven-resolver-transport-file-1.4.0-SNAPSHOT.jar
[INFO] Installing F:\jenkins\jenkins-slave\workspace\aven-resolver_MRESOLVER-62_tests\m\maven-resolver-transport-http\pom.xml to F:\jenkins\jenkins-slave\workspace\aven-resolver_MRESOLVER-62_tests\m\maven-resolver-demos\maven-resolver-demo-maven-plugin\target\local-repo\org\apache\maven\resolver\maven-resolver-transport-http\1.4.0-SNAPSHOT\maven-resolver-transport-http-1.4.0-SNAPSHOT.pom
[INFO] Installing F:\jenkins\jenkins-slave\workspace\aven-resolver_MRESOLVER-62_tests\m\maven-resolver-transport-http\target\maven-resolver-transport-http-1.4.0-SNAPSHOT.jar to F:\jenkins\jenkins-slave\workspace\aven-resolver_MRESOLVER-62_tests\m\maven-resolver-demos\maven-resolver-demo-maven-plugin\target\local-repo\org\apache\maven\resolver\maven-resolver-transport-http\1.4.0-SNAPSHOT\maven-resolver-transport-http-1.4.0-SNAPSHOT.jar
[INFO] Installing F:\jenkins\jenkins-slave\workspace\aven-resolver_MRESOLVER-62_tests\m\maven-resolver-transport-wagon\pom.xml to F:\jenkins\jenkins-slave\workspace\aven-resolver_MRESOLVER-62_tests\m\maven-resolver-demos\maven-resolver-demo-maven-plugin\target\local-repo\org\apache\maven\resolver\maven-resolver-transport-wagon\1.4.0-SNAPSHOT\maven-resolver-transport-wagon-1.4.0-SNAPSHOT.pom
[INFO] Installing F:\jenkins\jenkins-slave\workspace\aven-resolver_MRESOLVER-62_tests\m\maven-resolver-transport-wagon\target\maven-resolver-transport-wagon-1.4.0-SNAPSHOT.jar to F:\jenkins\jenkins-slave\workspace\aven-resolver_MRESOLVER-62_tests\m\maven-resolver-demos\maven-resolver-demo-maven-plugin\target\local-repo\org\apache\maven\resolver\maven-resolver-transport-wagon\1.4.0-SNAPSHOT\maven-resolver-transport-wagon-1.4.0-SNAPSHOT.jar
[INFO] Installing F:\jenkins\jenkins-slave\workspace\aven-resolver_MRESOLVER-62_tests\m\maven-resolver-demos\pom.xml to F:\jenkins\jenkins-slave\workspace\aven-resolver_MRESOLVER-62_tests\m\maven-resolver-demos\maven-resolver-demo-maven-plugin\target\local-repo\org\apache\maven\resolver\maven-resolver-demos\1.4.0-SNAPSHOT\maven-resolver-demos-1.4.0-SNAPSHOT.pom
[INFO] Installing F:\jenkins\jenkins-slave\workspace\aven-resolver_MRESOLVER-62_tests\m\maven-resolver-demos\target\maven-resolver-demos-1.4.0-SNAPSHOT-site.xml to F:\jenkins\jenkins-slave\workspace\aven-resolver_MRESOLVER-62_tests\m\maven-resolver-demos\maven-resolver-demo-maven-plugin\target\local-repo\org\apache\maven\resolver\maven-resolver-demos\1.4.0-SNAPSHOT\maven-resolver-demos-1.4.0-SNAPSHOT-site.xml
[INFO] Installing F:\jenkins\jenkins-slave\workspace\aven-resolver_MRESOLVER-62_tests\m\maven-resolver-demos\maven-resolver-demo-snippets\pom.xml to F:\jenkins\jenkins-slave\workspace\aven-resolver_MRESOLVER-62_tests\m\maven-resolver-demos\maven-resolver-demo-maven-plugin\target\local-repo\org\apache\maven\resolver\maven-resolver-demo-snippets\1.4.0-SNAPSHOT\maven-resolver-demo-snippets-1.4.0-SNAPSHOT.pom
[INFO] Installing F:\jenkins\jenkins-slave\workspace\aven-resolver_MRESOLVER-62_tests\m\maven-resolver-demos\maven-resolver-demo-snippets\target\maven-resolver-demo-snippets-1.4.0-SNAPSHOT.jar to F:\jenkins\jenkins-slave\workspace\aven-resolver_MRESOLVER-62_tests\m\maven-resolver-demos\maven-resolver-demo-maven-plugin\target\local-repo\org\apache\maven\resolver\maven-resolver-demo-snippets\1.4.0-SNAPSHOT\maven-resolver-demo-snippets-1.4.0-SNAPSHOT.jar
[INFO] Installing F:\jenkins\jenkins-slave\workspace\aven-resolver_MRESOLVER-62_tests\m\maven-resolver-demos\maven-resolver-demo-maven-plugin\pom.xml to F:\jenkins\jenkins-slave\workspace\aven-resolver_MRESOLVER-62_tests\m\maven-resolver-demos\maven-resolver-demo-maven-plugin\target\local-repo\org\apache\maven\resolver\maven-resolver-demo-maven-plugin\1.4.0-SNAPSHOT\maven-resolver-demo-maven-plugin-1.4.0-SNAPSHOT.pom
[INFO] Installing F:\jenkins\jenkins-slave\workspace\aven-resolver_MRESOLVER-62_tests\m\maven-resolver-demos\maven-resolver-demo-maven-plugin\target\maven-resolver-demo-maven-plugin-1.4.0-SNAPSHOT.jar to F:\jenkins\jenkins-slave\workspace\aven-resolver_MRESOLVER-62_tests\m\maven-resolver-demos\maven-resolver-demo-maven-plugin\target\local-repo\org\apache\maven\resolver\maven-resolver-demo-maven-plugin\1.4.0-SNAPSHOT\maven-resolver-demo-maven-plugin-1.4.0-SNAPSHOT.jar
[INFO]
[INFO] --- maven-invoker-plugin:3.0.1:run (integration-test) @ maven-resolver-demo-maven-plugin ---
[INFO] Running Setup Jobs
[INFO] Building: resolve-artifact\pom.xml
[INFO]           resolve-artifact\pom.xml ......................... SUCCESS (5.0 s)
[INFO] -------------------------------------------------
[INFO] Build Summary:
[INFO]   Passed: 1, Failed: 0, Errors: 0, Skipped: 0
[INFO] -------------------------------------------------
[INFO]
[INFO] --- maven-checkstyle-plugin:3.0.0:check (checkstyle-check) @ maven-resolver-demo-maven-plugin ---
[INFO] ------------------------------------------------------------------------
[INFO] Reactor Summary for Maven Artifact Resolver 1.4.0-SNAPSHOT:
[INFO]
[INFO] Maven Artifact Resolver ............................ SUCCESS [ 40.386 s]
[INFO] Maven Artifact Resolver API ........................ SUCCESS [ 21.690 s]
[INFO] Maven Artifact Resolver SPI ........................ SUCCESS [  3.555 s]
[INFO] Maven Artifact Resolver Test Utilities ............. SUCCESS [  3.643 s]
[INFO] Maven Artifact Resolver Utilities .................. SUCCESS [  8.488 s]
[INFO] Maven Artifact Resolver Implementation ............. SUCCESS [ 25.226 s]
[INFO] Maven Artifact Resolver Connector Basic ............ SUCCESS [  8.659 s]
[INFO] Maven Artifact Resolver Transport Classpath ........ SUCCESS [  3.041 s]
[INFO] Maven Artifact Resolver Transport File ............. SUCCESS [  3.717 s]
[INFO] Maven Artifact Resolver Transport HTTP ............. SUCCESS [ 12.451 s]
[INFO] Maven Artifact Resolver Transport Wagon ............ SUCCESS [  6.093 s]
[INFO] Maven Artifact Resolver Demos ...................... SUCCESS [  0.326 s]
[INFO] Maven Artifact Resolver Demo Snippets .............. SUCCESS [  3.187 s]
[INFO] Maven Artifact Resolver Demo Maven Plugin .......... SUCCESS [ 12.895 s]
[INFO] ------------------------------------------------------------------------
[INFO] BUILD SUCCESS
[INFO] ------------------------------------------------------------------------
[INFO] Total time:  02:34 min
[INFO] Finished at: 2020-01-12T07:38:28-08:00
[INFO] ------------------------------------------------------------------------
[INFO] [jenkins-event-spy] Generated F:\jenkins\jenkins-slave\workspace\aven-resolver_MRESOLVER-62_tests@tmp\withMaven9aa888f0\maven-spy-20200112-073553-15814284383712810409581.log
[Pipeline] }
[Pipeline] // dir
[Pipeline] }
[withMaven] invokerPublisher - Archive invoker results for Maven artifact MavenArtifact{org.apache.maven.resolver:maven-resolver-demo-maven-plugin:maven-plugin:1.4.0-SNAPSHOT(version: 1.4.0-SNAPSHOT, snapshot:false) } generated by PluginInvocation{org.apache.maven.plugins:maven-invoker-plugin:3.0.1@run  integration-test}: m\maven-resolver-demos\maven-resolver-demo-maven-plugin\target\invoker-reports\*.xml
[withMaven] junitPublisher - Archive test results for Maven artifact org.apache.maven.resolver:maven-resolver-api:jar:1.4.0-SNAPSHOT generated by maven-surefire-plugin:test (default-test): m\maven-resolver-api\target\surefire-reports\*.xml
[withMaven] junitPublisher - Archive test results for Maven artifact org.apache.maven.resolver:maven-resolver-spi:jar:1.4.0-SNAPSHOT generated by maven-surefire-plugin:test (default-test): m\maven-resolver-spi\target\surefire-reports\*.xml
[withMaven] junitPublisher - Archive test results for Maven artifact org.apache.maven.resolver:maven-resolver-test-util:jar:1.4.0-SNAPSHOT generated by maven-surefire-plugin:test (default-test): m\maven-resolver-test-util\target\surefire-reports\*.xml
[withMaven] junitPublisher - Archive test results for Maven artifact org.apache.maven.resolver:maven-resolver-util:jar:1.4.0-SNAPSHOT generated by maven-surefire-plugin:test (default-test): m\maven-resolver-util\target\surefire-reports\*.xml
[withMaven] junitPublisher - Archive test results for Maven artifact org.apache.maven.resolver:maven-resolver-impl:jar:1.4.0-SNAPSHOT generated by maven-surefire-plugin:test (default-test): m\maven-resolver-impl\target\surefire-reports\*.xml
[withMaven] junitPublisher - Archive test results for Maven artifact org.apache.maven.resolver:maven-resolver-connector-basic:jar:1.4.0-SNAPSHOT generated by maven-surefire-plugin:test (default-test): m\maven-resolver-connector-basic\target\surefire-reports\*.xml
[withMaven] junitPublisher - Archive test results for Maven artifact org.apache.maven.resolver:maven-resolver-transport-classpath:jar:1.4.0-SNAPSHOT generated by maven-surefire-plugin:test (default-test): m\maven-resolver-transport-classpath\target\surefire-reports\*.xml
[withMaven] junitPublisher - Archive test results for Maven artifact org.apache.maven.resolver:maven-resolver-transport-file:jar:1.4.0-SNAPSHOT generated by maven-surefire-plugin:test (default-test): m\maven-resolver-transport-file\target\surefire-reports\*.xml
[withMaven] junitPublisher - Archive test results for Maven artifact org.apache.maven.resolver:maven-resolver-transport-http:jar:1.4.0-SNAPSHOT generated by maven-surefire-plugin:test (default-test): m\maven-resolver-transport-http\target\surefire-reports\*.xml
[withMaven] junitPublisher - Archive test results for Maven artifact org.apache.maven.resolver:maven-resolver-transport-wagon:jar:1.4.0-SNAPSHOT generated by maven-surefire-plugin:test (default-test): m\maven-resolver-transport-wagon\target\surefire-reports\*.xml
[withMaven] junitPublisher - Archive test results for Maven artifact org.apache.maven.resolver:maven-resolver-demo-snippets:jar:1.4.0-SNAPSHOT generated by maven-surefire-plugin:test (default-test): m\maven-resolver-demos\maven-resolver-demo-snippets\target\surefire-reports\*.xml
[withMaven] junitPublisher - Archive test results for Maven artifact org.apache.maven.resolver:maven-resolver-demo-maven-plugin:maven-plugin:1.4.0-SNAPSHOT generated by maven-surefire-plugin:test (default-test): m\maven-resolver-demos\maven-resolver-demo-maven-plugin\target\surefire-reports\*.xml
Recording test results
[withMaven] Publishers: Pipeline Graph Publisher: 7 ms, Invoker Publisher: 648 ms, Junit Publisher: 2910 ms, Concordion Publisher: 1 ms, Dependencies Fingerprint Publisher: 474 ms
[Pipeline] // withMaven
[Pipeline] cleanWs
[WS-CLEANUP] Deleting project workspace...
[WS-CLEANUP] Deferred wipeout is used...
[WS-CLEANUP] done
[Pipeline] }
[Pipeline] // stage
[Pipeline] }
[Pipeline] // node
[Pipeline] }
[Pipeline] // parallel
[Pipeline] echo
[FAILURE-003] AbortException hudson.AbortException: script returned exit code 1
[Pipeline] stage
[Pipeline] { (Notifications)
[Pipeline] echo
Build result: FAILURE
[Pipeline] jiraIssueSelector
[Pipeline] echo
The authors of changes [rfscholte].
[Pipeline] echo
Sending email ...
[Pipeline] emailext
Reply | Threaded
Open this post in threaded view
|

Build failed in Jenkins: Maven TLP » maven-resolver » MRESOLVER-62_tests #17

Apache Jenkins Server-2
See https://builds.apache.org/job/maven-box/job/maven-resolver/job/MRESOLVER-62_tests/17/

Changes:

* Add JDK 15
* Add Maven 3.6.3

All tests passed

Build log:
[...truncated 16779 lines...]
plugins in the Group Id org.apache.maven.plugins
Please change your artifactId to the format ___-maven-plugin
In the future this error will break the build.


[INFO] Using 'UTF-8' encoding to read mojo source files.
[INFO] java-javadoc mojo extractor found 0 mojo descriptor.
[INFO] java-annotations mojo extractor found 1 mojo descriptor.
[INFO]
[INFO] --- maven-resources-plugin:3.1.0:testResources (default-testResources) @ maven-resolver-demo-maven-plugin ---
[INFO] Using 'UTF-8' encoding to copy filtered resources.
[INFO] skip non existing resourceDirectory /home/jenkins/jenkins-slave/workspace/aven-resolver_MRESOLVER-62_tests/m/maven-resolver-demos/maven-resolver-demo-maven-plugin/src/test/resources
[INFO] Copying 3 resources
[INFO]
[INFO] --- maven-compiler-plugin:3.7.0:testCompile (default-testCompile) @ maven-resolver-demo-maven-plugin ---
[INFO] No sources to compile
[INFO]
[INFO] --- maven-surefire-plugin:2.22.0:test (default-test) @ maven-resolver-demo-maven-plugin ---
[INFO]
[INFO] --- maven-jar-plugin:3.1.0:jar (default-jar) @ maven-resolver-demo-maven-plugin ---
[INFO] Building jar: /home/jenkins/jenkins-slave/workspace/aven-resolver_MRESOLVER-62_tests/m/maven-resolver-demos/maven-resolver-demo-maven-plugin/target/maven-resolver-demo-maven-plugin-1.4.0-SNAPSHOT.jar
[INFO]
[INFO] --- maven-plugin-plugin:3.5.2:addPluginArtifactMetadata (default-addPluginArtifactMetadata) @ maven-resolver-demo-maven-plugin ---
[INFO]
[INFO] --- maven-site-plugin:3.7.1:attach-descriptor (attach-descriptor) @ maven-resolver-demo-maven-plugin ---
[INFO] Skipping because packaging 'maven-plugin' is not pom.
[INFO]
[INFO] --- maven-invoker-plugin:3.0.1:install (integration-test) @ maven-resolver-demo-maven-plugin ---
[INFO] Downloading from central: https://repo.maven.apache.org/maven2/org/apache/maven/shared/maven-invoker/3.0.0/maven-invoker-3.0.0.pom
[INFO] Downloaded from central: https://repo.maven.apache.org/maven2/org/apache/maven/shared/maven-invoker/3.0.0/maven-invoker-3.0.0.pom (5.0 kB at 359 kB/s)
[INFO] Downloading from central: https://repo.maven.apache.org/maven2/org/apache/maven/reporting/maven-reporting-impl/2.4/maven-reporting-impl-2.4.pom
[INFO] Downloaded from central: https://repo.maven.apache.org/maven2/org/apache/maven/reporting/maven-reporting-impl/2.4/maven-reporting-impl-2.4.pom (6.1 kB at 466 kB/s)
[INFO] Downloading from central: https://repo.maven.apache.org/maven2/commons-validator/commons-validator/1.4.1/commons-validator-1.4.1.pom
[INFO] Downloaded from central: https://repo.maven.apache.org/maven2/commons-validator/commons-validator/1.4.1/commons-validator-1.4.1.pom (13 kB at 975 kB/s)
[INFO] Downloading from central: https://repo.maven.apache.org/maven2/org/apache/commons/commons-parent/36/commons-parent-36.pom
[INFO] Downloaded from central: https://repo.maven.apache.org/maven2/org/apache/commons/commons-parent/36/commons-parent-36.pom (58 kB at 4.1 MB/s)
[INFO] Downloading from central: https://repo.maven.apache.org/maven2/commons-beanutils/commons-beanutils/1.8.3/commons-beanutils-1.8.3.pom
[INFO] Downloaded from central: https://repo.maven.apache.org/maven2/commons-beanutils/commons-beanutils/1.8.3/commons-beanutils-1.8.3.pom (11 kB at 700 kB/s)
[INFO] Downloading from central: https://repo.maven.apache.org/maven2/org/apache/commons/commons-parent/14/commons-parent-14.pom
[INFO] Downloaded from central: https://repo.maven.apache.org/maven2/org/apache/commons/commons-parent/14/commons-parent-14.pom (31 kB at 2.2 MB/s)
[INFO] Downloading from central: https://repo.maven.apache.org/maven2/commons-digester/commons-digester/1.8.1/commons-digester-1.8.1.pom
[INFO] Downloaded from central: https://repo.maven.apache.org/maven2/commons-digester/commons-digester/1.8.1/commons-digester-1.8.1.pom (10 kB at 771 kB/s)
[INFO] Downloading from central: https://repo.maven.apache.org/maven2/org/apache/maven/shared/maven-script-interpreter/1.2/maven-script-interpreter-1.2.pom
[INFO] Downloaded from central: https://repo.maven.apache.org/maven2/org/apache/maven/shared/maven-script-interpreter/1.2/maven-script-interpreter-1.2.pom (4.0 kB at 333 kB/s)
[INFO] Downloading from central: https://repo.maven.apache.org/maven2/org/apache/ant/ant/1.8.1/ant-1.8.1.pom
[INFO] Downloaded from central: https://repo.maven.apache.org/maven2/org/apache/ant/ant/1.8.1/ant-1.8.1.pom (8.8 kB at 677 kB/s)
[INFO] Downloading from central: https://repo.maven.apache.org/maven2/org/apache/ant/ant-parent/1.8.1/ant-parent-1.8.1.pom
[INFO] Downloaded from central: https://repo.maven.apache.org/maven2/org/apache/ant/ant-parent/1.8.1/ant-parent-1.8.1.pom (4.3 kB at 329 kB/s)
[INFO] Downloading from central: https://repo.maven.apache.org/maven2/org/apache/maven/shared/maven-artifact-transfer/0.9.1/maven-artifact-transfer-0.9.1.pom
[INFO] Downloaded from central: https://repo.maven.apache.org/maven2/org/apache/maven/shared/maven-artifact-transfer/0.9.1/maven-artifact-transfer-0.9.1.pom (7.6 kB at 634 kB/s)
[INFO] Downloading from central: https://repo.maven.apache.org/maven2/org/apache/maven/shared/maven-common-artifact-filters/3.0.1/maven-common-artifact-filters-3.0.1.pom
[INFO] Downloaded from central: https://repo.maven.apache.org/maven2/org/apache/maven/shared/maven-common-artifact-filters/3.0.1/maven-common-artifact-filters-3.0.1.pom (4.8 kB at 345 kB/s)
[INFO] Downloading from central: https://repo.maven.apache.org/maven2/commons-codec/commons-codec/1.6/commons-codec-1.6.pom
[INFO] Downloaded from central: https://repo.maven.apache.org/maven2/commons-codec/commons-codec/1.6/commons-codec-1.6.pom (11 kB at 858 kB/s)
[INFO] Downloading from central: https://repo.maven.apache.org/maven2/org/slf4j/slf4j-api/1.7.5/slf4j-api-1.7.5.pom
[INFO] Downloaded from central: https://repo.maven.apache.org/maven2/org/slf4j/slf4j-api/1.7.5/slf4j-api-1.7.5.pom (2.7 kB at 207 kB/s)
[INFO] Downloading from central: https://repo.maven.apache.org/maven2/org/slf4j/slf4j-parent/1.7.5/slf4j-parent-1.7.5.pom
[INFO] Downloaded from central: https://repo.maven.apache.org/maven2/org/slf4j/slf4j-parent/1.7.5/slf4j-parent-1.7.5.pom (12 kB at 984 kB/s)
[INFO] Downloading from central: https://repo.maven.apache.org/maven2/org/apache/maven/doxia/doxia-sink-api/1.7/doxia-sink-api-1.7.pom
[INFO] Downloaded from central: https://repo.maven.apache.org/maven2/org/apache/maven/doxia/doxia-sink-api/1.7/doxia-sink-api-1.7.pom (1.5 kB at 128 kB/s)
[INFO] Downloading from central: https://repo.maven.apache.org/maven2/org/apache/maven/doxia/doxia/1.7/doxia-1.7.pom
[INFO] Downloaded from central: https://repo.maven.apache.org/maven2/org/apache/maven/doxia/doxia/1.7/doxia-1.7.pom (15 kB at 1.2 MB/s)
[INFO] Downloading from central: https://repo.maven.apache.org/maven2/org/apache/maven/doxia/doxia-logging-api/1.7/doxia-logging-api-1.7.pom
[INFO] Downloaded from central: https://repo.maven.apache.org/maven2/org/apache/maven/doxia/doxia-logging-api/1.7/doxia-logging-api-1.7.pom (1.5 kB at 128 kB/s)
[INFO] Downloading from central: https://repo.maven.apache.org/maven2/org/apache/maven/doxia/doxia-site-renderer/1.7.4/doxia-site-renderer-1.7.4.pom
[INFO] Downloaded from central: https://repo.maven.apache.org/maven2/org/apache/maven/doxia/doxia-site-renderer/1.7.4/doxia-site-renderer-1.7.4.pom (6.7 kB at 514 kB/s)
[INFO] Downloading from central: https://repo.maven.apache.org/maven2/org/apache/maven/doxia/doxia-sitetools/1.7.4/doxia-sitetools-1.7.4.pom
[INFO] Downloaded from central: https://repo.maven.apache.org/maven2/org/apache/maven/doxia/doxia-sitetools/1.7.4/doxia-sitetools-1.7.4.pom (14 kB at 1.1 MB/s)
[INFO] Downloading from central: https://repo.maven.apache.org/maven2/org/apache/maven/doxia/doxia-core/1.7/doxia-core-1.7.pom
[INFO] Downloaded from central: https://repo.maven.apache.org/maven2/org/apache/maven/doxia/doxia-core/1.7/doxia-core-1.7.pom (4.1 kB at 339 kB/s)
[INFO] Downloading from central: https://repo.maven.apache.org/maven2/org/apache/maven/doxia/doxia-decoration-model/1.7.4/doxia-decoration-model-1.7.4.pom
[INFO] Downloaded from central: https://repo.maven.apache.org/maven2/org/apache/maven/doxia/doxia-decoration-model/1.7.4/doxia-decoration-model-1.7.4.pom (3.4 kB at 283 kB/s)
[INFO] Downloading from central: https://repo.maven.apache.org/maven2/org/apache/maven/doxia/doxia-skin-model/1.7.4/doxia-skin-model-1.7.4.pom
[INFO] Downloaded from central: https://repo.maven.apache.org/maven2/org/apache/maven/doxia/doxia-skin-model/1.7.4/doxia-skin-model-1.7.4.pom (3.0 kB at 252 kB/s)
[INFO] Downloading from central: https://repo.maven.apache.org/maven2/org/apache/maven/doxia/doxia-module-xhtml/1.7/doxia-module-xhtml-1.7.pom
[INFO] Downloaded from central: https://repo.maven.apache.org/maven2/org/apache/maven/doxia/doxia-module-xhtml/1.7/doxia-module-xhtml-1.7.pom (1.6 kB at 136 kB/s)
[INFO] Downloading from central: https://repo.maven.apache.org/maven2/org/apache/maven/doxia/doxia-modules/1.7/doxia-modules-1.7.pom
[INFO] Downloaded from central: https://repo.maven.apache.org/maven2/org/apache/maven/doxia/doxia-modules/1.7/doxia-modules-1.7.pom (2.6 kB at 238 kB/s)
[INFO] Downloading from central: https://repo.maven.apache.org/maven2/org/codehaus/groovy/groovy-all/2.4.8/groovy-all-2.4.8.pom
[INFO] Downloaded from central: https://repo.maven.apache.org/maven2/org/codehaus/groovy/groovy-all/2.4.8/groovy-all-2.4.8.pom (21 kB at 1.6 MB/s)
[INFO] Downloading from central: https://repo.maven.apache.org/maven2/org/apache/maven/shared/maven-invoker/3.0.0/maven-invoker-3.0.0.jar
[INFO] Downloading from central: https://repo.maven.apache.org/maven2/commons-digester/commons-digester/1.8.1/commons-digester-1.8.1.jar
[INFO] Downloading from central: https://repo.maven.apache.org/maven2/commons-beanutils/commons-beanutils/1.8.3/commons-beanutils-1.8.3.jar
[INFO] Downloading from central: https://repo.maven.apache.org/maven2/commons-validator/commons-validator/1.4.1/commons-validator-1.4.1.jar
[INFO] Downloading from central: https://repo.maven.apache.org/maven2/org/apache/maven/reporting/maven-reporting-impl/2.4/maven-reporting-impl-2.4.jar
[INFO] Downloaded from central: https://repo.maven.apache.org/maven2/org/apache/maven/shared/maven-invoker/3.0.0/maven-invoker-3.0.0.jar (33 kB at 2.2 MB/s)
[INFO] Downloading from central: https://repo.maven.apache.org/maven2/commons-logging/commons-logging/1.2/commons-logging-1.2.jar
[INFO] Downloaded from central: https://repo.maven.apache.org/maven2/org/apache/maven/reporting/maven-reporting-impl/2.4/maven-reporting-impl-2.4.jar (20 kB at 1.0 MB/s)
[INFO] Downloading from central: https://repo.maven.apache.org/maven2/org/apache/maven/shared/maven-script-interpreter/1.2/maven-script-interpreter-1.2.jar
[INFO] Downloaded from central: https://repo.maven.apache.org/maven2/commons-digester/commons-digester/1.8.1/commons-digester-1.8.1.jar (146 kB at 7.3 MB/s)
[INFO] Downloading from central: https://repo.maven.apache.org/maven2/org/apache/ant/ant/1.8.1/ant-1.8.1.jar
[INFO] Downloaded from central: https://repo.maven.apache.org/maven2/commons-validator/commons-validator/1.4.1/commons-validator-1.4.1.jar (190 kB at 8.3 MB/s)
[INFO] Downloading from central: https://repo.maven.apache.org/maven2/org/apache/maven/shared/maven-artifact-transfer/0.9.1/maven-artifact-transfer-0.9.1.jar
[INFO] Downloaded from central: https://repo.maven.apache.org/maven2/commons-beanutils/commons-beanutils/1.8.3/commons-beanutils-1.8.3.jar (232 kB at 10 MB/s)
[INFO] Downloading from central: https://repo.maven.apache.org/maven2/org/apache/maven/shared/maven-common-artifact-filters/3.0.1/maven-common-artifact-filters-3.0.1.jar
[INFO] Downloaded from central: https://repo.maven.apache.org/maven2/commons-logging/commons-logging/1.2/commons-logging-1.2.jar (62 kB at 2.1 MB/s)
[INFO] Downloading from central: https://repo.maven.apache.org/maven2/commons-codec/commons-codec/1.6/commons-codec-1.6.jar
[INFO] Downloaded from central: https://repo.maven.apache.org/maven2/org/apache/maven/shared/maven-script-interpreter/1.2/maven-script-interpreter-1.2.jar (22 kB at 711 kB/s)
[INFO] Downloading from central: https://repo.maven.apache.org/maven2/org/slf4j/slf4j-api/1.7.5/slf4j-api-1.7.5.jar
[INFO] Downloaded from central: https://repo.maven.apache.org/maven2/org/apache/maven/shared/maven-common-artifact-filters/3.0.1/maven-common-artifact-filters-3.0.1.jar (61 kB at 1.5 MB/s)
[INFO] Downloaded from central: https://repo.maven.apache.org/maven2/org/apache/maven/shared/maven-artifact-transfer/0.9.1/maven-artifact-transfer-0.9.1.jar (123 kB at 2.9 MB/s)
[INFO] Downloading from central: https://repo.maven.apache.org/maven2/org/apache/maven/doxia/doxia-logging-api/1.7/doxia-logging-api-1.7.jar
[INFO] Downloading from central: https://repo.maven.apache.org/maven2/org/apache/maven/doxia/doxia-sink-api/1.7/doxia-sink-api-1.7.jar
[INFO] Downloaded from central: https://repo.maven.apache.org/maven2/org/slf4j/slf4j-api/1.7.5/slf4j-api-1.7.5.jar (26 kB at 555 kB/s)
[INFO] Downloading from central: https://repo.maven.apache.org/maven2/org/apache/maven/doxia/doxia-site-renderer/1.7.4/doxia-site-renderer-1.7.4.jar
[INFO] Downloaded from central: https://repo.maven.apache.org/maven2/commons-codec/commons-codec/1.6/commons-codec-1.6.jar (233 kB at 4.4 MB/s)
[INFO] Downloading from central: https://repo.maven.apache.org/maven2/org/apache/maven/doxia/doxia-decoration-model/1.7.4/doxia-decoration-model-1.7.4.jar
[INFO] Downloaded from central: https://repo.maven.apache.org/maven2/org/apache/maven/doxia/doxia-sink-api/1.7/doxia-sink-api-1.7.jar (11 kB at 200 kB/s)
[INFO] Downloaded from central: https://repo.maven.apache.org/maven2/org/apache/maven/doxia/doxia-logging-api/1.7/doxia-logging-api-1.7.jar (12 kB at 199 kB/s)
[INFO] Downloading from central: https://repo.maven.apache.org/maven2/org/apache/maven/doxia/doxia-module-xhtml/1.7/doxia-module-xhtml-1.7.jar
[INFO] Downloading from central: https://repo.maven.apache.org/maven2/org/apache/maven/doxia/doxia-skin-model/1.7.4/doxia-skin-model-1.7.4.jar
[INFO] Downloaded from central: https://repo.maven.apache.org/maven2/org/apache/maven/doxia/doxia-decoration-model/1.7.4/doxia-decoration-model-1.7.4.jar (61 kB at 866 kB/s)
[INFO] Downloading from central: https://repo.maven.apache.org/maven2/org/codehaus/groovy/groovy-all/2.4.8/groovy-all-2.4.8.jar
[INFO] Downloaded from central: https://repo.maven.apache.org/maven2/org/apache/maven/doxia/doxia-module-xhtml/1.7/doxia-module-xhtml-1.7.jar (17 kB at 242 kB/s)
[INFO] Downloaded from central: https://repo.maven.apache.org/maven2/org/apache/maven/doxia/doxia-site-renderer/1.7.4/doxia-site-renderer-1.7.4.jar (64 kB at 876 kB/s)
[INFO] Downloaded from central: https://repo.maven.apache.org/maven2/org/apache/maven/doxia/doxia-skin-model/1.7.4/doxia-skin-model-1.7.4.jar (16 kB at 216 kB/s)
[INFO] Downloaded from central: https://repo.maven.apache.org/maven2/org/apache/ant/ant/1.8.1/ant-1.8.1.jar (1.5 MB at 17 MB/s)
[INFO] Downloaded from central: https://repo.maven.apache.org/maven2/org/codehaus/groovy/groovy-all/2.4.8/groovy-all-2.4.8.jar (7.0 MB at 22 MB/s)
[INFO] Installing /home/jenkins/jenkins-slave/workspace/aven-resolver_MRESOLVER-62_tests/m/pom.xml to /home/jenkins/jenkins-slave/workspace/aven-resolver_MRESOLVER-62_tests/m/maven-resolver-demos/maven-resolver-demo-maven-plugin/target/local-repo/org/apache/maven/resolver/maven-resolver/1.4.0-SNAPSHOT/maven-resolver-1.4.0-SNAPSHOT.pom
[INFO] Installing /home/jenkins/jenkins-slave/workspace/aven-resolver_MRESOLVER-62_tests/m/target/maven-resolver-1.4.0-SNAPSHOT-site.xml to /home/jenkins/jenkins-slave/workspace/aven-resolver_MRESOLVER-62_tests/m/maven-resolver-demos/maven-resolver-demo-maven-plugin/target/local-repo/org/apache/maven/resolver/maven-resolver/1.4.0-SNAPSHOT/maven-resolver-1.4.0-SNAPSHOT-site.xml
[INFO] Installing /home/jenkins/jenkins-slave/workspace/aven-resolver_MRESOLVER-62_tests/m/maven-resolver-api/pom.xml to /home/jenkins/jenkins-slave/workspace/aven-resolver_MRESOLVER-62_tests/m/maven-resolver-demos/maven-resolver-demo-maven-plugin/target/local-repo/org/apache/maven/resolver/maven-resolver-api/1.4.0-SNAPSHOT/maven-resolver-api-1.4.0-SNAPSHOT.pom
[INFO] Installing /home/jenkins/jenkins-slave/workspace/aven-resolver_MRESOLVER-62_tests/m/maven-resolver-api/target/maven-resolver-api-1.4.0-SNAPSHOT.jar to /home/jenkins/jenkins-slave/workspace/aven-resolver_MRESOLVER-62_tests/m/maven-resolver-demos/maven-resolver-demo-maven-plugin/target/local-repo/org/apache/maven/resolver/maven-resolver-api/1.4.0-SNAPSHOT/maven-resolver-api-1.4.0-SNAPSHOT.jar
[INFO] Installing /home/jenkins/jenkins-slave/workspace/aven-resolver_MRESOLVER-62_tests/m/maven-resolver-spi/pom.xml to /home/jenkins/jenkins-slave/workspace/aven-resolver_MRESOLVER-62_tests/m/maven-resolver-demos/maven-resolver-demo-maven-plugin/target/local-repo/org/apache/maven/resolver/maven-resolver-spi/1.4.0-SNAPSHOT/maven-resolver-spi-1.4.0-SNAPSHOT.pom
[INFO] Installing /home/jenkins/jenkins-slave/workspace/aven-resolver_MRESOLVER-62_tests/m/maven-resolver-spi/target/maven-resolver-spi-1.4.0-SNAPSHOT.jar to /home/jenkins/jenkins-slave/workspace/aven-resolver_MRESOLVER-62_tests/m/maven-resolver-demos/maven-resolver-demo-maven-plugin/target/local-repo/org/apache/maven/resolver/maven-resolver-spi/1.4.0-SNAPSHOT/maven-resolver-spi-1.4.0-SNAPSHOT.jar
[INFO] Installing /home/jenkins/jenkins-slave/workspace/aven-resolver_MRESOLVER-62_tests/m/maven-resolver-test-util/pom.xml to /home/jenkins/jenkins-slave/workspace/aven-resolver_MRESOLVER-62_tests/m/maven-resolver-demos/maven-resolver-demo-maven-plugin/target/local-repo/org/apache/maven/resolver/maven-resolver-test-util/1.4.0-SNAPSHOT/maven-resolver-test-util-1.4.0-SNAPSHOT.pom
[INFO] Installing /home/jenkins/jenkins-slave/workspace/aven-resolver_MRESOLVER-62_tests/m/maven-resolver-test-util/target/maven-resolver-test-util-1.4.0-SNAPSHOT.jar to /home/jenkins/jenkins-slave/workspace/aven-resolver_MRESOLVER-62_tests/m/maven-resolver-demos/maven-resolver-demo-maven-plugin/target/local-repo/org/apache/maven/resolver/maven-resolver-test-util/1.4.0-SNAPSHOT/maven-resolver-test-util-1.4.0-SNAPSHOT.jar
[INFO] Installing /home/jenkins/jenkins-slave/workspace/aven-resolver_MRESOLVER-62_tests/m/maven-resolver-util/pom.xml to /home/jenkins/jenkins-slave/workspace/aven-resolver_MRESOLVER-62_tests/m/maven-resolver-demos/maven-resolver-demo-maven-plugin/target/local-repo/org/apache/maven/resolver/maven-resolver-util/1.4.0-SNAPSHOT/maven-resolver-util-1.4.0-SNAPSHOT.pom
[INFO] Installing /home/jenkins/jenkins-slave/workspace/aven-resolver_MRESOLVER-62_tests/m/maven-resolver-util/target/maven-resolver-util-1.4.0-SNAPSHOT.jar to /home/jenkins/jenkins-slave/workspace/aven-resolver_MRESOLVER-62_tests/m/maven-resolver-demos/maven-resolver-demo-maven-plugin/target/local-repo/org/apache/maven/resolver/maven-resolver-util/1.4.0-SNAPSHOT/maven-resolver-util-1.4.0-SNAPSHOT.jar
[INFO] Installing /home/jenkins/jenkins-slave/workspace/aven-resolver_MRESOLVER-62_tests/m/maven-resolver-impl/pom.xml to /home/jenkins/jenkins-slave/workspace/aven-resolver_MRESOLVER-62_tests/m/maven-resolver-demos/maven-resolver-demo-maven-plugin/target/local-repo/org/apache/maven/resolver/maven-resolver-impl/1.4.0-SNAPSHOT/maven-resolver-impl-1.4.0-SNAPSHOT.pom
[INFO] Installing /home/jenkins/jenkins-slave/workspace/aven-resolver_MRESOLVER-62_tests/m/maven-resolver-impl/target/maven-resolver-impl-1.4.0-SNAPSHOT.jar to /home/jenkins/jenkins-slave/workspace/aven-resolver_MRESOLVER-62_tests/m/maven-resolver-demos/maven-resolver-demo-maven-plugin/target/local-repo/org/apache/maven/resolver/maven-resolver-impl/1.4.0-SNAPSHOT/maven-resolver-impl-1.4.0-SNAPSHOT.jar
[INFO] Installing /home/jenkins/jenkins-slave/workspace/aven-resolver_MRESOLVER-62_tests/m/maven-resolver-connector-basic/pom.xml to /home/jenkins/jenkins-slave/workspace/aven-resolver_MRESOLVER-62_tests/m/maven-resolver-demos/maven-resolver-demo-maven-plugin/target/local-repo/org/apache/maven/resolver/maven-resolver-connector-basic/1.4.0-SNAPSHOT/maven-resolver-connector-basic-1.4.0-SNAPSHOT.pom
[INFO] Installing /home/jenkins/jenkins-slave/workspace/aven-resolver_MRESOLVER-62_tests/m/maven-resolver-connector-basic/target/maven-resolver-connector-basic-1.4.0-SNAPSHOT.jar to /home/jenkins/jenkins-slave/workspace/aven-resolver_MRESOLVER-62_tests/m/maven-resolver-demos/maven-resolver-demo-maven-plugin/target/local-repo/org/apache/maven/resolver/maven-resolver-connector-basic/1.4.0-SNAPSHOT/maven-resolver-connector-basic-1.4.0-SNAPSHOT.jar
[INFO] Installing /home/jenkins/jenkins-slave/workspace/aven-resolver_MRESOLVER-62_tests/m/maven-resolver-transport-classpath/pom.xml to /home/jenkins/jenkins-slave/workspace/aven-resolver_MRESOLVER-62_tests/m/maven-resolver-demos/maven-resolver-demo-maven-plugin/target/local-repo/org/apache/maven/resolver/maven-resolver-transport-classpath/1.4.0-SNAPSHOT/maven-resolver-transport-classpath-1.4.0-SNAPSHOT.pom
[INFO] Installing /home/jenkins/jenkins-slave/workspace/aven-resolver_MRESOLVER-62_tests/m/maven-resolver-transport-classpath/target/maven-resolver-transport-classpath-1.4.0-SNAPSHOT.jar to /home/jenkins/jenkins-slave/workspace/aven-resolver_MRESOLVER-62_tests/m/maven-resolver-demos/maven-resolver-demo-maven-plugin/target/local-repo/org/apache/maven/resolver/maven-resolver-transport-classpath/1.4.0-SNAPSHOT/maven-resolver-transport-classpath-1.4.0-SNAPSHOT.jar
[INFO] Installing /home/jenkins/jenkins-slave/workspace/aven-resolver_MRESOLVER-62_tests/m/maven-resolver-transport-file/pom.xml to /home/jenkins/jenkins-slave/workspace/aven-resolver_MRESOLVER-62_tests/m/maven-resolver-demos/maven-resolver-demo-maven-plugin/target/local-repo/org/apache/maven/resolver/maven-resolver-transport-file/1.4.0-SNAPSHOT/maven-resolver-transport-file-1.4.0-SNAPSHOT.pom
[INFO] Installing /home/jenkins/jenkins-slave/workspace/aven-resolver_MRESOLVER-62_tests/m/maven-resolver-transport-file/target/maven-resolver-transport-file-1.4.0-SNAPSHOT.jar to /home/jenkins/jenkins-slave/workspace/aven-resolver_MRESOLVER-62_tests/m/maven-resolver-demos/maven-resolver-demo-maven-plugin/target/local-repo/org/apache/maven/resolver/maven-resolver-transport-file/1.4.0-SNAPSHOT/maven-resolver-transport-file-1.4.0-SNAPSHOT.jar
[INFO] Installing /home/jenkins/jenkins-slave/workspace/aven-resolver_MRESOLVER-62_tests/m/maven-resolver-transport-http/pom.xml to /home/jenkins/jenkins-slave/workspace/aven-resolver_MRESOLVER-62_tests/m/maven-resolver-demos/maven-resolver-demo-maven-plugin/target/local-repo/org/apache/maven/resolver/maven-resolver-transport-http/1.4.0-SNAPSHOT/maven-resolver-transport-http-1.4.0-SNAPSHOT.pom
[INFO] Installing /home/jenkins/jenkins-slave/workspace/aven-resolver_MRESOLVER-62_tests/m/maven-resolver-transport-http/target/maven-resolver-transport-http-1.4.0-SNAPSHOT.jar to /home/jenkins/jenkins-slave/workspace/aven-resolver_MRESOLVER-62_tests/m/maven-resolver-demos/maven-resolver-demo-maven-plugin/target/local-repo/org/apache/maven/resolver/maven-resolver-transport-http/1.4.0-SNAPSHOT/maven-resolver-transport-http-1.4.0-SNAPSHOT.jar
[INFO] Installing /home/jenkins/jenkins-slave/workspace/aven-resolver_MRESOLVER-62_tests/m/maven-resolver-transport-wagon/pom.xml to /home/jenkins/jenkins-slave/workspace/aven-resolver_MRESOLVER-62_tests/m/maven-resolver-demos/maven-resolver-demo-maven-plugin/target/local-repo/org/apache/maven/resolver/maven-resolver-transport-wagon/1.4.0-SNAPSHOT/maven-resolver-transport-wagon-1.4.0-SNAPSHOT.pom
[INFO] Installing /home/jenkins/jenkins-slave/workspace/aven-resolver_MRESOLVER-62_tests/m/maven-resolver-transport-wagon/target/maven-resolver-transport-wagon-1.4.0-SNAPSHOT.jar to /home/jenkins/jenkins-slave/workspace/aven-resolver_MRESOLVER-62_tests/m/maven-resolver-demos/maven-resolver-demo-maven-plugin/target/local-repo/org/apache/maven/resolver/maven-resolver-transport-wagon/1.4.0-SNAPSHOT/maven-resolver-transport-wagon-1.4.0-SNAPSHOT.jar
[INFO] Installing /home/jenkins/jenkins-slave/workspace/aven-resolver_MRESOLVER-62_tests/m/maven-resolver-demos/pom.xml to /home/jenkins/jenkins-slave/workspace/aven-resolver_MRESOLVER-62_tests/m/maven-resolver-demos/maven-resolver-demo-maven-plugin/target/local-repo/org/apache/maven/resolver/maven-resolver-demos/1.4.0-SNAPSHOT/maven-resolver-demos-1.4.0-SNAPSHOT.pom
[INFO] Installing /home/jenkins/jenkins-slave/workspace/aven-resolver_MRESOLVER-62_tests/m/maven-resolver-demos/target/maven-resolver-demos-1.4.0-SNAPSHOT-site.xml to /home/jenkins/jenkins-slave/workspace/aven-resolver_MRESOLVER-62_tests/m/maven-resolver-demos/maven-resolver-demo-maven-plugin/target/local-repo/org/apache/maven/resolver/maven-resolver-demos/1.4.0-SNAPSHOT/maven-resolver-demos-1.4.0-SNAPSHOT-site.xml
[INFO] Installing /home/jenkins/jenkins-slave/workspace/aven-resolver_MRESOLVER-62_tests/m/maven-resolver-demos/maven-resolver-demo-snippets/pom.xml to /home/jenkins/jenkins-slave/workspace/aven-resolver_MRESOLVER-62_tests/m/maven-resolver-demos/maven-resolver-demo-maven-plugin/target/local-repo/org/apache/maven/resolver/maven-resolver-demo-snippets/1.4.0-SNAPSHOT/maven-resolver-demo-snippets-1.4.0-SNAPSHOT.pom
[INFO] Installing /home/jenkins/jenkins-slave/workspace/aven-resolver_MRESOLVER-62_tests/m/maven-resolver-demos/maven-resolver-demo-snippets/target/maven-resolver-demo-snippets-1.4.0-SNAPSHOT.jar to /home/jenkins/jenkins-slave/workspace/aven-resolver_MRESOLVER-62_tests/m/maven-resolver-demos/maven-resolver-demo-maven-plugin/target/local-repo/org/apache/maven/resolver/maven-resolver-demo-snippets/1.4.0-SNAPSHOT/maven-resolver-demo-snippets-1.4.0-SNAPSHOT.jar
[INFO] Installing /home/jenkins/jenkins-slave/workspace/aven-resolver_MRESOLVER-62_tests/m/maven-resolver-demos/maven-resolver-demo-maven-plugin/pom.xml to /home/jenkins/jenkins-slave/workspace/aven-resolver_MRESOLVER-62_tests/m/maven-resolver-demos/maven-resolver-demo-maven-plugin/target/local-repo/org/apache/maven/resolver/maven-resolver-demo-maven-plugin/1.4.0-SNAPSHOT/maven-resolver-demo-maven-plugin-1.4.0-SNAPSHOT.pom
[INFO] Installing /home/jenkins/jenkins-slave/workspace/aven-resolver_MRESOLVER-62_tests/m/maven-resolver-demos/maven-resolver-demo-maven-plugin/target/maven-resolver-demo-maven-plugin-1.4.0-SNAPSHOT.jar to /home/jenkins/jenkins-slave/workspace/aven-resolver_MRESOLVER-62_tests/m/maven-resolver-demos/maven-resolver-demo-maven-plugin/target/local-repo/org/apache/maven/resolver/maven-resolver-demo-maven-plugin/1.4.0-SNAPSHOT/maven-resolver-demo-maven-plugin-1.4.0-SNAPSHOT.jar
[INFO]
[INFO] --- maven-invoker-plugin:3.0.1:run (integration-test) @ maven-resolver-demo-maven-plugin ---
[INFO] Running Setup Jobs
[INFO] Building: resolve-artifact/pom.xml
[INFO]           resolve-artifact/pom.xml ......................... SUCCESS (4.3 s)
[INFO] -------------------------------------------------
[INFO] Build Summary:
[INFO]   Passed: 1, Failed: 0, Errors: 0, Skipped: 0
[INFO] -------------------------------------------------
[INFO]
[INFO] --- maven-checkstyle-plugin:3.0.0:check (checkstyle-check) @ maven-resolver-demo-maven-plugin ---
[INFO] ------------------------------------------------------------------------
[INFO] Reactor Summary for Maven Artifact Resolver 1.4.0-SNAPSHOT:
[INFO]
[INFO] Maven Artifact Resolver ............................ SUCCESS [ 16.600 s]
[INFO] Maven Artifact Resolver API ........................ SUCCESS [ 13.989 s]
[INFO] Maven Artifact Resolver SPI ........................ SUCCESS [  2.392 s]
[INFO] Maven Artifact Resolver Test Utilities ............. SUCCESS [  2.787 s]
[INFO] Maven Artifact Resolver Utilities .................. SUCCESS [  6.003 s]
[INFO] Maven Artifact Resolver Implementation ............. SUCCESS [ 21.470 s]
[INFO] Maven Artifact Resolver Connector Basic ............ SUCCESS [  7.750 s]
[INFO] Maven Artifact Resolver Transport Classpath ........ SUCCESS [  3.090 s]
[INFO] Maven Artifact Resolver Transport File ............. SUCCESS [  3.816 s]
[INFO] Maven Artifact Resolver Transport HTTP ............. SUCCESS [  8.423 s]
[INFO] Maven Artifact Resolver Transport Wagon ............ SUCCESS [  6.605 s]
[INFO] Maven Artifact Resolver Demos ...................... SUCCESS [  0.454 s]
[INFO] Maven Artifact Resolver Demo Snippets .............. SUCCESS [  1.884 s]
[INFO] Maven Artifact Resolver Demo Maven Plugin .......... SUCCESS [  7.591 s]
[INFO] ------------------------------------------------------------------------
[INFO] BUILD SUCCESS
[INFO] ------------------------------------------------------------------------
[INFO] Total time:  01:44 min
[INFO] Finished at: 2020-01-16T05:06:44Z
[INFO] ------------------------------------------------------------------------
[INFO] [jenkins-event-spy] Generated /home/jenkins/jenkins-slave/workspace/aven-resolver_MRESOLVER-62_tests@tmp/withMaven73aa7c23/maven-spy-20200116-050500-27363845151170465226.log
[Pipeline] }
[Pipeline] // dir
[Pipeline] }
[withMaven] invokerPublisher - Archive invoker results for Maven artifact MavenArtifact{org.apache.maven.resolver:maven-resolver-demo-maven-plugin:maven-plugin:1.4.0-SNAPSHOT(version: 1.4.0-SNAPSHOT, snapshot:false) } generated by PluginInvocation{org.apache.maven.plugins:maven-invoker-plugin:3.0.1@run  integration-test}: m/maven-resolver-demos/maven-resolver-demo-maven-plugin/target/invoker-reports/*.xml
[withMaven] junitPublisher - Archive test results for Maven artifact org.apache.maven.resolver:maven-resolver-api:jar:1.4.0-SNAPSHOT generated by maven-surefire-plugin:test (default-test): m/maven-resolver-api/target/surefire-reports/*.xml
[withMaven] junitPublisher - Archive test results for Maven artifact org.apache.maven.resolver:maven-resolver-spi:jar:1.4.0-SNAPSHOT generated by maven-surefire-plugin:test (default-test): m/maven-resolver-spi/target/surefire-reports/*.xml
[withMaven] junitPublisher - Archive test results for Maven artifact org.apache.maven.resolver:maven-resolver-test-util:jar:1.4.0-SNAPSHOT generated by maven-surefire-plugin:test (default-test): m/maven-resolver-test-util/target/surefire-reports/*.xml
[withMaven] junitPublisher - Archive test results for Maven artifact org.apache.maven.resolver:maven-resolver-util:jar:1.4.0-SNAPSHOT generated by maven-surefire-plugin:test (default-test): m/maven-resolver-util/target/surefire-reports/*.xml
[withMaven] junitPublisher - Archive test results for Maven artifact org.apache.maven.resolver:maven-resolver-impl:jar:1.4.0-SNAPSHOT generated by maven-surefire-plugin:test (default-test): m/maven-resolver-impl/target/surefire-reports/*.xml
[withMaven] junitPublisher - Archive test results for Maven artifact org.apache.maven.resolver:maven-resolver-connector-basic:jar:1.4.0-SNAPSHOT generated by maven-surefire-plugin:test (default-test): m/maven-resolver-connector-basic/target/surefire-reports/*.xml
[withMaven] junitPublisher - Archive test results for Maven artifact org.apache.maven.resolver:maven-resolver-transport-classpath:jar:1.4.0-SNAPSHOT generated by maven-surefire-plugin:test (default-test): m/maven-resolver-transport-classpath/target/surefire-reports/*.xml
[withMaven] junitPublisher - Archive test results for Maven artifact org.apache.maven.resolver:maven-resolver-transport-file:jar:1.4.0-SNAPSHOT generated by maven-surefire-plugin:test (default-test): m/maven-resolver-transport-file/target/surefire-reports/*.xml
[withMaven] junitPublisher - Archive test results for Maven artifact org.apache.maven.resolver:maven-resolver-transport-http:jar:1.4.0-SNAPSHOT generated by maven-surefire-plugin:test (default-test): m/maven-resolver-transport-http/target/surefire-reports/*.xml
[withMaven] junitPublisher - Archive test results for Maven artifact org.apache.maven.resolver:maven-resolver-transport-wagon:jar:1.4.0-SNAPSHOT generated by maven-surefire-plugin:test (default-test): m/maven-resolver-transport-wagon/target/surefire-reports/*.xml
[withMaven] junitPublisher - Archive test results for Maven artifact org.apache.maven.resolver:maven-resolver-demo-snippets:jar:1.4.0-SNAPSHOT generated by maven-surefire-plugin:test (default-test): m/maven-resolver-demos/maven-resolver-demo-snippets/target/surefire-reports/*.xml
[withMaven] junitPublisher - Archive test results for Maven artifact org.apache.maven.resolver:maven-resolver-demo-maven-plugin:maven-plugin:1.4.0-SNAPSHOT generated by maven-surefire-plugin:test (default-test): m/maven-resolver-demos/maven-resolver-demo-maven-plugin/target/surefire-reports/*.xml
Recording test results
[withMaven] Publishers: Pipeline Graph Publisher: 7 ms, Invoker Publisher: 1201 ms, Junit Publisher: 48050 ms, Concordion Publisher: 1 ms, Dependencies Fingerprint Publisher: 9214 ms
[Pipeline] // withMaven
[Pipeline] cleanWs
[WS-CLEANUP] Deleting project workspace...
[WS-CLEANUP] Deferred wipeout is used...
[WS-CLEANUP] done
[Pipeline] }
[Pipeline] // stage
[Pipeline] }
[Pipeline] // node
[Pipeline] }
[withMaven] Publishers: Pipeline Graph Publisher: 12 ms, Invoker Publisher: 1316 ms, Junit Publisher: 47807 ms, Concordion Publisher: 1 ms, Dependencies Fingerprint Publisher: 9260 ms
[Pipeline] // withMaven
[Pipeline] cleanWs
[WS-CLEANUP] Deleting project workspace...
[WS-CLEANUP] Deferred wipeout is used...
[WS-CLEANUP] done
[Pipeline] }
[Pipeline] // stage
[Pipeline] }
[Pipeline] // node
[Pipeline] }
Aborted by slachiewicz
[Pipeline] // node
[Pipeline] // node
[Pipeline] // node
[Pipeline] // node
[Pipeline] // node
[Pipeline] }
Failed in branch windows-jdk7
[Pipeline] }
Failed in branch windows-jdk8
[Pipeline] }
Failed in branch windows-jdk11
[Pipeline] }
Failed in branch windows-jdk13
[Pipeline] }
Failed in branch windows-jdk14
[Pipeline] // parallel
[Pipeline] echo
[FAILURE-002] FlowInterruptedException org.jenkinsci.plugins.workflow.steps.FlowInterruptedException
[Pipeline] stage
[Pipeline] { (Notifications)
[Pipeline] echo
Build result: FAILURE
[Pipeline] jiraIssueSelector
[Pipeline] echo
The authors of changes [slachiewicz].
[Pipeline] echo
Sending email ...
[Pipeline] emailext
Reply | Threaded
Open this post in threaded view
|

Build succeeded in Jenkins: Maven TLP » maven-resolver » MRESOLVER-62_tests #18

Apache Jenkins Server-2
See https://builds.apache.org/job/maven-box/job/maven-resolver/job/MRESOLVER-62_tests/18/

Changes:

* H30 is having issues
* H23 has issues.
* GitHub emails should not trigger notifier which otherwise breaks the
* Revert "GitHub emails should not trigger notifier which otherwise breaks
* H40 is unstable
* GitHub emails should not trigger notifier which otherwise breaks the
* send email if authors exist
* fixed Scripts not permitted to use staticMethod
* H24 in unstable

All tests passed