Build failed in Jenkins: Maven TLP » maven-resolver » MRESOLVER-33 #21

classic Classic list List threaded Threaded
3 messages Options
Reply | Threaded
Open this post in threaded view
|

Build failed in Jenkins: Maven TLP » maven-resolver » MRESOLVER-33 #21

Apache Jenkins Server-2
See https://builds.apache.org/job/maven-box/job/maven-resolver/job/MRESOLVER-33/21/

Changes:

* H30 is having issues

All tests passed

Build log:
[...truncated 29450 lines...]
‘H6’ doesn’t have label ‘H22’
‘H9’ doesn’t have label ‘H22’
‘Jenkins’ doesn’t have label ‘H22’
‘apache-beam-jenkins-10’ doesn’t have label ‘H22’
‘apache-beam-jenkins-11’ doesn’t have label ‘H22’
‘apache-beam-jenkins-12’ doesn’t have label ‘H22’
‘apache-beam-jenkins-13’ doesn’t have label ‘H22’
‘apache-beam-jenkins-14’ doesn’t have label ‘H22’
‘apache-beam-jenkins-15’ doesn’t have label ‘H22’
‘apache-beam-jenkins-16’ doesn’t have label ‘H22’
‘apache-beam-jenkins-1’ doesn’t have label ‘H22’
‘apache-beam-jenkins-2’ doesn’t have label ‘H22’
‘apache-beam-jenkins-3’ doesn’t have label ‘H22’
‘apache-beam-jenkins-4’ doesn’t have label ‘H22’
‘apache-beam-jenkins-5’ doesn’t have label ‘H22’
‘apache-beam-jenkins-6’ doesn’t have label ‘H22’
‘apache-beam-jenkins-7’ doesn’t have label ‘H22’
‘apache-beam-jenkins-8’ doesn’t have label ‘H22’
‘apache-beam-jenkins-9’ doesn’t have label ‘H22’
‘arm1’ doesn’t have label ‘H22’
‘arm2’ doesn’t have label ‘H22’
‘arm3’ doesn’t have label ‘H22’
‘cassandra10’ doesn’t have label ‘H22’
‘cassandra11’ doesn’t have label ‘H22’
‘cassandra12’ doesn’t have label ‘H22’
‘cassandra13’ doesn’t have label ‘H22’
‘cassandra14’ doesn’t have label ‘H22’
‘cassandra15’ doesn’t have label ‘H22’
‘cassandra16’ doesn’t have label ‘H22’
‘cassandra1’ doesn’t have label ‘H22’
‘cassandra2’ doesn’t have label ‘H22’
‘cassandra3’ doesn’t have label ‘H22’
‘cassandra4’ doesn’t have label ‘H22’
‘cassandra5’ doesn’t have label ‘H22’
‘cassandra6’ doesn’t have label ‘H22’
‘cassandra7’ doesn’t have label ‘H22’
‘cassandra8’ doesn’t have label ‘H22’
‘cassandra9’ doesn’t have label ‘H22’
‘hadoop-ppc64le-1’ doesn’t have label ‘H22’
‘hadoop-win1’ doesn’t have label ‘H22’
‘jenkins-skywalking1’ doesn’t have label ‘H22’
‘jenkins-skywalking2’ doesn’t have label ‘H22’
‘jenkins-skywalking3’ doesn’t have label ‘H22’
‘jenkins-skywalking4-se’ doesn’t have label ‘H22’
‘jenkins-skywalking5’ doesn’t have label ‘H22’
‘jenkins-skywalking6’ doesn’t have label ‘H22’
‘jenkins-win-he-de-1’ doesn’t have label ‘H22’
‘jenkins-win-he-de-2’ doesn’t have label ‘H22’
‘jenkins-win-he-de-3’ doesn’t have label ‘H22’
‘jenkins-win-he-de-4’ doesn’t have label ‘H22’
‘jenkins-win-he-de-5’ doesn’t have label ‘H22’
‘jenkins-win-he-de-6’ doesn’t have label ‘H22’
‘lucene2’ doesn’t have label ‘H22’
‘lucene’ doesn’t have label ‘H22’
‘openwhisk1’ doesn’t have label ‘H22’
‘openwhisk2’ doesn’t have label ‘H22’
‘openwhisk3’ doesn’t have label ‘H22’
‘plc4x1’ doesn’t have label ‘H22’
‘ubuntu-ppc64le’ doesn’t have label ‘H22’
‘websites’ doesn’t have label ‘H22’
Waiting to resume part of Maven TLP » maven-resolver » MRESOLVER-33 #21: Waiting for pending items to get a node assigned
‘H0’ doesn’t have label ‘H22’
‘H10’ doesn’t have label ‘H22’
‘H12’ doesn’t have label ‘H22’
‘H13’ doesn’t have label ‘H22’
‘H14’ doesn’t have label ‘H22’
‘H15’ doesn’t have label ‘H22’
‘H16’ doesn’t have label ‘H22’
‘H17’ doesn’t have label ‘H22’
‘H18’ doesn’t have label ‘H22’
‘H19’ doesn’t have label ‘H22’
‘H1’ doesn’t have label ‘H22’
‘H20’ doesn’t have label ‘H22’
‘H21’ doesn’t have label ‘H22’
‘H23’ doesn’t have label ‘H22’
‘H24’ doesn’t have label ‘H22’
‘H25’ doesn’t have label ‘H22’
‘H26’ doesn’t have label ‘H22’
‘H27’ doesn’t have label ‘H22’
‘H28’ doesn’t have label ‘H22’
‘H29’ doesn’t have label ‘H22’
‘H2’ doesn’t have label ‘H22’
‘H30’ doesn’t have label ‘H22’
‘H31’ doesn’t have label ‘H22’
‘H32’ doesn’t have label ‘H22’
‘H33’ doesn’t have label ‘H22’
‘H34’ doesn’t have label ‘H22’
‘H35’ doesn’t have label ‘H22’
‘H36’ doesn’t have label ‘H22’
‘H37’ doesn’t have label ‘H22’
‘H38’ doesn’t have label ‘H22’
‘H39’ doesn’t have label ‘H22’
‘H40’ doesn’t have label ‘H22’
‘H41’ doesn’t have label ‘H22’
‘H42’ doesn’t have label ‘H22’
‘H43’ doesn’t have label ‘H22’
‘H44’ doesn’t have label ‘H22’
‘H48’ doesn’t have label ‘H22’
‘H4’ doesn’t have label ‘H22’
‘H50’ doesn’t have label ‘H22’
‘H6’ doesn’t have label ‘H22’
‘H9’ doesn’t have label ‘H22’
‘Jenkins’ doesn’t have label ‘H22’
‘apache-beam-jenkins-10’ doesn’t have label ‘H22’
‘apache-beam-jenkins-12’ doesn’t have label ‘H22’
‘apache-beam-jenkins-14’ doesn’t have label ‘H22’
‘apache-beam-jenkins-16’ doesn’t have label ‘H22’
‘apache-beam-jenkins-2’ doesn’t have label ‘H22’
‘apache-beam-jenkins-5’ doesn’t have label ‘H22’
‘apache-beam-jenkins-9’ doesn’t have label ‘H22’
‘arm1’ doesn’t have label ‘H22’
‘arm2’ doesn’t have label ‘H22’
‘arm3’ doesn’t have label ‘H22’
‘cassandra10’ doesn’t have label ‘H22’
‘cassandra11’ doesn’t have label ‘H22’
‘cassandra12’ doesn’t have label ‘H22’
‘cassandra13’ doesn’t have label ‘H22’
‘cassandra14’ doesn’t have label ‘H22’
‘cassandra15’ doesn’t have label ‘H22’
‘cassandra16’ doesn’t have label ‘H22’
‘cassandra1’ doesn’t have label ‘H22’
‘cassandra2’ doesn’t have label ‘H22’
‘cassandra3’ doesn’t have label ‘H22’
‘cassandra4’ doesn’t have label ‘H22’
‘cassandra5’ doesn’t have label ‘H22’
‘cassandra6’ doesn’t have label ‘H22’
‘cassandra7’ doesn’t have label ‘H22’
‘cassandra8’ doesn’t have label ‘H22’
‘cassandra9’ doesn’t have label ‘H22’
‘hadoop-ppc64le-1’ doesn’t have label ‘H22’
‘hadoop-win1’ doesn’t have label ‘H22’
‘jenkins-skywalking1’ doesn’t have label ‘H22’
‘jenkins-skywalking2’ doesn’t have label ‘H22’
‘jenkins-skywalking3’ doesn’t have label ‘H22’
‘jenkins-skywalking4-se’ doesn’t have label ‘H22’
‘jenkins-skywalking5’ doesn’t have label ‘H22’
‘jenkins-skywalking6’ doesn’t have label ‘H22’
‘jenkins-win-he-de-1’ doesn’t have label ‘H22’
‘jenkins-win-he-de-2’ doesn’t have label ‘H22’
‘jenkins-win-he-de-3’ doesn’t have label ‘H22’
‘jenkins-win-he-de-4’ doesn’t have label ‘H22’
‘jenkins-win-he-de-5’ doesn’t have label ‘H22’
‘jenkins-win-he-de-6’ doesn’t have label ‘H22’
‘lucene2’ doesn’t have label ‘H22’
‘lucene’ doesn’t have label ‘H22’
‘openwhisk1’ doesn’t have label ‘H22’
‘openwhisk2’ doesn’t have label ‘H22’
‘openwhisk3’ doesn’t have label ‘H22’
‘plc4x1’ doesn’t have label ‘H22’
‘ubuntu-ppc64le’ doesn’t have label ‘H22’
Ready to run at Tue Jan 14 11:47:48 UTC 2020
Cannot contact H22: java.lang.InterruptedException
Aborted by rfscholte
Sending interrupt signal to process
[INFO]
[INFO] Results:
[INFO]
[INFO] Tests run: 105, Failures: 0, Errors: 0, Skipped: 0
[INFO]
[ERROR] There are test failures.

Please refer to /home/jenkins/jenkins-slave/workspace/_box_maven-resolver_MRESOLVER-33/m/maven-resolver-impl/target/surefire-reports for the individual test results.
Please refer to dump files (if any exist) [date]-jvmRun[N].dump, [date].dumpstream and [date]-jvmRun[N].dumpstream.
The forked VM terminated without properly saying goodbye. VM crash or System.exit called?
Command was /bin/sh -c cd /home/jenkins/jenkins-slave/workspace/_box_maven-resolver_MRESOLVER-33/m/maven-resolver-impl && /usr/local/asfpackages/java/jdk1.7.0_80/jre/bin/java -Xmx128m -jar /home/jenkins/jenkins-slave/workspace/_box_maven-resolver_MRESOLVER-33/m/maven-resolver-impl/target/surefire/surefirebooter2609646693736467062.jar /home/jenkins/jenkins-slave/workspace/_box_maven-resolver_MRESOLVER-33/m/maven-resolver-impl/target/surefire 2020-01-12T08-48-45_827-jvmRun1 surefire4828182837941526890tmp surefire_45468594736727965615tmp
Error occurred in starting fork, check output in log
Process Exit Code: 143
Crashed tests:
org.eclipse.aether.internal.impl.collect.DefaultDependencyCollectorTest
org.apache.maven.surefire.booter.SurefireBooterForkException: The forked VM terminated without properly saying goodbye. VM crash or System.exit called?
Command was /bin/sh -c cd /home/jenkins/jenkins-slave/workspace/_box_maven-resolver_MRESOLVER-33/m/maven-resolver-impl && /usr/local/asfpackages/java/jdk1.7.0_80/jre/bin/java -Xmx128m -jar /home/jenkins/jenkins-slave/workspace/_box_maven-resolver_MRESOLVER-33/m/maven-resolver-impl/target/surefire/surefirebooter2609646693736467062.jar /home/jenkins/jenkins-slave/workspace/_box_maven-resolver_MRESOLVER-33/m/maven-resolver-impl/target/surefire 2020-01-12T08-48-45_827-jvmRun1 surefire4828182837941526890tmp surefire_45468594736727965615tmp
Error occurred in starting fork, check output in log
Process Exit Code: 143
Crashed tests:
org.eclipse.aether.internal.impl.collect.DefaultDependencyCollectorTest
        at org.apache.maven.plugin.surefire.booterclient.ForkStarter.fork(ForkStarter.java:671)
        at org.apache.maven.plugin.surefire.booterclient.ForkStarter.fork(ForkStarter.java:533)
        at org.apache.maven.plugin.surefire.booterclient.ForkStarter.run(ForkStarter.java:278)
        at org.apache.maven.plugin.surefire.booterclient.ForkStarter.run(ForkStarter.java:244)
        at org.apache.maven.plugin.surefire.AbstractSurefireMojo.executeProvider(AbstractSurefireMojo.java:1194)
        at org.apache.maven.plugin.surefire.AbstractSurefireMojo.executeAfterPreconditionsChecked(AbstractSurefireMojo.java:1022)
        at org.apache.maven.plugin.surefire.AbstractSurefireMojo.execute(AbstractSurefireMojo.java:868)
        at org.apache.maven.plugin.DefaultBuildPluginManager.executeMojo(DefaultBuildPluginManager.java:137)
        at org.apache.maven.lifecycle.internal.MojoExecutor.execute(MojoExecutor.java:210)
        at org.apache.maven.lifecycle.internal.MojoExecutor.execute(MojoExecutor.java:156)
        at org.apache.maven.lifecycle.internal.MojoExecutor.execute(MojoExecutor.java:148)
        at org.apache.maven.lifecycle.internal.LifecycleModuleBuilder.buildProject(LifecycleModuleBuilder.java:117)
        at org.apache.maven.lifecycle.internal.LifecycleModuleBuilder.buildProject(LifecycleModuleBuilder.java:81)
        at org.apache.maven.lifecycle.internal.builder.singlethreaded.SingleThreadedBuilder.build(SingleThreadedBuilder.java:56)
        at org.apache.maven.lifecycle.internal.LifecycleStarter.execute(LifecycleStarter.java:128)
        at org.apache.maven.DefaultMaven.doExecute(DefaultMaven.java:305)
        at org.apache.maven.DefaultMaven.doExecute(DefaultMaven.java:192)
        at org.apache.maven.DefaultMaven.execute(DefaultMaven.java:105)
        at org.apache.maven.cli.MavenCli.execute(MavenCli.java:956)
        at org.apache.maven.cli.MavenCli.doMain(MavenCli.java:288)
        at org.apache.maven.cli.MavenCli.main(MavenCli.java:192)
        at sun.reflect.NativeMethodAccessorImpl.invoke0(Native Method)
        at sun.reflect.NativeMethodAccessorImpl.invoke(NativeMethodAccessorImpl.java:57)
        at sun.reflect.DelegatingMethodAccessorImpl.invoke(DelegatingMethodAccessorImpl.java:43)
        at java.lang.reflect.Method.invoke(Method.java:606)
        at org.codehaus.plexus.classworlds.launcher.Launcher.launchEnhanced(Launcher.java:282)
        at org.codehaus.plexus.classworlds.launcher.Launcher.launch(Launcher.java:225)
        at org.codehaus.plexus.classworlds.launcher.Launcher.mainWithExitCode(Launcher.java:406)
        at org.codehaus.plexus.classworlds.launcher.Launcher.main(Launcher.java:347)

[INFO]
[INFO] --- maven-jar-plugin:3.1.0:jar (default-jar) @ maven-resolver-impl ---
[INFO] Building jar: /home/jenkins/jenkins-slave/workspace/_box_maven-resolver_MRESOLVER-33/m/maven-resolver-impl/target/maven-resolver-impl-1.4.0-SNAPSHOT.jar
[INFO]
[INFO] --- maven-site-plugin:3.7.1:attach-descriptor (attach-descriptor) @ maven-resolver-impl ---
[INFO] Skipping because packaging 'jar' is not pom.
[INFO]
[INFO] --- maven-checkstyle-plugin:3.0.0:check (checkstyle-check) @ maven-resolver-impl ---
Click here to forcibly terminate running steps
script returned exit code 143
[Pipeline] }
[Pipeline] // dir
[Pipeline] }
[withMaven] One or multiple Maven executions have been ignored by the Jenkins Pipeline Maven Plugin because they have been interrupted before completion (1). See Pipeline Maven Plugin FAQ for more details.
[Pipeline] // withMaven
[Pipeline] echo
[FAILURE-004] org.jenkinsci.plugins.workflow.steps.FlowInterruptedException
[Pipeline] cleanWs
[WS-CLEANUP] Deleting project workspace...
[WS-CLEANUP] Deferred wipeout is used...
[WS-CLEANUP] done
[Pipeline] cleanWs
[WS-CLEANUP] Deleting project workspace...
[WS-CLEANUP] Deferred wipeout is used...
[WS-CLEANUP] done
[Pipeline] }
[Pipeline] // stage
[Pipeline] }
[Pipeline] // node
[Pipeline] }
Failed in branch linux-jdk7
[Pipeline] // parallel
[Pipeline] echo
[FAILURE-003] AbortException hudson.AbortException: Error cloning remote repo 'origin'
[Pipeline] stage
[Pipeline] { (Notifications)
[Pipeline] echo
Build result: FAILURE
[Pipeline] jiraIssueSelector
[Pipeline] echo
The authors of changes [rfscholte].
[Pipeline] echo
Sending email ...
[Pipeline] emailext
Reply | Threaded
Open this post in threaded view
|

Build failed in Jenkins: Maven TLP » maven-resolver » MRESOLVER-33 #22

Apache Jenkins Server-2
See https://builds.apache.org/job/maven-box/job/maven-resolver/job/MRESOLVER-33/22/

Changes:

* Add JDK 15
* Add Maven 3.6.3

All tests passed

Build log:
[...truncated 16689 lines...]
[INFO] Downloading from central: https://repo.maven.apache.org/maven2/org/apache/maven/surefire/surefire-booter/2.19.1/surefire-booter-2.19.1.jar
[INFO] Downloaded from central: https://repo.maven.apache.org/maven2/org/codehaus/plexus/plexus-utils/3.0.20/plexus-utils-3.0.20.jar (243 kB at 4.3 MB/s)
[INFO] Downloading from central: https://repo.maven.apache.org/maven2/org/apache/commons/commons-lang3/3.1/commons-lang3-3.1.jar
[INFO] Downloaded from central: https://repo.maven.apache.org/maven2/org/apache/maven/doxia/doxia-core/1.4/doxia-core-1.4.jar (165 kB at 2.8 MB/s)
[INFO] Downloaded from central: https://repo.maven.apache.org/maven2/org/apache/maven/surefire/maven-surefire-common/2.19.1/maven-surefire-common-2.19.1.jar (293 kB at 4.6 MB/s)
[INFO] Downloaded from central: https://repo.maven.apache.org/maven2/org/apache/maven/surefire/surefire-api/2.19.1/surefire-api-2.19.1.jar (196 kB at 3.1 MB/s)
[INFO] Downloaded from central: https://repo.maven.apache.org/maven2/org/apache/maven/surefire/surefire-booter/2.19.1/surefire-booter-2.19.1.jar (46 kB at 722 kB/s)
[INFO] Downloaded from central: https://repo.maven.apache.org/maven2/org/apache/commons/commons-lang3/3.1/commons-lang3-3.1.jar (316 kB at 3.9 MB/s)
[ERROR]

Artifact Ids of the format maven-___-plugin are reserved for
plugins in the Group Id org.apache.maven.plugins
Please change your artifactId to the format ___-maven-plugin
In the future this error will break the build.


[INFO] Using 'UTF-8' encoding to read mojo source files.
[INFO] java-javadoc mojo extractor found 0 mojo descriptor.
[INFO] java-annotations mojo extractor found 1 mojo descriptor.
[INFO]
[INFO] --- maven-resources-plugin:3.1.0:testResources (default-testResources) @ maven-resolver-demo-maven-plugin ---
[INFO] Using 'UTF-8' encoding to copy filtered resources.
[INFO] skip non existing resourceDirectory /home/jenkins/jenkins-slave/workspace/_box_maven-resolver_MRESOLVER-33/m/maven-resolver-demos/maven-resolver-demo-maven-plugin/src/test/resources
[INFO] Copying 3 resources
[INFO]
[INFO] --- maven-compiler-plugin:3.7.0:testCompile (default-testCompile) @ maven-resolver-demo-maven-plugin ---
[INFO] No sources to compile
[INFO]
[INFO] --- maven-surefire-plugin:2.22.0:test (default-test) @ maven-resolver-demo-maven-plugin ---
[INFO]
[INFO] --- maven-jar-plugin:3.1.0:jar (default-jar) @ maven-resolver-demo-maven-plugin ---
[INFO] Building jar: /home/jenkins/jenkins-slave/workspace/_box_maven-resolver_MRESOLVER-33/m/maven-resolver-demos/maven-resolver-demo-maven-plugin/target/maven-resolver-demo-maven-plugin-1.4.0-SNAPSHOT.jar
[INFO]
[INFO] --- maven-plugin-plugin:3.5.2:addPluginArtifactMetadata (default-addPluginArtifactMetadata) @ maven-resolver-demo-maven-plugin ---
[INFO]
[INFO] --- maven-site-plugin:3.7.1:attach-descriptor (attach-descriptor) @ maven-resolver-demo-maven-plugin ---
[INFO] Skipping because packaging 'maven-plugin' is not pom.
[INFO]
[INFO] --- maven-invoker-plugin:3.0.1:install (integration-test) @ maven-resolver-demo-maven-plugin ---
[INFO] Downloading from central: https://repo.maven.apache.org/maven2/org/apache/maven/shared/maven-invoker/3.0.0/maven-invoker-3.0.0.pom
[INFO] Downloaded from central: https://repo.maven.apache.org/maven2/org/apache/maven/shared/maven-invoker/3.0.0/maven-invoker-3.0.0.pom (5.0 kB at 359 kB/s)
[INFO] Downloading from central: https://repo.maven.apache.org/maven2/org/apache/maven/reporting/maven-reporting-impl/2.4/maven-reporting-impl-2.4.pom
[INFO] Downloaded from central: https://repo.maven.apache.org/maven2/org/apache/maven/reporting/maven-reporting-impl/2.4/maven-reporting-impl-2.4.pom (6.1 kB at 504 kB/s)
[INFO] Downloading from central: https://repo.maven.apache.org/maven2/commons-validator/commons-validator/1.4.1/commons-validator-1.4.1.pom
[INFO] Downloaded from central: https://repo.maven.apache.org/maven2/commons-validator/commons-validator/1.4.1/commons-validator-1.4.1.pom (13 kB at 905 kB/s)
[INFO] Downloading from central: https://repo.maven.apache.org/maven2/org/apache/commons/commons-parent/36/commons-parent-36.pom
[INFO] Downloaded from central: https://repo.maven.apache.org/maven2/org/apache/commons/commons-parent/36/commons-parent-36.pom (58 kB at 3.4 MB/s)
[INFO] Downloading from central: https://repo.maven.apache.org/maven2/commons-beanutils/commons-beanutils/1.8.3/commons-beanutils-1.8.3.pom
[INFO] Downloaded from central: https://repo.maven.apache.org/maven2/commons-beanutils/commons-beanutils/1.8.3/commons-beanutils-1.8.3.pom (11 kB at 933 kB/s)
[INFO] Downloading from central: https://repo.maven.apache.org/maven2/org/apache/commons/commons-parent/14/commons-parent-14.pom
[INFO] Downloaded from central: https://repo.maven.apache.org/maven2/org/apache/commons/commons-parent/14/commons-parent-14.pom (31 kB at 2.2 MB/s)
[INFO] Downloading from central: https://repo.maven.apache.org/maven2/commons-digester/commons-digester/1.8.1/commons-digester-1.8.1.pom
[INFO] Downloaded from central: https://repo.maven.apache.org/maven2/commons-digester/commons-digester/1.8.1/commons-digester-1.8.1.pom (10 kB at 836 kB/s)
[INFO] Downloading from central: https://repo.maven.apache.org/maven2/org/apache/maven/shared/maven-script-interpreter/1.2/maven-script-interpreter-1.2.pom
[INFO] Downloaded from central: https://repo.maven.apache.org/maven2/org/apache/maven/shared/maven-script-interpreter/1.2/maven-script-interpreter-1.2.pom (4.0 kB at 308 kB/s)
[INFO] Downloading from central: https://repo.maven.apache.org/maven2/org/apache/ant/ant/1.8.1/ant-1.8.1.pom
[INFO] Downloaded from central: https://repo.maven.apache.org/maven2/org/apache/ant/ant/1.8.1/ant-1.8.1.pom (8.8 kB at 677 kB/s)
[INFO] Downloading from central: https://repo.maven.apache.org/maven2/org/apache/ant/ant-parent/1.8.1/ant-parent-1.8.1.pom
[INFO] Downloaded from central: https://repo.maven.apache.org/maven2/org/apache/ant/ant-parent/1.8.1/ant-parent-1.8.1.pom (4.3 kB at 357 kB/s)
[INFO] Downloading from central: https://repo.maven.apache.org/maven2/org/apache/maven/shared/maven-artifact-transfer/0.9.1/maven-artifact-transfer-0.9.1.pom
[INFO] Downloaded from central: https://repo.maven.apache.org/maven2/org/apache/maven/shared/maven-artifact-transfer/0.9.1/maven-artifact-transfer-0.9.1.pom (7.6 kB at 634 kB/s)
[INFO] Downloading from central: https://repo.maven.apache.org/maven2/org/apache/maven/shared/maven-common-artifact-filters/3.0.1/maven-common-artifact-filters-3.0.1.pom
[INFO] Downloaded from central: https://repo.maven.apache.org/maven2/org/apache/maven/shared/maven-common-artifact-filters/3.0.1/maven-common-artifact-filters-3.0.1.pom (4.8 kB at 372 kB/s)
[INFO] Downloading from central: https://repo.maven.apache.org/maven2/commons-codec/commons-codec/1.6/commons-codec-1.6.pom
[INFO] Downloaded from central: https://repo.maven.apache.org/maven2/commons-codec/commons-codec/1.6/commons-codec-1.6.pom (11 kB at 930 kB/s)
[INFO] Downloading from central: https://repo.maven.apache.org/maven2/org/slf4j/slf4j-api/1.7.5/slf4j-api-1.7.5.pom
[INFO] Downloaded from central: https://repo.maven.apache.org/maven2/org/slf4j/slf4j-api/1.7.5/slf4j-api-1.7.5.pom (2.7 kB at 244 kB/s)
[INFO] Downloading from central: https://repo.maven.apache.org/maven2/org/slf4j/slf4j-parent/1.7.5/slf4j-parent-1.7.5.pom
[INFO] Downloaded from central: https://repo.maven.apache.org/maven2/org/slf4j/slf4j-parent/1.7.5/slf4j-parent-1.7.5.pom (12 kB at 843 kB/s)
[INFO] Downloading from central: https://repo.maven.apache.org/maven2/org/apache/maven/doxia/doxia-sink-api/1.7/doxia-sink-api-1.7.pom
[INFO] Downloaded from central: https://repo.maven.apache.org/maven2/org/apache/maven/doxia/doxia-sink-api/1.7/doxia-sink-api-1.7.pom (1.5 kB at 90 kB/s)
[INFO] Downloading from central: https://repo.maven.apache.org/maven2/org/apache/maven/doxia/doxia/1.7/doxia-1.7.pom
[INFO] Downloaded from central: https://repo.maven.apache.org/maven2/org/apache/maven/doxia/doxia/1.7/doxia-1.7.pom (15 kB at 1.3 MB/s)
[INFO] Downloading from central: https://repo.maven.apache.org/maven2/org/apache/maven/doxia/doxia-logging-api/1.7/doxia-logging-api-1.7.pom
[INFO] Downloaded from central: https://repo.maven.apache.org/maven2/org/apache/maven/doxia/doxia-logging-api/1.7/doxia-logging-api-1.7.pom (1.5 kB at 128 kB/s)
[INFO] Downloading from central: https://repo.maven.apache.org/maven2/org/apache/maven/doxia/doxia-site-renderer/1.7.4/doxia-site-renderer-1.7.4.pom
[INFO] Downloaded from central: https://repo.maven.apache.org/maven2/org/apache/maven/doxia/doxia-site-renderer/1.7.4/doxia-site-renderer-1.7.4.pom (6.7 kB at 608 kB/s)
[INFO] Downloading from central: https://repo.maven.apache.org/maven2/org/apache/maven/doxia/doxia-sitetools/1.7.4/doxia-sitetools-1.7.4.pom
[INFO] Downloaded from central: https://repo.maven.apache.org/maven2/org/apache/maven/doxia/doxia-sitetools/1.7.4/doxia-sitetools-1.7.4.pom (14 kB at 1.0 MB/s)
[INFO] Downloading from central: https://repo.maven.apache.org/maven2/org/apache/maven/doxia/doxia-core/1.7/doxia-core-1.7.pom
[INFO] Downloaded from central: https://repo.maven.apache.org/maven2/org/apache/maven/doxia/doxia-core/1.7/doxia-core-1.7.pom (4.1 kB at 339 kB/s)
[INFO] Downloading from central: https://repo.maven.apache.org/maven2/org/apache/maven/doxia/doxia-decoration-model/1.7.4/doxia-decoration-model-1.7.4.pom
[INFO] Downloaded from central: https://repo.maven.apache.org/maven2/org/apache/maven/doxia/doxia-decoration-model/1.7.4/doxia-decoration-model-1.7.4.pom (3.4 kB at 283 kB/s)
[INFO] Downloading from central: https://repo.maven.apache.org/maven2/org/apache/maven/doxia/doxia-skin-model/1.7.4/doxia-skin-model-1.7.4.pom
[INFO] Downloaded from central: https://repo.maven.apache.org/maven2/org/apache/maven/doxia/doxia-skin-model/1.7.4/doxia-skin-model-1.7.4.pom (3.0 kB at 233 kB/s)
[INFO] Downloading from central: https://repo.maven.apache.org/maven2/org/apache/maven/doxia/doxia-module-xhtml/1.7/doxia-module-xhtml-1.7.pom
[INFO] Downloaded from central: https://repo.maven.apache.org/maven2/org/apache/maven/doxia/doxia-module-xhtml/1.7/doxia-module-xhtml-1.7.pom (1.6 kB at 136 kB/s)
[INFO] Downloading from central: https://repo.maven.apache.org/maven2/org/apache/maven/doxia/doxia-modules/1.7/doxia-modules-1.7.pom
[INFO] Downloaded from central: https://repo.maven.apache.org/maven2/org/apache/maven/doxia/doxia-modules/1.7/doxia-modules-1.7.pom (2.6 kB at 238 kB/s)
[INFO] Downloading from central: https://repo.maven.apache.org/maven2/org/codehaus/groovy/groovy-all/2.4.8/groovy-all-2.4.8.pom
[INFO] Downloaded from central: https://repo.maven.apache.org/maven2/org/codehaus/groovy/groovy-all/2.4.8/groovy-all-2.4.8.pom (21 kB at 1.6 MB/s)
[INFO] Downloading from central: https://repo.maven.apache.org/maven2/org/apache/maven/shared/maven-invoker/3.0.0/maven-invoker-3.0.0.jar
[INFO] Downloading from central: https://repo.maven.apache.org/maven2/commons-digester/commons-digester/1.8.1/commons-digester-1.8.1.jar
[INFO] Downloading from central: https://repo.maven.apache.org/maven2/commons-beanutils/commons-beanutils/1.8.3/commons-beanutils-1.8.3.jar
[INFO] Downloading from central: https://repo.maven.apache.org/maven2/commons-validator/commons-validator/1.4.1/commons-validator-1.4.1.jar
[INFO] Downloading from central: https://repo.maven.apache.org/maven2/org/apache/maven/reporting/maven-reporting-impl/2.4/maven-reporting-impl-2.4.jar
[INFO] Downloaded from central: https://repo.maven.apache.org/maven2/org/apache/maven/shared/maven-invoker/3.0.0/maven-invoker-3.0.0.jar (33 kB at 2.2 MB/s)
[INFO] Downloading from central: https://repo.maven.apache.org/maven2/commons-logging/commons-logging/1.2/commons-logging-1.2.jar
[INFO] Downloaded from central: https://repo.maven.apache.org/maven2/org/apache/maven/reporting/maven-reporting-impl/2.4/maven-reporting-impl-2.4.jar (20 kB at 1.2 MB/s)
[INFO] Downloading from central: https://repo.maven.apache.org/maven2/org/apache/maven/shared/maven-script-interpreter/1.2/maven-script-interpreter-1.2.jar
[INFO] Downloaded from central: https://repo.maven.apache.org/maven2/commons-digester/commons-digester/1.8.1/commons-digester-1.8.1.jar (146 kB at 7.7 MB/s)
[INFO] Downloading from central: https://repo.maven.apache.org/maven2/org/apache/ant/ant/1.8.1/ant-1.8.1.jar
[INFO] Downloaded from central: https://repo.maven.apache.org/maven2/commons-beanutils/commons-beanutils/1.8.3/commons-beanutils-1.8.3.jar (232 kB at 11 MB/s)
[INFO] Downloading from central: https://repo.maven.apache.org/maven2/org/apache/maven/shared/maven-artifact-transfer/0.9.1/maven-artifact-transfer-0.9.1.jar
[INFO] Downloaded from central: https://repo.maven.apache.org/maven2/commons-validator/commons-validator/1.4.1/commons-validator-1.4.1.jar (190 kB at 7.9 MB/s)
[INFO] Downloading from central: https://repo.maven.apache.org/maven2/org/apache/maven/shared/maven-common-artifact-filters/3.0.1/maven-common-artifact-filters-3.0.1.jar
[INFO] Downloaded from central: https://repo.maven.apache.org/maven2/commons-logging/commons-logging/1.2/commons-logging-1.2.jar (62 kB at 2.1 MB/s)
[INFO] Downloading from central: https://repo.maven.apache.org/maven2/commons-codec/commons-codec/1.6/commons-codec-1.6.jar
[INFO] Downloaded from central: https://repo.maven.apache.org/maven2/org/apache/maven/shared/maven-script-interpreter/1.2/maven-script-interpreter-1.2.jar (22 kB at 735 kB/s)
[INFO] Downloading from central: https://repo.maven.apache.org/maven2/org/slf4j/slf4j-api/1.7.5/slf4j-api-1.7.5.jar
[INFO] Downloaded from central: https://repo.maven.apache.org/maven2/org/apache/maven/shared/maven-common-artifact-filters/3.0.1/maven-common-artifact-filters-3.0.1.jar (61 kB at 1.5 MB/s)
[INFO] Downloaded from central: https://repo.maven.apache.org/maven2/org/apache/maven/shared/maven-artifact-transfer/0.9.1/maven-artifact-transfer-0.9.1.jar (123 kB at 2.9 MB/s)
[INFO] Downloading from central: https://repo.maven.apache.org/maven2/org/apache/maven/doxia/doxia-sink-api/1.7/doxia-sink-api-1.7.jar
[INFO] Downloading from central: https://repo.maven.apache.org/maven2/org/apache/maven/doxia/doxia-logging-api/1.7/doxia-logging-api-1.7.jar
[INFO] Downloaded from central: https://repo.maven.apache.org/maven2/org/slf4j/slf4j-api/1.7.5/slf4j-api-1.7.5.jar (26 kB at 607 kB/s)
[INFO] Downloading from central: https://repo.maven.apache.org/maven2/org/apache/maven/doxia/doxia-site-renderer/1.7.4/doxia-site-renderer-1.7.4.jar
[INFO] Downloaded from central: https://repo.maven.apache.org/maven2/commons-codec/commons-codec/1.6/commons-codec-1.6.jar (233 kB at 4.8 MB/s)
[INFO] Downloading from central: https://repo.maven.apache.org/maven2/org/apache/maven/doxia/doxia-decoration-model/1.7.4/doxia-decoration-model-1.7.4.jar
[INFO] Downloaded from central: https://repo.maven.apache.org/maven2/org/apache/maven/doxia/doxia-sink-api/1.7/doxia-sink-api-1.7.jar (11 kB at 207 kB/s)
[INFO] Downloading from central: https://repo.maven.apache.org/maven2/org/apache/maven/doxia/doxia-skin-model/1.7.4/doxia-skin-model-1.7.4.jar
[INFO] Downloaded from central: https://repo.maven.apache.org/maven2/org/apache/maven/doxia/doxia-logging-api/1.7/doxia-logging-api-1.7.jar (12 kB at 207 kB/s)
[INFO] Downloading from central: https://repo.maven.apache.org/maven2/org/apache/maven/doxia/doxia-module-xhtml/1.7/doxia-module-xhtml-1.7.jar
[INFO] Downloaded from central: https://repo.maven.apache.org/maven2/org/apache/maven/doxia/doxia-site-renderer/1.7.4/doxia-site-renderer-1.7.4.jar (64 kB at 1.0 MB/s)
[INFO] Downloading from central: https://repo.maven.apache.org/maven2/org/codehaus/groovy/groovy-all/2.4.8/groovy-all-2.4.8.jar
[INFO] Downloaded from central: https://repo.maven.apache.org/maven2/org/apache/maven/doxia/doxia-decoration-model/1.7.4/doxia-decoration-model-1.7.4.jar (61 kB at 947 kB/s)
[INFO] Downloaded from central: https://repo.maven.apache.org/maven2/org/apache/maven/doxia/doxia-skin-model/1.7.4/doxia-skin-model-1.7.4.jar (16 kB at 232 kB/s)
[INFO] Downloaded from central: https://repo.maven.apache.org/maven2/org/apache/maven/doxia/doxia-module-xhtml/1.7/doxia-module-xhtml-1.7.jar (17 kB at 246 kB/s)
[INFO] Downloaded from central: https://repo.maven.apache.org/maven2/org/apache/ant/ant/1.8.1/ant-1.8.1.jar (1.5 MB at 18 MB/s)
[INFO] Downloaded from central: https://repo.maven.apache.org/maven2/org/codehaus/groovy/groovy-all/2.4.8/groovy-all-2.4.8.jar (7.0 MB at 24 MB/s)
[INFO] Installing /home/jenkins/jenkins-slave/workspace/_box_maven-resolver_MRESOLVER-33/m/pom.xml to /home/jenkins/jenkins-slave/workspace/_box_maven-resolver_MRESOLVER-33/m/maven-resolver-demos/maven-resolver-demo-maven-plugin/target/local-repo/org/apache/maven/resolver/maven-resolver/1.4.0-SNAPSHOT/maven-resolver-1.4.0-SNAPSHOT.pom
[INFO] Installing /home/jenkins/jenkins-slave/workspace/_box_maven-resolver_MRESOLVER-33/m/target/maven-resolver-1.4.0-SNAPSHOT-site.xml to /home/jenkins/jenkins-slave/workspace/_box_maven-resolver_MRESOLVER-33/m/maven-resolver-demos/maven-resolver-demo-maven-plugin/target/local-repo/org/apache/maven/resolver/maven-resolver/1.4.0-SNAPSHOT/maven-resolver-1.4.0-SNAPSHOT-site.xml
[INFO] Installing /home/jenkins/jenkins-slave/workspace/_box_maven-resolver_MRESOLVER-33/m/maven-resolver-api/pom.xml to /home/jenkins/jenkins-slave/workspace/_box_maven-resolver_MRESOLVER-33/m/maven-resolver-demos/maven-resolver-demo-maven-plugin/target/local-repo/org/apache/maven/resolver/maven-resolver-api/1.4.0-SNAPSHOT/maven-resolver-api-1.4.0-SNAPSHOT.pom
[INFO] Installing /home/jenkins/jenkins-slave/workspace/_box_maven-resolver_MRESOLVER-33/m/maven-resolver-api/target/maven-resolver-api-1.4.0-SNAPSHOT.jar to /home/jenkins/jenkins-slave/workspace/_box_maven-resolver_MRESOLVER-33/m/maven-resolver-demos/maven-resolver-demo-maven-plugin/target/local-repo/org/apache/maven/resolver/maven-resolver-api/1.4.0-SNAPSHOT/maven-resolver-api-1.4.0-SNAPSHOT.jar
[INFO] Installing /home/jenkins/jenkins-slave/workspace/_box_maven-resolver_MRESOLVER-33/m/maven-resolver-spi/pom.xml to /home/jenkins/jenkins-slave/workspace/_box_maven-resolver_MRESOLVER-33/m/maven-resolver-demos/maven-resolver-demo-maven-plugin/target/local-repo/org/apache/maven/resolver/maven-resolver-spi/1.4.0-SNAPSHOT/maven-resolver-spi-1.4.0-SNAPSHOT.pom
[INFO] Installing /home/jenkins/jenkins-slave/workspace/_box_maven-resolver_MRESOLVER-33/m/maven-resolver-spi/target/maven-resolver-spi-1.4.0-SNAPSHOT.jar to /home/jenkins/jenkins-slave/workspace/_box_maven-resolver_MRESOLVER-33/m/maven-resolver-demos/maven-resolver-demo-maven-plugin/target/local-repo/org/apache/maven/resolver/maven-resolver-spi/1.4.0-SNAPSHOT/maven-resolver-spi-1.4.0-SNAPSHOT.jar
[INFO] Installing /home/jenkins/jenkins-slave/workspace/_box_maven-resolver_MRESOLVER-33/m/maven-resolver-test-util/pom.xml to /home/jenkins/jenkins-slave/workspace/_box_maven-resolver_MRESOLVER-33/m/maven-resolver-demos/maven-resolver-demo-maven-plugin/target/local-repo/org/apache/maven/resolver/maven-resolver-test-util/1.4.0-SNAPSHOT/maven-resolver-test-util-1.4.0-SNAPSHOT.pom
[INFO] Installing /home/jenkins/jenkins-slave/workspace/_box_maven-resolver_MRESOLVER-33/m/maven-resolver-test-util/target/maven-resolver-test-util-1.4.0-SNAPSHOT.jar to /home/jenkins/jenkins-slave/workspace/_box_maven-resolver_MRESOLVER-33/m/maven-resolver-demos/maven-resolver-demo-maven-plugin/target/local-repo/org/apache/maven/resolver/maven-resolver-test-util/1.4.0-SNAPSHOT/maven-resolver-test-util-1.4.0-SNAPSHOT.jar
[INFO] Installing /home/jenkins/jenkins-slave/workspace/_box_maven-resolver_MRESOLVER-33/m/maven-resolver-util/pom.xml to /home/jenkins/jenkins-slave/workspace/_box_maven-resolver_MRESOLVER-33/m/maven-resolver-demos/maven-resolver-demo-maven-plugin/target/local-repo/org/apache/maven/resolver/maven-resolver-util/1.4.0-SNAPSHOT/maven-resolver-util-1.4.0-SNAPSHOT.pom
[INFO] Installing /home/jenkins/jenkins-slave/workspace/_box_maven-resolver_MRESOLVER-33/m/maven-resolver-util/target/maven-resolver-util-1.4.0-SNAPSHOT.jar to /home/jenkins/jenkins-slave/workspace/_box_maven-resolver_MRESOLVER-33/m/maven-resolver-demos/maven-resolver-demo-maven-plugin/target/local-repo/org/apache/maven/resolver/maven-resolver-util/1.4.0-SNAPSHOT/maven-resolver-util-1.4.0-SNAPSHOT.jar
[INFO] Installing /home/jenkins/jenkins-slave/workspace/_box_maven-resolver_MRESOLVER-33/m/maven-resolver-impl/pom.xml to /home/jenkins/jenkins-slave/workspace/_box_maven-resolver_MRESOLVER-33/m/maven-resolver-demos/maven-resolver-demo-maven-plugin/target/local-repo/org/apache/maven/resolver/maven-resolver-impl/1.4.0-SNAPSHOT/maven-resolver-impl-1.4.0-SNAPSHOT.pom
[INFO] Installing /home/jenkins/jenkins-slave/workspace/_box_maven-resolver_MRESOLVER-33/m/maven-resolver-impl/target/maven-resolver-impl-1.4.0-SNAPSHOT.jar to /home/jenkins/jenkins-slave/workspace/_box_maven-resolver_MRESOLVER-33/m/maven-resolver-demos/maven-resolver-demo-maven-plugin/target/local-repo/org/apache/maven/resolver/maven-resolver-impl/1.4.0-SNAPSHOT/maven-resolver-impl-1.4.0-SNAPSHOT.jar
[INFO] Installing /home/jenkins/jenkins-slave/workspace/_box_maven-resolver_MRESOLVER-33/m/maven-resolver-connector-basic/pom.xml to /home/jenkins/jenkins-slave/workspace/_box_maven-resolver_MRESOLVER-33/m/maven-resolver-demos/maven-resolver-demo-maven-plugin/target/local-repo/org/apache/maven/resolver/maven-resolver-connector-basic/1.4.0-SNAPSHOT/maven-resolver-connector-basic-1.4.0-SNAPSHOT.pom
[INFO] Installing /home/jenkins/jenkins-slave/workspace/_box_maven-resolver_MRESOLVER-33/m/maven-resolver-connector-basic/target/maven-resolver-connector-basic-1.4.0-SNAPSHOT.jar to /home/jenkins/jenkins-slave/workspace/_box_maven-resolver_MRESOLVER-33/m/maven-resolver-demos/maven-resolver-demo-maven-plugin/target/local-repo/org/apache/maven/resolver/maven-resolver-connector-basic/1.4.0-SNAPSHOT/maven-resolver-connector-basic-1.4.0-SNAPSHOT.jar
[INFO] Installing /home/jenkins/jenkins-slave/workspace/_box_maven-resolver_MRESOLVER-33/m/maven-resolver-transport-classpath/pom.xml to /home/jenkins/jenkins-slave/workspace/_box_maven-resolver_MRESOLVER-33/m/maven-resolver-demos/maven-resolver-demo-maven-plugin/target/local-repo/org/apache/maven/resolver/maven-resolver-transport-classpath/1.4.0-SNAPSHOT/maven-resolver-transport-classpath-1.4.0-SNAPSHOT.pom
[INFO] Installing /home/jenkins/jenkins-slave/workspace/_box_maven-resolver_MRESOLVER-33/m/maven-resolver-transport-classpath/target/maven-resolver-transport-classpath-1.4.0-SNAPSHOT.jar to /home/jenkins/jenkins-slave/workspace/_box_maven-resolver_MRESOLVER-33/m/maven-resolver-demos/maven-resolver-demo-maven-plugin/target/local-repo/org/apache/maven/resolver/maven-resolver-transport-classpath/1.4.0-SNAPSHOT/maven-resolver-transport-classpath-1.4.0-SNAPSHOT.jar
[INFO] Installing /home/jenkins/jenkins-slave/workspace/_box_maven-resolver_MRESOLVER-33/m/maven-resolver-transport-file/pom.xml to /home/jenkins/jenkins-slave/workspace/_box_maven-resolver_MRESOLVER-33/m/maven-resolver-demos/maven-resolver-demo-maven-plugin/target/local-repo/org/apache/maven/resolver/maven-resolver-transport-file/1.4.0-SNAPSHOT/maven-resolver-transport-file-1.4.0-SNAPSHOT.pom
[INFO] Installing /home/jenkins/jenkins-slave/workspace/_box_maven-resolver_MRESOLVER-33/m/maven-resolver-transport-file/target/maven-resolver-transport-file-1.4.0-SNAPSHOT.jar to /home/jenkins/jenkins-slave/workspace/_box_maven-resolver_MRESOLVER-33/m/maven-resolver-demos/maven-resolver-demo-maven-plugin/target/local-repo/org/apache/maven/resolver/maven-resolver-transport-file/1.4.0-SNAPSHOT/maven-resolver-transport-file-1.4.0-SNAPSHOT.jar
[INFO] Installing /home/jenkins/jenkins-slave/workspace/_box_maven-resolver_MRESOLVER-33/m/maven-resolver-transport-http/pom.xml to /home/jenkins/jenkins-slave/workspace/_box_maven-resolver_MRESOLVER-33/m/maven-resolver-demos/maven-resolver-demo-maven-plugin/target/local-repo/org/apache/maven/resolver/maven-resolver-transport-http/1.4.0-SNAPSHOT/maven-resolver-transport-http-1.4.0-SNAPSHOT.pom
[INFO] Installing /home/jenkins/jenkins-slave/workspace/_box_maven-resolver_MRESOLVER-33/m/maven-resolver-transport-http/target/maven-resolver-transport-http-1.4.0-SNAPSHOT.jar to /home/jenkins/jenkins-slave/workspace/_box_maven-resolver_MRESOLVER-33/m/maven-resolver-demos/maven-resolver-demo-maven-plugin/target/local-repo/org/apache/maven/resolver/maven-resolver-transport-http/1.4.0-SNAPSHOT/maven-resolver-transport-http-1.4.0-SNAPSHOT.jar
[INFO] Installing /home/jenkins/jenkins-slave/workspace/_box_maven-resolver_MRESOLVER-33/m/maven-resolver-transport-wagon/pom.xml to /home/jenkins/jenkins-slave/workspace/_box_maven-resolver_MRESOLVER-33/m/maven-resolver-demos/maven-resolver-demo-maven-plugin/target/local-repo/org/apache/maven/resolver/maven-resolver-transport-wagon/1.4.0-SNAPSHOT/maven-resolver-transport-wagon-1.4.0-SNAPSHOT.pom
[INFO] Installing /home/jenkins/jenkins-slave/workspace/_box_maven-resolver_MRESOLVER-33/m/maven-resolver-transport-wagon/target/maven-resolver-transport-wagon-1.4.0-SNAPSHOT.jar to /home/jenkins/jenkins-slave/workspace/_box_maven-resolver_MRESOLVER-33/m/maven-resolver-demos/maven-resolver-demo-maven-plugin/target/local-repo/org/apache/maven/resolver/maven-resolver-transport-wagon/1.4.0-SNAPSHOT/maven-resolver-transport-wagon-1.4.0-SNAPSHOT.jar
[INFO] Installing /home/jenkins/jenkins-slave/workspace/_box_maven-resolver_MRESOLVER-33/m/maven-resolver-demos/pom.xml to /home/jenkins/jenkins-slave/workspace/_box_maven-resolver_MRESOLVER-33/m/maven-resolver-demos/maven-resolver-demo-maven-plugin/target/local-repo/org/apache/maven/resolver/maven-resolver-demos/1.4.0-SNAPSHOT/maven-resolver-demos-1.4.0-SNAPSHOT.pom
[INFO] Installing /home/jenkins/jenkins-slave/workspace/_box_maven-resolver_MRESOLVER-33/m/maven-resolver-demos/target/maven-resolver-demos-1.4.0-SNAPSHOT-site.xml to /home/jenkins/jenkins-slave/workspace/_box_maven-resolver_MRESOLVER-33/m/maven-resolver-demos/maven-resolver-demo-maven-plugin/target/local-repo/org/apache/maven/resolver/maven-resolver-demos/1.4.0-SNAPSHOT/maven-resolver-demos-1.4.0-SNAPSHOT-site.xml
[INFO] Installing /home/jenkins/jenkins-slave/workspace/_box_maven-resolver_MRESOLVER-33/m/maven-resolver-demos/maven-resolver-demo-snippets/pom.xml to /home/jenkins/jenkins-slave/workspace/_box_maven-resolver_MRESOLVER-33/m/maven-resolver-demos/maven-resolver-demo-maven-plugin/target/local-repo/org/apache/maven/resolver/maven-resolver-demo-snippets/1.4.0-SNAPSHOT/maven-resolver-demo-snippets-1.4.0-SNAPSHOT.pom
[INFO] Installing /home/jenkins/jenkins-slave/workspace/_box_maven-resolver_MRESOLVER-33/m/maven-resolver-demos/maven-resolver-demo-snippets/target/maven-resolver-demo-snippets-1.4.0-SNAPSHOT.jar to /home/jenkins/jenkins-slave/workspace/_box_maven-resolver_MRESOLVER-33/m/maven-resolver-demos/maven-resolver-demo-maven-plugin/target/local-repo/org/apache/maven/resolver/maven-resolver-demo-snippets/1.4.0-SNAPSHOT/maven-resolver-demo-snippets-1.4.0-SNAPSHOT.jar
[INFO] Installing /home/jenkins/jenkins-slave/workspace/_box_maven-resolver_MRESOLVER-33/m/maven-resolver-demos/maven-resolver-demo-maven-plugin/pom.xml to /home/jenkins/jenkins-slave/workspace/_box_maven-resolver_MRESOLVER-33/m/maven-resolver-demos/maven-resolver-demo-maven-plugin/target/local-repo/org/apache/maven/resolver/maven-resolver-demo-maven-plugin/1.4.0-SNAPSHOT/maven-resolver-demo-maven-plugin-1.4.0-SNAPSHOT.pom
[INFO] Installing /home/jenkins/jenkins-slave/workspace/_box_maven-resolver_MRESOLVER-33/m/maven-resolver-demos/maven-resolver-demo-maven-plugin/target/maven-resolver-demo-maven-plugin-1.4.0-SNAPSHOT.jar to /home/jenkins/jenkins-slave/workspace/_box_maven-resolver_MRESOLVER-33/m/maven-resolver-demos/maven-resolver-demo-maven-plugin/target/local-repo/org/apache/maven/resolver/maven-resolver-demo-maven-plugin/1.4.0-SNAPSHOT/maven-resolver-demo-maven-plugin-1.4.0-SNAPSHOT.jar
[INFO]
[INFO] --- maven-invoker-plugin:3.0.1:run (integration-test) @ maven-resolver-demo-maven-plugin ---
[INFO] Running Setup Jobs
[INFO] Building: resolve-artifact/pom.xml
[INFO]           resolve-artifact/pom.xml ......................... SUCCESS (4.5 s)
[INFO] -------------------------------------------------
[INFO] Build Summary:
[INFO]   Passed: 1, Failed: 0, Errors: 0, Skipped: 0
[INFO] -------------------------------------------------
[INFO]
[INFO] --- maven-checkstyle-plugin:3.0.0:check (checkstyle-check) @ maven-resolver-demo-maven-plugin ---
[INFO] ------------------------------------------------------------------------
[INFO] Reactor Summary for Maven Artifact Resolver 1.4.0-SNAPSHOT:
[INFO]
[INFO] Maven Artifact Resolver ............................ SUCCESS [ 16.343 s]
[INFO] Maven Artifact Resolver API ........................ SUCCESS [ 13.892 s]
[INFO] Maven Artifact Resolver SPI ........................ SUCCESS [  2.368 s]
[INFO] Maven Artifact Resolver Test Utilities ............. SUCCESS [  2.704 s]
[INFO] Maven Artifact Resolver Utilities .................. SUCCESS [  6.347 s]
[INFO] Maven Artifact Resolver Implementation ............. SUCCESS [  9.563 s]
[INFO] Maven Artifact Resolver Connector Basic ............ SUCCESS [  7.738 s]
[INFO] Maven Artifact Resolver Transport Classpath ........ SUCCESS [  2.159 s]
[INFO] Maven Artifact Resolver Transport File ............. SUCCESS [  2.235 s]
[INFO] Maven Artifact Resolver Transport HTTP ............. SUCCESS [  7.367 s]
[INFO] Maven Artifact Resolver Transport Wagon ............ SUCCESS [  4.412 s]
[INFO] Maven Artifact Resolver Demos ...................... SUCCESS [  0.469 s]
[INFO] Maven Artifact Resolver Demo Snippets .............. SUCCESS [  1.868 s]
[INFO] Maven Artifact Resolver Demo Maven Plugin .......... SUCCESS [  7.637 s]
[INFO] ------------------------------------------------------------------------
[INFO] BUILD SUCCESS
[INFO] ------------------------------------------------------------------------
[INFO] Total time:  01:26 min
[INFO] Finished at: 2020-01-16T05:04:15Z
[INFO] ------------------------------------------------------------------------
[INFO] [jenkins-event-spy] Generated /home/jenkins/jenkins-slave/workspace/_box_maven-resolver_MRESOLVER-33@tmp/withMavenc33f4be9/maven-spy-20200116-050248-3811121825580193930770.log
[Pipeline] }
[Pipeline] // dir
[Pipeline] }
[withMaven] invokerPublisher - Archive invoker results for Maven artifact MavenArtifact{org.apache.maven.resolver:maven-resolver-demo-maven-plugin:maven-plugin:1.4.0-SNAPSHOT(version: 1.4.0-SNAPSHOT, snapshot:false) } generated by PluginInvocation{org.apache.maven.plugins:maven-invoker-plugin:3.0.1@run  integration-test}: m/maven-resolver-demos/maven-resolver-demo-maven-plugin/target/invoker-reports/*.xml
[withMaven] junitPublisher - Archive test results for Maven artifact org.apache.maven.resolver:maven-resolver-api:jar:1.4.0-SNAPSHOT generated by maven-surefire-plugin:test (default-test): m/maven-resolver-api/target/surefire-reports/*.xml
[withMaven] junitPublisher - Archive test results for Maven artifact org.apache.maven.resolver:maven-resolver-spi:jar:1.4.0-SNAPSHOT generated by maven-surefire-plugin:test (default-test): m/maven-resolver-spi/target/surefire-reports/*.xml
[withMaven] junitPublisher - Archive test results for Maven artifact org.apache.maven.resolver:maven-resolver-test-util:jar:1.4.0-SNAPSHOT generated by maven-surefire-plugin:test (default-test): m/maven-resolver-test-util/target/surefire-reports/*.xml
[withMaven] junitPublisher - Archive test results for Maven artifact org.apache.maven.resolver:maven-resolver-util:jar:1.4.0-SNAPSHOT generated by maven-surefire-plugin:test (default-test): m/maven-resolver-util/target/surefire-reports/*.xml
[withMaven] junitPublisher - Archive test results for Maven artifact org.apache.maven.resolver:maven-resolver-impl:jar:1.4.0-SNAPSHOT generated by maven-surefire-plugin:test (default-test): m/maven-resolver-impl/target/surefire-reports/*.xml
[withMaven] junitPublisher - Archive test results for Maven artifact org.apache.maven.resolver:maven-resolver-connector-basic:jar:1.4.0-SNAPSHOT generated by maven-surefire-plugin:test (default-test): m/maven-resolver-connector-basic/target/surefire-reports/*.xml
[withMaven] junitPublisher - Archive test results for Maven artifact org.apache.maven.resolver:maven-resolver-transport-classpath:jar:1.4.0-SNAPSHOT generated by maven-surefire-plugin:test (default-test): m/maven-resolver-transport-classpath/target/surefire-reports/*.xml
[withMaven] junitPublisher - Archive test results for Maven artifact org.apache.maven.resolver:maven-resolver-transport-file:jar:1.4.0-SNAPSHOT generated by maven-surefire-plugin:test (default-test): m/maven-resolver-transport-file/target/surefire-reports/*.xml
[withMaven] junitPublisher - Archive test results for Maven artifact org.apache.maven.resolver:maven-resolver-transport-http:jar:1.4.0-SNAPSHOT generated by maven-surefire-plugin:test (default-test): m/maven-resolver-transport-http/target/surefire-reports/*.xml
[withMaven] junitPublisher - Archive test results for Maven artifact org.apache.maven.resolver:maven-resolver-transport-wagon:jar:1.4.0-SNAPSHOT generated by maven-surefire-plugin:test (default-test): m/maven-resolver-transport-wagon/target/surefire-reports/*.xml
[withMaven] junitPublisher - Archive test results for Maven artifact org.apache.maven.resolver:maven-resolver-demo-snippets:jar:1.4.0-SNAPSHOT generated by maven-surefire-plugin:test (default-test): m/maven-resolver-demos/maven-resolver-demo-snippets/target/surefire-reports/*.xml
[withMaven] junitPublisher - Archive test results for Maven artifact org.apache.maven.resolver:maven-resolver-demo-maven-plugin:maven-plugin:1.4.0-SNAPSHOT generated by maven-surefire-plugin:test (default-test): m/maven-resolver-demos/maven-resolver-demo-maven-plugin/target/surefire-reports/*.xml
Recording test results
[withMaven] Publishers: Pipeline Graph Publisher: 11 ms, Invoker Publisher: 1298 ms, Junit Publisher: 48159 ms, Concordion Publisher: 1 ms, Dependencies Fingerprint Publisher: 9249 ms
[Pipeline] // withMaven
[Pipeline] cleanWs
[WS-CLEANUP] Deleting project workspace...
[WS-CLEANUP] Deferred wipeout is used...
[WS-CLEANUP] done
[Pipeline] }
[Pipeline] // stage
[Pipeline] }
[Pipeline] // node
[Pipeline] }
Aborted by slachiewicz
[Pipeline] // node
[Pipeline] // node
[Pipeline] // node
[Pipeline] // node
[Pipeline] // node
[Pipeline] }
Failed in branch windows-jdk7
[Pipeline] }
Failed in branch windows-jdk8
[Pipeline] }
Failed in branch windows-jdk11
[Pipeline] }
Failed in branch windows-jdk13
[Pipeline] }
Failed in branch windows-jdk14
[Pipeline] // parallel
[Pipeline] echo
[FAILURE-002] FlowInterruptedException org.jenkinsci.plugins.workflow.steps.FlowInterruptedException
[Pipeline] stage
[Pipeline] { (Notifications)
[Pipeline] echo
Build result: FAILURE
[Pipeline] jiraIssueSelector
[Pipeline] echo
The authors of changes [slachiewicz].
[Pipeline] echo
Sending email ...
[Pipeline] emailext
Reply | Threaded
Open this post in threaded view
|

Build succeeded in Jenkins: Maven TLP » maven-resolver » MRESOLVER-33 #23

Apache Jenkins Server-2
See https://builds.apache.org/job/maven-box/job/maven-resolver/job/MRESOLVER-33/23/

Changes:

* H30 is having issues
* H23 has issues.
* GitHub emails should not trigger notifier which otherwise breaks the
* Revert "GitHub emails should not trigger notifier which otherwise breaks
* H40 is unstable
* GitHub emails should not trigger notifier which otherwise breaks the
* send email if authors exist
* fixed Scripts not permitted to use staticMethod
* H24 in unstable

All tests passed