Build failed in Jenkins: Maven TLP » maven-release » master #56

classic Classic list List threaded Threaded
4 messages Options
Reply | Threaded
Open this post in threaded view
|

Build failed in Jenkins: Maven TLP » maven-release » master #56

Apache Jenkins Server-2
See https://builds.apache.org/job/maven-box/job/maven-release/job/master/56/

No changes.

All tests passed

Build log:
[...truncated 7.46 MB...]
[windows-jdk10-m3.5.x_build] [INFO] Exclude: .repository/**
[windows-jdk10-m3.5.x_build] [INFO] Exclude: .maven/spy.log
[windows-jdk10-m3.5.x_build] [INFO] Exclude: dependency-reduced-pom.xml
[windows-jdk10-m3.5.x_build] [INFO] Exclude: .java-version
[windows-jdk10-m3.5.x_build] [INFO] 4 resources included (use -debug for more details)
[windows-jdk10-m3.5.x_build] [INFO] Rat check: Summary over all files. Unapproved: 0, unknown: 0, generated: 0, approved: 4 licenses.
[windows-jdk10-m3.5.x_build] [INFO]
[windows-jdk10-m3.5.x_build] [INFO] --- maven-remote-resources-plugin:1.5:process (process-resource-bundles) @ maven-release-oddeven-policy ---
[windows-jdk10-m3.5.x_build] [INFO]
[windows-jdk10-m3.5.x_build] [INFO] --- maven-resources-plugin:3.1.0:resources (default-resources) @ maven-release-oddeven-policy ---
[windows-jdk10-m3.5.x_build] [INFO] Using 'UTF-8' encoding to copy filtered resources.
[windows-jdk10-m3.5.x_build] [INFO] skip non existing resourceDirectory F:\jenkins\jenkins-slave\workspace\en-box_maven-release_master-OCKGULQBCZ67VBKJ7HF6E7KZUCKX7ZC6FX64GH66OHP7A4VAQBIQ\windows-jdk10-m3.5.x_build\maven-release-policies\maven-release-oddeven-policy\src\main\resources
[windows-jdk10-m3.5.x_build] [INFO] Copying 3 resources
[windows-jdk10-m3.5.x_build] [INFO]
[windows-jdk10-m3.5.x_build] [INFO] --- maven-compiler-plugin:3.7.0:compile (default-compile) @ maven-release-oddeven-policy ---
[windows-jdk10-m3.5.x_build] [INFO] Changes detected - recompiling the module!
[windows-jdk10-m3.5.x_build] [INFO] Compiling 2 source files to F:\jenkins\jenkins-slave\workspace\en-box_maven-release_master-OCKGULQBCZ67VBKJ7HF6E7KZUCKX7ZC6FX64GH66OHP7A4VAQBIQ\windows-jdk10-m3.5.x_build\maven-release-policies\maven-release-oddeven-policy\target\classes
[windows-jdk10-m3.5.x_build] [INFO]
[windows-jdk10-m3.5.x_build] [INFO] --- plexus-component-metadata:1.7.1:generate-metadata (process-classes) @ maven-release-oddeven-policy ---
[windows-jdk10-m3.5.x_build] [INFO] Discovered 1 component descriptors(s)
[windows-jdk10-m3.5.x_build] [INFO]
[windows-jdk10-m3.5.x_build] [INFO] --- maven-resources-plugin:3.1.0:testResources (default-testResources) @ maven-release-oddeven-policy ---
[windows-jdk10-m3.5.x_build] [INFO] Using 'UTF-8' encoding to copy filtered resources.
[windows-jdk10-m3.5.x_build] [INFO] skip non existing resourceDirectory F:\jenkins\jenkins-slave\workspace\en-box_maven-release_master-OCKGULQBCZ67VBKJ7HF6E7KZUCKX7ZC6FX64GH66OHP7A4VAQBIQ\windows-jdk10-m3.5.x_build\maven-release-policies\maven-release-oddeven-policy\src\test\resources
[windows-jdk10-m3.5.x_build] [INFO] Copying 3 resources
[windows-jdk10-m3.5.x_build] [INFO]
[windows-jdk10-m3.5.x_build] [INFO] --- maven-compiler-plugin:3.7.0:testCompile (default-testCompile) @ maven-release-oddeven-policy ---
[windows-jdk10-m3.5.x_build] [INFO] Changes detected - recompiling the module!
[windows-jdk10-m3.5.x_build] [INFO] Compiling 1 source file to F:\jenkins\jenkins-slave\workspace\en-box_maven-release_master-OCKGULQBCZ67VBKJ7HF6E7KZUCKX7ZC6FX64GH66OHP7A4VAQBIQ\windows-jdk10-m3.5.x_build\maven-release-policies\maven-release-oddeven-policy\target\test-classes
[windows-jdk10-m3.5.x_build] [INFO]
[windows-jdk10-m3.5.x_build] [INFO] --- maven-surefire-plugin:2.22.0:test (default-test) @ maven-release-oddeven-policy ---
[windows-jdk10-m3.5.x_build] [INFO]
[windows-jdk10-m3.5.x_build] [INFO] -------------------------------------------------------
[windows-jdk10-m3.5.x_build] [INFO]  T E S T S
[windows-jdk10-m3.5.x_build] [INFO] -------------------------------------------------------
[windows-jdk10-m3.5.x_build] [INFO] Running org.apache.maven.shared.release.policy.oddeven.OddEvenVersionPolicyTestCase
[windows-jdk10-m3.5.x_build] [INFO] Tests run: 3, Failures: 0, Errors: 0, Skipped: 0, Time elapsed: 0.162 s - in org.apache.maven.shared.release.policy.oddeven.OddEvenVersionPolicyTestCase
[windows-jdk10-m3.5.x_build] [INFO]
[windows-jdk10-m3.5.x_build] [INFO] Results:
[windows-jdk10-m3.5.x_build] [INFO]
[windows-jdk10-m3.5.x_build] [INFO] Tests run: 3, Failures: 0, Errors: 0, Skipped: 0
[windows-jdk10-m3.5.x_build] [INFO]
[windows-jdk10-m3.5.x_build] [INFO]
[windows-jdk10-m3.5.x_build] [INFO] --- maven-jar-plugin:3.1.0:jar (default-jar) @ maven-release-oddeven-policy ---
[windows-jdk10-m3.5.x_build] [INFO] Building jar: F:\jenkins\jenkins-slave\workspace\en-box_maven-release_master-OCKGULQBCZ67VBKJ7HF6E7KZUCKX7ZC6FX64GH66OHP7A4VAQBIQ\windows-jdk10-m3.5.x_build\maven-release-policies\maven-release-oddeven-policy\target\maven-release-oddeven-policy-3.0.0-SNAPSHOT.jar
[windows-jdk10-m3.5.x_build] [INFO]
[windows-jdk10-m3.5.x_build] [INFO] --- maven-site-plugin:3.7.1:attach-descriptor (attach-descriptor) @ maven-release-oddeven-policy ---
[windows-jdk10-m3.5.x_build] [INFO] Skipping because packaging 'jar' is not pom.
[windows-jdk10-m3.5.x_build] [INFO]
[windows-jdk10-m3.5.x_build] [INFO] --- maven-checkstyle-plugin:3.0.0:check (checkstyle-check) @ maven-release-oddeven-policy ---
[windows-jdk10-m3.5.x_build] [INFO]
[windows-jdk10-m3.5.x_build] [INFO] ------------------------------------------------------------------------
[windows-jdk10-m3.5.x_build] [INFO] Building Maven Release SemVer Policy 3.0.0-SNAPSHOT
[windows-jdk10-m3.5.x_build] [INFO] ------------------------------------------------------------------------
[windows-jdk10-m3.5.x_build] [INFO] Downloading from central: https://repo.maven.apache.org/maven2/org/semver/api/0.9.33/api-0.9.33.pom
[windows-jdk10-m3.5.x_build] [INFO] Downloaded from central: https://repo.maven.apache.org/maven2/org/semver/api/0.9.33/api-0.9.33.pom (2.8 kB at 157 kB/s)
[windows-jdk10-m3.5.x_build] [INFO] Downloading from central: https://repo.maven.apache.org/maven2/org/semver/parent/0.9.33/parent-0.9.33.pom
[windows-jdk10-m3.5.x_build] [INFO] Downloaded from central: https://repo.maven.apache.org/maven2/org/semver/parent/0.9.33/parent-0.9.33.pom (1.3 kB at 90 kB/s)
[windows-jdk10-m3.5.x_build] [INFO] Downloading from central: https://repo.maven.apache.org/maven2/com/github/jeluard/oss-parent/9/oss-parent-9.pom
[windows-jdk10-m3.5.x_build] [INFO] Downloaded from central: https://repo.maven.apache.org/maven2/com/github/jeluard/oss-parent/9/oss-parent-9.pom (12 kB at 623 kB/s)
[windows-jdk10-m3.5.x_build] [INFO] Downloading from central: https://repo.maven.apache.org/maven2/com/google/code/findbugs/jsr305/2.0.0/jsr305-2.0.0.pom
[windows-jdk10-m3.5.x_build] [INFO] Downloaded from central: https://repo.maven.apache.org/maven2/com/google/code/findbugs/jsr305/2.0.0/jsr305-2.0.0.pom (965 B at 88 kB/s)
[windows-jdk10-m3.5.x_build] [INFO] Downloading from central: https://repo.maven.apache.org/maven2/org/ow2/asm/asm/5.0.3/asm-5.0.3.pom
[windows-jdk10-m3.5.x_build] [INFO] Downloaded from central: https://repo.maven.apache.org/maven2/org/ow2/asm/asm/5.0.3/asm-5.0.3.pom (1.9 kB at 161 kB/s)
[windows-jdk10-m3.5.x_build] [INFO] Downloading from central: https://repo.maven.apache.org/maven2/org/ow2/asm/asm-parent/5.0.3/asm-parent-5.0.3.pom
[windows-jdk10-m3.5.x_build] [INFO] Downloaded from central: https://repo.maven.apache.org/maven2/org/ow2/asm/asm-parent/5.0.3/asm-parent-5.0.3.pom (5.5 kB at 65 kB/s)
[windows-jdk10-m3.5.x_build] [INFO] Downloading from central: https://repo.maven.apache.org/maven2/org/ow2/asm/asm-commons/5.0.3/asm-commons-5.0.3.pom
[windows-jdk10-m3.5.x_build] [INFO] Downloaded from central: https://repo.maven.apache.org/maven2/org/ow2/asm/asm-commons/5.0.3/asm-commons-5.0.3.pom (2.1 kB at 140 kB/s)
[windows-jdk10-m3.5.x_build] [INFO] Downloading from central: https://repo.maven.apache.org/maven2/org/ow2/asm/asm-tree/5.0.3/asm-tree-5.0.3.pom
[windows-jdk10-m3.5.x_build] [INFO] Downloaded from central: https://repo.maven.apache.org/maven2/org/ow2/asm/asm-tree/5.0.3/asm-tree-5.0.3.pom (2.1 kB at 174 kB/s)
[windows-jdk10-m3.5.x_build] [INFO] Downloading from central: https://repo.maven.apache.org/maven2/commons-lang/commons-lang/1.0/commons-lang-1.0.pom
[windows-jdk10-m3.5.x_build] [INFO] Downloaded from central: https://repo.maven.apache.org/maven2/commons-lang/commons-lang/1.0/commons-lang-1.0.pom (2.5 kB at 223 kB/s)
[windows-jdk10-m3.5.x_build] [INFO] Downloading from central: https://repo.maven.apache.org/maven2/de/tototec/de.tototec.cmdoption/0.2.0/de.tototec.cmdoption-0.2.0.pom
[windows-jdk10-m3.5.x_build] [INFO] Downloaded from central: https://repo.maven.apache.org/maven2/de/tototec/de.tototec.cmdoption/0.2.0/de.tototec.cmdoption-0.2.0.pom (956 B at 68 kB/s)
[windows-jdk10-m3.5.x_build] [INFO] Downloading from central: https://repo.maven.apache.org/maven2/org/semver/api/0.9.33/api-0.9.33.jar
[windows-jdk10-m3.5.x_build] [INFO] Downloading from central: https://repo.maven.apache.org/maven2/com/google/code/findbugs/jsr305/2.0.0/jsr305-2.0.0.jar
[windows-jdk10-m3.5.x_build] [INFO] Downloading from central: https://repo.maven.apache.org/maven2/org/ow2/asm/asm-tree/5.0.3/asm-tree-5.0.3.jar
[windows-jdk10-m3.5.x_build] [INFO] Downloading from central: https://repo.maven.apache.org/maven2/org/ow2/asm/asm-commons/5.0.3/asm-commons-5.0.3.jar
[windows-jdk10-m3.5.x_build] [INFO] Downloading from central: https://repo.maven.apache.org/maven2/org/ow2/asm/asm/5.0.3/asm-5.0.3.jar
[windows-jdk10-m3.5.x_build] [INFO] Downloaded from central: https://repo.maven.apache.org/maven2/org/ow2/asm/asm/5.0.3/asm-5.0.3.jar (53 kB at 1.1 MB/s)
[windows-jdk10-m3.5.x_build] [INFO] Downloading from central: https://repo.maven.apache.org/maven2/commons-lang/commons-lang/1.0/commons-lang-1.0.jar
[windows-jdk10-m3.5.x_build] [INFO] Downloaded from central: https://repo.maven.apache.org/maven2/org/semver/api/0.9.33/api-0.9.33.jar (64 kB at 1.1 MB/s)
[windows-jdk10-m3.5.x_build] [INFO] Downloading from central: https://repo.maven.apache.org/maven2/de/tototec/de.tototec.cmdoption/0.2.0/de.tototec.cmdoption-0.2.0.jar
[windows-jdk10-m3.5.x_build] [INFO] Downloaded from central: https://repo.maven.apache.org/maven2/commons-lang/commons-lang/1.0/commons-lang-1.0.jar (64 kB at 297 kB/s)
[windows-jdk10-m3.5.x_build] [INFO] Downloaded from central: https://repo.maven.apache.org/maven2/org/ow2/asm/asm-tree/5.0.3/asm-tree-5.0.3.jar (29 kB at 128 kB/s)
[windows-jdk10-m3.5.x_build] [INFO] Downloaded from central: https://repo.maven.apache.org/maven2/org/ow2/asm/asm-commons/5.0.3/asm-commons-5.0.3.jar (42 kB at 89 kB/s)
[windows-jdk10-m3.5.x_build] [INFO] Downloaded from central: https://repo.maven.apache.org/maven2/de/tototec/de.tototec.cmdoption/0.2.0/de.tototec.cmdoption-0.2.0.jar (42 kB at 79 kB/s)
[windows-jdk10-m3.5.x_build] [INFO] Downloaded from central: https://repo.maven.apache.org/maven2/com/google/code/findbugs/jsr305/2.0.0/jsr305-2.0.0.jar (32 kB at 59 kB/s)
[windows-jdk10-m3.5.x_build] [INFO]
[windows-jdk10-m3.5.x_build] [INFO] --- maven-clean-plugin:3.1.0:clean (default-clean) @ maven-release-semver-policy ---
[windows-jdk10-m3.5.x_build] [INFO]
[windows-jdk10-m3.5.x_build] [INFO] --- maven-enforcer-plugin:1.4.1:enforce (enforce-maven-version) @ maven-release-semver-policy ---
[windows-jdk10-m3.5.x_build] [INFO]
[windows-jdk10-m3.5.x_build] [INFO] --- maven-enforcer-plugin:1.4.1:enforce (enforce-bytecode-version) @ maven-release-semver-policy ---
[windows-jdk10-m3.5.x_build] [INFO]
[windows-jdk10-m3.5.x_build] [INFO] --- maven-enforcer-plugin:1.4.1:enforce (ban-known-bad-maven-versions) @ maven-release-semver-policy ---
[windows-jdk10-m3.5.x_build] [INFO]
[windows-jdk10-m3.5.x_build] [INFO] --- apache-rat-plugin:0.12:check (rat-check) @ maven-release-semver-policy ---
[windows-jdk10-m3.5.x_build] [INFO] Enabled default license matchers.
[windows-jdk10-m3.5.x_build] [INFO] Will parse SCM ignores for exclusions...
[windows-jdk10-m3.5.x_build] [INFO] Finished adding exclusions from SCM ignore files.
[windows-jdk10-m3.5.x_build] [INFO] 61 implicit excludes (use -debug for more details).
[windows-jdk10-m3.5.x_build] [INFO] Exclude: .repository
[windows-jdk10-m3.5.x_build] [INFO] Exclude: Jenkinsfile
[windows-jdk10-m3.5.x_build] [INFO] Exclude: .repository/**
[windows-jdk10-m3.5.x_build] [INFO] Exclude: .maven/spy.log
[windows-jdk10-m3.5.x_build] [INFO] Exclude: dependency-reduced-pom.xml
[windows-jdk10-m3.5.x_build] [INFO] Exclude: .java-version
[windows-jdk10-m3.5.x_build] [INFO] 3 resources included (use -debug for more details)
[windows-jdk10-m3.5.x_build] [INFO] Rat check: Summary over all files. Unapproved: 0, unknown: 0, generated: 0, approved: 3 licenses.
[windows-jdk10-m3.5.x_build] [INFO]
[windows-jdk10-m3.5.x_build] [INFO] --- maven-remote-resources-plugin:1.5:process (process-resource-bundles) @ maven-release-semver-policy ---
[windows-jdk10-m3.5.x_build] [INFO]
[windows-jdk10-m3.5.x_build] [INFO] --- maven-resources-plugin:3.1.0:resources (default-resources) @ maven-release-semver-policy ---
[windows-jdk10-m3.5.x_build] [INFO] Using 'UTF-8' encoding to copy filtered resources.
[windows-jdk10-m3.5.x_build] [INFO] skip non existing resourceDirectory F:\jenkins\jenkins-slave\workspace\en-box_maven-release_master-OCKGULQBCZ67VBKJ7HF6E7KZUCKX7ZC6FX64GH66OHP7A4VAQBIQ\windows-jdk10-m3.5.x_build\maven-release-policies\maven-release-semver-policy\src\main\resources
[windows-jdk10-m3.5.x_build] [INFO] Copying 3 resources
[windows-jdk10-m3.5.x_build] [INFO]
[windows-jdk10-m3.5.x_build] [INFO] --- maven-compiler-plugin:3.7.0:compile (default-compile) @ maven-release-semver-policy ---
[windows-jdk10-m3.5.x_build] [INFO] Changes detected - recompiling the module!
[windows-jdk10-m3.5.x_build] [INFO] Compiling 1 source file to F:\jenkins\jenkins-slave\workspace\en-box_maven-release_master-OCKGULQBCZ67VBKJ7HF6E7KZUCKX7ZC6FX64GH66OHP7A4VAQBIQ\windows-jdk10-m3.5.x_build\maven-release-policies\maven-release-semver-policy\target\classes
[windows-jdk10-m3.5.x_build] [INFO]
[windows-jdk10-m3.5.x_build] [INFO] --- plexus-component-metadata:1.7.1:generate-metadata (process-classes) @ maven-release-semver-policy ---
[windows-jdk10-m3.5.x_build] [INFO] Discovered 1 component descriptors(s)
[windows-jdk10-m3.5.x_build] [INFO]
[windows-jdk10-m3.5.x_build] [INFO] --- maven-resources-plugin:3.1.0:testResources (default-testResources) @ maven-release-semver-policy ---
[windows-jdk10-m3.5.x_build] [INFO] Using 'UTF-8' encoding to copy filtered resources.
[windows-jdk10-m3.5.x_build] [INFO] skip non existing resourceDirectory F:\jenkins\jenkins-slave\workspace\en-box_maven-release_master-OCKGULQBCZ67VBKJ7HF6E7KZUCKX7ZC6FX64GH66OHP7A4VAQBIQ\windows-jdk10-m3.5.x_build\maven-release-policies\maven-release-semver-policy\src\test\resources
[windows-jdk10-m3.5.x_build] [INFO] Copying 3 resources
[windows-jdk10-m3.5.x_build] [INFO]
[windows-jdk10-m3.5.x_build] [INFO] --- maven-compiler-plugin:3.7.0:testCompile (default-testCompile) @ maven-release-semver-policy ---
[windows-jdk10-m3.5.x_build] [INFO] Changes detected - recompiling the module!
[windows-jdk10-m3.5.x_build] [INFO] Compiling 1 source file to F:\jenkins\jenkins-slave\workspace\en-box_maven-release_master-OCKGULQBCZ67VBKJ7HF6E7KZUCKX7ZC6FX64GH66OHP7A4VAQBIQ\windows-jdk10-m3.5.x_build\maven-release-policies\maven-release-semver-policy\target\test-classes
[windows-jdk10-m3.5.x_build] [INFO]
[windows-jdk10-m3.5.x_build] [INFO] --- maven-surefire-plugin:2.22.0:test (default-test) @ maven-release-semver-policy ---
[windows-jdk10-m3.5.x_build] [INFO]
[windows-jdk10-m3.5.x_build] [INFO] -------------------------------------------------------
[windows-jdk10-m3.5.x_build] [INFO]  T E S T S
[windows-jdk10-m3.5.x_build] [INFO] -------------------------------------------------------
[windows-jdk10-m3.5.x_build] [INFO] Running org.apache.maven.shared.release.policy.semver.SemVerVersionPolicyTest
[windows-jdk10-m3.5.x_build] [INFO] Tests run: 2, Failures: 0, Errors: 0, Skipped: 0, Time elapsed: 0.149 s - in org.apache.maven.shared.release.policy.semver.SemVerVersionPolicyTest
[windows-jdk10-m3.5.x_build] [INFO]
[windows-jdk10-m3.5.x_build] [INFO] Results:
[windows-jdk10-m3.5.x_build] [INFO]
[windows-jdk10-m3.5.x_build] [INFO] Tests run: 2, Failures: 0, Errors: 0, Skipped: 0
[windows-jdk10-m3.5.x_build] [INFO]
[windows-jdk10-m3.5.x_build] [INFO]
[windows-jdk10-m3.5.x_build] [INFO] --- maven-jar-plugin:3.1.0:jar (default-jar) @ maven-release-semver-policy ---
[windows-jdk10-m3.5.x_build] [INFO] Building jar: F:\jenkins\jenkins-slave\workspace\en-box_maven-release_master-OCKGULQBCZ67VBKJ7HF6E7KZUCKX7ZC6FX64GH66OHP7A4VAQBIQ\windows-jdk10-m3.5.x_build\maven-release-policies\maven-release-semver-policy\target\maven-release-semver-policy-3.0.0-SNAPSHOT.jar
[windows-jdk10-m3.5.x_build] [INFO]
[windows-jdk10-m3.5.x_build] [INFO] --- maven-site-plugin:3.7.1:attach-descriptor (attach-descriptor) @ maven-release-semver-policy ---
[windows-jdk10-m3.5.x_build] [INFO] Skipping because packaging 'jar' is not pom.
[windows-jdk10-m3.5.x_build] [INFO]
[windows-jdk10-m3.5.x_build] [INFO] --- maven-checkstyle-plugin:3.0.0:check (checkstyle-check) @ maven-release-semver-policy ---
[windows-jdk10-m3.5.x_build] [INFO] ------------------------------------------------------------------------
[windows-jdk10-m3.5.x_build] [INFO] Reactor Summary:
[windows-jdk10-m3.5.x_build] [INFO]
[windows-jdk10-m3.5.x_build] [INFO] Maven Release ...................................... SUCCESS [ 46.458 s]
[windows-jdk10-m3.5.x_build] [INFO] Maven Release APIs ................................. SUCCESS [ 12.517 s]
[windows-jdk10-m3.5.x_build] [INFO] Maven Release Manager .............................. SUCCESS [02:43 min]
[windows-jdk10-m3.5.x_build] [INFO] Maven Release Plugin ............................... SUCCESS [07:46 min]
[windows-jdk10-m3.5.x_build] [INFO] Maven Release Odd-Even Policy ...................... SUCCESS [  3.326 s]
[windows-jdk10-m3.5.x_build] [INFO] Maven Release SemVer Policy ........................ SUCCESS [  4.547 s]
[windows-jdk10-m3.5.x_build] [INFO] ------------------------------------------------------------------------
[windows-jdk10-m3.5.x_build] [INFO] BUILD SUCCESS
[windows-jdk10-m3.5.x_build] [INFO] ------------------------------------------------------------------------
[windows-jdk10-m3.5.x_build] [INFO] Total time: 11:38 min
[windows-jdk10-m3.5.x_build] [INFO] Finished at: 2018-09-11T11:16:38-07:00
[windows-jdk10-m3.5.x_build] [INFO] Final Memory: 55M/184M
[windows-jdk10-m3.5.x_build] [INFO] ------------------------------------------------------------------------
[windows-jdk10-m3.5.x_build] [INFO] [jenkins-event-spy] Generated F:\jenkins\jenkins-slave\workspace\en-box_maven-release_master-OCKGULQBCZ67VBKJ7HF6E7KZUCKX7ZC6FX64GH66OHP7A4VAQBIQ@tmp\withMavendcc8ee59\maven-spy-20180911-110459-6678376535674217312186.log
[Pipeline] [windows-jdk10-m3.5.x_build] }
[Pipeline] [windows-jdk10-m3.5.x_build] // dir
[Pipeline] [windows-jdk10-m3.5.x_build] }
[windows-jdk10-m3.5.x_build] [withMaven] artifactsPublisher - Archive artifact windows-jdk10-m3.5.x_build\pom.xml under org\apache\maven\release\maven-release\3.0.0-SNAPSHOT\maven-release-3.0.0-SNAPSHOT.pom
[windows-jdk10-m3.5.x_build] [withMaven] artifactsPublisher - Archive artifact windows-jdk10-m3.5.x_build\target\maven-release-3.0.0-SNAPSHOT-site.xml under org\apache\maven\release\maven-release\3.0.0-SNAPSHOT\maven-release-3.0.0-SNAPSHOT-site.xml
[windows-jdk10-m3.5.x_build] [withMaven] artifactsPublisher - Archive artifact windows-jdk10-m3.5.x_build\maven-release-api\pom.xml under org\apache\maven\release\maven-release-api\3.0.0-SNAPSHOT\maven-release-api-3.0.0-SNAPSHOT.pom
[windows-jdk10-m3.5.x_build] [withMaven] artifactsPublisher - Archive artifact windows-jdk10-m3.5.x_build\maven-release-api\target\maven-release-api-3.0.0-SNAPSHOT.jar under org\apache\maven\release\maven-release-api\3.0.0-SNAPSHOT\maven-release-api-3.0.0-SNAPSHOT.jar
[windows-jdk10-m3.5.x_build] [withMaven] artifactsPublisher - Archive artifact windows-jdk10-m3.5.x_build\maven-release-manager\pom.xml under org\apache\maven\release\maven-release-manager\3.0.0-SNAPSHOT\maven-release-manager-3.0.0-SNAPSHOT.pom
[windows-jdk10-m3.5.x_build] [withMaven] artifactsPublisher - Archive artifact windows-jdk10-m3.5.x_build\maven-release-manager\target\maven-release-manager-3.0.0-SNAPSHOT.jar under org\apache\maven\release\maven-release-manager\3.0.0-SNAPSHOT\maven-release-manager-3.0.0-SNAPSHOT.jar
[windows-jdk10-m3.5.x_build] [withMaven] artifactsPublisher - Archive artifact windows-jdk10-m3.5.x_build\maven-release-plugin\pom.xml under org\apache\maven\plugins\maven-release-plugin\3.0.0-SNAPSHOT\maven-release-plugin-3.0.0-SNAPSHOT.pom
[windows-jdk10-m3.5.x_build] [withMaven] artifactsPublisher - Archive artifact windows-jdk10-m3.5.x_build\maven-release-plugin\target\maven-release-plugin-3.0.0-SNAPSHOT.jar under org\apache\maven\plugins\maven-release-plugin\3.0.0-SNAPSHOT\maven-release-plugin-3.0.0-SNAPSHOT.jar
[windows-jdk10-m3.5.x_build] [withMaven] artifactsPublisher - Archive artifact windows-jdk10-m3.5.x_build\maven-release-policies\maven-release-oddeven-policy\pom.xml under org\apache\maven\release\maven-release-oddeven-policy\3.0.0-SNAPSHOT\maven-release-oddeven-policy-3.0.0-SNAPSHOT.pom
[windows-jdk10-m3.5.x_build] [withMaven] artifactsPublisher - Archive artifact windows-jdk10-m3.5.x_build\maven-release-policies\maven-release-oddeven-policy\target\maven-release-oddeven-policy-3.0.0-SNAPSHOT.jar under org\apache\maven\release\maven-release-oddeven-policy\3.0.0-SNAPSHOT\maven-release-oddeven-policy-3.0.0-SNAPSHOT.jar
[windows-jdk10-m3.5.x_build] [withMaven] artifactsPublisher - Archive artifact windows-jdk10-m3.5.x_build\maven-release-policies\maven-release-semver-policy\pom.xml under org\apache\maven\release\maven-release-semver-policy\3.0.0-SNAPSHOT\maven-release-semver-policy-3.0.0-SNAPSHOT.pom
[windows-jdk10-m3.5.x_build] [withMaven] artifactsPublisher - Archive artifact windows-jdk10-m3.5.x_build\maven-release-policies\maven-release-semver-policy\target\maven-release-semver-policy-3.0.0-SNAPSHOT.jar under org\apache\maven\release\maven-release-semver-policy\3.0.0-SNAPSHOT\maven-release-semver-policy-3.0.0-SNAPSHOT.jar
[windows-jdk10-m3.5.x_build] [withMaven] invokerPublisher - Archive invoker results for Maven artifact MavenArtifact{org.apache.maven.plugins:maven-release-plugin::3.0.0-SNAPSHOT(version: 3.0.0-SNAPSHOT, snapshot:false) } generated by PluginInvocation{org.apache.maven.plugins:maven-invoker-plugin:3.0.1@run  integration-test-prepare}: windows-jdk10-m3.5.x_build\maven-release-plugin\target\invoker-reports\*.xml
[windows-jdk10-m3.5.x_build] performing MavenInvokerRecorder, reportsFilenamePattern:'**/windows-jdk10-m3.5.x_build\maven-release-plugin\target\invoker-reports/BUILD*.xml', invokerBuildDir:'**/windows-jdk10-m3.5.x_build\maven-release-plugin\target\it'
[windows-jdk10-m3.5.x_build] Found reports:[f:\jenkins\jenkins-slave\workspace\en-box_maven-release_master-OCKGULQBCZ67VBKJ7HF6E7KZUCKX7ZC6FX64GH66OHP7A4VAQBIQ\windows-jdk10-m3.5.x_build\maven-release-plugin\target\invoker-reports\BUILD-projects_update-versions_MRELEASE-555.xml, f:\jenkins\jenkins-slave\workspace\en-box_maven-release_master-OCKGULQBCZ67VBKJ7HF6E7KZUCKX7ZC6FX64GH66OHP7A4VAQBIQ\windows-jdk10-m3.5.x_build\maven-release-plugin\target\invoker-reports\BUILD-projects_update-versions_MRELEASE-611.xml, f:\jenkins\jenkins-slave\workspace\en-box_maven-release_master-OCKGULQBCZ67VBKJ7HF6E7KZUCKX7ZC6FX64GH66OHP7A4VAQBIQ\windows-jdk10-m3.5.x_build\maven-release-plugin\target\invoker-reports\BUILD-projects_update-versions_MRELEASE-783.xml, f:\jenkins\jenkins-slave\workspace\en-box_maven-release_master-OCKGULQBCZ67VBKJ7HF6E7KZUCKX7ZC6FX64GH66OHP7A4VAQBIQ\windows-jdk10-m3.5.x_build\maven-release-plugin\target\invoker-reports\BUILD-projects_update-versions_MRELEASE-976.xml]
[windows-jdk10-m3.5.x_build] Found logs:[f:\jenkins\jenkins-slave\workspace\en-box_maven-release_master-OCKGULQBCZ67VBKJ7HF6E7KZUCKX7ZC6FX64GH66OHP7A4VAQBIQ\windows-jdk10-m3.5.x_build\maven-release-plugin\target\it\projects\update-versions\MRELEASE-555\build.log, f:\jenkins\jenkins-slave\workspace\en-box_maven-release_master-OCKGULQBCZ67VBKJ7HF6E7KZUCKX7ZC6FX64GH66OHP7A4VAQBIQ\windows-jdk10-m3.5.x_build\maven-release-plugin\target\it\projects\update-versions\MRELEASE-611\build.log, f:\jenkins\jenkins-slave\workspace\en-box_maven-release_master-OCKGULQBCZ67VBKJ7HF6E7KZUCKX7ZC6FX64GH66OHP7A4VAQBIQ\windows-jdk10-m3.5.x_build\maven-release-plugin\target\it\projects\update-versions\MRELEASE-783\build.log, f:\jenkins\jenkins-slave\workspace\en-box_maven-release_master-OCKGULQBCZ67VBKJ7HF6E7KZUCKX7ZC6FX64GH66OHP7A4VAQBIQ\windows-jdk10-m3.5.x_build\maven-release-plugin\target\it\projects\update-versions\MRELEASE-976\build.log]
[windows-jdk10-m3.5.x_build] Finished parsing Maven Invoker results (found 4)
[windows-jdk10-m3.5.x_build] [withMaven] invokerPublisher - Archive invoker results for Maven artifact MavenArtifact{org.apache.maven.plugins:maven-release-plugin::3.0.0-SNAPSHOT(version: 3.0.0-SNAPSHOT, snapshot:false) } generated by PluginInvocation{org.apache.maven.plugins:maven-invoker-plugin:3.0.1@run  integration-test-prepare-with-pom}: windows-jdk10-m3.5.x_build\maven-release-plugin\target\invoker-reports\*.xml
[windows-jdk10-m3.5.x_build] performing MavenInvokerRecorder, reportsFilenamePattern:'**/windows-jdk10-m3.5.x_build\maven-release-plugin\target\invoker-reports/BUILD*.xml', invokerBuildDir:'**/windows-jdk10-m3.5.x_build\maven-release-plugin\target\it'
[windows-jdk10-m3.5.x_build] Found reports:[f:\jenkins\jenkins-slave\workspace\en-box_maven-release_master-OCKGULQBCZ67VBKJ7HF6E7KZUCKX7ZC6FX64GH66OHP7A4VAQBIQ\windows-jdk10-m3.5.x_build\maven-release-plugin\target\invoker-reports\BUILD-projects_update-versions_MRELEASE-555.xml, f:\jenkins\jenkins-slave\workspace\en-box_maven-release_master-OCKGULQBCZ67VBKJ7HF6E7KZUCKX7ZC6FX64GH66OHP7A4VAQBIQ\windows-jdk10-m3.5.x_build\maven-release-plugin\target\invoker-reports\BUILD-projects_update-versions_MRELEASE-611.xml, f:\jenkins\jenkins-slave\workspace\en-box_maven-release_master-OCKGULQBCZ67VBKJ7HF6E7KZUCKX7ZC6FX64GH66OHP7A4VAQBIQ\windows-jdk10-m3.5.x_build\maven-release-plugin\target\invoker-reports\BUILD-projects_update-versions_MRELEASE-783.xml, f:\jenkins\jenkins-slave\workspace\en-box_maven-release_master-OCKGULQBCZ67VBKJ7HF6E7KZUCKX7ZC6FX64GH66OHP7A4VAQBIQ\windows-jdk10-m3.5.x_build\maven-release-plugin\target\invoker-reports\BUILD-projects_update-versions_MRELEASE-976.xml]
[windows-jdk10-m3.5.x_build] Found logs:[f:\jenkins\jenkins-slave\workspace\en-box_maven-release_master-OCKGULQBCZ67VBKJ7HF6E7KZUCKX7ZC6FX64GH66OHP7A4VAQBIQ\windows-jdk10-m3.5.x_build\maven-release-plugin\target\it\projects\update-versions\MRELEASE-555\build.log, f:\jenkins\jenkins-slave\workspace\en-box_maven-release_master-OCKGULQBCZ67VBKJ7HF6E7KZUCKX7ZC6FX64GH66OHP7A4VAQBIQ\windows-jdk10-m3.5.x_build\maven-release-plugin\target\it\projects\update-versions\MRELEASE-611\build.log, f:\jenkins\jenkins-slave\workspace\en-box_maven-release_master-OCKGULQBCZ67VBKJ7HF6E7KZUCKX7ZC6FX64GH66OHP7A4VAQBIQ\windows-jdk10-m3.5.x_build\maven-release-plugin\target\it\projects\update-versions\MRELEASE-783\build.log, f:\jenkins\jenkins-slave\workspace\en-box_maven-release_master-OCKGULQBCZ67VBKJ7HF6E7KZUCKX7ZC6FX64GH66OHP7A4VAQBIQ\windows-jdk10-m3.5.x_build\maven-release-plugin\target\it\projects\update-versions\MRELEASE-976\build.log]
[windows-jdk10-m3.5.x_build] Finished parsing Maven Invoker results (found 4)
[windows-jdk10-m3.5.x_build] [withMaven] invokerPublisher - Archive invoker results for Maven artifact MavenArtifact{org.apache.maven.plugins:maven-release-plugin::3.0.0-SNAPSHOT(version: 3.0.0-SNAPSHOT, snapshot:false) } generated by PluginInvocation{org.apache.maven.plugins:maven-invoker-plugin:3.0.1@run  integration-test-branch}: windows-jdk10-m3.5.x_build\maven-release-plugin\target\invoker-reports\*.xml
[windows-jdk10-m3.5.x_build] performing MavenInvokerRecorder, reportsFilenamePattern:'**/windows-jdk10-m3.5.x_build\maven-release-plugin\target\invoker-reports/BUILD*.xml', invokerBuildDir:'**/windows-jdk10-m3.5.x_build\maven-release-plugin\target\it'
[windows-jdk10-m3.5.x_build] Found reports:[f:\jenkins\jenkins-slave\workspace\en-box_maven-release_master-OCKGULQBCZ67VBKJ7HF6E7KZUCKX7ZC6FX64GH66OHP7A4VAQBIQ\windows-jdk10-m3.5.x_build\maven-release-plugin\target\invoker-reports\BUILD-projects_update-versions_MRELEASE-555.xml, f:\jenkins\jenkins-slave\workspace\en-box_maven-release_master-OCKGULQBCZ67VBKJ7HF6E7KZUCKX7ZC6FX64GH66OHP7A4VAQBIQ\windows-jdk10-m3.5.x_build\maven-release-plugin\target\invoker-reports\BUILD-projects_update-versions_MRELEASE-611.xml, f:\jenkins\jenkins-slave\workspace\en-box_maven-release_master-OCKGULQBCZ67VBKJ7HF6E7KZUCKX7ZC6FX64GH66OHP7A4VAQBIQ\windows-jdk10-m3.5.x_build\maven-release-plugin\target\invoker-reports\BUILD-projects_update-versions_MRELEASE-783.xml, f:\jenkins\jenkins-slave\workspace\en-box_maven-release_master-OCKGULQBCZ67VBKJ7HF6E7KZUCKX7ZC6FX64GH66OHP7A4VAQBIQ\windows-jdk10-m3.5.x_build\maven-release-plugin\target\invoker-reports\BUILD-projects_update-versions_MRELEASE-976.xml]
[windows-jdk10-m3.5.x_build] Found logs:[f:\jenkins\jenkins-slave\workspace\en-box_maven-release_master-OCKGULQBCZ67VBKJ7HF6E7KZUCKX7ZC6FX64GH66OHP7A4VAQBIQ\windows-jdk10-m3.5.x_build\maven-release-plugin\target\it\projects\update-versions\MRELEASE-555\build.log, f:\jenkins\jenkins-slave\workspace\en-box_maven-release_master-OCKGULQBCZ67VBKJ7HF6E7KZUCKX7ZC6FX64GH66OHP7A4VAQBIQ\windows-jdk10-m3.5.x_build\maven-release-plugin\target\it\projects\update-versions\MRELEASE-611\build.log, f:\jenkins\jenkins-slave\workspace\en-box_maven-release_master-OCKGULQBCZ67VBKJ7HF6E7KZUCKX7ZC6FX64GH66OHP7A4VAQBIQ\windows-jdk10-m3.5.x_build\maven-release-plugin\target\it\projects\update-versions\MRELEASE-783\build.log, f:\jenkins\jenkins-slave\workspace\en-box_maven-release_master-OCKGULQBCZ67VBKJ7HF6E7KZUCKX7ZC6FX64GH66OHP7A4VAQBIQ\windows-jdk10-m3.5.x_build\maven-release-plugin\target\it\projects\update-versions\MRELEASE-976\build.log]
[windows-jdk10-m3.5.x_build] Finished parsing Maven Invoker results (found 4)
[windows-jdk10-m3.5.x_build] [withMaven] invokerPublisher - Archive invoker results for Maven artifact MavenArtifact{org.apache.maven.plugins:maven-release-plugin::3.0.0-SNAPSHOT(version: 3.0.0-SNAPSHOT, snapshot:false) } generated by PluginInvocation{org.apache.maven.plugins:maven-invoker-plugin:3.0.1@run  integration-test-perform}: windows-jdk10-m3.5.x_build\maven-release-plugin\target\invoker-reports\*.xml
[windows-jdk10-m3.5.x_build] performing MavenInvokerRecorder, reportsFilenamePattern:'**/windows-jdk10-m3.5.x_build\maven-release-plugin\target\invoker-reports/BUILD*.xml', invokerBuildDir:'**/windows-jdk10-m3.5.x_build\maven-release-plugin\target\it'
[windows-jdk10-m3.5.x_build] Found reports:[f:\jenkins\jenkins-slave\workspace\en-box_maven-release_master-OCKGULQBCZ67VBKJ7HF6E7KZUCKX7ZC6FX64GH66OHP7A4VAQBIQ\windows-jdk10-m3.5.x_build\maven-release-plugin\target\invoker-reports\BUILD-projects_update-versions_MRELEASE-555.xml, f:\jenkins\jenkins-slave\workspace\en-box_maven-release_master-OCKGULQBCZ67VBKJ7HF6E7KZUCKX7ZC6FX64GH66OHP7A4VAQBIQ\windows-jdk10-m3.5.x_build\maven-release-plugin\target\invoker-reports\BUILD-projects_update-versions_MRELEASE-611.xml, f:\jenkins\jenkins-slave\workspace\en-box_maven-release_master-OCKGULQBCZ67VBKJ7HF6E7KZUCKX7ZC6FX64GH66OHP7A4VAQBIQ\windows-jdk10-m3.5.x_build\maven-release-plugin\target\invoker-reports\BUILD-projects_update-versions_MRELEASE-783.xml, f:\jenkins\jenkins-slave\workspace\en-box_maven-release_master-OCKGULQBCZ67VBKJ7HF6E7KZUCKX7ZC6FX64GH66OHP7A4VAQBIQ\windows-jdk10-m3.5.x_build\maven-release-plugin\target\invoker-reports\BUILD-projects_update-versions_MRELEASE-976.xml]
[windows-jdk10-m3.5.x_build] Found logs:[f:\jenkins\jenkins-slave\workspace\en-box_maven-release_master-OCKGULQBCZ67VBKJ7HF6E7KZUCKX7ZC6FX64GH66OHP7A4VAQBIQ\windows-jdk10-m3.5.x_build\maven-release-plugin\target\it\projects\update-versions\MRELEASE-555\build.log, f:\jenkins\jenkins-slave\workspace\en-box_maven-release_master-OCKGULQBCZ67VBKJ7HF6E7KZUCKX7ZC6FX64GH66OHP7A4VAQBIQ\windows-jdk10-m3.5.x_build\maven-release-plugin\target\it\projects\update-versions\MRELEASE-611\build.log, f:\jenkins\jenkins-slave\workspace\en-box_maven-release_master-OCKGULQBCZ67VBKJ7HF6E7KZUCKX7ZC6FX64GH66OHP7A4VAQBIQ\windows-jdk10-m3.5.x_build\maven-release-plugin\target\it\projects\update-versions\MRELEASE-783\build.log, f:\jenkins\jenkins-slave\workspace\en-box_maven-release_master-OCKGULQBCZ67VBKJ7HF6E7KZUCKX7ZC6FX64GH66OHP7A4VAQBIQ\windows-jdk10-m3.5.x_build\maven-release-plugin\target\it\projects\update-versions\MRELEASE-976\build.log]
[windows-jdk10-m3.5.x_build] Finished parsing Maven Invoker results (found 4)
[windows-jdk10-m3.5.x_build] [withMaven] invokerPublisher - Archive invoker results for Maven artifact MavenArtifact{org.apache.maven.plugins:maven-release-plugin::3.0.0-SNAPSHOT(version: 3.0.0-SNAPSHOT, snapshot:false) } generated by PluginInvocation{org.apache.maven.plugins:maven-invoker-plugin:3.0.1@run  integration-test-update-versions}: windows-jdk10-m3.5.x_build\maven-release-plugin\target\invoker-reports\*.xml
[windows-jdk10-m3.5.x_build] performing MavenInvokerRecorder, reportsFilenamePattern:'**/windows-jdk10-m3.5.x_build\maven-release-plugin\target\invoker-reports/BUILD*.xml', invokerBuildDir:'**/windows-jdk10-m3.5.x_build\maven-release-plugin\target\it'
[windows-jdk10-m3.5.x_build] Found reports:[f:\jenkins\jenkins-slave\workspace\en-box_maven-release_master-OCKGULQBCZ67VBKJ7HF6E7KZUCKX7ZC6FX64GH66OHP7A4VAQBIQ\windows-jdk10-m3.5.x_build\maven-release-plugin\target\invoker-reports\BUILD-projects_update-versions_MRELEASE-555.xml, f:\jenkins\jenkins-slave\workspace\en-box_maven-release_master-OCKGULQBCZ67VBKJ7HF6E7KZUCKX7ZC6FX64GH66OHP7A4VAQBIQ\windows-jdk10-m3.5.x_build\maven-release-plugin\target\invoker-reports\BUILD-projects_update-versions_MRELEASE-611.xml, f:\jenkins\jenkins-slave\workspace\en-box_maven-release_master-OCKGULQBCZ67VBKJ7HF6E7KZUCKX7ZC6FX64GH66OHP7A4VAQBIQ\windows-jdk10-m3.5.x_build\maven-release-plugin\target\invoker-reports\BUILD-projects_update-versions_MRELEASE-783.xml, f:\jenkins\jenkins-slave\workspace\en-box_maven-release_master-OCKGULQBCZ67VBKJ7HF6E7KZUCKX7ZC6FX64GH66OHP7A4VAQBIQ\windows-jdk10-m3.5.x_build\maven-release-plugin\target\invoker-reports\BUILD-projects_update-versions_MRELEASE-976.xml]
[windows-jdk10-m3.5.x_build] Found logs:[f:\jenkins\jenkins-slave\workspace\en-box_maven-release_master-OCKGULQBCZ67VBKJ7HF6E7KZUCKX7ZC6FX64GH66OHP7A4VAQBIQ\windows-jdk10-m3.5.x_build\maven-release-plugin\target\it\projects\update-versions\MRELEASE-555\build.log, f:\jenkins\jenkins-slave\workspace\en-box_maven-release_master-OCKGULQBCZ67VBKJ7HF6E7KZUCKX7ZC6FX64GH66OHP7A4VAQBIQ\windows-jdk10-m3.5.x_build\maven-release-plugin\target\it\projects\update-versions\MRELEASE-611\build.log, f:\jenkins\jenkins-slave\workspace\en-box_maven-release_master-OCKGULQBCZ67VBKJ7HF6E7KZUCKX7ZC6FX64GH66OHP7A4VAQBIQ\windows-jdk10-m3.5.x_build\maven-release-plugin\target\it\projects\update-versions\MRELEASE-783\build.log, f:\jenkins\jenkins-slave\workspace\en-box_maven-release_master-OCKGULQBCZ67VBKJ7HF6E7KZUCKX7ZC6FX64GH66OHP7A4VAQBIQ\windows-jdk10-m3.5.x_build\maven-release-plugin\target\it\projects\update-versions\MRELEASE-976\build.log]
[windows-jdk10-m3.5.x_build] Finished parsing Maven Invoker results (found 4)
[windows-jdk10-m3.5.x_build] [withMaven] junitPublisher - Archive test results for Maven artifact org.apache.maven.release:maven-release-api:3.0.0-SNAPSHOT generated by maven-surefire-plugin:test (default-test): windows-jdk10-m3.5.x_build\maven-release-api\target\surefire-reports\*.xml
[windows-jdk10-m3.5.x_build] Recording test results
[windows-jdk10-m3.5.x_build] None of the test reports contained any result
[windows-jdk10-m3.5.x_build] [withMaven] junitPublisher - Archive test results for Maven artifact org.apache.maven.release:maven-release-manager:3.0.0-SNAPSHOT generated by maven-surefire-plugin:test (default-test): windows-jdk10-m3.5.x_build\maven-release-manager\target\surefire-reports\*.xml
[windows-jdk10-m3.5.x_build] Recording test results
[windows-jdk10-m3.5.x_build] [withMaven] junitPublisher - Archive test results for Maven artifact org.apache.maven.plugins:maven-release-plugin:3.0.0-SNAPSHOT generated by maven-surefire-plugin:test (default-test): windows-jdk10-m3.5.x_build\maven-release-plugin\target\surefire-reports\*.xml
[windows-jdk10-m3.5.x_build] Recording test results
[windows-jdk10-m3.5.x_build] [withMaven] junitPublisher - Archive test results for Maven artifact org.apache.maven.release:maven-release-oddeven-policy:3.0.0-SNAPSHOT generated by maven-surefire-plugin:test (default-test): windows-jdk10-m3.5.x_build\maven-release-policies\maven-release-oddeven-policy\target\surefire-reports\*.xml
[windows-jdk10-m3.5.x_build] Recording test results
[windows-jdk10-m3.5.x_build] [withMaven] junitPublisher - Archive test results for Maven artifact org.apache.maven.release:maven-release-semver-policy:3.0.0-SNAPSHOT generated by maven-surefire-plugin:test (default-test): windows-jdk10-m3.5.x_build\maven-release-policies\maven-release-semver-policy\target\surefire-reports\*.xml
[windows-jdk10-m3.5.x_build] Recording test results
[windows-jdk10-m3.5.x_build] [withMaven] junitPublisher - Archive test results for Maven artifact org.apache.maven.release:maven-release-manager:3.0.0-SNAPSHOT generated by maven-failsafe-plugin:integration-test (default): windows-jdk10-m3.5.x_build\maven-release-manager\target\failsafe-reports\*.xml
[windows-jdk10-m3.5.x_build] Recording test results
[windows-jdk10-m3.5.x_build] [withMaven] openTasksPublisher - Scan Tasks for Maven artifact org.apache.maven.release:maven-release-api:3.0.0-SNAPSHOT in source directory windows-jdk10-m3.5.x_build\maven-release-api\src\main\java
[windows-jdk10-m3.5.x_build] [withMaven] openTasksPublisher - Scan Tasks for Maven artifact org.apache.maven.release:maven-release-manager:3.0.0-SNAPSHOT in source directory windows-jdk10-m3.5.x_build\maven-release-manager\src\main\java
[windows-jdk10-m3.5.x_build] [withMaven] openTasksPublisher - Scan Tasks for Maven artifact org.apache.maven.plugins:maven-release-plugin:3.0.0-SNAPSHOT in source directory windows-jdk10-m3.5.x_build\maven-release-plugin\src\main\java
[windows-jdk10-m3.5.x_build] [withMaven] openTasksPublisher - Scan Tasks for Maven artifact org.apache.maven.release:maven-release-oddeven-policy:3.0.0-SNAPSHOT in source directory windows-jdk10-m3.5.x_build\maven-release-policies\maven-release-oddeven-policy\src\main\java
[windows-jdk10-m3.5.x_build] [withMaven] openTasksPublisher - Scan Tasks for Maven artifact org.apache.maven.release:maven-release-semver-policy:3.0.0-SNAPSHOT in source directory windows-jdk10-m3.5.x_build\maven-release-policies\maven-release-semver-policy\src\main\java
[windows-jdk10-m3.5.x_build] [TASKS] Scanning folder 'f:\jenkins\jenkins-slave\workspace\en-box_maven-release_master-OCKGULQBCZ67VBKJ7HF6E7KZUCKX7ZC6FX64GH66OHP7A4VAQBIQ' for files matching the pattern 'windows-jdk10-m3.5.x_build\maven-release-api\src\main\java\**\*,windows-jdk10-m3.5.x_build\maven-release-manager\src\main\java\**\*,windows-jdk10-m3.5.x_build\maven-release-plugin\src\main\java\**\*,windows-jdk10-m3.5.x_build\maven-release-policies\maven-release-oddeven-policy\src\main\java\**\*,windows-jdk10-m3.5.x_build\maven-release-policies\maven-release-semver-policy\src\main\java\**\*' - excludes: null
[windows-jdk10-m3.5.x_build] [TASKS] Found 130 files to scan for tasks
[windows-jdk10-m3.5.x_build] [TASKS] Found 21 open tasks.
[windows-jdk10-m3.5.x_build] Skipping warnings blame since pipelines do not have an SCM link.%n
[windows-jdk10-m3.5.x_build] [TASKS] Computing warning deltas based on reference build #54
[Pipeline] [windows-jdk10-m3.5.x_build] // withMaven
[Pipeline] [windows-jdk10-m3.5.x_build] cleanWs
[windows-jdk10-m3.5.x_build] [WS-CLEANUP] Deleting project workspace...[WS-CLEANUP] done
[Pipeline] [windows-jdk10-m3.5.x_build] }
[Pipeline] [windows-jdk10-m3.5.x_build] // stage
[Pipeline] [windows-jdk10-m3.5.x_build] }
[Pipeline] [windows-jdk10-m3.5.x_build] // node
[Pipeline] [windows-jdk10-m3.5.x_build] }
[Pipeline] // parallel
[Pipeline] stage
[Pipeline] { (Notifications)
[Pipeline] echo
Build result: FAILURE
[Pipeline] jiraIssueSelector
[Pipeline] emailext
Reply | Threaded
Open this post in threaded view
|

Build failed in Jenkins: Maven TLP » maven-release » master #57

Apache Jenkins Server-2
See https://builds.apache.org/job/maven-box/job/maven-release/job/master/57/

No changes.

All tests passed

Build log:
[...truncated 7.42 MB...]
[windows-jdk9-m3.5.x_build] [INFO] Exclude: .repository/**
[windows-jdk9-m3.5.x_build] [INFO] Exclude: .maven/spy.log
[windows-jdk9-m3.5.x_build] [INFO] Exclude: dependency-reduced-pom.xml
[windows-jdk9-m3.5.x_build] [INFO] Exclude: .java-version
[windows-jdk9-m3.5.x_build] [INFO] 4 resources included (use -debug for more details)
[windows-jdk9-m3.5.x_build] [INFO] Rat check: Summary over all files. Unapproved: 0, unknown: 0, generated: 0, approved: 4 licenses.
[windows-jdk9-m3.5.x_build] [INFO]
[windows-jdk9-m3.5.x_build] [INFO] --- maven-remote-resources-plugin:1.5:process (process-resource-bundles) @ maven-release-oddeven-policy ---
[windows-jdk9-m3.5.x_build] [INFO]
[windows-jdk9-m3.5.x_build] [INFO] --- maven-resources-plugin:3.1.0:resources (default-resources) @ maven-release-oddeven-policy ---
[windows-jdk9-m3.5.x_build] [INFO] Using 'UTF-8' encoding to copy filtered resources.
[windows-jdk9-m3.5.x_build] [INFO] skip non existing resourceDirectory F:\jenkins\jenkins-slave\workspace\en-box_maven-release_master-OCKGULQBCZ67VBKJ7HF6E7KZUCKX7ZC6FX64GH66OHP7A4VAQBIQ\windows-jdk9-m3.5.x_build\maven-release-policies\maven-release-oddeven-policy\src\main\resources
[windows-jdk9-m3.5.x_build] [INFO] Copying 3 resources
[windows-jdk9-m3.5.x_build] [INFO]
[windows-jdk9-m3.5.x_build] [INFO] --- maven-compiler-plugin:3.7.0:compile (default-compile) @ maven-release-oddeven-policy ---
[windows-jdk9-m3.5.x_build] [INFO] Changes detected - recompiling the module!
[windows-jdk9-m3.5.x_build] [INFO] Compiling 2 source files to F:\jenkins\jenkins-slave\workspace\en-box_maven-release_master-OCKGULQBCZ67VBKJ7HF6E7KZUCKX7ZC6FX64GH66OHP7A4VAQBIQ\windows-jdk9-m3.5.x_build\maven-release-policies\maven-release-oddeven-policy\target\classes
[windows-jdk9-m3.5.x_build] [INFO]
[windows-jdk9-m3.5.x_build] [INFO] --- plexus-component-metadata:1.7.1:generate-metadata (process-classes) @ maven-release-oddeven-policy ---
[windows-jdk9-m3.5.x_build] [INFO] Discovered 1 component descriptors(s)
[windows-jdk9-m3.5.x_build] [INFO]
[windows-jdk9-m3.5.x_build] [INFO] --- maven-resources-plugin:3.1.0:testResources (default-testResources) @ maven-release-oddeven-policy ---
[windows-jdk9-m3.5.x_build] [INFO] Using 'UTF-8' encoding to copy filtered resources.
[windows-jdk9-m3.5.x_build] [INFO] skip non existing resourceDirectory F:\jenkins\jenkins-slave\workspace\en-box_maven-release_master-OCKGULQBCZ67VBKJ7HF6E7KZUCKX7ZC6FX64GH66OHP7A4VAQBIQ\windows-jdk9-m3.5.x_build\maven-release-policies\maven-release-oddeven-policy\src\test\resources
[windows-jdk9-m3.5.x_build] [INFO] Copying 3 resources
[windows-jdk9-m3.5.x_build] [INFO]
[windows-jdk9-m3.5.x_build] [INFO] --- maven-compiler-plugin:3.7.0:testCompile (default-testCompile) @ maven-release-oddeven-policy ---
[windows-jdk9-m3.5.x_build] [INFO] Changes detected - recompiling the module!
[windows-jdk9-m3.5.x_build] [INFO] Compiling 1 source file to F:\jenkins\jenkins-slave\workspace\en-box_maven-release_master-OCKGULQBCZ67VBKJ7HF6E7KZUCKX7ZC6FX64GH66OHP7A4VAQBIQ\windows-jdk9-m3.5.x_build\maven-release-policies\maven-release-oddeven-policy\target\test-classes
[windows-jdk9-m3.5.x_build] [INFO]
[windows-jdk9-m3.5.x_build] [INFO] --- maven-surefire-plugin:2.22.0:test (default-test) @ maven-release-oddeven-policy ---
[windows-jdk9-m3.5.x_build] [INFO]
[windows-jdk9-m3.5.x_build] [INFO] -------------------------------------------------------
[windows-jdk9-m3.5.x_build] [INFO]  T E S T S
[windows-jdk9-m3.5.x_build] [INFO] -------------------------------------------------------
[windows-jdk9-m3.5.x_build] [INFO] Running org.apache.maven.shared.release.policy.oddeven.OddEvenVersionPolicyTestCase
[windows-jdk9-m3.5.x_build] [INFO] Tests run: 3, Failures: 0, Errors: 0, Skipped: 0, Time elapsed: 0.228 s - in org.apache.maven.shared.release.policy.oddeven.OddEvenVersionPolicyTestCase
[windows-jdk9-m3.5.x_build] [INFO]
[windows-jdk9-m3.5.x_build] [INFO] Results:
[windows-jdk9-m3.5.x_build] [INFO]
[windows-jdk9-m3.5.x_build] [INFO] Tests run: 3, Failures: 0, Errors: 0, Skipped: 0
[windows-jdk9-m3.5.x_build] [INFO]
[windows-jdk9-m3.5.x_build] [INFO]
[windows-jdk9-m3.5.x_build] [INFO] --- maven-jar-plugin:3.1.0:jar (default-jar) @ maven-release-oddeven-policy ---
[windows-jdk9-m3.5.x_build] [INFO] Building jar: F:\jenkins\jenkins-slave\workspace\en-box_maven-release_master-OCKGULQBCZ67VBKJ7HF6E7KZUCKX7ZC6FX64GH66OHP7A4VAQBIQ\windows-jdk9-m3.5.x_build\maven-release-policies\maven-release-oddeven-policy\target\maven-release-oddeven-policy-3.0.0-SNAPSHOT.jar
[windows-jdk9-m3.5.x_build] [INFO]
[windows-jdk9-m3.5.x_build] [INFO] --- maven-site-plugin:3.7.1:attach-descriptor (attach-descriptor) @ maven-release-oddeven-policy ---
[windows-jdk9-m3.5.x_build] [INFO] Skipping because packaging 'jar' is not pom.
[windows-jdk9-m3.5.x_build] [INFO]
[windows-jdk9-m3.5.x_build] [INFO] --- maven-checkstyle-plugin:3.0.0:check (checkstyle-check) @ maven-release-oddeven-policy ---
[windows-jdk9-m3.5.x_build] [INFO]
[windows-jdk9-m3.5.x_build] [INFO] ------------------------------------------------------------------------
[windows-jdk9-m3.5.x_build] [INFO] Building Maven Release SemVer Policy 3.0.0-SNAPSHOT
[windows-jdk9-m3.5.x_build] [INFO] ------------------------------------------------------------------------
[windows-jdk9-m3.5.x_build] [INFO] Downloading from central: https://repo.maven.apache.org/maven2/org/semver/api/0.9.33/api-0.9.33.pom
[windows-jdk9-m3.5.x_build] [INFO] Downloaded from central: https://repo.maven.apache.org/maven2/org/semver/api/0.9.33/api-0.9.33.pom (2.8 kB at 23 kB/s)
[windows-jdk9-m3.5.x_build] [INFO] Downloading from central: https://repo.maven.apache.org/maven2/org/semver/parent/0.9.33/parent-0.9.33.pom
[windows-jdk9-m3.5.x_build] [INFO] Downloaded from central: https://repo.maven.apache.org/maven2/org/semver/parent/0.9.33/parent-0.9.33.pom (1.3 kB at 31 kB/s)
[windows-jdk9-m3.5.x_build] [INFO] Downloading from central: https://repo.maven.apache.org/maven2/com/github/jeluard/oss-parent/9/oss-parent-9.pom
[windows-jdk9-m3.5.x_build] [INFO] Downloaded from central: https://repo.maven.apache.org/maven2/com/github/jeluard/oss-parent/9/oss-parent-9.pom (12 kB at 320 kB/s)
[windows-jdk9-m3.5.x_build] [INFO] Downloading from central: https://repo.maven.apache.org/maven2/com/google/code/findbugs/jsr305/2.0.0/jsr305-2.0.0.pom
[windows-jdk9-m3.5.x_build] [INFO] Downloaded from central: https://repo.maven.apache.org/maven2/com/google/code/findbugs/jsr305/2.0.0/jsr305-2.0.0.pom (965 B at 24 kB/s)
[windows-jdk9-m3.5.x_build] [INFO] Downloading from central: https://repo.maven.apache.org/maven2/org/ow2/asm/asm/5.0.3/asm-5.0.3.pom
[windows-jdk9-m3.5.x_build] [INFO] Downloaded from central: https://repo.maven.apache.org/maven2/org/ow2/asm/asm/5.0.3/asm-5.0.3.pom (1.9 kB at 74 kB/s)
[windows-jdk9-m3.5.x_build] [INFO] Downloading from central: https://repo.maven.apache.org/maven2/org/ow2/asm/asm-parent/5.0.3/asm-parent-5.0.3.pom
[windows-jdk9-m3.5.x_build] [INFO] Downloaded from central: https://repo.maven.apache.org/maven2/org/ow2/asm/asm-parent/5.0.3/asm-parent-5.0.3.pom (5.5 kB at 137 kB/s)
[windows-jdk9-m3.5.x_build] [INFO] Downloading from central: https://repo.maven.apache.org/maven2/org/ow2/asm/asm-commons/5.0.3/asm-commons-5.0.3.pom
[windows-jdk9-m3.5.x_build] [INFO] Downloaded from central: https://repo.maven.apache.org/maven2/org/ow2/asm/asm-commons/5.0.3/asm-commons-5.0.3.pom (2.1 kB at 81 kB/s)
[windows-jdk9-m3.5.x_build] [INFO] Downloading from central: https://repo.maven.apache.org/maven2/org/ow2/asm/asm-tree/5.0.3/asm-tree-5.0.3.pom
[windows-jdk9-m3.5.x_build] [INFO] Downloaded from central: https://repo.maven.apache.org/maven2/org/ow2/asm/asm-tree/5.0.3/asm-tree-5.0.3.pom (2.1 kB at 87 kB/s)
[windows-jdk9-m3.5.x_build] [INFO] Downloading from central: https://repo.maven.apache.org/maven2/commons-lang/commons-lang/1.0/commons-lang-1.0.pom
[windows-jdk9-m3.5.x_build] [INFO] Downloaded from central: https://repo.maven.apache.org/maven2/commons-lang/commons-lang/1.0/commons-lang-1.0.pom (2.5 kB at 91 kB/s)
[windows-jdk9-m3.5.x_build] [INFO] Downloading from central: https://repo.maven.apache.org/maven2/de/tototec/de.tototec.cmdoption/0.2.0/de.tototec.cmdoption-0.2.0.pom
[windows-jdk9-m3.5.x_build] [INFO] Downloaded from central: https://repo.maven.apache.org/maven2/de/tototec/de.tototec.cmdoption/0.2.0/de.tototec.cmdoption-0.2.0.pom (956 B at 35 kB/s)
[windows-jdk9-m3.5.x_build] [INFO] Downloading from central: https://repo.maven.apache.org/maven2/org/ow2/asm/asm/5.0.3/asm-5.0.3.jar
[windows-jdk9-m3.5.x_build] [INFO] Downloading from central: https://repo.maven.apache.org/maven2/org/ow2/asm/asm-commons/5.0.3/asm-commons-5.0.3.jar
[windows-jdk9-m3.5.x_build] [INFO] Downloading from central: https://repo.maven.apache.org/maven2/org/semver/api/0.9.33/api-0.9.33.jar
[windows-jdk9-m3.5.x_build] [INFO] Downloading from central: https://repo.maven.apache.org/maven2/com/google/code/findbugs/jsr305/2.0.0/jsr305-2.0.0.jar
[windows-jdk9-m3.5.x_build] [INFO] Downloading from central: https://repo.maven.apache.org/maven2/org/ow2/asm/asm-tree/5.0.3/asm-tree-5.0.3.jar
[windows-jdk9-m3.5.x_build] [INFO] Downloaded from central: https://repo.maven.apache.org/maven2/org/ow2/asm/asm/5.0.3/asm-5.0.3.jar (53 kB at 386 kB/s)
[windows-jdk9-m3.5.x_build] [INFO] Downloading from central: https://repo.maven.apache.org/maven2/commons-lang/commons-lang/1.0/commons-lang-1.0.jar
[windows-jdk9-m3.5.x_build] [INFO] Downloaded from central: https://repo.maven.apache.org/maven2/commons-lang/commons-lang/1.0/commons-lang-1.0.jar (64 kB at 353 kB/s)
[windows-jdk9-m3.5.x_build] [INFO] Downloading from central: https://repo.maven.apache.org/maven2/de/tototec/de.tototec.cmdoption/0.2.0/de.tototec.cmdoption-0.2.0.jar
[windows-jdk9-m3.5.x_build] [INFO] Downloaded from central: https://repo.maven.apache.org/maven2/com/google/code/findbugs/jsr305/2.0.0/jsr305-2.0.0.jar (32 kB at 63 kB/s)
[windows-jdk9-m3.5.x_build] [INFO] Downloaded from central: https://repo.maven.apache.org/maven2/org/semver/api/0.9.33/api-0.9.33.jar (64 kB at 120 kB/s)
[windows-jdk9-m3.5.x_build] [INFO] Downloaded from central: https://repo.maven.apache.org/maven2/org/ow2/asm/asm-commons/5.0.3/asm-commons-5.0.3.jar (42 kB at 74 kB/s)
[windows-jdk9-m3.5.x_build] [INFO] Downloaded from central: https://repo.maven.apache.org/maven2/org/ow2/asm/asm-tree/5.0.3/asm-tree-5.0.3.jar (29 kB at 51 kB/s)
[windows-jdk9-m3.5.x_build] [INFO] Downloaded from central: https://repo.maven.apache.org/maven2/de/tototec/de.tototec.cmdoption/0.2.0/de.tototec.cmdoption-0.2.0.jar (42 kB at 74 kB/s)
[windows-jdk9-m3.5.x_build] [INFO]
[windows-jdk9-m3.5.x_build] [INFO] --- maven-clean-plugin:3.1.0:clean (default-clean) @ maven-release-semver-policy ---
[windows-jdk9-m3.5.x_build] [INFO]
[windows-jdk9-m3.5.x_build] [INFO] --- maven-enforcer-plugin:1.4.1:enforce (enforce-maven-version) @ maven-release-semver-policy ---
[windows-jdk9-m3.5.x_build] [INFO]
[windows-jdk9-m3.5.x_build] [INFO] --- maven-enforcer-plugin:1.4.1:enforce (enforce-bytecode-version) @ maven-release-semver-policy ---
[windows-jdk9-m3.5.x_build] [INFO]
[windows-jdk9-m3.5.x_build] [INFO] --- maven-enforcer-plugin:1.4.1:enforce (ban-known-bad-maven-versions) @ maven-release-semver-policy ---
[windows-jdk9-m3.5.x_build] [INFO]
[windows-jdk9-m3.5.x_build] [INFO] --- apache-rat-plugin:0.12:check (rat-check) @ maven-release-semver-policy ---
[windows-jdk9-m3.5.x_build] [INFO] Enabled default license matchers.
[windows-jdk9-m3.5.x_build] [INFO] Will parse SCM ignores for exclusions...
[windows-jdk9-m3.5.x_build] [INFO] Finished adding exclusions from SCM ignore files.
[windows-jdk9-m3.5.x_build] [INFO] 61 implicit excludes (use -debug for more details).
[windows-jdk9-m3.5.x_build] [INFO] Exclude: .repository
[windows-jdk9-m3.5.x_build] [INFO] Exclude: Jenkinsfile
[windows-jdk9-m3.5.x_build] [INFO] Exclude: .repository/**
[windows-jdk9-m3.5.x_build] [INFO] Exclude: .maven/spy.log
[windows-jdk9-m3.5.x_build] [INFO] Exclude: dependency-reduced-pom.xml
[windows-jdk9-m3.5.x_build] [INFO] Exclude: .java-version
[windows-jdk9-m3.5.x_build] [INFO] 3 resources included (use -debug for more details)
[windows-jdk9-m3.5.x_build] [INFO] Rat check: Summary over all files. Unapproved: 0, unknown: 0, generated: 0, approved: 3 licenses.
[windows-jdk9-m3.5.x_build] [INFO]
[windows-jdk9-m3.5.x_build] [INFO] --- maven-remote-resources-plugin:1.5:process (process-resource-bundles) @ maven-release-semver-policy ---
[windows-jdk9-m3.5.x_build] [INFO]
[windows-jdk9-m3.5.x_build] [INFO] --- maven-resources-plugin:3.1.0:resources (default-resources) @ maven-release-semver-policy ---
[windows-jdk9-m3.5.x_build] [INFO] Using 'UTF-8' encoding to copy filtered resources.
[windows-jdk9-m3.5.x_build] [INFO] skip non existing resourceDirectory F:\jenkins\jenkins-slave\workspace\en-box_maven-release_master-OCKGULQBCZ67VBKJ7HF6E7KZUCKX7ZC6FX64GH66OHP7A4VAQBIQ\windows-jdk9-m3.5.x_build\maven-release-policies\maven-release-semver-policy\src\main\resources
[windows-jdk9-m3.5.x_build] [INFO] Copying 3 resources
[windows-jdk9-m3.5.x_build] [INFO]
[windows-jdk9-m3.5.x_build] [INFO] --- maven-compiler-plugin:3.7.0:compile (default-compile) @ maven-release-semver-policy ---
[windows-jdk9-m3.5.x_build] [INFO] Changes detected - recompiling the module!
[windows-jdk9-m3.5.x_build] [INFO] Compiling 1 source file to F:\jenkins\jenkins-slave\workspace\en-box_maven-release_master-OCKGULQBCZ67VBKJ7HF6E7KZUCKX7ZC6FX64GH66OHP7A4VAQBIQ\windows-jdk9-m3.5.x_build\maven-release-policies\maven-release-semver-policy\target\classes
[windows-jdk9-m3.5.x_build] [INFO]
[windows-jdk9-m3.5.x_build] [INFO] --- plexus-component-metadata:1.7.1:generate-metadata (process-classes) @ maven-release-semver-policy ---
[windows-jdk9-m3.5.x_build] [INFO] Discovered 1 component descriptors(s)
[windows-jdk9-m3.5.x_build] [INFO]
[windows-jdk9-m3.5.x_build] [INFO] --- maven-resources-plugin:3.1.0:testResources (default-testResources) @ maven-release-semver-policy ---
[windows-jdk9-m3.5.x_build] [INFO] Using 'UTF-8' encoding to copy filtered resources.
[windows-jdk9-m3.5.x_build] [INFO] skip non existing resourceDirectory F:\jenkins\jenkins-slave\workspace\en-box_maven-release_master-OCKGULQBCZ67VBKJ7HF6E7KZUCKX7ZC6FX64GH66OHP7A4VAQBIQ\windows-jdk9-m3.5.x_build\maven-release-policies\maven-release-semver-policy\src\test\resources
[windows-jdk9-m3.5.x_build] [INFO] Copying 3 resources
[windows-jdk9-m3.5.x_build] [INFO]
[windows-jdk9-m3.5.x_build] [INFO] --- maven-compiler-plugin:3.7.0:testCompile (default-testCompile) @ maven-release-semver-policy ---
[windows-jdk9-m3.5.x_build] [INFO] Changes detected - recompiling the module!
[windows-jdk9-m3.5.x_build] [INFO] Compiling 1 source file to F:\jenkins\jenkins-slave\workspace\en-box_maven-release_master-OCKGULQBCZ67VBKJ7HF6E7KZUCKX7ZC6FX64GH66OHP7A4VAQBIQ\windows-jdk9-m3.5.x_build\maven-release-policies\maven-release-semver-policy\target\test-classes
[windows-jdk9-m3.5.x_build] [INFO]
[windows-jdk9-m3.5.x_build] [INFO] --- maven-surefire-plugin:2.22.0:test (default-test) @ maven-release-semver-policy ---
[windows-jdk9-m3.5.x_build] [INFO]
[windows-jdk9-m3.5.x_build] [INFO] -------------------------------------------------------
[windows-jdk9-m3.5.x_build] [INFO]  T E S T S
[windows-jdk9-m3.5.x_build] [INFO] -------------------------------------------------------
[windows-jdk9-m3.5.x_build] [INFO] Running org.apache.maven.shared.release.policy.semver.SemVerVersionPolicyTest
[windows-jdk9-m3.5.x_build] [INFO] Tests run: 2, Failures: 0, Errors: 0, Skipped: 0, Time elapsed: 0.239 s - in org.apache.maven.shared.release.policy.semver.SemVerVersionPolicyTest
[windows-jdk9-m3.5.x_build] [INFO]
[windows-jdk9-m3.5.x_build] [INFO] Results:
[windows-jdk9-m3.5.x_build] [INFO]
[windows-jdk9-m3.5.x_build] [INFO] Tests run: 2, Failures: 0, Errors: 0, Skipped: 0
[windows-jdk9-m3.5.x_build] [INFO]
[windows-jdk9-m3.5.x_build] [INFO]
[windows-jdk9-m3.5.x_build] [INFO] --- maven-jar-plugin:3.1.0:jar (default-jar) @ maven-release-semver-policy ---
[windows-jdk9-m3.5.x_build] [INFO] Building jar: F:\jenkins\jenkins-slave\workspace\en-box_maven-release_master-OCKGULQBCZ67VBKJ7HF6E7KZUCKX7ZC6FX64GH66OHP7A4VAQBIQ\windows-jdk9-m3.5.x_build\maven-release-policies\maven-release-semver-policy\target\maven-release-semver-policy-3.0.0-SNAPSHOT.jar
[windows-jdk9-m3.5.x_build] [INFO]
[windows-jdk9-m3.5.x_build] [INFO] --- maven-site-plugin:3.7.1:attach-descriptor (attach-descriptor) @ maven-release-semver-policy ---
[windows-jdk9-m3.5.x_build] [INFO] Skipping because packaging 'jar' is not pom.
[windows-jdk9-m3.5.x_build] [INFO]
[windows-jdk9-m3.5.x_build] [INFO] --- maven-checkstyle-plugin:3.0.0:check (checkstyle-check) @ maven-release-semver-policy ---
[windows-jdk9-m3.5.x_build] [INFO] ------------------------------------------------------------------------
[windows-jdk9-m3.5.x_build] [INFO] Reactor Summary:
[windows-jdk9-m3.5.x_build] [INFO]
[windows-jdk9-m3.5.x_build] [INFO] Maven Release ...................................... SUCCESS [ 45.131 s]
[windows-jdk9-m3.5.x_build] [INFO] Maven Release APIs ................................. SUCCESS [ 12.387 s]
[windows-jdk9-m3.5.x_build] [INFO] Maven Release Manager .............................. SUCCESS [02:51 min]
[windows-jdk9-m3.5.x_build] [INFO] Maven Release Plugin ............................... SUCCESS [10:13 min]
[windows-jdk9-m3.5.x_build] [INFO] Maven Release Odd-Even Policy ...................... SUCCESS [  5.018 s]
[windows-jdk9-m3.5.x_build] [INFO] Maven Release SemVer Policy ........................ SUCCESS [  7.299 s]
[windows-jdk9-m3.5.x_build] [INFO] ------------------------------------------------------------------------
[windows-jdk9-m3.5.x_build] [INFO] BUILD SUCCESS
[windows-jdk9-m3.5.x_build] [INFO] ------------------------------------------------------------------------
[windows-jdk9-m3.5.x_build] [INFO] Total time: 14:17 min
[windows-jdk9-m3.5.x_build] [INFO] Finished at: 2018-09-13T11:39:24-07:00
[windows-jdk9-m3.5.x_build] [INFO] Final Memory: 54M/180M
[windows-jdk9-m3.5.x_build] [INFO] ------------------------------------------------------------------------
[windows-jdk9-m3.5.x_build] [INFO] [jenkins-event-spy] Generated F:\jenkins\jenkins-slave\workspace\en-box_maven-release_master-OCKGULQBCZ67VBKJ7HF6E7KZUCKX7ZC6FX64GH66OHP7A4VAQBIQ@tmp\withMaven9f962823\maven-spy-20180913-112506-5556647611447437303563.log
[Pipeline] [windows-jdk9-m3.5.x_build] }
[Pipeline] [windows-jdk9-m3.5.x_build] // dir
[Pipeline] [windows-jdk9-m3.5.x_build] }
[windows-jdk9-m3.5.x_build] [withMaven] artifactsPublisher - Archive artifact windows-jdk9-m3.5.x_build\pom.xml under org\apache\maven\release\maven-release\3.0.0-SNAPSHOT\maven-release-3.0.0-SNAPSHOT.pom
[windows-jdk9-m3.5.x_build] [withMaven] artifactsPublisher - Archive artifact windows-jdk9-m3.5.x_build\target\maven-release-3.0.0-SNAPSHOT-site.xml under org\apache\maven\release\maven-release\3.0.0-SNAPSHOT\maven-release-3.0.0-SNAPSHOT-site.xml
[windows-jdk9-m3.5.x_build] [withMaven] artifactsPublisher - Archive artifact windows-jdk9-m3.5.x_build\maven-release-api\pom.xml under org\apache\maven\release\maven-release-api\3.0.0-SNAPSHOT\maven-release-api-3.0.0-SNAPSHOT.pom
[windows-jdk9-m3.5.x_build] [withMaven] artifactsPublisher - Archive artifact windows-jdk9-m3.5.x_build\maven-release-api\target\maven-release-api-3.0.0-SNAPSHOT.jar under org\apache\maven\release\maven-release-api\3.0.0-SNAPSHOT\maven-release-api-3.0.0-SNAPSHOT.jar
[windows-jdk9-m3.5.x_build] [withMaven] artifactsPublisher - Archive artifact windows-jdk9-m3.5.x_build\maven-release-manager\pom.xml under org\apache\maven\release\maven-release-manager\3.0.0-SNAPSHOT\maven-release-manager-3.0.0-SNAPSHOT.pom
[windows-jdk9-m3.5.x_build] [withMaven] artifactsPublisher - Archive artifact windows-jdk9-m3.5.x_build\maven-release-manager\target\maven-release-manager-3.0.0-SNAPSHOT.jar under org\apache\maven\release\maven-release-manager\3.0.0-SNAPSHOT\maven-release-manager-3.0.0-SNAPSHOT.jar
[windows-jdk9-m3.5.x_build] [withMaven] artifactsPublisher - Archive artifact windows-jdk9-m3.5.x_build\maven-release-plugin\pom.xml under org\apache\maven\plugins\maven-release-plugin\3.0.0-SNAPSHOT\maven-release-plugin-3.0.0-SNAPSHOT.pom
[windows-jdk9-m3.5.x_build] [withMaven] artifactsPublisher - Archive artifact windows-jdk9-m3.5.x_build\maven-release-plugin\target\maven-release-plugin-3.0.0-SNAPSHOT.jar under org\apache\maven\plugins\maven-release-plugin\3.0.0-SNAPSHOT\maven-release-plugin-3.0.0-SNAPSHOT.jar
[windows-jdk9-m3.5.x_build] [withMaven] artifactsPublisher - Archive artifact windows-jdk9-m3.5.x_build\maven-release-policies\maven-release-oddeven-policy\pom.xml under org\apache\maven\release\maven-release-oddeven-policy\3.0.0-SNAPSHOT\maven-release-oddeven-policy-3.0.0-SNAPSHOT.pom
[windows-jdk9-m3.5.x_build] [withMaven] artifactsPublisher - Archive artifact windows-jdk9-m3.5.x_build\maven-release-policies\maven-release-oddeven-policy\target\maven-release-oddeven-policy-3.0.0-SNAPSHOT.jar under org\apache\maven\release\maven-release-oddeven-policy\3.0.0-SNAPSHOT\maven-release-oddeven-policy-3.0.0-SNAPSHOT.jar
[windows-jdk9-m3.5.x_build] [withMaven] artifactsPublisher - Archive artifact windows-jdk9-m3.5.x_build\maven-release-policies\maven-release-semver-policy\pom.xml under org\apache\maven\release\maven-release-semver-policy\3.0.0-SNAPSHOT\maven-release-semver-policy-3.0.0-SNAPSHOT.pom
[windows-jdk9-m3.5.x_build] [withMaven] artifactsPublisher - Archive artifact windows-jdk9-m3.5.x_build\maven-release-policies\maven-release-semver-policy\target\maven-release-semver-policy-3.0.0-SNAPSHOT.jar under org\apache\maven\release\maven-release-semver-policy\3.0.0-SNAPSHOT\maven-release-semver-policy-3.0.0-SNAPSHOT.jar
[windows-jdk9-m3.5.x_build] [withMaven] invokerPublisher - Archive invoker results for Maven artifact MavenArtifact{org.apache.maven.plugins:maven-release-plugin::3.0.0-SNAPSHOT(version: 3.0.0-SNAPSHOT, snapshot:false) } generated by PluginInvocation{org.apache.maven.plugins:maven-invoker-plugin:3.0.1@run  integration-test-prepare}: windows-jdk9-m3.5.x_build\maven-release-plugin\target\invoker-reports\*.xml
[windows-jdk9-m3.5.x_build] performing MavenInvokerRecorder, reportsFilenamePattern:'**/windows-jdk9-m3.5.x_build\maven-release-plugin\target\invoker-reports/BUILD*.xml', invokerBuildDir:'**/windows-jdk9-m3.5.x_build\maven-release-plugin\target\it'
[windows-jdk9-m3.5.x_build] Found reports:[f:\jenkins\jenkins-slave\workspace\en-box_maven-release_master-OCKGULQBCZ67VBKJ7HF6E7KZUCKX7ZC6FX64GH66OHP7A4VAQBIQ\windows-jdk9-m3.5.x_build\maven-release-plugin\target\invoker-reports\BUILD-projects_update-versions_MRELEASE-555.xml, f:\jenkins\jenkins-slave\workspace\en-box_maven-release_master-OCKGULQBCZ67VBKJ7HF6E7KZUCKX7ZC6FX64GH66OHP7A4VAQBIQ\windows-jdk9-m3.5.x_build\maven-release-plugin\target\invoker-reports\BUILD-projects_update-versions_MRELEASE-611.xml, f:\jenkins\jenkins-slave\workspace\en-box_maven-release_master-OCKGULQBCZ67VBKJ7HF6E7KZUCKX7ZC6FX64GH66OHP7A4VAQBIQ\windows-jdk9-m3.5.x_build\maven-release-plugin\target\invoker-reports\BUILD-projects_update-versions_MRELEASE-783.xml, f:\jenkins\jenkins-slave\workspace\en-box_maven-release_master-OCKGULQBCZ67VBKJ7HF6E7KZUCKX7ZC6FX64GH66OHP7A4VAQBIQ\windows-jdk9-m3.5.x_build\maven-release-plugin\target\invoker-reports\BUILD-projects_update-versions_MRELEASE-976.xml]
[windows-jdk9-m3.5.x_build] Found logs:[f:\jenkins\jenkins-slave\workspace\en-box_maven-release_master-OCKGULQBCZ67VBKJ7HF6E7KZUCKX7ZC6FX64GH66OHP7A4VAQBIQ\windows-jdk9-m3.5.x_build\maven-release-plugin\target\it\projects\update-versions\MRELEASE-555\build.log, f:\jenkins\jenkins-slave\workspace\en-box_maven-release_master-OCKGULQBCZ67VBKJ7HF6E7KZUCKX7ZC6FX64GH66OHP7A4VAQBIQ\windows-jdk9-m3.5.x_build\maven-release-plugin\target\it\projects\update-versions\MRELEASE-611\build.log, f:\jenkins\jenkins-slave\workspace\en-box_maven-release_master-OCKGULQBCZ67VBKJ7HF6E7KZUCKX7ZC6FX64GH66OHP7A4VAQBIQ\windows-jdk9-m3.5.x_build\maven-release-plugin\target\it\projects\update-versions\MRELEASE-783\build.log, f:\jenkins\jenkins-slave\workspace\en-box_maven-release_master-OCKGULQBCZ67VBKJ7HF6E7KZUCKX7ZC6FX64GH66OHP7A4VAQBIQ\windows-jdk9-m3.5.x_build\maven-release-plugin\target\it\projects\update-versions\MRELEASE-976\build.log]
[windows-jdk9-m3.5.x_build] Finished parsing Maven Invoker results (found 4)
[windows-jdk9-m3.5.x_build] [withMaven] invokerPublisher - Archive invoker results for Maven artifact MavenArtifact{org.apache.maven.plugins:maven-release-plugin::3.0.0-SNAPSHOT(version: 3.0.0-SNAPSHOT, snapshot:false) } generated by PluginInvocation{org.apache.maven.plugins:maven-invoker-plugin:3.0.1@run  integration-test-prepare-with-pom}: windows-jdk9-m3.5.x_build\maven-release-plugin\target\invoker-reports\*.xml
[windows-jdk9-m3.5.x_build] performing MavenInvokerRecorder, reportsFilenamePattern:'**/windows-jdk9-m3.5.x_build\maven-release-plugin\target\invoker-reports/BUILD*.xml', invokerBuildDir:'**/windows-jdk9-m3.5.x_build\maven-release-plugin\target\it'
[windows-jdk9-m3.5.x_build] Found reports:[f:\jenkins\jenkins-slave\workspace\en-box_maven-release_master-OCKGULQBCZ67VBKJ7HF6E7KZUCKX7ZC6FX64GH66OHP7A4VAQBIQ\windows-jdk9-m3.5.x_build\maven-release-plugin\target\invoker-reports\BUILD-projects_update-versions_MRELEASE-555.xml, f:\jenkins\jenkins-slave\workspace\en-box_maven-release_master-OCKGULQBCZ67VBKJ7HF6E7KZUCKX7ZC6FX64GH66OHP7A4VAQBIQ\windows-jdk9-m3.5.x_build\maven-release-plugin\target\invoker-reports\BUILD-projects_update-versions_MRELEASE-611.xml, f:\jenkins\jenkins-slave\workspace\en-box_maven-release_master-OCKGULQBCZ67VBKJ7HF6E7KZUCKX7ZC6FX64GH66OHP7A4VAQBIQ\windows-jdk9-m3.5.x_build\maven-release-plugin\target\invoker-reports\BUILD-projects_update-versions_MRELEASE-783.xml, f:\jenkins\jenkins-slave\workspace\en-box_maven-release_master-OCKGULQBCZ67VBKJ7HF6E7KZUCKX7ZC6FX64GH66OHP7A4VAQBIQ\windows-jdk9-m3.5.x_build\maven-release-plugin\target\invoker-reports\BUILD-projects_update-versions_MRELEASE-976.xml]
[windows-jdk9-m3.5.x_build] Found logs:[f:\jenkins\jenkins-slave\workspace\en-box_maven-release_master-OCKGULQBCZ67VBKJ7HF6E7KZUCKX7ZC6FX64GH66OHP7A4VAQBIQ\windows-jdk9-m3.5.x_build\maven-release-plugin\target\it\projects\update-versions\MRELEASE-555\build.log, f:\jenkins\jenkins-slave\workspace\en-box_maven-release_master-OCKGULQBCZ67VBKJ7HF6E7KZUCKX7ZC6FX64GH66OHP7A4VAQBIQ\windows-jdk9-m3.5.x_build\maven-release-plugin\target\it\projects\update-versions\MRELEASE-611\build.log, f:\jenkins\jenkins-slave\workspace\en-box_maven-release_master-OCKGULQBCZ67VBKJ7HF6E7KZUCKX7ZC6FX64GH66OHP7A4VAQBIQ\windows-jdk9-m3.5.x_build\maven-release-plugin\target\it\projects\update-versions\MRELEASE-783\build.log, f:\jenkins\jenkins-slave\workspace\en-box_maven-release_master-OCKGULQBCZ67VBKJ7HF6E7KZUCKX7ZC6FX64GH66OHP7A4VAQBIQ\windows-jdk9-m3.5.x_build\maven-release-plugin\target\it\projects\update-versions\MRELEASE-976\build.log]
[windows-jdk9-m3.5.x_build] Finished parsing Maven Invoker results (found 4)
[windows-jdk9-m3.5.x_build] [withMaven] invokerPublisher - Archive invoker results for Maven artifact MavenArtifact{org.apache.maven.plugins:maven-release-plugin::3.0.0-SNAPSHOT(version: 3.0.0-SNAPSHOT, snapshot:false) } generated by PluginInvocation{org.apache.maven.plugins:maven-invoker-plugin:3.0.1@run  integration-test-branch}: windows-jdk9-m3.5.x_build\maven-release-plugin\target\invoker-reports\*.xml
[windows-jdk9-m3.5.x_build] performing MavenInvokerRecorder, reportsFilenamePattern:'**/windows-jdk9-m3.5.x_build\maven-release-plugin\target\invoker-reports/BUILD*.xml', invokerBuildDir:'**/windows-jdk9-m3.5.x_build\maven-release-plugin\target\it'
[windows-jdk9-m3.5.x_build] Found reports:[f:\jenkins\jenkins-slave\workspace\en-box_maven-release_master-OCKGULQBCZ67VBKJ7HF6E7KZUCKX7ZC6FX64GH66OHP7A4VAQBIQ\windows-jdk9-m3.5.x_build\maven-release-plugin\target\invoker-reports\BUILD-projects_update-versions_MRELEASE-555.xml, f:\jenkins\jenkins-slave\workspace\en-box_maven-release_master-OCKGULQBCZ67VBKJ7HF6E7KZUCKX7ZC6FX64GH66OHP7A4VAQBIQ\windows-jdk9-m3.5.x_build\maven-release-plugin\target\invoker-reports\BUILD-projects_update-versions_MRELEASE-611.xml, f:\jenkins\jenkins-slave\workspace\en-box_maven-release_master-OCKGULQBCZ67VBKJ7HF6E7KZUCKX7ZC6FX64GH66OHP7A4VAQBIQ\windows-jdk9-m3.5.x_build\maven-release-plugin\target\invoker-reports\BUILD-projects_update-versions_MRELEASE-783.xml, f:\jenkins\jenkins-slave\workspace\en-box_maven-release_master-OCKGULQBCZ67VBKJ7HF6E7KZUCKX7ZC6FX64GH66OHP7A4VAQBIQ\windows-jdk9-m3.5.x_build\maven-release-plugin\target\invoker-reports\BUILD-projects_update-versions_MRELEASE-976.xml]
[windows-jdk9-m3.5.x_build] Found logs:[f:\jenkins\jenkins-slave\workspace\en-box_maven-release_master-OCKGULQBCZ67VBKJ7HF6E7KZUCKX7ZC6FX64GH66OHP7A4VAQBIQ\windows-jdk9-m3.5.x_build\maven-release-plugin\target\it\projects\update-versions\MRELEASE-555\build.log, f:\jenkins\jenkins-slave\workspace\en-box_maven-release_master-OCKGULQBCZ67VBKJ7HF6E7KZUCKX7ZC6FX64GH66OHP7A4VAQBIQ\windows-jdk9-m3.5.x_build\maven-release-plugin\target\it\projects\update-versions\MRELEASE-611\build.log, f:\jenkins\jenkins-slave\workspace\en-box_maven-release_master-OCKGULQBCZ67VBKJ7HF6E7KZUCKX7ZC6FX64GH66OHP7A4VAQBIQ\windows-jdk9-m3.5.x_build\maven-release-plugin\target\it\projects\update-versions\MRELEASE-783\build.log, f:\jenkins\jenkins-slave\workspace\en-box_maven-release_master-OCKGULQBCZ67VBKJ7HF6E7KZUCKX7ZC6FX64GH66OHP7A4VAQBIQ\windows-jdk9-m3.5.x_build\maven-release-plugin\target\it\projects\update-versions\MRELEASE-976\build.log]
[windows-jdk9-m3.5.x_build] Finished parsing Maven Invoker results (found 4)
[windows-jdk9-m3.5.x_build] [withMaven] invokerPublisher - Archive invoker results for Maven artifact MavenArtifact{org.apache.maven.plugins:maven-release-plugin::3.0.0-SNAPSHOT(version: 3.0.0-SNAPSHOT, snapshot:false) } generated by PluginInvocation{org.apache.maven.plugins:maven-invoker-plugin:3.0.1@run  integration-test-perform}: windows-jdk9-m3.5.x_build\maven-release-plugin\target\invoker-reports\*.xml
[windows-jdk9-m3.5.x_build] performing MavenInvokerRecorder, reportsFilenamePattern:'**/windows-jdk9-m3.5.x_build\maven-release-plugin\target\invoker-reports/BUILD*.xml', invokerBuildDir:'**/windows-jdk9-m3.5.x_build\maven-release-plugin\target\it'
[windows-jdk9-m3.5.x_build] Found reports:[f:\jenkins\jenkins-slave\workspace\en-box_maven-release_master-OCKGULQBCZ67VBKJ7HF6E7KZUCKX7ZC6FX64GH66OHP7A4VAQBIQ\windows-jdk9-m3.5.x_build\maven-release-plugin\target\invoker-reports\BUILD-projects_update-versions_MRELEASE-555.xml, f:\jenkins\jenkins-slave\workspace\en-box_maven-release_master-OCKGULQBCZ67VBKJ7HF6E7KZUCKX7ZC6FX64GH66OHP7A4VAQBIQ\windows-jdk9-m3.5.x_build\maven-release-plugin\target\invoker-reports\BUILD-projects_update-versions_MRELEASE-611.xml, f:\jenkins\jenkins-slave\workspace\en-box_maven-release_master-OCKGULQBCZ67VBKJ7HF6E7KZUCKX7ZC6FX64GH66OHP7A4VAQBIQ\windows-jdk9-m3.5.x_build\maven-release-plugin\target\invoker-reports\BUILD-projects_update-versions_MRELEASE-783.xml, f:\jenkins\jenkins-slave\workspace\en-box_maven-release_master-OCKGULQBCZ67VBKJ7HF6E7KZUCKX7ZC6FX64GH66OHP7A4VAQBIQ\windows-jdk9-m3.5.x_build\maven-release-plugin\target\invoker-reports\BUILD-projects_update-versions_MRELEASE-976.xml]
[windows-jdk9-m3.5.x_build] Found logs:[f:\jenkins\jenkins-slave\workspace\en-box_maven-release_master-OCKGULQBCZ67VBKJ7HF6E7KZUCKX7ZC6FX64GH66OHP7A4VAQBIQ\windows-jdk9-m3.5.x_build\maven-release-plugin\target\it\projects\update-versions\MRELEASE-555\build.log, f:\jenkins\jenkins-slave\workspace\en-box_maven-release_master-OCKGULQBCZ67VBKJ7HF6E7KZUCKX7ZC6FX64GH66OHP7A4VAQBIQ\windows-jdk9-m3.5.x_build\maven-release-plugin\target\it\projects\update-versions\MRELEASE-611\build.log, f:\jenkins\jenkins-slave\workspace\en-box_maven-release_master-OCKGULQBCZ67VBKJ7HF6E7KZUCKX7ZC6FX64GH66OHP7A4VAQBIQ\windows-jdk9-m3.5.x_build\maven-release-plugin\target\it\projects\update-versions\MRELEASE-783\build.log, f:\jenkins\jenkins-slave\workspace\en-box_maven-release_master-OCKGULQBCZ67VBKJ7HF6E7KZUCKX7ZC6FX64GH66OHP7A4VAQBIQ\windows-jdk9-m3.5.x_build\maven-release-plugin\target\it\projects\update-versions\MRELEASE-976\build.log]
[windows-jdk9-m3.5.x_build] Finished parsing Maven Invoker results (found 4)
[windows-jdk9-m3.5.x_build] [withMaven] invokerPublisher - Archive invoker results for Maven artifact MavenArtifact{org.apache.maven.plugins:maven-release-plugin::3.0.0-SNAPSHOT(version: 3.0.0-SNAPSHOT, snapshot:false) } generated by PluginInvocation{org.apache.maven.plugins:maven-invoker-plugin:3.0.1@run  integration-test-update-versions}: windows-jdk9-m3.5.x_build\maven-release-plugin\target\invoker-reports\*.xml
[windows-jdk9-m3.5.x_build] performing MavenInvokerRecorder, reportsFilenamePattern:'**/windows-jdk9-m3.5.x_build\maven-release-plugin\target\invoker-reports/BUILD*.xml', invokerBuildDir:'**/windows-jdk9-m3.5.x_build\maven-release-plugin\target\it'
[windows-jdk9-m3.5.x_build] Found reports:[f:\jenkins\jenkins-slave\workspace\en-box_maven-release_master-OCKGULQBCZ67VBKJ7HF6E7KZUCKX7ZC6FX64GH66OHP7A4VAQBIQ\windows-jdk9-m3.5.x_build\maven-release-plugin\target\invoker-reports\BUILD-projects_update-versions_MRELEASE-555.xml, f:\jenkins\jenkins-slave\workspace\en-box_maven-release_master-OCKGULQBCZ67VBKJ7HF6E7KZUCKX7ZC6FX64GH66OHP7A4VAQBIQ\windows-jdk9-m3.5.x_build\maven-release-plugin\target\invoker-reports\BUILD-projects_update-versions_MRELEASE-611.xml, f:\jenkins\jenkins-slave\workspace\en-box_maven-release_master-OCKGULQBCZ67VBKJ7HF6E7KZUCKX7ZC6FX64GH66OHP7A4VAQBIQ\windows-jdk9-m3.5.x_build\maven-release-plugin\target\invoker-reports\BUILD-projects_update-versions_MRELEASE-783.xml, f:\jenkins\jenkins-slave\workspace\en-box_maven-release_master-OCKGULQBCZ67VBKJ7HF6E7KZUCKX7ZC6FX64GH66OHP7A4VAQBIQ\windows-jdk9-m3.5.x_build\maven-release-plugin\target\invoker-reports\BUILD-projects_update-versions_MRELEASE-976.xml]
[windows-jdk9-m3.5.x_build] Found logs:[f:\jenkins\jenkins-slave\workspace\en-box_maven-release_master-OCKGULQBCZ67VBKJ7HF6E7KZUCKX7ZC6FX64GH66OHP7A4VAQBIQ\windows-jdk9-m3.5.x_build\maven-release-plugin\target\it\projects\update-versions\MRELEASE-555\build.log, f:\jenkins\jenkins-slave\workspace\en-box_maven-release_master-OCKGULQBCZ67VBKJ7HF6E7KZUCKX7ZC6FX64GH66OHP7A4VAQBIQ\windows-jdk9-m3.5.x_build\maven-release-plugin\target\it\projects\update-versions\MRELEASE-611\build.log, f:\jenkins\jenkins-slave\workspace\en-box_maven-release_master-OCKGULQBCZ67VBKJ7HF6E7KZUCKX7ZC6FX64GH66OHP7A4VAQBIQ\windows-jdk9-m3.5.x_build\maven-release-plugin\target\it\projects\update-versions\MRELEASE-783\build.log, f:\jenkins\jenkins-slave\workspace\en-box_maven-release_master-OCKGULQBCZ67VBKJ7HF6E7KZUCKX7ZC6FX64GH66OHP7A4VAQBIQ\windows-jdk9-m3.5.x_build\maven-release-plugin\target\it\projects\update-versions\MRELEASE-976\build.log]
[windows-jdk9-m3.5.x_build] Finished parsing Maven Invoker results (found 4)
[windows-jdk9-m3.5.x_build] [withMaven] junitPublisher - Archive test results for Maven artifact org.apache.maven.release:maven-release-api:3.0.0-SNAPSHOT generated by maven-surefire-plugin:test (default-test): windows-jdk9-m3.5.x_build\maven-release-api\target\surefire-reports\*.xml
[windows-jdk9-m3.5.x_build] Recording test results
[windows-jdk9-m3.5.x_build] None of the test reports contained any result
[windows-jdk9-m3.5.x_build] [withMaven] junitPublisher - Archive test results for Maven artifact org.apache.maven.release:maven-release-manager:3.0.0-SNAPSHOT generated by maven-surefire-plugin:test (default-test): windows-jdk9-m3.5.x_build\maven-release-manager\target\surefire-reports\*.xml
[windows-jdk9-m3.5.x_build] Recording test results
[windows-jdk9-m3.5.x_build] [withMaven] junitPublisher - Archive test results for Maven artifact org.apache.maven.plugins:maven-release-plugin:3.0.0-SNAPSHOT generated by maven-surefire-plugin:test (default-test): windows-jdk9-m3.5.x_build\maven-release-plugin\target\surefire-reports\*.xml
[windows-jdk9-m3.5.x_build] Recording test results
[windows-jdk9-m3.5.x_build] [withMaven] junitPublisher - Archive test results for Maven artifact org.apache.maven.release:maven-release-oddeven-policy:3.0.0-SNAPSHOT generated by maven-surefire-plugin:test (default-test): windows-jdk9-m3.5.x_build\maven-release-policies\maven-release-oddeven-policy\target\surefire-reports\*.xml
[windows-jdk9-m3.5.x_build] Recording test results
[windows-jdk9-m3.5.x_build] [withMaven] junitPublisher - Archive test results for Maven artifact org.apache.maven.release:maven-release-semver-policy:3.0.0-SNAPSHOT generated by maven-surefire-plugin:test (default-test): windows-jdk9-m3.5.x_build\maven-release-policies\maven-release-semver-policy\target\surefire-reports\*.xml
[windows-jdk9-m3.5.x_build] Recording test results
[windows-jdk9-m3.5.x_build] [withMaven] junitPublisher - Archive test results for Maven artifact org.apache.maven.release:maven-release-manager:3.0.0-SNAPSHOT generated by maven-failsafe-plugin:integration-test (default): windows-jdk9-m3.5.x_build\maven-release-manager\target\failsafe-reports\*.xml
[windows-jdk9-m3.5.x_build] Recording test results
[windows-jdk9-m3.5.x_build] [withMaven] openTasksPublisher - Scan Tasks for Maven artifact org.apache.maven.release:maven-release-api:3.0.0-SNAPSHOT in source directory windows-jdk9-m3.5.x_build\maven-release-api\src\main\java
[windows-jdk9-m3.5.x_build] [withMaven] openTasksPublisher - Scan Tasks for Maven artifact org.apache.maven.release:maven-release-manager:3.0.0-SNAPSHOT in source directory windows-jdk9-m3.5.x_build\maven-release-manager\src\main\java
[windows-jdk9-m3.5.x_build] [withMaven] openTasksPublisher - Scan Tasks for Maven artifact org.apache.maven.plugins:maven-release-plugin:3.0.0-SNAPSHOT in source directory windows-jdk9-m3.5.x_build\maven-release-plugin\src\main\java
[windows-jdk9-m3.5.x_build] [withMaven] openTasksPublisher - Scan Tasks for Maven artifact org.apache.maven.release:maven-release-oddeven-policy:3.0.0-SNAPSHOT in source directory windows-jdk9-m3.5.x_build\maven-release-policies\maven-release-oddeven-policy\src\main\java
[windows-jdk9-m3.5.x_build] [withMaven] openTasksPublisher - Scan Tasks for Maven artifact org.apache.maven.release:maven-release-semver-policy:3.0.0-SNAPSHOT in source directory windows-jdk9-m3.5.x_build\maven-release-policies\maven-release-semver-policy\src\main\java
[windows-jdk9-m3.5.x_build] [TASKS] Scanning folder 'f:\jenkins\jenkins-slave\workspace\en-box_maven-release_master-OCKGULQBCZ67VBKJ7HF6E7KZUCKX7ZC6FX64GH66OHP7A4VAQBIQ' for files matching the pattern 'windows-jdk9-m3.5.x_build\maven-release-api\src\main\java\**\*,windows-jdk9-m3.5.x_build\maven-release-manager\src\main\java\**\*,windows-jdk9-m3.5.x_build\maven-release-plugin\src\main\java\**\*,windows-jdk9-m3.5.x_build\maven-release-policies\maven-release-oddeven-policy\src\main\java\**\*,windows-jdk9-m3.5.x_build\maven-release-policies\maven-release-semver-policy\src\main\java\**\*' - excludes: null
[windows-jdk9-m3.5.x_build] [TASKS] Found 130 files to scan for tasks
[windows-jdk9-m3.5.x_build] [TASKS] Found 21 open tasks.
[windows-jdk9-m3.5.x_build] Skipping warnings blame since pipelines do not have an SCM link.%n
[windows-jdk9-m3.5.x_build] [TASKS] Computing warning deltas based on reference build #54
[Pipeline] [windows-jdk9-m3.5.x_build] // withMaven
[Pipeline] [windows-jdk9-m3.5.x_build] cleanWs
[windows-jdk9-m3.5.x_build] [WS-CLEANUP] Deleting project workspace...[WS-CLEANUP] done
[Pipeline] [windows-jdk9-m3.5.x_build] }
[Pipeline] [windows-jdk9-m3.5.x_build] // stage
[Pipeline] [windows-jdk9-m3.5.x_build] }
[Pipeline] [windows-jdk9-m3.5.x_build] // node
[Pipeline] [windows-jdk9-m3.5.x_build] }
[Pipeline] // parallel
[Pipeline] stage
[Pipeline] { (Notifications)
[Pipeline] echo
Build result: FAILURE
[Pipeline] jiraIssueSelector
[Pipeline] emailext
Reply | Threaded
Open this post in threaded view
|

Build failed in Jenkins: Maven TLP » maven-release » master #58

Apache Jenkins Server-2
See https://builds.apache.org/job/maven-box/job/maven-release/job/master/58/

Changes:

* upgraded parent POM from 32 to 33

All tests passed

Build log:
[...truncated 7.42 MB...]
[windows-jdk8-m3.5.x_build] [INFO] Exclude: .maven/spy.log
[windows-jdk8-m3.5.x_build] [INFO] Exclude: dependency-reduced-pom.xml
[windows-jdk8-m3.5.x_build] [INFO] Exclude: .java-version
[windows-jdk8-m3.5.x_build] [INFO] 4 resources included (use -debug for more details)
[windows-jdk8-m3.5.x_build] [INFO] Rat check: Summary over all files. Unapproved: 0, unknown: 0, generated: 0, approved: 4 licenses.
[windows-jdk8-m3.5.x_build] [INFO]
[windows-jdk8-m3.5.x_build] [INFO] --- maven-remote-resources-plugin:1.5:process (process-resource-bundles) @ maven-release-oddeven-policy ---
[windows-jdk8-m3.5.x_build] [INFO]
[windows-jdk8-m3.5.x_build] [INFO] --- maven-resources-plugin:3.1.0:resources (default-resources) @ maven-release-oddeven-policy ---
[windows-jdk8-m3.5.x_build] [INFO] Using 'UTF-8' encoding to copy filtered resources.
[windows-jdk8-m3.5.x_build] [INFO] skip non existing resourceDirectory F:\jenkins\jenkins-slave\workspace\en-box_maven-release_master-OCKGULQBCZ67VBKJ7HF6E7KZUCKX7ZC6FX64GH66OHP7A4VAQBIQ\windows-jdk8-m3.5.x_build\maven-release-policies\maven-release-oddeven-policy\src\main\resources
[windows-jdk8-m3.5.x_build] [INFO] Copying 3 resources
[windows-jdk8-m3.5.x_build] [INFO]
[windows-jdk8-m3.5.x_build] [INFO] --- maven-compiler-plugin:3.7.0:compile (default-compile) @ maven-release-oddeven-policy ---
[windows-jdk8-m3.5.x_build] [INFO] Changes detected - recompiling the module!
[windows-jdk8-m3.5.x_build] [INFO] Compiling 2 source files to F:\jenkins\jenkins-slave\workspace\en-box_maven-release_master-OCKGULQBCZ67VBKJ7HF6E7KZUCKX7ZC6FX64GH66OHP7A4VAQBIQ\windows-jdk8-m3.5.x_build\maven-release-policies\maven-release-oddeven-policy\target\classes
[windows-jdk8-m3.5.x_build] [INFO]
[windows-jdk8-m3.5.x_build] [INFO] --- plexus-component-metadata:1.7.1:generate-metadata (process-classes) @ maven-release-oddeven-policy ---
[windows-jdk8-m3.5.x_build] [INFO] Discovered 1 component descriptors(s)
[windows-jdk8-m3.5.x_build] [INFO]
[windows-jdk8-m3.5.x_build] [INFO] --- maven-resources-plugin:3.1.0:testResources (default-testResources) @ maven-release-oddeven-policy ---
[windows-jdk8-m3.5.x_build] [INFO] Using 'UTF-8' encoding to copy filtered resources.
[windows-jdk8-m3.5.x_build] [INFO] skip non existing resourceDirectory F:\jenkins\jenkins-slave\workspace\en-box_maven-release_master-OCKGULQBCZ67VBKJ7HF6E7KZUCKX7ZC6FX64GH66OHP7A4VAQBIQ\windows-jdk8-m3.5.x_build\maven-release-policies\maven-release-oddeven-policy\src\test\resources
[windows-jdk8-m3.5.x_build] [INFO] Copying 3 resources
[windows-jdk8-m3.5.x_build] [INFO]
[windows-jdk8-m3.5.x_build] [INFO] --- maven-compiler-plugin:3.7.0:testCompile (default-testCompile) @ maven-release-oddeven-policy ---
[windows-jdk8-m3.5.x_build] [INFO] Changes detected - recompiling the module!
[windows-jdk8-m3.5.x_build] [INFO] Compiling 1 source file to F:\jenkins\jenkins-slave\workspace\en-box_maven-release_master-OCKGULQBCZ67VBKJ7HF6E7KZUCKX7ZC6FX64GH66OHP7A4VAQBIQ\windows-jdk8-m3.5.x_build\maven-release-policies\maven-release-oddeven-policy\target\test-classes
[windows-jdk8-m3.5.x_build] [INFO]
[windows-jdk8-m3.5.x_build] [INFO] --- maven-surefire-plugin:2.22.0:test (default-test) @ maven-release-oddeven-policy ---
[windows-jdk8-m3.5.x_build] [INFO]
[windows-jdk8-m3.5.x_build] [INFO] -------------------------------------------------------
[windows-jdk8-m3.5.x_build] [INFO]  T E S T S
[windows-jdk8-m3.5.x_build] [INFO] -------------------------------------------------------
[windows-jdk8-m3.5.x_build] [INFO] Running org.apache.maven.shared.release.policy.oddeven.OddEvenVersionPolicyTestCase
[windows-jdk8-m3.5.x_build] [INFO] Tests run: 3, Failures: 0, Errors: 0, Skipped: 0, Time elapsed: 0.227 s - in org.apache.maven.shared.release.policy.oddeven.OddEvenVersionPolicyTestCase
[windows-jdk8-m3.5.x_build] [INFO]
[windows-jdk8-m3.5.x_build] [INFO] Results:
[windows-jdk8-m3.5.x_build] [INFO]
[windows-jdk8-m3.5.x_build] [INFO] Tests run: 3, Failures: 0, Errors: 0, Skipped: 0
[windows-jdk8-m3.5.x_build] [INFO]
[windows-jdk8-m3.5.x_build] [INFO]
[windows-jdk8-m3.5.x_build] [INFO] --- maven-jar-plugin:3.1.0:jar (default-jar) @ maven-release-oddeven-policy ---
[windows-jdk8-m3.5.x_build] [INFO] Building jar: F:\jenkins\jenkins-slave\workspace\en-box_maven-release_master-OCKGULQBCZ67VBKJ7HF6E7KZUCKX7ZC6FX64GH66OHP7A4VAQBIQ\windows-jdk8-m3.5.x_build\maven-release-policies\maven-release-oddeven-policy\target\maven-release-oddeven-policy-3.0.0-SNAPSHOT.jar
[windows-jdk8-m3.5.x_build] [INFO]
[windows-jdk8-m3.5.x_build] [INFO] --- maven-site-plugin:3.7.1:attach-descriptor (attach-descriptor) @ maven-release-oddeven-policy ---
[windows-jdk8-m3.5.x_build] [INFO] Skipping because packaging 'jar' is not pom.
[windows-jdk8-m3.5.x_build] [INFO]
[windows-jdk8-m3.5.x_build] [INFO] --- maven-checkstyle-plugin:3.0.0:check (checkstyle-check) @ maven-release-oddeven-policy ---
[windows-jdk8-m3.5.x_build] [INFO]
[windows-jdk8-m3.5.x_build] [INFO] ------------------------------------------------------------------------
[windows-jdk8-m3.5.x_build] [INFO] Building Maven Release SemVer Policy 3.0.0-SNAPSHOT
[windows-jdk8-m3.5.x_build] [INFO] ------------------------------------------------------------------------
[windows-jdk8-m3.5.x_build] [INFO] Downloading from central: https://repo.maven.apache.org/maven2/org/semver/api/0.9.33/api-0.9.33.pom
[windows-jdk8-m3.5.x_build] [INFO] Downloaded from central: https://repo.maven.apache.org/maven2/org/semver/api/0.9.33/api-0.9.33.pom (2.8 kB at 118 kB/s)
[windows-jdk8-m3.5.x_build] [INFO] Downloading from central: https://repo.maven.apache.org/maven2/org/semver/parent/0.9.33/parent-0.9.33.pom
[windows-jdk8-m3.5.x_build] [INFO] Downloaded from central: https://repo.maven.apache.org/maven2/org/semver/parent/0.9.33/parent-0.9.33.pom (1.3 kB at 50 kB/s)
[windows-jdk8-m3.5.x_build] [INFO] Downloading from central: https://repo.maven.apache.org/maven2/com/github/jeluard/oss-parent/9/oss-parent-9.pom
[windows-jdk8-m3.5.x_build] [INFO] Downloaded from central: https://repo.maven.apache.org/maven2/com/github/jeluard/oss-parent/9/oss-parent-9.pom (12 kB at 445 kB/s)
[windows-jdk8-m3.5.x_build] [INFO] Downloading from central: https://repo.maven.apache.org/maven2/com/google/code/findbugs/jsr305/2.0.0/jsr305-2.0.0.pom
[windows-jdk8-m3.5.x_build] [INFO] Downloaded from central: https://repo.maven.apache.org/maven2/com/google/code/findbugs/jsr305/2.0.0/jsr305-2.0.0.pom (965 B at 32 kB/s)
[windows-jdk8-m3.5.x_build] [INFO] Downloading from central: https://repo.maven.apache.org/maven2/org/ow2/asm/asm/5.0.3/asm-5.0.3.pom
[windows-jdk8-m3.5.x_build] [INFO] Downloaded from central: https://repo.maven.apache.org/maven2/org/ow2/asm/asm/5.0.3/asm-5.0.3.pom (1.9 kB at 54 kB/s)
[windows-jdk8-m3.5.x_build] [INFO] Downloading from central: https://repo.maven.apache.org/maven2/org/ow2/asm/asm-parent/5.0.3/asm-parent-5.0.3.pom
[windows-jdk8-m3.5.x_build] [INFO] Downloaded from central: https://repo.maven.apache.org/maven2/org/ow2/asm/asm-parent/5.0.3/asm-parent-5.0.3.pom (5.5 kB at 211 kB/s)
[windows-jdk8-m3.5.x_build] [INFO] Downloading from central: https://repo.maven.apache.org/maven2/org/ow2/asm/asm-commons/5.0.3/asm-commons-5.0.3.pom
[windows-jdk8-m3.5.x_build] [INFO] Downloaded from central: https://repo.maven.apache.org/maven2/org/ow2/asm/asm-commons/5.0.3/asm-commons-5.0.3.pom (2.1 kB at 84 kB/s)
[windows-jdk8-m3.5.x_build] [INFO] Downloading from central: https://repo.maven.apache.org/maven2/org/ow2/asm/asm-tree/5.0.3/asm-tree-5.0.3.pom
[windows-jdk8-m3.5.x_build] [INFO] Downloaded from central: https://repo.maven.apache.org/maven2/org/ow2/asm/asm-tree/5.0.3/asm-tree-5.0.3.pom (2.1 kB at 51 kB/s)
[windows-jdk8-m3.5.x_build] [INFO] Downloading from central: https://repo.maven.apache.org/maven2/commons-lang/commons-lang/1.0/commons-lang-1.0.pom
[windows-jdk8-m3.5.x_build] [INFO] Downloaded from central: https://repo.maven.apache.org/maven2/commons-lang/commons-lang/1.0/commons-lang-1.0.pom (2.5 kB at 98 kB/s)
[windows-jdk8-m3.5.x_build] [INFO] Downloading from central: https://repo.maven.apache.org/maven2/de/tototec/de.tototec.cmdoption/0.2.0/de.tototec.cmdoption-0.2.0.pom
[windows-jdk8-m3.5.x_build] [INFO] Downloaded from central: https://repo.maven.apache.org/maven2/de/tototec/de.tototec.cmdoption/0.2.0/de.tototec.cmdoption-0.2.0.pom (956 B at 40 kB/s)
[windows-jdk8-m3.5.x_build] [INFO] Downloading from central: https://repo.maven.apache.org/maven2/org/semver/api/0.9.33/api-0.9.33.jar
[windows-jdk8-m3.5.x_build] [INFO] Downloading from central: https://repo.maven.apache.org/maven2/org/ow2/asm/asm-commons/5.0.3/asm-commons-5.0.3.jar
[windows-jdk8-m3.5.x_build] [INFO] Downloading from central: https://repo.maven.apache.org/maven2/com/google/code/findbugs/jsr305/2.0.0/jsr305-2.0.0.jar
[windows-jdk8-m3.5.x_build] [INFO] Downloading from central: https://repo.maven.apache.org/maven2/org/ow2/asm/asm/5.0.3/asm-5.0.3.jar
[windows-jdk8-m3.5.x_build] [INFO] Downloading from central: https://repo.maven.apache.org/maven2/org/ow2/asm/asm-tree/5.0.3/asm-tree-5.0.3.jar
[windows-jdk8-m3.5.x_build] [INFO] Downloaded from central: https://repo.maven.apache.org/maven2/org/ow2/asm/asm/5.0.3/asm-5.0.3.jar (53 kB at 193 kB/s)
[windows-jdk8-m3.5.x_build] [INFO] Downloading from central: https://repo.maven.apache.org/maven2/commons-lang/commons-lang/1.0/commons-lang-1.0.jar
[windows-jdk8-m3.5.x_build] [INFO] Downloaded from central: https://repo.maven.apache.org/maven2/commons-lang/commons-lang/1.0/commons-lang-1.0.jar (64 kB at 167 kB/s)
[windows-jdk8-m3.5.x_build] [INFO] Downloading from central: https://repo.maven.apache.org/maven2/de/tototec/de.tototec.cmdoption/0.2.0/de.tototec.cmdoption-0.2.0.jar
[windows-jdk8-m3.5.x_build] [INFO] Downloaded from central: https://repo.maven.apache.org/maven2/org/ow2/asm/asm-commons/5.0.3/asm-commons-5.0.3.jar (42 kB at 106 kB/s)
[windows-jdk8-m3.5.x_build] [INFO] Downloaded from central: https://repo.maven.apache.org/maven2/org/semver/api/0.9.33/api-0.9.33.jar (64 kB at 159 kB/s)
[windows-jdk8-m3.5.x_build] [INFO] Downloaded from central: https://repo.maven.apache.org/maven2/org/ow2/asm/asm-tree/5.0.3/asm-tree-5.0.3.jar (29 kB at 68 kB/s)
[windows-jdk8-m3.5.x_build] [INFO] Downloaded from central: https://repo.maven.apache.org/maven2/com/google/code/findbugs/jsr305/2.0.0/jsr305-2.0.0.jar (32 kB at 71 kB/s)
[windows-jdk8-m3.5.x_build] [INFO] Downloaded from central: https://repo.maven.apache.org/maven2/de/tototec/de.tototec.cmdoption/0.2.0/de.tototec.cmdoption-0.2.0.jar (42 kB at 67 kB/s)
[windows-jdk8-m3.5.x_build] [INFO]
[windows-jdk8-m3.5.x_build] [INFO] --- maven-clean-plugin:3.1.0:clean (default-clean) @ maven-release-semver-policy ---
[windows-jdk8-m3.5.x_build] [INFO]
[windows-jdk8-m3.5.x_build] [INFO] --- maven-enforcer-plugin:1.4.1:enforce (enforce-maven-version) @ maven-release-semver-policy ---
[windows-jdk8-m3.5.x_build] [INFO]
[windows-jdk8-m3.5.x_build] [INFO] --- maven-enforcer-plugin:1.4.1:enforce (enforce-bytecode-version) @ maven-release-semver-policy ---
[windows-jdk8-m3.5.x_build] [INFO]
[windows-jdk8-m3.5.x_build] [INFO] --- maven-enforcer-plugin:1.4.1:enforce (ban-known-bad-maven-versions) @ maven-release-semver-policy ---
[windows-jdk8-m3.5.x_build] [INFO]
[windows-jdk8-m3.5.x_build] [INFO] --- apache-rat-plugin:0.12:check (rat-check) @ maven-release-semver-policy ---
[windows-jdk8-m3.5.x_build] [INFO] Enabled default license matchers.
[windows-jdk8-m3.5.x_build] [INFO] Will parse SCM ignores for exclusions...
[windows-jdk8-m3.5.x_build] [INFO] Finished adding exclusions from SCM ignore files.
[windows-jdk8-m3.5.x_build] [INFO] 61 implicit excludes (use -debug for more details).
[windows-jdk8-m3.5.x_build] [INFO] Exclude: .repository
[windows-jdk8-m3.5.x_build] [INFO] Exclude: Jenkinsfile
[windows-jdk8-m3.5.x_build] [INFO] Exclude: .repository/**
[windows-jdk8-m3.5.x_build] [INFO] Exclude: .maven/spy.log
[windows-jdk8-m3.5.x_build] [INFO] Exclude: dependency-reduced-pom.xml
[windows-jdk8-m3.5.x_build] [INFO] Exclude: .java-version
[windows-jdk8-m3.5.x_build] [INFO] 3 resources included (use -debug for more details)
[windows-jdk8-m3.5.x_build] [INFO] Rat check: Summary over all files. Unapproved: 0, unknown: 0, generated: 0, approved: 3 licenses.
[windows-jdk8-m3.5.x_build] [INFO]
[windows-jdk8-m3.5.x_build] [INFO] --- maven-remote-resources-plugin:1.5:process (process-resource-bundles) @ maven-release-semver-policy ---
[windows-jdk8-m3.5.x_build] [INFO]
[windows-jdk8-m3.5.x_build] [INFO] --- maven-resources-plugin:3.1.0:resources (default-resources) @ maven-release-semver-policy ---
[windows-jdk8-m3.5.x_build] [INFO] Using 'UTF-8' encoding to copy filtered resources.
[windows-jdk8-m3.5.x_build] [INFO] skip non existing resourceDirectory F:\jenkins\jenkins-slave\workspace\en-box_maven-release_master-OCKGULQBCZ67VBKJ7HF6E7KZUCKX7ZC6FX64GH66OHP7A4VAQBIQ\windows-jdk8-m3.5.x_build\maven-release-policies\maven-release-semver-policy\src\main\resources
[windows-jdk8-m3.5.x_build] [INFO] Copying 3 resources
[windows-jdk8-m3.5.x_build] [INFO]
[windows-jdk8-m3.5.x_build] [INFO] --- maven-compiler-plugin:3.7.0:compile (default-compile) @ maven-release-semver-policy ---
[windows-jdk8-m3.5.x_build] [INFO] Changes detected - recompiling the module!
[windows-jdk8-m3.5.x_build] [INFO] Compiling 1 source file to F:\jenkins\jenkins-slave\workspace\en-box_maven-release_master-OCKGULQBCZ67VBKJ7HF6E7KZUCKX7ZC6FX64GH66OHP7A4VAQBIQ\windows-jdk8-m3.5.x_build\maven-release-policies\maven-release-semver-policy\target\classes
[windows-jdk8-m3.5.x_build] [INFO]
[windows-jdk8-m3.5.x_build] [INFO] --- plexus-component-metadata:1.7.1:generate-metadata (process-classes) @ maven-release-semver-policy ---
[windows-jdk8-m3.5.x_build] [INFO] Discovered 1 component descriptors(s)
[windows-jdk8-m3.5.x_build] [INFO]
[windows-jdk8-m3.5.x_build] [INFO] --- maven-resources-plugin:3.1.0:testResources (default-testResources) @ maven-release-semver-policy ---
[windows-jdk8-m3.5.x_build] [INFO] Using 'UTF-8' encoding to copy filtered resources.
[windows-jdk8-m3.5.x_build] [INFO] skip non existing resourceDirectory F:\jenkins\jenkins-slave\workspace\en-box_maven-release_master-OCKGULQBCZ67VBKJ7HF6E7KZUCKX7ZC6FX64GH66OHP7A4VAQBIQ\windows-jdk8-m3.5.x_build\maven-release-policies\maven-release-semver-policy\src\test\resources
[windows-jdk8-m3.5.x_build] [INFO] Copying 3 resources
[windows-jdk8-m3.5.x_build] [INFO]
[windows-jdk8-m3.5.x_build] [INFO] --- maven-compiler-plugin:3.7.0:testCompile (default-testCompile) @ maven-release-semver-policy ---
[windows-jdk8-m3.5.x_build] [INFO] Changes detected - recompiling the module!
[windows-jdk8-m3.5.x_build] [INFO] Compiling 1 source file to F:\jenkins\jenkins-slave\workspace\en-box_maven-release_master-OCKGULQBCZ67VBKJ7HF6E7KZUCKX7ZC6FX64GH66OHP7A4VAQBIQ\windows-jdk8-m3.5.x_build\maven-release-policies\maven-release-semver-policy\target\test-classes
[windows-jdk8-m3.5.x_build] [INFO]
[windows-jdk8-m3.5.x_build] [INFO] --- maven-surefire-plugin:2.22.0:test (default-test) @ maven-release-semver-policy ---
[windows-jdk8-m3.5.x_build] [INFO]
[windows-jdk8-m3.5.x_build] [INFO] -------------------------------------------------------
[windows-jdk8-m3.5.x_build] [INFO]  T E S T S
[windows-jdk8-m3.5.x_build] [INFO] -------------------------------------------------------
[windows-jdk8-m3.5.x_build] [INFO] Running org.apache.maven.shared.release.policy.semver.SemVerVersionPolicyTest
[windows-jdk8-m3.5.x_build] [INFO] Tests run: 2, Failures: 0, Errors: 0, Skipped: 0, Time elapsed: 0.163 s - in org.apache.maven.shared.release.policy.semver.SemVerVersionPolicyTest
[windows-jdk8-m3.5.x_build] [INFO]
[windows-jdk8-m3.5.x_build] [INFO] Results:
[windows-jdk8-m3.5.x_build] [INFO]
[windows-jdk8-m3.5.x_build] [INFO] Tests run: 2, Failures: 0, Errors: 0, Skipped: 0
[windows-jdk8-m3.5.x_build] [INFO]
[windows-jdk8-m3.5.x_build] [INFO]
[windows-jdk8-m3.5.x_build] [INFO] --- maven-jar-plugin:3.1.0:jar (default-jar) @ maven-release-semver-policy ---
[windows-jdk8-m3.5.x_build] [INFO] Building jar: F:\jenkins\jenkins-slave\workspace\en-box_maven-release_master-OCKGULQBCZ67VBKJ7HF6E7KZUCKX7ZC6FX64GH66OHP7A4VAQBIQ\windows-jdk8-m3.5.x_build\maven-release-policies\maven-release-semver-policy\target\maven-release-semver-policy-3.0.0-SNAPSHOT.jar
[windows-jdk8-m3.5.x_build] [INFO]
[windows-jdk8-m3.5.x_build] [INFO] --- maven-site-plugin:3.7.1:attach-descriptor (attach-descriptor) @ maven-release-semver-policy ---
[windows-jdk8-m3.5.x_build] [INFO] Skipping because packaging 'jar' is not pom.
[windows-jdk8-m3.5.x_build] [INFO]
[windows-jdk8-m3.5.x_build] [INFO] --- maven-checkstyle-plugin:3.0.0:check (checkstyle-check) @ maven-release-semver-policy ---
[windows-jdk8-m3.5.x_build] [INFO] ------------------------------------------------------------------------
[windows-jdk8-m3.5.x_build] [INFO] Reactor Summary:
[windows-jdk8-m3.5.x_build] [INFO]
[windows-jdk8-m3.5.x_build] [INFO] Maven Release ...................................... SUCCESS [ 46.991 s]
[windows-jdk8-m3.5.x_build] [INFO] Maven Release APIs ................................. SUCCESS [ 11.674 s]
[windows-jdk8-m3.5.x_build] [INFO] Maven Release Manager .............................. SUCCESS [02:46 min]
[windows-jdk8-m3.5.x_build] [INFO] Maven Release Plugin ............................... SUCCESS [08:11 min]
[windows-jdk8-m3.5.x_build] [INFO] Maven Release Odd-Even Policy ...................... SUCCESS [  7.056 s]
[windows-jdk8-m3.5.x_build] [INFO] Maven Release SemVer Policy ........................ SUCCESS [  5.625 s]
[windows-jdk8-m3.5.x_build] [INFO] ------------------------------------------------------------------------
[windows-jdk8-m3.5.x_build] [INFO] BUILD SUCCESS
[windows-jdk8-m3.5.x_build] [INFO] ------------------------------------------------------------------------
[windows-jdk8-m3.5.x_build] [INFO] Total time: 12:11 min
[windows-jdk8-m3.5.x_build] [INFO] Finished at: 2018-09-15T14:14:54-07:00
[windows-jdk8-m3.5.x_build] [INFO] Final Memory: 66M/1053M
[windows-jdk8-m3.5.x_build] [INFO] ------------------------------------------------------------------------
[windows-jdk8-m3.5.x_build] [INFO] [jenkins-event-spy] Generated F:\jenkins\jenkins-slave\workspace\en-box_maven-release_master-OCKGULQBCZ67VBKJ7HF6E7KZUCKX7ZC6FX64GH66OHP7A4VAQBIQ@tmp\withMavenea3cc2db\maven-spy-20180915-140242-14908416361046183277.log
[windows-jdk8-m3.5.x_build] Picked up JAVA_TOOL_OPTIONS: -Dmaven.ext.class.path="f:\jenkins\jenkins-slave\workspace\en-box_maven-release_master-OCKGULQBCZ67VBKJ7HF6E7KZUCKX7ZC6FX64GH66OHP7A4VAQBIQ@tmp\withMavenea3cc2db\pipeline-maven-spy.jar" -Dorg.jenkinsci.plugins.pipeline.maven.reportsFolder="f:\jenkins\jenkins-slave\workspace\en-box_maven-release_master-OCKGULQBCZ67VBKJ7HF6E7KZUCKX7ZC6FX64GH66OHP7A4VAQBIQ@tmp\withMavenea3cc2db"
[Pipeline] [windows-jdk8-m3.5.x_build] }
[Pipeline] [windows-jdk8-m3.5.x_build] // dir
[Pipeline] [windows-jdk8-m3.5.x_build] }
[windows-jdk8-m3.5.x_build] [withMaven] artifactsPublisher - Archive artifact windows-jdk8-m3.5.x_build\pom.xml under org\apache\maven\release\maven-release\3.0.0-SNAPSHOT\maven-release-3.0.0-SNAPSHOT.pom
[windows-jdk8-m3.5.x_build] [withMaven] artifactsPublisher - Archive artifact windows-jdk8-m3.5.x_build\target\maven-release-3.0.0-SNAPSHOT-site.xml under org\apache\maven\release\maven-release\3.0.0-SNAPSHOT\maven-release-3.0.0-SNAPSHOT-site.xml
[windows-jdk8-m3.5.x_build] [withMaven] artifactsPublisher - Archive artifact windows-jdk8-m3.5.x_build\maven-release-api\pom.xml under org\apache\maven\release\maven-release-api\3.0.0-SNAPSHOT\maven-release-api-3.0.0-SNAPSHOT.pom
[windows-jdk8-m3.5.x_build] [withMaven] artifactsPublisher - Archive artifact windows-jdk8-m3.5.x_build\maven-release-api\target\maven-release-api-3.0.0-SNAPSHOT.jar under org\apache\maven\release\maven-release-api\3.0.0-SNAPSHOT\maven-release-api-3.0.0-SNAPSHOT.jar
[windows-jdk8-m3.5.x_build] [withMaven] artifactsPublisher - Archive artifact windows-jdk8-m3.5.x_build\maven-release-manager\pom.xml under org\apache\maven\release\maven-release-manager\3.0.0-SNAPSHOT\maven-release-manager-3.0.0-SNAPSHOT.pom
[windows-jdk8-m3.5.x_build] [withMaven] artifactsPublisher - Archive artifact windows-jdk8-m3.5.x_build\maven-release-manager\target\maven-release-manager-3.0.0-SNAPSHOT.jar under org\apache\maven\release\maven-release-manager\3.0.0-SNAPSHOT\maven-release-manager-3.0.0-SNAPSHOT.jar
[windows-jdk8-m3.5.x_build] [withMaven] artifactsPublisher - Archive artifact windows-jdk8-m3.5.x_build\maven-release-plugin\pom.xml under org\apache\maven\plugins\maven-release-plugin\3.0.0-SNAPSHOT\maven-release-plugin-3.0.0-SNAPSHOT.pom
[windows-jdk8-m3.5.x_build] [withMaven] artifactsPublisher - Archive artifact windows-jdk8-m3.5.x_build\maven-release-plugin\target\maven-release-plugin-3.0.0-SNAPSHOT.jar under org\apache\maven\plugins\maven-release-plugin\3.0.0-SNAPSHOT\maven-release-plugin-3.0.0-SNAPSHOT.jar
[windows-jdk8-m3.5.x_build] [withMaven] artifactsPublisher - Archive artifact windows-jdk8-m3.5.x_build\maven-release-policies\maven-release-oddeven-policy\pom.xml under org\apache\maven\release\maven-release-oddeven-policy\3.0.0-SNAPSHOT\maven-release-oddeven-policy-3.0.0-SNAPSHOT.pom
[windows-jdk8-m3.5.x_build] [withMaven] artifactsPublisher - Archive artifact windows-jdk8-m3.5.x_build\maven-release-policies\maven-release-oddeven-policy\target\maven-release-oddeven-policy-3.0.0-SNAPSHOT.jar under org\apache\maven\release\maven-release-oddeven-policy\3.0.0-SNAPSHOT\maven-release-oddeven-policy-3.0.0-SNAPSHOT.jar
[windows-jdk8-m3.5.x_build] [withMaven] artifactsPublisher - Archive artifact windows-jdk8-m3.5.x_build\maven-release-policies\maven-release-semver-policy\pom.xml under org\apache\maven\release\maven-release-semver-policy\3.0.0-SNAPSHOT\maven-release-semver-policy-3.0.0-SNAPSHOT.pom
[windows-jdk8-m3.5.x_build] [withMaven] artifactsPublisher - Archive artifact windows-jdk8-m3.5.x_build\maven-release-policies\maven-release-semver-policy\target\maven-release-semver-policy-3.0.0-SNAPSHOT.jar under org\apache\maven\release\maven-release-semver-policy\3.0.0-SNAPSHOT\maven-release-semver-policy-3.0.0-SNAPSHOT.jar
[windows-jdk8-m3.5.x_build] [withMaven] invokerPublisher - Archive invoker results for Maven artifact MavenArtifact{org.apache.maven.plugins:maven-release-plugin::3.0.0-SNAPSHOT(version: 3.0.0-SNAPSHOT, snapshot:false) } generated by PluginInvocation{org.apache.maven.plugins:maven-invoker-plugin:3.0.1@run  integration-test-prepare}: windows-jdk8-m3.5.x_build\maven-release-plugin\target\invoker-reports\*.xml
[windows-jdk8-m3.5.x_build] performing MavenInvokerRecorder, reportsFilenamePattern:'**/windows-jdk8-m3.5.x_build\maven-release-plugin\target\invoker-reports/BUILD*.xml', invokerBuildDir:'**/windows-jdk8-m3.5.x_build\maven-release-plugin\target\it'
[windows-jdk8-m3.5.x_build] Found reports:[f:\jenkins\jenkins-slave\workspace\en-box_maven-release_master-OCKGULQBCZ67VBKJ7HF6E7KZUCKX7ZC6FX64GH66OHP7A4VAQBIQ\windows-jdk8-m3.5.x_build\maven-release-plugin\target\invoker-reports\BUILD-projects_update-versions_MRELEASE-555.xml, f:\jenkins\jenkins-slave\workspace\en-box_maven-release_master-OCKGULQBCZ67VBKJ7HF6E7KZUCKX7ZC6FX64GH66OHP7A4VAQBIQ\windows-jdk8-m3.5.x_build\maven-release-plugin\target\invoker-reports\BUILD-projects_update-versions_MRELEASE-611.xml, f:\jenkins\jenkins-slave\workspace\en-box_maven-release_master-OCKGULQBCZ67VBKJ7HF6E7KZUCKX7ZC6FX64GH66OHP7A4VAQBIQ\windows-jdk8-m3.5.x_build\maven-release-plugin\target\invoker-reports\BUILD-projects_update-versions_MRELEASE-783.xml, f:\jenkins\jenkins-slave\workspace\en-box_maven-release_master-OCKGULQBCZ67VBKJ7HF6E7KZUCKX7ZC6FX64GH66OHP7A4VAQBIQ\windows-jdk8-m3.5.x_build\maven-release-plugin\target\invoker-reports\BUILD-projects_update-versions_MRELEASE-976.xml]
[windows-jdk8-m3.5.x_build] Found logs:[f:\jenkins\jenkins-slave\workspace\en-box_maven-release_master-OCKGULQBCZ67VBKJ7HF6E7KZUCKX7ZC6FX64GH66OHP7A4VAQBIQ\windows-jdk8-m3.5.x_build\maven-release-plugin\target\it\projects\update-versions\MRELEASE-555\build.log, f:\jenkins\jenkins-slave\workspace\en-box_maven-release_master-OCKGULQBCZ67VBKJ7HF6E7KZUCKX7ZC6FX64GH66OHP7A4VAQBIQ\windows-jdk8-m3.5.x_build\maven-release-plugin\target\it\projects\update-versions\MRELEASE-611\build.log, f:\jenkins\jenkins-slave\workspace\en-box_maven-release_master-OCKGULQBCZ67VBKJ7HF6E7KZUCKX7ZC6FX64GH66OHP7A4VAQBIQ\windows-jdk8-m3.5.x_build\maven-release-plugin\target\it\projects\update-versions\MRELEASE-783\build.log, f:\jenkins\jenkins-slave\workspace\en-box_maven-release_master-OCKGULQBCZ67VBKJ7HF6E7KZUCKX7ZC6FX64GH66OHP7A4VAQBIQ\windows-jdk8-m3.5.x_build\maven-release-plugin\target\it\projects\update-versions\MRELEASE-976\build.log]
[windows-jdk8-m3.5.x_build] Finished parsing Maven Invoker results (found 4)
[windows-jdk8-m3.5.x_build] [withMaven] invokerPublisher - Archive invoker results for Maven artifact MavenArtifact{org.apache.maven.plugins:maven-release-plugin::3.0.0-SNAPSHOT(version: 3.0.0-SNAPSHOT, snapshot:false) } generated by PluginInvocation{org.apache.maven.plugins:maven-invoker-plugin:3.0.1@run  integration-test-prepare-with-pom}: windows-jdk8-m3.5.x_build\maven-release-plugin\target\invoker-reports\*.xml
[windows-jdk8-m3.5.x_build] performing MavenInvokerRecorder, reportsFilenamePattern:'**/windows-jdk8-m3.5.x_build\maven-release-plugin\target\invoker-reports/BUILD*.xml', invokerBuildDir:'**/windows-jdk8-m3.5.x_build\maven-release-plugin\target\it'
[windows-jdk8-m3.5.x_build] Found reports:[f:\jenkins\jenkins-slave\workspace\en-box_maven-release_master-OCKGULQBCZ67VBKJ7HF6E7KZUCKX7ZC6FX64GH66OHP7A4VAQBIQ\windows-jdk8-m3.5.x_build\maven-release-plugin\target\invoker-reports\BUILD-projects_update-versions_MRELEASE-555.xml, f:\jenkins\jenkins-slave\workspace\en-box_maven-release_master-OCKGULQBCZ67VBKJ7HF6E7KZUCKX7ZC6FX64GH66OHP7A4VAQBIQ\windows-jdk8-m3.5.x_build\maven-release-plugin\target\invoker-reports\BUILD-projects_update-versions_MRELEASE-611.xml, f:\jenkins\jenkins-slave\workspace\en-box_maven-release_master-OCKGULQBCZ67VBKJ7HF6E7KZUCKX7ZC6FX64GH66OHP7A4VAQBIQ\windows-jdk8-m3.5.x_build\maven-release-plugin\target\invoker-reports\BUILD-projects_update-versions_MRELEASE-783.xml, f:\jenkins\jenkins-slave\workspace\en-box_maven-release_master-OCKGULQBCZ67VBKJ7HF6E7KZUCKX7ZC6FX64GH66OHP7A4VAQBIQ\windows-jdk8-m3.5.x_build\maven-release-plugin\target\invoker-reports\BUILD-projects_update-versions_MRELEASE-976.xml]
[windows-jdk8-m3.5.x_build] Found logs:[f:\jenkins\jenkins-slave\workspace\en-box_maven-release_master-OCKGULQBCZ67VBKJ7HF6E7KZUCKX7ZC6FX64GH66OHP7A4VAQBIQ\windows-jdk8-m3.5.x_build\maven-release-plugin\target\it\projects\update-versions\MRELEASE-555\build.log, f:\jenkins\jenkins-slave\workspace\en-box_maven-release_master-OCKGULQBCZ67VBKJ7HF6E7KZUCKX7ZC6FX64GH66OHP7A4VAQBIQ\windows-jdk8-m3.5.x_build\maven-release-plugin\target\it\projects\update-versions\MRELEASE-611\build.log, f:\jenkins\jenkins-slave\workspace\en-box_maven-release_master-OCKGULQBCZ67VBKJ7HF6E7KZUCKX7ZC6FX64GH66OHP7A4VAQBIQ\windows-jdk8-m3.5.x_build\maven-release-plugin\target\it\projects\update-versions\MRELEASE-783\build.log, f:\jenkins\jenkins-slave\workspace\en-box_maven-release_master-OCKGULQBCZ67VBKJ7HF6E7KZUCKX7ZC6FX64GH66OHP7A4VAQBIQ\windows-jdk8-m3.5.x_build\maven-release-plugin\target\it\projects\update-versions\MRELEASE-976\build.log]
[windows-jdk8-m3.5.x_build] Finished parsing Maven Invoker results (found 4)
[windows-jdk8-m3.5.x_build] [withMaven] invokerPublisher - Archive invoker results for Maven artifact MavenArtifact{org.apache.maven.plugins:maven-release-plugin::3.0.0-SNAPSHOT(version: 3.0.0-SNAPSHOT, snapshot:false) } generated by PluginInvocation{org.apache.maven.plugins:maven-invoker-plugin:3.0.1@run  integration-test-branch}: windows-jdk8-m3.5.x_build\maven-release-plugin\target\invoker-reports\*.xml
[windows-jdk8-m3.5.x_build] performing MavenInvokerRecorder, reportsFilenamePattern:'**/windows-jdk8-m3.5.x_build\maven-release-plugin\target\invoker-reports/BUILD*.xml', invokerBuildDir:'**/windows-jdk8-m3.5.x_build\maven-release-plugin\target\it'
[windows-jdk8-m3.5.x_build] Found reports:[f:\jenkins\jenkins-slave\workspace\en-box_maven-release_master-OCKGULQBCZ67VBKJ7HF6E7KZUCKX7ZC6FX64GH66OHP7A4VAQBIQ\windows-jdk8-m3.5.x_build\maven-release-plugin\target\invoker-reports\BUILD-projects_update-versions_MRELEASE-555.xml, f:\jenkins\jenkins-slave\workspace\en-box_maven-release_master-OCKGULQBCZ67VBKJ7HF6E7KZUCKX7ZC6FX64GH66OHP7A4VAQBIQ\windows-jdk8-m3.5.x_build\maven-release-plugin\target\invoker-reports\BUILD-projects_update-versions_MRELEASE-611.xml, f:\jenkins\jenkins-slave\workspace\en-box_maven-release_master-OCKGULQBCZ67VBKJ7HF6E7KZUCKX7ZC6FX64GH66OHP7A4VAQBIQ\windows-jdk8-m3.5.x_build\maven-release-plugin\target\invoker-reports\BUILD-projects_update-versions_MRELEASE-783.xml, f:\jenkins\jenkins-slave\workspace\en-box_maven-release_master-OCKGULQBCZ67VBKJ7HF6E7KZUCKX7ZC6FX64GH66OHP7A4VAQBIQ\windows-jdk8-m3.5.x_build\maven-release-plugin\target\invoker-reports\BUILD-projects_update-versions_MRELEASE-976.xml]
[windows-jdk8-m3.5.x_build] Found logs:[f:\jenkins\jenkins-slave\workspace\en-box_maven-release_master-OCKGULQBCZ67VBKJ7HF6E7KZUCKX7ZC6FX64GH66OHP7A4VAQBIQ\windows-jdk8-m3.5.x_build\maven-release-plugin\target\it\projects\update-versions\MRELEASE-555\build.log, f:\jenkins\jenkins-slave\workspace\en-box_maven-release_master-OCKGULQBCZ67VBKJ7HF6E7KZUCKX7ZC6FX64GH66OHP7A4VAQBIQ\windows-jdk8-m3.5.x_build\maven-release-plugin\target\it\projects\update-versions\MRELEASE-611\build.log, f:\jenkins\jenkins-slave\workspace\en-box_maven-release_master-OCKGULQBCZ67VBKJ7HF6E7KZUCKX7ZC6FX64GH66OHP7A4VAQBIQ\windows-jdk8-m3.5.x_build\maven-release-plugin\target\it\projects\update-versions\MRELEASE-783\build.log, f:\jenkins\jenkins-slave\workspace\en-box_maven-release_master-OCKGULQBCZ67VBKJ7HF6E7KZUCKX7ZC6FX64GH66OHP7A4VAQBIQ\windows-jdk8-m3.5.x_build\maven-release-plugin\target\it\projects\update-versions\MRELEASE-976\build.log]
[windows-jdk8-m3.5.x_build] Finished parsing Maven Invoker results (found 4)
[windows-jdk8-m3.5.x_build] [withMaven] invokerPublisher - Archive invoker results for Maven artifact MavenArtifact{org.apache.maven.plugins:maven-release-plugin::3.0.0-SNAPSHOT(version: 3.0.0-SNAPSHOT, snapshot:false) } generated by PluginInvocation{org.apache.maven.plugins:maven-invoker-plugin:3.0.1@run  integration-test-perform}: windows-jdk8-m3.5.x_build\maven-release-plugin\target\invoker-reports\*.xml
[windows-jdk8-m3.5.x_build] performing MavenInvokerRecorder, reportsFilenamePattern:'**/windows-jdk8-m3.5.x_build\maven-release-plugin\target\invoker-reports/BUILD*.xml', invokerBuildDir:'**/windows-jdk8-m3.5.x_build\maven-release-plugin\target\it'
[windows-jdk8-m3.5.x_build] Found reports:[f:\jenkins\jenkins-slave\workspace\en-box_maven-release_master-OCKGULQBCZ67VBKJ7HF6E7KZUCKX7ZC6FX64GH66OHP7A4VAQBIQ\windows-jdk8-m3.5.x_build\maven-release-plugin\target\invoker-reports\BUILD-projects_update-versions_MRELEASE-555.xml, f:\jenkins\jenkins-slave\workspace\en-box_maven-release_master-OCKGULQBCZ67VBKJ7HF6E7KZUCKX7ZC6FX64GH66OHP7A4VAQBIQ\windows-jdk8-m3.5.x_build\maven-release-plugin\target\invoker-reports\BUILD-projects_update-versions_MRELEASE-611.xml, f:\jenkins\jenkins-slave\workspace\en-box_maven-release_master-OCKGULQBCZ67VBKJ7HF6E7KZUCKX7ZC6FX64GH66OHP7A4VAQBIQ\windows-jdk8-m3.5.x_build\maven-release-plugin\target\invoker-reports\BUILD-projects_update-versions_MRELEASE-783.xml, f:\jenkins\jenkins-slave\workspace\en-box_maven-release_master-OCKGULQBCZ67VBKJ7HF6E7KZUCKX7ZC6FX64GH66OHP7A4VAQBIQ\windows-jdk8-m3.5.x_build\maven-release-plugin\target\invoker-reports\BUILD-projects_update-versions_MRELEASE-976.xml]
[windows-jdk8-m3.5.x_build] Found logs:[f:\jenkins\jenkins-slave\workspace\en-box_maven-release_master-OCKGULQBCZ67VBKJ7HF6E7KZUCKX7ZC6FX64GH66OHP7A4VAQBIQ\windows-jdk8-m3.5.x_build\maven-release-plugin\target\it\projects\update-versions\MRELEASE-555\build.log, f:\jenkins\jenkins-slave\workspace\en-box_maven-release_master-OCKGULQBCZ67VBKJ7HF6E7KZUCKX7ZC6FX64GH66OHP7A4VAQBIQ\windows-jdk8-m3.5.x_build\maven-release-plugin\target\it\projects\update-versions\MRELEASE-611\build.log, f:\jenkins\jenkins-slave\workspace\en-box_maven-release_master-OCKGULQBCZ67VBKJ7HF6E7KZUCKX7ZC6FX64GH66OHP7A4VAQBIQ\windows-jdk8-m3.5.x_build\maven-release-plugin\target\it\projects\update-versions\MRELEASE-783\build.log, f:\jenkins\jenkins-slave\workspace\en-box_maven-release_master-OCKGULQBCZ67VBKJ7HF6E7KZUCKX7ZC6FX64GH66OHP7A4VAQBIQ\windows-jdk8-m3.5.x_build\maven-release-plugin\target\it\projects\update-versions\MRELEASE-976\build.log]
[windows-jdk8-m3.5.x_build] Finished parsing Maven Invoker results (found 4)
[windows-jdk8-m3.5.x_build] [withMaven] invokerPublisher - Archive invoker results for Maven artifact MavenArtifact{org.apache.maven.plugins:maven-release-plugin::3.0.0-SNAPSHOT(version: 3.0.0-SNAPSHOT, snapshot:false) } generated by PluginInvocation{org.apache.maven.plugins:maven-invoker-plugin:3.0.1@run  integration-test-update-versions}: windows-jdk8-m3.5.x_build\maven-release-plugin\target\invoker-reports\*.xml
[windows-jdk8-m3.5.x_build] performing MavenInvokerRecorder, reportsFilenamePattern:'**/windows-jdk8-m3.5.x_build\maven-release-plugin\target\invoker-reports/BUILD*.xml', invokerBuildDir:'**/windows-jdk8-m3.5.x_build\maven-release-plugin\target\it'
[windows-jdk8-m3.5.x_build] Found reports:[f:\jenkins\jenkins-slave\workspace\en-box_maven-release_master-OCKGULQBCZ67VBKJ7HF6E7KZUCKX7ZC6FX64GH66OHP7A4VAQBIQ\windows-jdk8-m3.5.x_build\maven-release-plugin\target\invoker-reports\BUILD-projects_update-versions_MRELEASE-555.xml, f:\jenkins\jenkins-slave\workspace\en-box_maven-release_master-OCKGULQBCZ67VBKJ7HF6E7KZUCKX7ZC6FX64GH66OHP7A4VAQBIQ\windows-jdk8-m3.5.x_build\maven-release-plugin\target\invoker-reports\BUILD-projects_update-versions_MRELEASE-611.xml, f:\jenkins\jenkins-slave\workspace\en-box_maven-release_master-OCKGULQBCZ67VBKJ7HF6E7KZUCKX7ZC6FX64GH66OHP7A4VAQBIQ\windows-jdk8-m3.5.x_build\maven-release-plugin\target\invoker-reports\BUILD-projects_update-versions_MRELEASE-783.xml, f:\jenkins\jenkins-slave\workspace\en-box_maven-release_master-OCKGULQBCZ67VBKJ7HF6E7KZUCKX7ZC6FX64GH66OHP7A4VAQBIQ\windows-jdk8-m3.5.x_build\maven-release-plugin\target\invoker-reports\BUILD-projects_update-versions_MRELEASE-976.xml]
[windows-jdk8-m3.5.x_build] Found logs:[f:\jenkins\jenkins-slave\workspace\en-box_maven-release_master-OCKGULQBCZ67VBKJ7HF6E7KZUCKX7ZC6FX64GH66OHP7A4VAQBIQ\windows-jdk8-m3.5.x_build\maven-release-plugin\target\it\projects\update-versions\MRELEASE-555\build.log, f:\jenkins\jenkins-slave\workspace\en-box_maven-release_master-OCKGULQBCZ67VBKJ7HF6E7KZUCKX7ZC6FX64GH66OHP7A4VAQBIQ\windows-jdk8-m3.5.x_build\maven-release-plugin\target\it\projects\update-versions\MRELEASE-611\build.log, f:\jenkins\jenkins-slave\workspace\en-box_maven-release_master-OCKGULQBCZ67VBKJ7HF6E7KZUCKX7ZC6FX64GH66OHP7A4VAQBIQ\windows-jdk8-m3.5.x_build\maven-release-plugin\target\it\projects\update-versions\MRELEASE-783\build.log, f:\jenkins\jenkins-slave\workspace\en-box_maven-release_master-OCKGULQBCZ67VBKJ7HF6E7KZUCKX7ZC6FX64GH66OHP7A4VAQBIQ\windows-jdk8-m3.5.x_build\maven-release-plugin\target\it\projects\update-versions\MRELEASE-976\build.log]
[windows-jdk8-m3.5.x_build] Finished parsing Maven Invoker results (found 4)
[windows-jdk8-m3.5.x_build] [withMaven] junitPublisher - Archive test results for Maven artifact org.apache.maven.release:maven-release-api:3.0.0-SNAPSHOT generated by maven-surefire-plugin:test (default-test): windows-jdk8-m3.5.x_build\maven-release-api\target\surefire-reports\*.xml
[windows-jdk8-m3.5.x_build] Recording test results
[windows-jdk8-m3.5.x_build] None of the test reports contained any result
[windows-jdk8-m3.5.x_build] [withMaven] junitPublisher - Archive test results for Maven artifact org.apache.maven.release:maven-release-manager:3.0.0-SNAPSHOT generated by maven-surefire-plugin:test (default-test): windows-jdk8-m3.5.x_build\maven-release-manager\target\surefire-reports\*.xml
[windows-jdk8-m3.5.x_build] Recording test results
[windows-jdk8-m3.5.x_build] [withMaven] junitPublisher - Archive test results for Maven artifact org.apache.maven.plugins:maven-release-plugin:3.0.0-SNAPSHOT generated by maven-surefire-plugin:test (default-test): windows-jdk8-m3.5.x_build\maven-release-plugin\target\surefire-reports\*.xml
[windows-jdk8-m3.5.x_build] Recording test results
[windows-jdk8-m3.5.x_build] [withMaven] junitPublisher - Archive test results for Maven artifact org.apache.maven.release:maven-release-oddeven-policy:3.0.0-SNAPSHOT generated by maven-surefire-plugin:test (default-test): windows-jdk8-m3.5.x_build\maven-release-policies\maven-release-oddeven-policy\target\surefire-reports\*.xml
[windows-jdk8-m3.5.x_build] Recording test results
[windows-jdk8-m3.5.x_build] [withMaven] junitPublisher - Archive test results for Maven artifact org.apache.maven.release:maven-release-semver-policy:3.0.0-SNAPSHOT generated by maven-surefire-plugin:test (default-test): windows-jdk8-m3.5.x_build\maven-release-policies\maven-release-semver-policy\target\surefire-reports\*.xml
[windows-jdk8-m3.5.x_build] Recording test results
[windows-jdk8-m3.5.x_build] [withMaven] junitPublisher - Archive test results for Maven artifact org.apache.maven.release:maven-release-manager:3.0.0-SNAPSHOT generated by maven-failsafe-plugin:integration-test (default): windows-jdk8-m3.5.x_build\maven-release-manager\target\failsafe-reports\*.xml
[windows-jdk8-m3.5.x_build] Recording test results
[windows-jdk8-m3.5.x_build] [withMaven] openTasksPublisher - Scan Tasks for Maven artifact org.apache.maven.release:maven-release-api:3.0.0-SNAPSHOT in source directory windows-jdk8-m3.5.x_build\maven-release-api\src\main\java
[windows-jdk8-m3.5.x_build] [withMaven] openTasksPublisher - Scan Tasks for Maven artifact org.apache.maven.release:maven-release-manager:3.0.0-SNAPSHOT in source directory windows-jdk8-m3.5.x_build\maven-release-manager\src\main\java
[windows-jdk8-m3.5.x_build] [withMaven] openTasksPublisher - Scan Tasks for Maven artifact org.apache.maven.plugins:maven-release-plugin:3.0.0-SNAPSHOT in source directory windows-jdk8-m3.5.x_build\maven-release-plugin\src\main\java
[windows-jdk8-m3.5.x_build] [withMaven] openTasksPublisher - Scan Tasks for Maven artifact org.apache.maven.release:maven-release-oddeven-policy:3.0.0-SNAPSHOT in source directory windows-jdk8-m3.5.x_build\maven-release-policies\maven-release-oddeven-policy\src\main\java
[windows-jdk8-m3.5.x_build] [withMaven] openTasksPublisher - Scan Tasks for Maven artifact org.apache.maven.release:maven-release-semver-policy:3.0.0-SNAPSHOT in source directory windows-jdk8-m3.5.x_build\maven-release-policies\maven-release-semver-policy\src\main\java
[windows-jdk8-m3.5.x_build] [TASKS] Scanning folder 'f:\jenkins\jenkins-slave\workspace\en-box_maven-release_master-OCKGULQBCZ67VBKJ7HF6E7KZUCKX7ZC6FX64GH66OHP7A4VAQBIQ' for files matching the pattern 'windows-jdk8-m3.5.x_build\maven-release-api\src\main\java\**\*,windows-jdk8-m3.5.x_build\maven-release-manager\src\main\java\**\*,windows-jdk8-m3.5.x_build\maven-release-plugin\src\main\java\**\*,windows-jdk8-m3.5.x_build\maven-release-policies\maven-release-oddeven-policy\src\main\java\**\*,windows-jdk8-m3.5.x_build\maven-release-policies\maven-release-semver-policy\src\main\java\**\*' - excludes: null
[windows-jdk8-m3.5.x_build] [TASKS] Found 130 files to scan for tasks
[windows-jdk8-m3.5.x_build] [TASKS] Found 21 open tasks.
[windows-jdk8-m3.5.x_build] Skipping warnings blame since pipelines do not have an SCM link.%n
[windows-jdk8-m3.5.x_build] [TASKS] Computing warning deltas based on reference build #54
[Pipeline] [windows-jdk8-m3.5.x_build] // withMaven
[Pipeline] [windows-jdk8-m3.5.x_build] cleanWs
[windows-jdk8-m3.5.x_build] [WS-CLEANUP] Deleting project workspace...[WS-CLEANUP] done
[Pipeline] [windows-jdk8-m3.5.x_build] }
[Pipeline] [windows-jdk8-m3.5.x_build] // stage
[Pipeline] [windows-jdk8-m3.5.x_build] }
[Pipeline] [windows-jdk8-m3.5.x_build] // node
[Pipeline] [windows-jdk8-m3.5.x_build] }
[Pipeline] // parallel
[Pipeline] stage
[Pipeline] { (Notifications)
[Pipeline] echo
Build result: FAILURE
[Pipeline] jiraIssueSelector
[Pipeline] emailext
Reply | Threaded
Open this post in threaded view
|

Build failed in Jenkins: Maven TLP » maven-release » master #59

Apache Jenkins Server-2
See https://builds.apache.org/job/maven-box/job/maven-release/job/master/59/

Changes:

* Exclude H25
* Exclude H31 cause master is failing constantly.
* no need to test anymore with '3.0.x'
* Add Java 11 to defaults
* Try to shorten path for Windows by using tempDir
* Fix arguments
* Add option for temp workspace
* disable tmpWs
* enable tmpWs
* Use def
* Try to shorten wsDir

All tests passed

Build log:
[...truncated 7.49 MB...]
[windows-jdk10-m3.5.x_build] [INFO] Exclude: dependency-reduced-pom.xml
[windows-jdk10-m3.5.x_build] [INFO] Exclude: .java-version
[windows-jdk10-m3.5.x_build] [INFO] 4 resources included (use -debug for more details)
[windows-jdk10-m3.5.x_build] [INFO] Rat check: Summary over all files. Unapproved: 0, unknown: 0, generated: 0, approved: 4 licenses.
[windows-jdk10-m3.5.x_build] [INFO]
[windows-jdk10-m3.5.x_build] [INFO] --- maven-remote-resources-plugin:1.5:process (process-resource-bundles) @ maven-release-oddeven-policy ---
[windows-jdk10-m3.5.x_build] [INFO]
[windows-jdk10-m3.5.x_build] [INFO] --- maven-resources-plugin:3.1.0:resources (default-resources) @ maven-release-oddeven-policy ---
[windows-jdk10-m3.5.x_build] [INFO] Using 'UTF-8' encoding to copy filtered resources.
[windows-jdk10-m3.5.x_build] [INFO] skip non existing resourceDirectory F:\jenkins\jenkins-slave\workspace\en-box_maven-release_master-OCKGULQBCZ67VBKJ7HF6E7KZUCKX7ZC6FX64GH66OHP7A4VAQBIQ@3@2\windows-jdk10-m3.5.x_build\maven-release-policies\maven-release-oddeven-policy\src\main\resources
[windows-jdk10-m3.5.x_build] [INFO] Copying 3 resources
[windows-jdk10-m3.5.x_build] [INFO]
[windows-jdk10-m3.5.x_build] [INFO] --- maven-compiler-plugin:3.7.0:compile (default-compile) @ maven-release-oddeven-policy ---
[windows-jdk10-m3.5.x_build] [INFO] Changes detected - recompiling the module!
[windows-jdk10-m3.5.x_build] [INFO] Compiling 2 source files to F:\jenkins\jenkins-slave\workspace\en-box_maven-release_master-OCKGULQBCZ67VBKJ7HF6E7KZUCKX7ZC6FX64GH66OHP7A4VAQBIQ@3@2\windows-jdk10-m3.5.x_build\maven-release-policies\maven-release-oddeven-policy\target\classes
[windows-jdk10-m3.5.x_build] [INFO]
[windows-jdk10-m3.5.x_build] [INFO] --- plexus-component-metadata:1.7.1:generate-metadata (process-classes) @ maven-release-oddeven-policy ---
[windows-jdk10-m3.5.x_build] [INFO] Discovered 1 component descriptors(s)
[windows-jdk10-m3.5.x_build] [INFO]
[windows-jdk10-m3.5.x_build] [INFO] --- maven-resources-plugin:3.1.0:testResources (default-testResources) @ maven-release-oddeven-policy ---
[windows-jdk10-m3.5.x_build] [INFO] Using 'UTF-8' encoding to copy filtered resources.
[windows-jdk10-m3.5.x_build] [INFO] skip non existing resourceDirectory F:\jenkins\jenkins-slave\workspace\en-box_maven-release_master-OCKGULQBCZ67VBKJ7HF6E7KZUCKX7ZC6FX64GH66OHP7A4VAQBIQ@3@2\windows-jdk10-m3.5.x_build\maven-release-policies\maven-release-oddeven-policy\src\test\resources
[windows-jdk10-m3.5.x_build] [INFO] Copying 3 resources
[windows-jdk10-m3.5.x_build] [INFO]
[windows-jdk10-m3.5.x_build] [INFO] --- maven-compiler-plugin:3.7.0:testCompile (default-testCompile) @ maven-release-oddeven-policy ---
[windows-jdk10-m3.5.x_build] [INFO] Changes detected - recompiling the module!
[windows-jdk10-m3.5.x_build] [INFO] Compiling 1 source file to F:\jenkins\jenkins-slave\workspace\en-box_maven-release_master-OCKGULQBCZ67VBKJ7HF6E7KZUCKX7ZC6FX64GH66OHP7A4VAQBIQ@3@2\windows-jdk10-m3.5.x_build\maven-release-policies\maven-release-oddeven-policy\target\test-classes
[windows-jdk10-m3.5.x_build] [INFO]
[windows-jdk10-m3.5.x_build] [INFO] --- maven-surefire-plugin:2.22.0:test (default-test) @ maven-release-oddeven-policy ---
[windows-jdk10-m3.5.x_build] [INFO]
[windows-jdk10-m3.5.x_build] [INFO] -------------------------------------------------------
[windows-jdk10-m3.5.x_build] [INFO]  T E S T S
[windows-jdk10-m3.5.x_build] [INFO] -------------------------------------------------------
[windows-jdk10-m3.5.x_build] [INFO] Running org.apache.maven.shared.release.policy.oddeven.OddEvenVersionPolicyTestCase
[windows-jdk10-m3.5.x_build] [INFO] Tests run: 3, Failures: 0, Errors: 0, Skipped: 0, Time elapsed: 0.113 s - in org.apache.maven.shared.release.policy.oddeven.OddEvenVersionPolicyTestCase
[windows-jdk10-m3.5.x_build] [INFO]
[windows-jdk10-m3.5.x_build] [INFO] Results:
[windows-jdk10-m3.5.x_build] [INFO]
[windows-jdk10-m3.5.x_build] [INFO] Tests run: 3, Failures: 0, Errors: 0, Skipped: 0
[windows-jdk10-m3.5.x_build] [INFO]
[windows-jdk10-m3.5.x_build] [INFO]
[windows-jdk10-m3.5.x_build] [INFO] --- maven-jar-plugin:3.1.0:jar (default-jar) @ maven-release-oddeven-policy ---
[windows-jdk10-m3.5.x_build] [INFO] Building jar: F:\jenkins\jenkins-slave\workspace\en-box_maven-release_master-OCKGULQBCZ67VBKJ7HF6E7KZUCKX7ZC6FX64GH66OHP7A4VAQBIQ@3@2\windows-jdk10-m3.5.x_build\maven-release-policies\maven-release-oddeven-policy\target\maven-release-oddeven-policy-3.0.0-SNAPSHOT.jar
[windows-jdk10-m3.5.x_build] [INFO]
[windows-jdk10-m3.5.x_build] [INFO] --- maven-site-plugin:3.7.1:attach-descriptor (attach-descriptor) @ maven-release-oddeven-policy ---
[windows-jdk10-m3.5.x_build] [INFO] Skipping because packaging 'jar' is not pom.
[windows-jdk10-m3.5.x_build] [INFO]
[windows-jdk10-m3.5.x_build] [INFO] --- maven-checkstyle-plugin:3.0.0:check (checkstyle-check) @ maven-release-oddeven-policy ---
[windows-jdk10-m3.5.x_build] [INFO]
[windows-jdk10-m3.5.x_build] [INFO] ------------------------------------------------------------------------
[windows-jdk10-m3.5.x_build] [INFO] Building Maven Release SemVer Policy 3.0.0-SNAPSHOT
[windows-jdk10-m3.5.x_build] [INFO] ------------------------------------------------------------------------
[windows-jdk10-m3.5.x_build] [INFO] Downloading from central: https://repo.maven.apache.org/maven2/org/semver/api/0.9.33/api-0.9.33.pom
[windows-jdk10-m3.5.x_build] [INFO] Downloaded from central: https://repo.maven.apache.org/maven2/org/semver/api/0.9.33/api-0.9.33.pom (2.8 kB at 142 kB/s)
[windows-jdk10-m3.5.x_build] [INFO] Downloading from central: https://repo.maven.apache.org/maven2/org/semver/parent/0.9.33/parent-0.9.33.pom
[windows-jdk10-m3.5.x_build] [INFO] Downloaded from central: https://repo.maven.apache.org/maven2/org/semver/parent/0.9.33/parent-0.9.33.pom (1.3 kB at 70 kB/s)
[windows-jdk10-m3.5.x_build] [INFO] Downloading from central: https://repo.maven.apache.org/maven2/com/github/jeluard/oss-parent/9/oss-parent-9.pom
[windows-jdk10-m3.5.x_build] [INFO] Downloaded from central: https://repo.maven.apache.org/maven2/com/github/jeluard/oss-parent/9/oss-parent-9.pom (12 kB at 519 kB/s)
[windows-jdk10-m3.5.x_build] [INFO] Downloading from central: https://repo.maven.apache.org/maven2/com/google/code/findbugs/jsr305/2.0.0/jsr305-2.0.0.pom
[windows-jdk10-m3.5.x_build] [INFO] Downloaded from central: https://repo.maven.apache.org/maven2/com/google/code/findbugs/jsr305/2.0.0/jsr305-2.0.0.pom (965 B at 54 kB/s)
[windows-jdk10-m3.5.x_build] [INFO] Downloading from central: https://repo.maven.apache.org/maven2/org/ow2/asm/asm/5.0.3/asm-5.0.3.pom
[windows-jdk10-m3.5.x_build] [INFO] Downloaded from central: https://repo.maven.apache.org/maven2/org/ow2/asm/asm/5.0.3/asm-5.0.3.pom (1.9 kB at 97 kB/s)
[windows-jdk10-m3.5.x_build] [INFO] Downloading from central: https://repo.maven.apache.org/maven2/org/ow2/asm/asm-parent/5.0.3/asm-parent-5.0.3.pom
[windows-jdk10-m3.5.x_build] [INFO] Downloaded from central: https://repo.maven.apache.org/maven2/org/ow2/asm/asm-parent/5.0.3/asm-parent-5.0.3.pom (5.5 kB at 229 kB/s)
[windows-jdk10-m3.5.x_build] [INFO] Downloading from central: https://repo.maven.apache.org/maven2/org/ow2/asm/asm-commons/5.0.3/asm-commons-5.0.3.pom
[windows-jdk10-m3.5.x_build] [INFO] Downloaded from central: https://repo.maven.apache.org/maven2/org/ow2/asm/asm-commons/5.0.3/asm-commons-5.0.3.pom (2.1 kB at 116 kB/s)
[windows-jdk10-m3.5.x_build] [INFO] Downloading from central: https://repo.maven.apache.org/maven2/org/ow2/asm/asm-tree/5.0.3/asm-tree-5.0.3.pom
[windows-jdk10-m3.5.x_build] [INFO] Downloaded from central: https://repo.maven.apache.org/maven2/org/ow2/asm/asm-tree/5.0.3/asm-tree-5.0.3.pom (2.1 kB at 110 kB/s)
[windows-jdk10-m3.5.x_build] [INFO] Downloading from central: https://repo.maven.apache.org/maven2/commons-lang/commons-lang/1.0/commons-lang-1.0.pom
[windows-jdk10-m3.5.x_build] [INFO] Downloaded from central: https://repo.maven.apache.org/maven2/commons-lang/commons-lang/1.0/commons-lang-1.0.pom (2.5 kB at 154 kB/s)
[windows-jdk10-m3.5.x_build] [INFO] Downloading from central: https://repo.maven.apache.org/maven2/de/tototec/de.tototec.cmdoption/0.2.0/de.tototec.cmdoption-0.2.0.pom
[windows-jdk10-m3.5.x_build] [INFO] Downloaded from central: https://repo.maven.apache.org/maven2/de/tototec/de.tototec.cmdoption/0.2.0/de.tototec.cmdoption-0.2.0.pom (956 B at 53 kB/s)
[windows-jdk10-m3.5.x_build] [INFO] Downloading from central: https://repo.maven.apache.org/maven2/org/ow2/asm/asm/5.0.3/asm-5.0.3.jar
[windows-jdk10-m3.5.x_build] [INFO] Downloading from central: https://repo.maven.apache.org/maven2/org/ow2/asm/asm-commons/5.0.3/asm-commons-5.0.3.jar
[windows-jdk10-m3.5.x_build] [INFO] Downloading from central: https://repo.maven.apache.org/maven2/com/google/code/findbugs/jsr305/2.0.0/jsr305-2.0.0.jar
[windows-jdk10-m3.5.x_build] [INFO] Downloading from central: https://repo.maven.apache.org/maven2/org/ow2/asm/asm-tree/5.0.3/asm-tree-5.0.3.jar
[windows-jdk10-m3.5.x_build] [INFO] Downloading from central: https://repo.maven.apache.org/maven2/org/semver/api/0.9.33/api-0.9.33.jar
[windows-jdk10-m3.5.x_build] [INFO] Downloaded from central: https://repo.maven.apache.org/maven2/org/ow2/asm/asm/5.0.3/asm-5.0.3.jar (53 kB at 1.6 MB/s)
[windows-jdk10-m3.5.x_build] [INFO] Downloading from central: https://repo.maven.apache.org/maven2/commons-lang/commons-lang/1.0/commons-lang-1.0.jar
[windows-jdk10-m3.5.x_build] [INFO] Downloaded from central: https://repo.maven.apache.org/maven2/commons-lang/commons-lang/1.0/commons-lang-1.0.jar (64 kB at 367 kB/s)
[windows-jdk10-m3.5.x_build] [INFO] Downloading from central: https://repo.maven.apache.org/maven2/de/tototec/de.tototec.cmdoption/0.2.0/de.tototec.cmdoption-0.2.0.jar
[windows-jdk10-m3.5.x_build] [INFO] Downloaded from central: https://repo.maven.apache.org/maven2/org/semver/api/0.9.33/api-0.9.33.jar (64 kB at 356 kB/s)
[windows-jdk10-m3.5.x_build] [INFO] Downloaded from central: https://repo.maven.apache.org/maven2/org/ow2/asm/asm-commons/5.0.3/asm-commons-5.0.3.jar (42 kB at 130 kB/s)
[windows-jdk10-m3.5.x_build] [INFO] Downloaded from central: https://repo.maven.apache.org/maven2/com/google/code/findbugs/jsr305/2.0.0/jsr305-2.0.0.jar (32 kB at 97 kB/s)
[windows-jdk10-m3.5.x_build] [INFO] Downloaded from central: https://repo.maven.apache.org/maven2/org/ow2/asm/asm-tree/5.0.3/asm-tree-5.0.3.jar (29 kB at 87 kB/s)
[windows-jdk10-m3.5.x_build] [INFO] Downloaded from central: https://repo.maven.apache.org/maven2/de/tototec/de.tototec.cmdoption/0.2.0/de.tototec.cmdoption-0.2.0.jar (42 kB at 88 kB/s)
[windows-jdk10-m3.5.x_build] [INFO]
[windows-jdk10-m3.5.x_build] [INFO] --- maven-clean-plugin:3.1.0:clean (default-clean) @ maven-release-semver-policy ---
[windows-jdk10-m3.5.x_build] [INFO]
[windows-jdk10-m3.5.x_build] [INFO] --- maven-enforcer-plugin:1.4.1:enforce (enforce-maven-version) @ maven-release-semver-policy ---
[windows-jdk10-m3.5.x_build] [INFO]
[windows-jdk10-m3.5.x_build] [INFO] --- maven-enforcer-plugin:1.4.1:enforce (enforce-bytecode-version) @ maven-release-semver-policy ---
[windows-jdk10-m3.5.x_build] [INFO]
[windows-jdk10-m3.5.x_build] [INFO] --- maven-enforcer-plugin:1.4.1:enforce (ban-known-bad-maven-versions) @ maven-release-semver-policy ---
[windows-jdk10-m3.5.x_build] [INFO]
[windows-jdk10-m3.5.x_build] [INFO] --- apache-rat-plugin:0.12:check (rat-check) @ maven-release-semver-policy ---
[windows-jdk10-m3.5.x_build] [INFO] Enabled default license matchers.
[windows-jdk10-m3.5.x_build] [INFO] Will parse SCM ignores for exclusions...
[windows-jdk10-m3.5.x_build] [INFO] Finished adding exclusions from SCM ignore files.
[windows-jdk10-m3.5.x_build] [INFO] 61 implicit excludes (use -debug for more details).
[windows-jdk10-m3.5.x_build] [INFO] Exclude: .repository
[windows-jdk10-m3.5.x_build] [INFO] Exclude: Jenkinsfile
[windows-jdk10-m3.5.x_build] [INFO] Exclude: .repository/**
[windows-jdk10-m3.5.x_build] [INFO] Exclude: .maven/spy.log
[windows-jdk10-m3.5.x_build] [INFO] Exclude: dependency-reduced-pom.xml
[windows-jdk10-m3.5.x_build] [INFO] Exclude: .java-version
[windows-jdk10-m3.5.x_build] [INFO] 3 resources included (use -debug for more details)
[windows-jdk10-m3.5.x_build] [INFO] Rat check: Summary over all files. Unapproved: 0, unknown: 0, generated: 0, approved: 3 licenses.
[windows-jdk10-m3.5.x_build] [INFO]
[windows-jdk10-m3.5.x_build] [INFO] --- maven-remote-resources-plugin:1.5:process (process-resource-bundles) @ maven-release-semver-policy ---
[windows-jdk10-m3.5.x_build] [INFO]
[windows-jdk10-m3.5.x_build] [INFO] --- maven-resources-plugin:3.1.0:resources (default-resources) @ maven-release-semver-policy ---
[windows-jdk10-m3.5.x_build] [INFO] Using 'UTF-8' encoding to copy filtered resources.
[windows-jdk10-m3.5.x_build] [INFO] skip non existing resourceDirectory F:\jenkins\jenkins-slave\workspace\en-box_maven-release_master-OCKGULQBCZ67VBKJ7HF6E7KZUCKX7ZC6FX64GH66OHP7A4VAQBIQ@3@2\windows-jdk10-m3.5.x_build\maven-release-policies\maven-release-semver-policy\src\main\resources
[windows-jdk10-m3.5.x_build] [INFO] Copying 3 resources
[windows-jdk10-m3.5.x_build] [INFO]
[windows-jdk10-m3.5.x_build] [INFO] --- maven-compiler-plugin:3.7.0:compile (default-compile) @ maven-release-semver-policy ---
[windows-jdk10-m3.5.x_build] [INFO] Changes detected - recompiling the module!
[windows-jdk10-m3.5.x_build] [INFO] Compiling 1 source file to F:\jenkins\jenkins-slave\workspace\en-box_maven-release_master-OCKGULQBCZ67VBKJ7HF6E7KZUCKX7ZC6FX64GH66OHP7A4VAQBIQ@3@2\windows-jdk10-m3.5.x_build\maven-release-policies\maven-release-semver-policy\target\classes
[windows-jdk10-m3.5.x_build] [INFO]
[windows-jdk10-m3.5.x_build] [INFO] --- plexus-component-metadata:1.7.1:generate-metadata (process-classes) @ maven-release-semver-policy ---
[windows-jdk10-m3.5.x_build] [INFO] Discovered 1 component descriptors(s)
[windows-jdk10-m3.5.x_build] [INFO]
[windows-jdk10-m3.5.x_build] [INFO] --- maven-resources-plugin:3.1.0:testResources (default-testResources) @ maven-release-semver-policy ---
[windows-jdk10-m3.5.x_build] [INFO] Using 'UTF-8' encoding to copy filtered resources.
[windows-jdk10-m3.5.x_build] [INFO] skip non existing resourceDirectory F:\jenkins\jenkins-slave\workspace\en-box_maven-release_master-OCKGULQBCZ67VBKJ7HF6E7KZUCKX7ZC6FX64GH66OHP7A4VAQBIQ@3@2\windows-jdk10-m3.5.x_build\maven-release-policies\maven-release-semver-policy\src\test\resources
[windows-jdk10-m3.5.x_build] [INFO] Copying 3 resources
[windows-jdk10-m3.5.x_build] [INFO]
[windows-jdk10-m3.5.x_build] [INFO] --- maven-compiler-plugin:3.7.0:testCompile (default-testCompile) @ maven-release-semver-policy ---
[windows-jdk10-m3.5.x_build] [INFO] Changes detected - recompiling the module!
[windows-jdk10-m3.5.x_build] [INFO] Compiling 1 source file to F:\jenkins\jenkins-slave\workspace\en-box_maven-release_master-OCKGULQBCZ67VBKJ7HF6E7KZUCKX7ZC6FX64GH66OHP7A4VAQBIQ@3@2\windows-jdk10-m3.5.x_build\maven-release-policies\maven-release-semver-policy\target\test-classes
[windows-jdk10-m3.5.x_build] [INFO]
[windows-jdk10-m3.5.x_build] [INFO] --- maven-surefire-plugin:2.22.0:test (default-test) @ maven-release-semver-policy ---
[windows-jdk10-m3.5.x_build] [INFO]
[windows-jdk10-m3.5.x_build] [INFO] -------------------------------------------------------
[windows-jdk10-m3.5.x_build] [INFO]  T E S T S
[windows-jdk10-m3.5.x_build] [INFO] -------------------------------------------------------
[windows-jdk10-m3.5.x_build] [INFO] Running org.apache.maven.shared.release.policy.semver.SemVerVersionPolicyTest
[windows-jdk10-m3.5.x_build] [INFO] Tests run: 2, Failures: 0, Errors: 0, Skipped: 0, Time elapsed: 0.083 s - in org.apache.maven.shared.release.policy.semver.SemVerVersionPolicyTest
[windows-jdk10-m3.5.x_build] [INFO]
[windows-jdk10-m3.5.x_build] [INFO] Results:
[windows-jdk10-m3.5.x_build] [INFO]
[windows-jdk10-m3.5.x_build] [INFO] Tests run: 2, Failures: 0, Errors: 0, Skipped: 0
[windows-jdk10-m3.5.x_build] [INFO]
[windows-jdk10-m3.5.x_build] [INFO]
[windows-jdk10-m3.5.x_build] [INFO] --- maven-jar-plugin:3.1.0:jar (default-jar) @ maven-release-semver-policy ---
[windows-jdk10-m3.5.x_build] [INFO] Building jar: F:\jenkins\jenkins-slave\workspace\en-box_maven-release_master-OCKGULQBCZ67VBKJ7HF6E7KZUCKX7ZC6FX64GH66OHP7A4VAQBIQ@3@2\windows-jdk10-m3.5.x_build\maven-release-policies\maven-release-semver-policy\target\maven-release-semver-policy-3.0.0-SNAPSHOT.jar
[windows-jdk10-m3.5.x_build] [INFO]
[windows-jdk10-m3.5.x_build] [INFO] --- maven-site-plugin:3.7.1:attach-descriptor (attach-descriptor) @ maven-release-semver-policy ---
[windows-jdk10-m3.5.x_build] [INFO] Skipping because packaging 'jar' is not pom.
[windows-jdk10-m3.5.x_build] [INFO]
[windows-jdk10-m3.5.x_build] [INFO] --- maven-checkstyle-plugin:3.0.0:check (checkstyle-check) @ maven-release-semver-policy ---
[windows-jdk10-m3.5.x_build] [INFO] ------------------------------------------------------------------------
[windows-jdk10-m3.5.x_build] [INFO] Reactor Summary:
[windows-jdk10-m3.5.x_build] [INFO]
[windows-jdk10-m3.5.x_build] [INFO] Maven Release ...................................... SUCCESS [ 33.872 s]
[windows-jdk10-m3.5.x_build] [INFO] Maven Release APIs ................................. SUCCESS [  7.621 s]
[windows-jdk10-m3.5.x_build] [INFO] Maven Release Manager .............................. SUCCESS [02:09 min]
[windows-jdk10-m3.5.x_build] [INFO] Maven Release Plugin ............................... SUCCESS [05:24 min]
[windows-jdk10-m3.5.x_build] [INFO] Maven Release Odd-Even Policy ...................... SUCCESS [  3.005 s]
[windows-jdk10-m3.5.x_build] [INFO] Maven Release SemVer Policy ........................ SUCCESS [  3.710 s]
[windows-jdk10-m3.5.x_build] [INFO] ------------------------------------------------------------------------
[windows-jdk10-m3.5.x_build] [INFO] BUILD SUCCESS
[windows-jdk10-m3.5.x_build] [INFO] ------------------------------------------------------------------------
[windows-jdk10-m3.5.x_build] [INFO] Total time: 08:23 min
[windows-jdk10-m3.5.x_build] [INFO] Finished at: 2018-10-10T11:43:34-07:00
[windows-jdk10-m3.5.x_build] [INFO] Final Memory: 54M/180M
[windows-jdk10-m3.5.x_build] [INFO] ------------------------------------------------------------------------
[windows-jdk10-m3.5.x_build] [INFO] [jenkins-event-spy] Generated F:\jenkins\jenkins-slave\workspace\en-box_maven-release_master-OCKGULQBCZ67VBKJ7HF6E7KZUCKX7ZC6FX64GH66OHP7A4VAQBIQ@3@2@tmp\withMaven98f50735\maven-spy-20181010-113510-59711552341838746199162.log
[Pipeline] [windows-jdk10-m3.5.x_build] }
[Pipeline] [windows-jdk10-m3.5.x_build] // dir
[Pipeline] [windows-jdk10-m3.5.x_build] }
[windows-jdk10-m3.5.x_build] [withMaven] artifactsPublisher - Archive artifact windows-jdk10-m3.5.x_build\pom.xml under org\apache\maven\release\maven-release\3.0.0-SNAPSHOT\maven-release-3.0.0-SNAPSHOT.pom
[windows-jdk10-m3.5.x_build] [withMaven] artifactsPublisher - Archive artifact windows-jdk10-m3.5.x_build\target\maven-release-3.0.0-SNAPSHOT-site.xml under org\apache\maven\release\maven-release\3.0.0-SNAPSHOT\maven-release-3.0.0-SNAPSHOT-site.xml
[windows-jdk10-m3.5.x_build] [withMaven] artifactsPublisher - Archive artifact windows-jdk10-m3.5.x_build\maven-release-api\pom.xml under org\apache\maven\release\maven-release-api\3.0.0-SNAPSHOT\maven-release-api-3.0.0-SNAPSHOT.pom
[windows-jdk10-m3.5.x_build] [withMaven] artifactsPublisher - Archive artifact windows-jdk10-m3.5.x_build\maven-release-api\target\maven-release-api-3.0.0-SNAPSHOT.jar under org\apache\maven\release\maven-release-api\3.0.0-SNAPSHOT\maven-release-api-3.0.0-SNAPSHOT.jar
[windows-jdk10-m3.5.x_build] [withMaven] artifactsPublisher - Archive artifact windows-jdk10-m3.5.x_build\maven-release-manager\pom.xml under org\apache\maven\release\maven-release-manager\3.0.0-SNAPSHOT\maven-release-manager-3.0.0-SNAPSHOT.pom
[windows-jdk10-m3.5.x_build] [withMaven] artifactsPublisher - Archive artifact windows-jdk10-m3.5.x_build\maven-release-manager\target\maven-release-manager-3.0.0-SNAPSHOT.jar under org\apache\maven\release\maven-release-manager\3.0.0-SNAPSHOT\maven-release-manager-3.0.0-SNAPSHOT.jar
[windows-jdk10-m3.5.x_build] [withMaven] artifactsPublisher - Archive artifact windows-jdk10-m3.5.x_build\maven-release-plugin\pom.xml under org\apache\maven\plugins\maven-release-plugin\3.0.0-SNAPSHOT\maven-release-plugin-3.0.0-SNAPSHOT.pom
[windows-jdk10-m3.5.x_build] [withMaven] artifactsPublisher - Archive artifact windows-jdk10-m3.5.x_build\maven-release-plugin\target\maven-release-plugin-3.0.0-SNAPSHOT.jar under org\apache\maven\plugins\maven-release-plugin\3.0.0-SNAPSHOT\maven-release-plugin-3.0.0-SNAPSHOT.jar
[windows-jdk10-m3.5.x_build] [withMaven] artifactsPublisher - Archive artifact windows-jdk10-m3.5.x_build\maven-release-policies\maven-release-oddeven-policy\pom.xml under org\apache\maven\release\maven-release-oddeven-policy\3.0.0-SNAPSHOT\maven-release-oddeven-policy-3.0.0-SNAPSHOT.pom
[windows-jdk10-m3.5.x_build] [withMaven] artifactsPublisher - Archive artifact windows-jdk10-m3.5.x_build\maven-release-policies\maven-release-oddeven-policy\target\maven-release-oddeven-policy-3.0.0-SNAPSHOT.jar under org\apache\maven\release\maven-release-oddeven-policy\3.0.0-SNAPSHOT\maven-release-oddeven-policy-3.0.0-SNAPSHOT.jar
[windows-jdk10-m3.5.x_build] [withMaven] artifactsPublisher - Archive artifact windows-jdk10-m3.5.x_build\maven-release-policies\maven-release-semver-policy\pom.xml under org\apache\maven\release\maven-release-semver-policy\3.0.0-SNAPSHOT\maven-release-semver-policy-3.0.0-SNAPSHOT.pom
[windows-jdk10-m3.5.x_build] [withMaven] artifactsPublisher - Archive artifact windows-jdk10-m3.5.x_build\maven-release-policies\maven-release-semver-policy\target\maven-release-semver-policy-3.0.0-SNAPSHOT.jar under org\apache\maven\release\maven-release-semver-policy\3.0.0-SNAPSHOT\maven-release-semver-policy-3.0.0-SNAPSHOT.jar
[windows-jdk10-m3.5.x_build] [withMaven] invokerPublisher - Archive invoker results for Maven artifact MavenArtifact{org.apache.maven.plugins:maven-release-plugin::3.0.0-SNAPSHOT(version: 3.0.0-SNAPSHOT, snapshot:false) } generated by PluginInvocation{org.apache.maven.plugins:maven-invoker-plugin:3.0.1@run  integration-test-prepare}: windows-jdk10-m3.5.x_build\maven-release-plugin\target\invoker-reports\*.xml
[windows-jdk10-m3.5.x_build] performing MavenInvokerRecorder, reportsFilenamePattern:'**/windows-jdk10-m3.5.x_build\maven-release-plugin\target\invoker-reports/BUILD*.xml', invokerBuildDir:'**/windows-jdk10-m3.5.x_build\maven-release-plugin\target\it'
[windows-jdk10-m3.5.x_build] Found reports:[f:\jenkins\jenkins-slave\workspace\en-box_maven-release_master-OCKGULQBCZ67VBKJ7HF6E7KZUCKX7ZC6FX64GH66OHP7A4VAQBIQ@3@2\windows-jdk10-m3.5.x_build\maven-release-plugin\target\invoker-reports\BUILD-projects_update-versions_MRELEASE-555.xml, f:\jenkins\jenkins-slave\workspace\en-box_maven-release_master-OCKGULQBCZ67VBKJ7HF6E7KZUCKX7ZC6FX64GH66OHP7A4VAQBIQ@3@2\windows-jdk10-m3.5.x_build\maven-release-plugin\target\invoker-reports\BUILD-projects_update-versions_MRELEASE-611.xml, f:\jenkins\jenkins-slave\workspace\en-box_maven-release_master-OCKGULQBCZ67VBKJ7HF6E7KZUCKX7ZC6FX64GH66OHP7A4VAQBIQ@3@2\windows-jdk10-m3.5.x_build\maven-release-plugin\target\invoker-reports\BUILD-projects_update-versions_MRELEASE-783.xml, f:\jenkins\jenkins-slave\workspace\en-box_maven-release_master-OCKGULQBCZ67VBKJ7HF6E7KZUCKX7ZC6FX64GH66OHP7A4VAQBIQ@3@2\windows-jdk10-m3.5.x_build\maven-release-plugin\target\invoker-reports\BUILD-projects_update-versions_MRELEASE-976.xml]
[windows-jdk10-m3.5.x_build] Found logs:[f:\jenkins\jenkins-slave\workspace\en-box_maven-release_master-OCKGULQBCZ67VBKJ7HF6E7KZUCKX7ZC6FX64GH66OHP7A4VAQBIQ@3@2\windows-jdk10-m3.5.x_build\maven-release-plugin\target\it\projects\update-versions\MRELEASE-555\build.log, f:\jenkins\jenkins-slave\workspace\en-box_maven-release_master-OCKGULQBCZ67VBKJ7HF6E7KZUCKX7ZC6FX64GH66OHP7A4VAQBIQ@3@2\windows-jdk10-m3.5.x_build\maven-release-plugin\target\it\projects\update-versions\MRELEASE-611\build.log, f:\jenkins\jenkins-slave\workspace\en-box_maven-release_master-OCKGULQBCZ67VBKJ7HF6E7KZUCKX7ZC6FX64GH66OHP7A4VAQBIQ@3@2\windows-jdk10-m3.5.x_build\maven-release-plugin\target\it\projects\update-versions\MRELEASE-783\build.log, f:\jenkins\jenkins-slave\workspace\en-box_maven-release_master-OCKGULQBCZ67VBKJ7HF6E7KZUCKX7ZC6FX64GH66OHP7A4VAQBIQ@3@2\windows-jdk10-m3.5.x_build\maven-release-plugin\target\it\projects\update-versions\MRELEASE-976\build.log]
[windows-jdk10-m3.5.x_build] Finished parsing Maven Invoker results (found 4)
[windows-jdk10-m3.5.x_build] [withMaven] invokerPublisher - Archive invoker results for Maven artifact MavenArtifact{org.apache.maven.plugins:maven-release-plugin::3.0.0-SNAPSHOT(version: 3.0.0-SNAPSHOT, snapshot:false) } generated by PluginInvocation{org.apache.maven.plugins:maven-invoker-plugin:3.0.1@run  integration-test-prepare-with-pom}: windows-jdk10-m3.5.x_build\maven-release-plugin\target\invoker-reports\*.xml
[windows-jdk10-m3.5.x_build] performing MavenInvokerRecorder, reportsFilenamePattern:'**/windows-jdk10-m3.5.x_build\maven-release-plugin\target\invoker-reports/BUILD*.xml', invokerBuildDir:'**/windows-jdk10-m3.5.x_build\maven-release-plugin\target\it'
[windows-jdk10-m3.5.x_build] Found reports:[f:\jenkins\jenkins-slave\workspace\en-box_maven-release_master-OCKGULQBCZ67VBKJ7HF6E7KZUCKX7ZC6FX64GH66OHP7A4VAQBIQ@3@2\windows-jdk10-m3.5.x_build\maven-release-plugin\target\invoker-reports\BUILD-projects_update-versions_MRELEASE-555.xml, f:\jenkins\jenkins-slave\workspace\en-box_maven-release_master-OCKGULQBCZ67VBKJ7HF6E7KZUCKX7ZC6FX64GH66OHP7A4VAQBIQ@3@2\windows-jdk10-m3.5.x_build\maven-release-plugin\target\invoker-reports\BUILD-projects_update-versions_MRELEASE-611.xml, f:\jenkins\jenkins-slave\workspace\en-box_maven-release_master-OCKGULQBCZ67VBKJ7HF6E7KZUCKX7ZC6FX64GH66OHP7A4VAQBIQ@3@2\windows-jdk10-m3.5.x_build\maven-release-plugin\target\invoker-reports\BUILD-projects_update-versions_MRELEASE-783.xml, f:\jenkins\jenkins-slave\workspace\en-box_maven-release_master-OCKGULQBCZ67VBKJ7HF6E7KZUCKX7ZC6FX64GH66OHP7A4VAQBIQ@3@2\windows-jdk10-m3.5.x_build\maven-release-plugin\target\invoker-reports\BUILD-projects_update-versions_MRELEASE-976.xml]
[windows-jdk10-m3.5.x_build] Found logs:[f:\jenkins\jenkins-slave\workspace\en-box_maven-release_master-OCKGULQBCZ67VBKJ7HF6E7KZUCKX7ZC6FX64GH66OHP7A4VAQBIQ@3@2\windows-jdk10-m3.5.x_build\maven-release-plugin\target\it\projects\update-versions\MRELEASE-555\build.log, f:\jenkins\jenkins-slave\workspace\en-box_maven-release_master-OCKGULQBCZ67VBKJ7HF6E7KZUCKX7ZC6FX64GH66OHP7A4VAQBIQ@3@2\windows-jdk10-m3.5.x_build\maven-release-plugin\target\it\projects\update-versions\MRELEASE-611\build.log, f:\jenkins\jenkins-slave\workspace\en-box_maven-release_master-OCKGULQBCZ67VBKJ7HF6E7KZUCKX7ZC6FX64GH66OHP7A4VAQBIQ@3@2\windows-jdk10-m3.5.x_build\maven-release-plugin\target\it\projects\update-versions\MRELEASE-783\build.log, f:\jenkins\jenkins-slave\workspace\en-box_maven-release_master-OCKGULQBCZ67VBKJ7HF6E7KZUCKX7ZC6FX64GH66OHP7A4VAQBIQ@3@2\windows-jdk10-m3.5.x_build\maven-release-plugin\target\it\projects\update-versions\MRELEASE-976\build.log]
[windows-jdk10-m3.5.x_build] Finished parsing Maven Invoker results (found 4)
[windows-jdk10-m3.5.x_build] [withMaven] invokerPublisher - Archive invoker results for Maven artifact MavenArtifact{org.apache.maven.plugins:maven-release-plugin::3.0.0-SNAPSHOT(version: 3.0.0-SNAPSHOT, snapshot:false) } generated by PluginInvocation{org.apache.maven.plugins:maven-invoker-plugin:3.0.1@run  integration-test-branch}: windows-jdk10-m3.5.x_build\maven-release-plugin\target\invoker-reports\*.xml
[windows-jdk10-m3.5.x_build] performing MavenInvokerRecorder, reportsFilenamePattern:'**/windows-jdk10-m3.5.x_build\maven-release-plugin\target\invoker-reports/BUILD*.xml', invokerBuildDir:'**/windows-jdk10-m3.5.x_build\maven-release-plugin\target\it'
[windows-jdk10-m3.5.x_build] Found reports:[f:\jenkins\jenkins-slave\workspace\en-box_maven-release_master-OCKGULQBCZ67VBKJ7HF6E7KZUCKX7ZC6FX64GH66OHP7A4VAQBIQ@3@2\windows-jdk10-m3.5.x_build\maven-release-plugin\target\invoker-reports\BUILD-projects_update-versions_MRELEASE-555.xml, f:\jenkins\jenkins-slave\workspace\en-box_maven-release_master-OCKGULQBCZ67VBKJ7HF6E7KZUCKX7ZC6FX64GH66OHP7A4VAQBIQ@3@2\windows-jdk10-m3.5.x_build\maven-release-plugin\target\invoker-reports\BUILD-projects_update-versions_MRELEASE-611.xml, f:\jenkins\jenkins-slave\workspace\en-box_maven-release_master-OCKGULQBCZ67VBKJ7HF6E7KZUCKX7ZC6FX64GH66OHP7A4VAQBIQ@3@2\windows-jdk10-m3.5.x_build\maven-release-plugin\target\invoker-reports\BUILD-projects_update-versions_MRELEASE-783.xml, f:\jenkins\jenkins-slave\workspace\en-box_maven-release_master-OCKGULQBCZ67VBKJ7HF6E7KZUCKX7ZC6FX64GH66OHP7A4VAQBIQ@3@2\windows-jdk10-m3.5.x_build\maven-release-plugin\target\invoker-reports\BUILD-projects_update-versions_MRELEASE-976.xml]
[windows-jdk10-m3.5.x_build] Found logs:[f:\jenkins\jenkins-slave\workspace\en-box_maven-release_master-OCKGULQBCZ67VBKJ7HF6E7KZUCKX7ZC6FX64GH66OHP7A4VAQBIQ@3@2\windows-jdk10-m3.5.x_build\maven-release-plugin\target\it\projects\update-versions\MRELEASE-555\build.log, f:\jenkins\jenkins-slave\workspace\en-box_maven-release_master-OCKGULQBCZ67VBKJ7HF6E7KZUCKX7ZC6FX64GH66OHP7A4VAQBIQ@3@2\windows-jdk10-m3.5.x_build\maven-release-plugin\target\it\projects\update-versions\MRELEASE-611\build.log, f:\jenkins\jenkins-slave\workspace\en-box_maven-release_master-OCKGULQBCZ67VBKJ7HF6E7KZUCKX7ZC6FX64GH66OHP7A4VAQBIQ@3@2\windows-jdk10-m3.5.x_build\maven-release-plugin\target\it\projects\update-versions\MRELEASE-783\build.log, f:\jenkins\jenkins-slave\workspace\en-box_maven-release_master-OCKGULQBCZ67VBKJ7HF6E7KZUCKX7ZC6FX64GH66OHP7A4VAQBIQ@3@2\windows-jdk10-m3.5.x_build\maven-release-plugin\target\it\projects\update-versions\MRELEASE-976\build.log]
[windows-jdk10-m3.5.x_build] Finished parsing Maven Invoker results (found 4)
[windows-jdk10-m3.5.x_build] [withMaven] invokerPublisher - Archive invoker results for Maven artifact MavenArtifact{org.apache.maven.plugins:maven-release-plugin::3.0.0-SNAPSHOT(version: 3.0.0-SNAPSHOT, snapshot:false) } generated by PluginInvocation{org.apache.maven.plugins:maven-invoker-plugin:3.0.1@run  integration-test-perform}: windows-jdk10-m3.5.x_build\maven-release-plugin\target\invoker-reports\*.xml
[windows-jdk10-m3.5.x_build] performing MavenInvokerRecorder, reportsFilenamePattern:'**/windows-jdk10-m3.5.x_build\maven-release-plugin\target\invoker-reports/BUILD*.xml', invokerBuildDir:'**/windows-jdk10-m3.5.x_build\maven-release-plugin\target\it'
[windows-jdk10-m3.5.x_build] Found reports:[f:\jenkins\jenkins-slave\workspace\en-box_maven-release_master-OCKGULQBCZ67VBKJ7HF6E7KZUCKX7ZC6FX64GH66OHP7A4VAQBIQ@3@2\windows-jdk10-m3.5.x_build\maven-release-plugin\target\invoker-reports\BUILD-projects_update-versions_MRELEASE-555.xml, f:\jenkins\jenkins-slave\workspace\en-box_maven-release_master-OCKGULQBCZ67VBKJ7HF6E7KZUCKX7ZC6FX64GH66OHP7A4VAQBIQ@3@2\windows-jdk10-m3.5.x_build\maven-release-plugin\target\invoker-reports\BUILD-projects_update-versions_MRELEASE-611.xml, f:\jenkins\jenkins-slave\workspace\en-box_maven-release_master-OCKGULQBCZ67VBKJ7HF6E7KZUCKX7ZC6FX64GH66OHP7A4VAQBIQ@3@2\windows-jdk10-m3.5.x_build\maven-release-plugin\target\invoker-reports\BUILD-projects_update-versions_MRELEASE-783.xml, f:\jenkins\jenkins-slave\workspace\en-box_maven-release_master-OCKGULQBCZ67VBKJ7HF6E7KZUCKX7ZC6FX64GH66OHP7A4VAQBIQ@3@2\windows-jdk10-m3.5.x_build\maven-release-plugin\target\invoker-reports\BUILD-projects_update-versions_MRELEASE-976.xml]
[windows-jdk10-m3.5.x_build] Found logs:[f:\jenkins\jenkins-slave\workspace\en-box_maven-release_master-OCKGULQBCZ67VBKJ7HF6E7KZUCKX7ZC6FX64GH66OHP7A4VAQBIQ@3@2\windows-jdk10-m3.5.x_build\maven-release-plugin\target\it\projects\update-versions\MRELEASE-555\build.log, f:\jenkins\jenkins-slave\workspace\en-box_maven-release_master-OCKGULQBCZ67VBKJ7HF6E7KZUCKX7ZC6FX64GH66OHP7A4VAQBIQ@3@2\windows-jdk10-m3.5.x_build\maven-release-plugin\target\it\projects\update-versions\MRELEASE-611\build.log, f:\jenkins\jenkins-slave\workspace\en-box_maven-release_master-OCKGULQBCZ67VBKJ7HF6E7KZUCKX7ZC6FX64GH66OHP7A4VAQBIQ@3@2\windows-jdk10-m3.5.x_build\maven-release-plugin\target\it\projects\update-versions\MRELEASE-783\build.log, f:\jenkins\jenkins-slave\workspace\en-box_maven-release_master-OCKGULQBCZ67VBKJ7HF6E7KZUCKX7ZC6FX64GH66OHP7A4VAQBIQ@3@2\windows-jdk10-m3.5.x_build\maven-release-plugin\target\it\projects\update-versions\MRELEASE-976\build.log]
[windows-jdk10-m3.5.x_build] Finished parsing Maven Invoker results (found 4)
[windows-jdk10-m3.5.x_build] [withMaven] invokerPublisher - Archive invoker results for Maven artifact MavenArtifact{org.apache.maven.plugins:maven-release-plugin::3.0.0-SNAPSHOT(version: 3.0.0-SNAPSHOT, snapshot:false) } generated by PluginInvocation{org.apache.maven.plugins:maven-invoker-plugin:3.0.1@run  integration-test-update-versions}: windows-jdk10-m3.5.x_build\maven-release-plugin\target\invoker-reports\*.xml
[windows-jdk10-m3.5.x_build] performing MavenInvokerRecorder, reportsFilenamePattern:'**/windows-jdk10-m3.5.x_build\maven-release-plugin\target\invoker-reports/BUILD*.xml', invokerBuildDir:'**/windows-jdk10-m3.5.x_build\maven-release-plugin\target\it'
[windows-jdk10-m3.5.x_build] Found reports:[f:\jenkins\jenkins-slave\workspace\en-box_maven-release_master-OCKGULQBCZ67VBKJ7HF6E7KZUCKX7ZC6FX64GH66OHP7A4VAQBIQ@3@2\windows-jdk10-m3.5.x_build\maven-release-plugin\target\invoker-reports\BUILD-projects_update-versions_MRELEASE-555.xml, f:\jenkins\jenkins-slave\workspace\en-box_maven-release_master-OCKGULQBCZ67VBKJ7HF6E7KZUCKX7ZC6FX64GH66OHP7A4VAQBIQ@3@2\windows-jdk10-m3.5.x_build\maven-release-plugin\target\invoker-reports\BUILD-projects_update-versions_MRELEASE-611.xml, f:\jenkins\jenkins-slave\workspace\en-box_maven-release_master-OCKGULQBCZ67VBKJ7HF6E7KZUCKX7ZC6FX64GH66OHP7A4VAQBIQ@3@2\windows-jdk10-m3.5.x_build\maven-release-plugin\target\invoker-reports\BUILD-projects_update-versions_MRELEASE-783.xml, f:\jenkins\jenkins-slave\workspace\en-box_maven-release_master-OCKGULQBCZ67VBKJ7HF6E7KZUCKX7ZC6FX64GH66OHP7A4VAQBIQ@3@2\windows-jdk10-m3.5.x_build\maven-release-plugin\target\invoker-reports\BUILD-projects_update-versions_MRELEASE-976.xml]
[windows-jdk10-m3.5.x_build] Found logs:[f:\jenkins\jenkins-slave\workspace\en-box_maven-release_master-OCKGULQBCZ67VBKJ7HF6E7KZUCKX7ZC6FX64GH66OHP7A4VAQBIQ@3@2\windows-jdk10-m3.5.x_build\maven-release-plugin\target\it\projects\update-versions\MRELEASE-555\build.log, f:\jenkins\jenkins-slave\workspace\en-box_maven-release_master-OCKGULQBCZ67VBKJ7HF6E7KZUCKX7ZC6FX64GH66OHP7A4VAQBIQ@3@2\windows-jdk10-m3.5.x_build\maven-release-plugin\target\it\projects\update-versions\MRELEASE-611\build.log, f:\jenkins\jenkins-slave\workspace\en-box_maven-release_master-OCKGULQBCZ67VBKJ7HF6E7KZUCKX7ZC6FX64GH66OHP7A4VAQBIQ@3@2\windows-jdk10-m3.5.x_build\maven-release-plugin\target\it\projects\update-versions\MRELEASE-783\build.log, f:\jenkins\jenkins-slave\workspace\en-box_maven-release_master-OCKGULQBCZ67VBKJ7HF6E7KZUCKX7ZC6FX64GH66OHP7A4VAQBIQ@3@2\windows-jdk10-m3.5.x_build\maven-release-plugin\target\it\projects\update-versions\MRELEASE-976\build.log]
[windows-jdk10-m3.5.x_build] Finished parsing Maven Invoker results (found 4)
[windows-jdk10-m3.5.x_build] [withMaven] junitPublisher - Archive test results for Maven artifact org.apache.maven.release:maven-release-api:3.0.0-SNAPSHOT generated by maven-surefire-plugin:test (default-test): windows-jdk10-m3.5.x_build\maven-release-api\target\surefire-reports\*.xml
[windows-jdk10-m3.5.x_build] Recording test results
[windows-jdk10-m3.5.x_build] None of the test reports contained any result
[windows-jdk10-m3.5.x_build] [withMaven] junitPublisher - Archive test results for Maven artifact org.apache.maven.release:maven-release-manager:3.0.0-SNAPSHOT generated by maven-surefire-plugin:test (default-test): windows-jdk10-m3.5.x_build\maven-release-manager\target\surefire-reports\*.xml
[windows-jdk10-m3.5.x_build] Recording test results
[windows-jdk10-m3.5.x_build] [withMaven] junitPublisher - Archive test results for Maven artifact org.apache.maven.plugins:maven-release-plugin:3.0.0-SNAPSHOT generated by maven-surefire-plugin:test (default-test): windows-jdk10-m3.5.x_build\maven-release-plugin\target\surefire-reports\*.xml
[windows-jdk10-m3.5.x_build] Recording test results
[windows-jdk10-m3.5.x_build] [withMaven] junitPublisher - Archive test results for Maven artifact org.apache.maven.release:maven-release-oddeven-policy:3.0.0-SNAPSHOT generated by maven-surefire-plugin:test (default-test): windows-jdk10-m3.5.x_build\maven-release-policies\maven-release-oddeven-policy\target\surefire-reports\*.xml
[windows-jdk10-m3.5.x_build] Recording test results
[windows-jdk10-m3.5.x_build] [withMaven] junitPublisher - Archive test results for Maven artifact org.apache.maven.release:maven-release-semver-policy:3.0.0-SNAPSHOT generated by maven-surefire-plugin:test (default-test): windows-jdk10-m3.5.x_build\maven-release-policies\maven-release-semver-policy\target\surefire-reports\*.xml
[windows-jdk10-m3.5.x_build] Recording test results
[windows-jdk10-m3.5.x_build] [withMaven] junitPublisher - Archive test results for Maven artifact org.apache.maven.release:maven-release-manager:3.0.0-SNAPSHOT generated by maven-failsafe-plugin:integration-test (default): windows-jdk10-m3.5.x_build\maven-release-manager\target\failsafe-reports\*.xml
[windows-jdk10-m3.5.x_build] Recording test results
[windows-jdk10-m3.5.x_build] [withMaven] openTasksPublisher - Scan Tasks for Maven artifact org.apache.maven.release:maven-release-api:3.0.0-SNAPSHOT in source directory windows-jdk10-m3.5.x_build\maven-release-api\src\main\java
[windows-jdk10-m3.5.x_build] [withMaven] openTasksPublisher - Scan Tasks for Maven artifact org.apache.maven.release:maven-release-manager:3.0.0-SNAPSHOT in source directory windows-jdk10-m3.5.x_build\maven-release-manager\src\main\java
[windows-jdk10-m3.5.x_build] [withMaven] openTasksPublisher - Scan Tasks for Maven artifact org.apache.maven.plugins:maven-release-plugin:3.0.0-SNAPSHOT in source directory windows-jdk10-m3.5.x_build\maven-release-plugin\src\main\java
[windows-jdk10-m3.5.x_build] [withMaven] openTasksPublisher - Scan Tasks for Maven artifact org.apache.maven.release:maven-release-oddeven-policy:3.0.0-SNAPSHOT in source directory windows-jdk10-m3.5.x_build\maven-release-policies\maven-release-oddeven-policy\src\main\java
[windows-jdk10-m3.5.x_build] [withMaven] openTasksPublisher - Scan Tasks for Maven artifact org.apache.maven.release:maven-release-semver-policy:3.0.0-SNAPSHOT in source directory windows-jdk10-m3.5.x_build\maven-release-policies\maven-release-semver-policy\src\main\java
[windows-jdk10-m3.5.x_build] [TASKS] Scanning folder 'f:\jenkins\jenkins-slave\workspace\en-box_maven-release_master-OCKGULQBCZ67VBKJ7HF6E7KZUCKX7ZC6FX64GH66OHP7A4VAQBIQ@3@2' for files matching the pattern 'windows-jdk10-m3.5.x_build\maven-release-api\src\main\java\**\*,windows-jdk10-m3.5.x_build\maven-release-manager\src\main\java\**\*,windows-jdk10-m3.5.x_build\maven-release-plugin\src\main\java\**\*,windows-jdk10-m3.5.x_build\maven-release-policies\maven-release-oddeven-policy\src\main\java\**\*,windows-jdk10-m3.5.x_build\maven-release-policies\maven-release-semver-policy\src\main\java\**\*' - excludes: null
[windows-jdk10-m3.5.x_build] [TASKS] Found 130 files to scan for tasks
[windows-jdk10-m3.5.x_build] [TASKS] Found 21 open tasks.
[windows-jdk10-m3.5.x_build] Skipping warnings blame since pipelines do not have an SCM link.%n
[windows-jdk10-m3.5.x_build] [TASKS] Computing warning deltas based on reference build #54
[Pipeline] [windows-jdk10-m3.5.x_build] // withMaven
[Pipeline] [windows-jdk10-m3.5.x_build] cleanWs
[windows-jdk10-m3.5.x_build] [WS-CLEANUP] Deleting project workspace...[WS-CLEANUP] done
[Pipeline] [windows-jdk10-m3.5.x_build] }
[Pipeline] [windows-jdk10-m3.5.x_build] // stage
[Pipeline] [windows-jdk10-m3.5.x_build] }
[Pipeline] [windows-jdk10-m3.5.x_build] // ws
[Pipeline] [windows-jdk10-m3.5.x_build] }
[Pipeline] [windows-jdk10-m3.5.x_build] // node
[Pipeline] [windows-jdk10-m3.5.x_build] }
[Pipeline] // parallel
[Pipeline] stage
[Pipeline] { (Notifications)
[Pipeline] echo
Build result: FAILURE
[Pipeline] jiraIssueSelector
[Pipeline] emailext