Build failed in Jenkins: Maven TLP » maven-release » master #55

classic Classic list List threaded Threaded
3 messages Options
Reply | Threaded
Open this post in threaded view
|

Build failed in Jenkins: Maven TLP » maven-release » master #55

Apache Jenkins Server-2
See https://builds.apache.org/job/maven-box/job/maven-release/job/master/55/

Changes:

* added GitHub configuration

No tests ran.

Build log:
[...truncated 3113 lines...]
    at org.apache.maven.lifecycle.internal.MojoExecutor.execute (MojoExecutor.java:215)
    at org.apache.maven.lifecycle.internal.MojoExecutor.execute (MojoExecutor.java:156)
    at org.apache.maven.lifecycle.internal.MojoExecutor.execute (MojoExecutor.java:148)
    at org.apache.maven.lifecycle.internal.LifecycleModuleBuilder.buildProject (LifecycleModuleBuilder.java:117)
    at org.apache.maven.lifecycle.internal.LifecycleModuleBuilder.buildProject (LifecycleModuleBuilder.java:81)
    at org.apache.maven.lifecycle.internal.builder.singlethreaded.SingleThreadedBuilder.build (SingleThreadedBuilder.java:56)
    at org.apache.maven.lifecycle.internal.LifecycleStarter.execute (LifecycleStarter.java:128)
    at org.apache.maven.DefaultMaven.doExecute (DefaultMaven.java:305)
    at org.apache.maven.DefaultMaven.doExecute (DefaultMaven.java:192)
    at org.apache.maven.DefaultMaven.execute (DefaultMaven.java:105)
    at org.apache.maven.cli.MavenCli.execute (MavenCli.java:956)
    at org.apache.maven.cli.MavenCli.doMain (MavenCli.java:288)
    at org.apache.maven.cli.MavenCli.main (MavenCli.java:192)
    at jdk.internal.reflect.NativeMethodAccessorImpl.invoke0 (Native Method)
    at jdk.internal.reflect.NativeMethodAccessorImpl.invoke (NativeMethodAccessorImpl.java:62)
    at jdk.internal.reflect.DelegatingMethodAccessorImpl.invoke (DelegatingMethodAccessorImpl.java:43)
    at java.lang.reflect.Method.invoke (Method.java:566)
    at org.codehaus.plexus.classworlds.launcher.Launcher.launchEnhanced (Launcher.java:282)
    at org.codehaus.plexus.classworlds.launcher.Launcher.launch (Launcher.java:225)
    at org.codehaus.plexus.classworlds.launcher.Launcher.mainWithExitCode (Launcher.java:406)
    at org.codehaus.plexus.classworlds.launcher.Launcher.main (Launcher.java:347)
[INFO] 10 resources included (use -debug for more details)
[INFO] Rat check: Summary over all files. Unapproved: 1, unknown: 1, generated: 0, approved: 8 licenses.
[INFO] ------------------------------------------------------------------------
[INFO] Reactor Summary for Maven Release 3.0.0-SNAPSHOT:
[INFO]
[INFO] Maven Release ...................................... FAILURE [ 13.042 s]
[INFO] Maven Release APIs ................................. SKIPPED
[INFO] Maven Release Manager .............................. SKIPPED
[INFO] Maven Release Plugin ............................... SKIPPED
[INFO] Maven Release Odd-Even Policy ...................... SKIPPED
[INFO] Maven Release SemVer Policy ........................ SKIPPED
[INFO] ------------------------------------------------------------------------
[INFO] BUILD FAILURE
[INFO] ------------------------------------------------------------------------
[INFO] Total time:  13.595 s
[INFO] Finished at: 2020-02-11T23:42:18-08:00
[INFO] ------------------------------------------------------------------------
[INFO] [jenkins-event-spy] Generated F:\jenkins\jenkins-slave\workspace\maven-box_maven-release_master@2@2@tmp\withMaven7e92385c\maven-spy-20200211-234204-6299059066164555885859.log
[ERROR] Failed to execute goal org.apache.rat:apache-rat-plugin:0.12:check (rat-check) on project maven-release: Too many files with unapproved license: 1 See RAT report in: f:\jenkins\jenkins-slave\workspace\maven-box_maven-release_master@2@2\windows-jdk14-m3.6.x_build\target\rat.txt -> [Help 1]
org.apache.maven.lifecycle.LifecycleExecutionException: Failed to execute goal org.apache.rat:apache-rat-plugin:0.12:check (rat-check) on project maven-release: Too many files with unapproved license: 1 See RAT report in: f:\jenkins\jenkins-slave\workspace\maven-box_maven-release_master@2@2\windows-jdk14-m3.6.x_build\target\rat.txt
    at org.apache.maven.lifecycle.internal.MojoExecutor.execute (MojoExecutor.java:215)
    at org.apache.maven.lifecycle.internal.MojoExecutor.execute (MojoExecutor.java:156)
    at org.apache.maven.lifecycle.internal.MojoExecutor.execute (MojoExecutor.java:148)
    at org.apache.maven.lifecycle.internal.LifecycleModuleBuilder.buildProject (LifecycleModuleBuilder.java:117)
    at org.apache.maven.lifecycle.internal.LifecycleModuleBuilder.buildProject (LifecycleModuleBuilder.java:81)
    at org.apache.maven.lifecycle.internal.builder.singlethreaded.SingleThreadedBuilder.build (SingleThreadedBuilder.java:56)
    at org.apache.maven.lifecycle.internal.LifecycleStarter.execute (LifecycleStarter.java:128)
    at org.apache.maven.DefaultMaven.doExecute (DefaultMaven.java:305)
    at org.apache.maven.DefaultMaven.doExecute (DefaultMaven.java:192)
    at org.apache.maven.DefaultMaven.execute (DefaultMaven.java:105)
    at org.apache.maven.cli.MavenCli.execute (MavenCli.java:956)
    at org.apache.maven.cli.MavenCli.doMain (MavenCli.java:288)
    at org.apache.maven.cli.MavenCli.main (MavenCli.java:192)
    at jdk.internal.reflect.NativeMethodAccessorImpl.invoke0 (Native Method)
    at jdk.internal.reflect.NativeMethodAccessorImpl.invoke (NativeMethodAccessorImpl.java:62)
    at jdk.internal.reflect.DelegatingMethodAccessorImpl.invoke (DelegatingMethodAccessorImpl.java:43)
    at java.lang.reflect.Method.invoke (Method.java:567)
    at org.codehaus.plexus.classworlds.launcher.Launcher.launchEnhanced (Launcher.java:282)
    at org.codehaus.plexus.classworlds.launcher.Launcher.launch (Launcher.java:225)
    at org.codehaus.plexus.classworlds.launcher.Launcher.mainWithExitCode (Launcher.java:406)
    at org.codehaus.plexus.classworlds.launcher.Launcher.main (Launcher.java:347)
Caused by: org.apache.rat.mp.RatCheckException: Too many files with unapproved license: 1 See RAT report in: f:\jenkins\jenkins-slave\workspace\maven-box_maven-release_master@2@2\windows-jdk14-m3.6.x_build\target\rat.txt
    at org.apache.rat.mp.RatCheckMojo.check (RatCheckMojo.java:183)
    at org.apache.rat.mp.RatCheckMojo.execute (RatCheckMojo.java:156)
    at org.apache.maven.plugin.DefaultBuildPluginManager.executeMojo (DefaultBuildPluginManager.java:137)
    at org.apache.maven.lifecycle.internal.MojoExecutor.execute (MojoExecutor.java:210)
    at org.apache.maven.lifecycle.internal.MojoExecutor.execute (MojoExecutor.java:156)
    at org.apache.maven.lifecycle.internal.MojoExecutor.execute (MojoExecutor.java:148)
    at org.apache.maven.lifecycle.internal.LifecycleModuleBuilder.buildProject (LifecycleModuleBuilder.java:117)
    at org.apache.maven.lifecycle.internal.LifecycleModuleBuilder.buildProject (LifecycleModuleBuilder.java:81)
    at org.apache.maven.lifecycle.internal.builder.singlethreaded.SingleThreadedBuilder.build (SingleThreadedBuilder.java:56)
    at org.apache.maven.lifecycle.internal.LifecycleStarter.execute (LifecycleStarter.java:128)
    at org.apache.maven.DefaultMaven.doExecute (DefaultMaven.java:305)
    at org.apache.maven.DefaultMaven.doExecute (DefaultMaven.java:192)
    at org.apache.maven.DefaultMaven.execute (DefaultMaven.java:105)
    at org.apache.maven.cli.MavenCli.execute (MavenCli.java:956)
    at org.apache.maven.cli.MavenCli.doMain (MavenCli.java:288)
    at org.apache.maven.cli.MavenCli.main (MavenCli.java:192)
    at jdk.internal.reflect.NativeMethodAccessorImpl.invoke0 (Native Method)
    at jdk.internal.reflect.NativeMethodAccessorImpl.invoke (NativeMethodAccessorImpl.java:62)
    at jdk.internal.reflect.DelegatingMethodAccessorImpl.invoke (DelegatingMethodAccessorImpl.java:43)
    at java.lang.reflect.Method.invoke (Method.java:567)
    at org.codehaus.plexus.classworlds.launcher.Launcher.launchEnhanced (Launcher.java:282)
    at org.codehaus.plexus.classworlds.launcher.Launcher.launch (Launcher.java:225)
    at org.codehaus.plexus.classworlds.launcher.Launcher.mainWithExitCode (Launcher.java:406)
    at org.codehaus.plexus.classworlds.launcher.Launcher.main (Launcher.java:347)
[ERROR]
[ERROR] Re-run Maven using the -X switch to enable full debug logging.
[ERROR]
[ERROR] For more information about the errors and possible solutions, please read the following articles:
[ERROR] [Help 1] http://cwiki.apache.org/confluence/display/MAVEN/MojoFailureException
[Pipeline] }
[Pipeline] // dir
Caused by: org.apache.rat.mp.RatCheckException: Too many files with unapproved license: 1 See RAT report in: f:\jenkins\jenkins-slave\workspace\maven-box_maven-release_master@3\windows-jdk11-m3.6.x_build\target\rat.txt
    at org.apache.rat.mp.RatCheckMojo.check (RatCheckMojo.java:183)
    at org.apache.rat.mp.RatCheckMojo.execute (RatCheckMojo.java:156)
    at org.apache.maven.plugin.DefaultBuildPluginManager.executeMojo (DefaultBuildPluginManager.java:137)
    at org.apache.maven.lifecycle.internal.MojoExecutor.execute (MojoExecutor.java:210)
    at org.apache.maven.lifecycle.internal.MojoExecutor.execute (MojoExecutor.java:156)
    at org.apache.maven.lifecycle.internal.MojoExecutor.execute (MojoExecutor.java:148)
    at org.apache.maven.lifecycle.internal.LifecycleModuleBuilder.buildProject (LifecycleModuleBuilder.java:117)
    at org.apache.maven.lifecycle.internal.LifecycleModuleBuilder.buildProject (LifecycleModuleBuilder.java:81)
    at org.apache.maven.lifecycle.internal.builder.singlethreaded.SingleThreadedBuilder.build (SingleThreadedBuilder.java:56)
    at org.apache.maven.lifecycle.internal.LifecycleStarter.execute (LifecycleStarter.java:128)
    at org.apache.maven.DefaultMaven.doExecute (DefaultMaven.java:305)
    at org.apache.maven.DefaultMaven.doExecute (DefaultMaven.java:192)
    at org.apache.maven.DefaultMaven.execute (DefaultMaven.java:105)
    at org.apache.maven.cli.MavenCli.execute (MavenCli.java:956)
    at org.apache.maven.cli.MavenCli.doMain (MavenCli.java:288)
    at org.apache.maven.cli.MavenCli.main (MavenCli.java:192)
    at jdk.internal.reflect.NativeMethodAccessorImpl.invoke0 (Native Method)
    at jdk.internal.reflect.NativeMethodAccessorImpl.invoke (NativeMethodAccessorImpl.java:62)
    at jdk.internal.reflect.DelegatingMethodAccessorImpl.invoke (DelegatingMethodAccessorImpl.java:43)
    at java.lang.reflect.Method.invoke (Method.java:566)
    at org.codehaus.plexus.classworlds.launcher.Launcher.launchEnhanced (Launcher.java:282)
    at org.codehaus.plexus.classworlds.launcher.Launcher.launch (Launcher.java:225)
    at org.codehaus.plexus.classworlds.launcher.Launcher.mainWithExitCode (Launcher.java:406)
    at org.codehaus.plexus.classworlds.launcher.Launcher.main (Launcher.java:347)
[ERROR]
[ERROR] Re-run Maven using the -X switch to enable full debug logging.
[ERROR]
[ERROR] For more information about the errors and possible solutions, please read the following articles:
[ERROR] [Help 1] http://cwiki.apache.org/confluence/display/MAVEN/MojoFailureException
[Pipeline] }
[Pipeline] }
[Pipeline] // dir
[withMaven] Publishers: Generated Artifacts Publisher: 21 ms, Open Task Scanner Publisher: 5 ms
[Pipeline] }
[Pipeline] // withMaven
[INFO] Rat check: Summary over all files. Unapproved: 1, unknown: 1, generated: 0, approved: 8 licenses.
[Pipeline] cleanWs
[WS-CLEANUP] Deleting project workspace...
[WS-CLEANUP] Deferred wipeout is used...
[withMaven] Publishers: Generated Artifacts Publisher: 18 ms, Open Task Scanner Publisher: 5 ms
[WS-CLEANUP] done
[Pipeline] cleanWs
[WS-CLEANUP] Deleting project workspace...
[WS-CLEANUP] Deferred wipeout is used...
[Pipeline] // withMaven
[WS-CLEANUP] done
[Pipeline] cleanWs
[WS-CLEANUP] Deleting project workspace...
[WS-CLEANUP] Deferred wipeout is used...
[Pipeline] }
[WS-CLEANUP] done
[Pipeline] // stage
[Pipeline] }
[Pipeline] cleanWs
[WS-CLEANUP] Deleting project workspace...
[WS-CLEANUP] Deferred wipeout is used...
[Pipeline] // ws
[INFO] ------------------------------------------------------------------------
[INFO] Reactor Summary:
[INFO]
[INFO] Maven Release ...................................... FAILURE [  9.949 s]
[INFO] Maven Release APIs ................................. SKIPPED
[INFO] Maven Release Manager .............................. SKIPPED
[INFO] Maven Release Plugin ............................... SKIPPED
[INFO] Maven Release Odd-Even Policy ...................... SKIPPED
[INFO] Maven Release SemVer Policy ........................ SKIPPED
[INFO] ------------------------------------------------------------------------
[INFO] BUILD FAILURE
[INFO] ------------------------------------------------------------------------
[INFO] Total time: 10.663 s
[INFO] Finished at: 2020-02-11T23:42:19-08:00
[INFO] Final Memory: 14M/244M
[INFO] ------------------------------------------------------------------------
[INFO] [jenkins-event-spy] Generated F:\jenkins\jenkins-slave\workspace\maven-box_maven-release_master@3@tmp\withMaven92e4afa0\maven-spy-20200211-234207-8994679440621043442795.log
[ERROR] Failed to execute goal org.apache.rat:apache-rat-plugin:0.12:check (rat-check) on project maven-release: Too many files with unapproved license: 1 See RAT report in: f:\jenkins\jenkins-slave\workspace\maven-box_maven-release_master@3\windows-jdk7-m3.3.x_build\target\rat.txt -> [Help 1]
org.apache.maven.lifecycle.LifecycleExecutionException: Failed to execute goal org.apache.rat:apache-rat-plugin:0.12:check (rat-check) on project maven-release: Too many files with unapproved license: 1 See RAT report in: f:\jenkins\jenkins-slave\workspace\maven-box_maven-release_master@3\windows-jdk7-m3.3.x_build\target\rat.txt
        at org.apache.maven.lifecycle.internal.MojoExecutor.execute(MojoExecutor.java:212)
        at org.apache.maven.lifecycle.internal.MojoExecutor.execute(MojoExecutor.java:153)
        at org.apache.maven.lifecycle.internal.MojoExecutor.execute(MojoExecutor.java:145)
        at org.apache.maven.lifecycle.internal.LifecycleModuleBuilder.buildProject(LifecycleModuleBuilder.java:116)
        at org.apache.maven.lifecycle.internal.LifecycleModuleBuilder.buildProject(LifecycleModuleBuilder.java:80)
        at org.apache.maven.lifecycle.internal.builder.singlethreaded.SingleThreadedBuilder.build(SingleThreadedBuilder.java:51)
        at org.apache.maven.lifecycle.internal.LifecycleStarter.execute(LifecycleStarter.java:128)
        at org.apache.maven.DefaultMaven.doExecute(DefaultMaven.java:307)
        at org.apache.maven.DefaultMaven.doExecute(DefaultMaven.java:193)
        at org.apache.maven.DefaultMaven.execute(DefaultMaven.java:106)
        at org.apache.maven.cli.MavenCli.execute(MavenCli.java:863)
        at org.apache.maven.cli.MavenCli.doMain(MavenCli.java:288)
        at org.apache.maven.cli.MavenCli.main(MavenCli.java:199)
        at sun.reflect.NativeMethodAccessorImpl.invoke0(Native Method)
        at sun.reflect.NativeMethodAccessorImpl.invoke(NativeMethodAccessorImpl.java:57)
        at sun.reflect.DelegatingMethodAccessorImpl.invoke(DelegatingMethodAccessorImpl.java:43)
        at java.lang.reflect.Method.invoke(Method.java:606)
        at org.codehaus.plexus.classworlds.launcher.Launcher.launchEnhanced(Launcher.java:289)
        at org.codehaus.plexus.classworlds.launcher.Launcher.launch(Launcher.java:229)
        at org.codehaus.plexus.classworlds.launcher.Launcher.mainWithExitCode(Launcher.java:415)
        at org.codehaus.plexus.classworlds.launcher.Launcher.main(Launcher.java:356)
Caused by: org.apache.rat.mp.RatCheckException: Too many files with unapproved license: 1 See RAT report in: f:\jenkins\jenkins-slave\workspace\maven-box_maven-release_master@3\windows-jdk7-m3.3.x_build\target\rat.txt
        at org.apache.rat.mp.RatCheckMojo.check(RatCheckMojo.java:183)
        at org.apache.rat.mp.RatCheckMojo.execute(RatCheckMojo.java:156)
        at org.apache.maven.plugin.DefaultBuildPluginManager.executeMojo(DefaultBuildPluginManager.java:134)
        at org.apache.maven.lifecycle.internal.MojoExecutor.execute(MojoExecutor.java:207)
        ... 20 more
[ERROR]
[ERROR] Re-run Maven using the -X switch to enable full debug logging.
[ERROR]
[ERROR] For more information about the errors and possible solutions, please read the following articles:
[ERROR] [Help 1] http://cwiki.apache.org/confluence/display/MAVEN/MojoFailureException
Picked up JAVA_TOOL_OPTIONS: -Dmaven.ext.class.path="f:\jenkins\jenkins-slave\workspace\maven-box_maven-release_master@3@tmp\withMaven92e4afa0\pipeline-maven-spy.jar" -Dorg.jenkinsci.plugins.pipeline.maven.reportsFolder="f:\jenkins\jenkins-slave\workspace\maven-box_maven-release_master@3@tmp\withMaven92e4afa0"
[Pipeline] }
[WS-CLEANUP] done
[Pipeline] // node
[Pipeline] }
Failed in branch windows-jdk14-m3.6.x_build
[Pipeline] }
[Pipeline] }
[Pipeline] // stage
[Pipeline] // dir
[Pipeline] }
[Pipeline] }
[Pipeline] // ws
[Pipeline] }
[withMaven] Publishers: Generated Artifacts Publisher: 20 ms, Open Task Scanner Publisher: 5 ms
[Pipeline] // node
[Pipeline] // withMaven
[Pipeline] }
Failed in branch windows-jdk11-m3.6.x_build
[Pipeline] cleanWs
[WS-CLEANUP] Deleting project workspace...
[WS-CLEANUP] Deferred wipeout is used...
[WS-CLEANUP] done
[Pipeline] cleanWs
[WS-CLEANUP] Deleting project workspace...
[WS-CLEANUP] Deferred wipeout is used...
[WS-CLEANUP] done
[Pipeline] }
[Pipeline] // stage
[Pipeline] }
[Pipeline] // ws
[Pipeline] }
[Pipeline] // node
[Pipeline] }
Failed in branch windows-jdk7-m3.3.x_build
[Pipeline] // parallel
[Pipeline] stage
[Pipeline] { (Notifications)
[Pipeline] echo
Build result: FAILURE
[Pipeline] jiraIssueSelector
[Pipeline] echo
The authors of changes [hboutemy].
[Pipeline] echo
Sending email ...
[Pipeline] emailext
Reply | Threaded
Open this post in threaded view
|

Build failed in Jenkins: Maven TLP » maven-release » master #56

Apache Jenkins Server-2
See https://builds.apache.org/job/maven-box/job/maven-release/job/master/56/

Changes:

* fixed project website URL

No tests ran.

Build log:
[...truncated 3113 lines...]
[INFO] Scanning for projects...
[INFO] Exclude: .repository
[INFO] ------------------------------------------------------------------------
[INFO] Exclude: .repository/**
[INFO] Reactor Build Order:
[INFO]
[INFO] Exclude: .maven/spy.log
[INFO] Maven Release                                                      [pom]
[INFO] Exclude: dependency-reduced-pom.xml
[INFO] Maven Release APIs                                                 [jar]
[INFO] Exclude: .java-version
[INFO] Maven Release Manager                                              [jar]
[INFO] 10 resources included (use -debug for more details)
[INFO] Maven Release Plugin                                      [maven-plugin]
[INFO] Rat check: Summary over all files. Unapproved: 1, unknown: 1, generated: 0, approved: 8 licenses.
[INFO] Maven Release Odd-Even Policy                                      [jar]
[INFO] ------------------------------------------------------------------------
[INFO] Maven Release SemVer Policy                                        [jar]
[INFO] Reactor Summary for Maven Release 3.0.0-SNAPSHOT:
[INFO]
[INFO]
[INFO] Maven Release ...................................... FAILURE [  1.834 s]
[INFO] ---------------< org.apache.maven.release:maven-release >---------------
[INFO] Maven Release APIs ................................. SKIPPED
[INFO] Building Maven Release 3.0.0-SNAPSHOT                              [1/6]
[INFO] Maven Release Manager .............................. SKIPPED
[INFO] --------------------------------[ pom ]---------------------------------
[INFO] Maven Release Plugin ............................... SKIPPED
[INFO]
[INFO] Maven Release Odd-Even Policy ...................... SKIPPED
[INFO] Maven Release SemVer Policy ........................ SKIPPED
[INFO] --- maven-clean-plugin:3.1.0:clean (default-clean) @ maven-release ---
[INFO] ------------------------------------------------------------------------
[INFO] BUILD FAILURE
[INFO]
[INFO] ------------------------------------------------------------------------
[INFO] Total time:  2.081 s
[INFO] Finished at: 2020-02-12T07:43:10Z
[INFO] --- maven-enforcer-plugin:1.4.1:enforce (enforce-maven-version) @ maven-release ---
[INFO]
[INFO] ------------------------------------------------------------------------
[INFO] --- maven-enforcer-plugin:1.4.1:enforce (enforce-bytecode-version) @ maven-release ---
[INFO]
[INFO] [jenkins-event-spy] Generated /home/jenkins/jenkins-slave/workspace/maven-box_maven-release_master@3@tmp/withMavena04c5325/maven-spy-20200212-074308-5519214234758250932353.log
[INFO] --- maven-enforcer-plugin:1.4.1:enforce (ban-known-bad-maven-versions) @ maven-release ---
[INFO]
[ERROR] Failed to execute goal org.apache.rat:apache-rat-plugin:0.12:check (rat-check) on project maven-release: Too many files with unapproved license: 1 See RAT report in: /home/jenkins/jenkins-slave/workspace/maven-box_maven-release_master@3/linux-jdk8-m3.6.x_build/target/rat.txt -> [Help 1]
[INFO] --- apache-rat-plugin:0.12:check (rat-check) @ maven-release ---
[INFO] Enabled default license matchers.
[INFO] Will parse SCM ignores for exclusions...
org.apache.maven.lifecycle.LifecycleExecutionException: Failed to execute goal org.apache.rat:apache-rat-plugin:0.12:check (rat-check) on project maven-release: Too many files with unapproved license: 1 See RAT report in: /home/jenkins/jenkins-slave/workspace/maven-box_maven-release_master@3/linux-jdk8-m3.6.x_build/target/rat.txt
[INFO] Parsing exclusions from /home/jenkins/jenkins-slave/workspace/maven-box_maven-release_master@2@2/linux-jdk11-m3.6.x_build/.gitignore
    at org.apache.maven.lifecycle.internal.MojoExecutor.execute (MojoExecutor.java:215)
[INFO] Finished adding exclusions from SCM ignore files.
    at org.apache.maven.lifecycle.internal.MojoExecutor.execute (MojoExecutor.java:156)
[INFO] 71 implicit excludes (use -debug for more details).
    at org.apache.maven.lifecycle.internal.MojoExecutor.execute (MojoExecutor.java:148)
[INFO] Exclude: .repository
    at org.apache.maven.lifecycle.internal.LifecycleModuleBuilder.buildProject (LifecycleModuleBuilder.java:117)
[INFO] Exclude: .repository/**
    at org.apache.maven.lifecycle.internal.LifecycleModuleBuilder.buildProject (LifecycleModuleBuilder.java:81)
[INFO] Exclude: .maven/spy.log
    at org.apache.maven.lifecycle.internal.builder.singlethreaded.SingleThreadedBuilder.build (SingleThreadedBuilder.java:56)
[INFO] Exclude: dependency-reduced-pom.xml
    at org.apache.maven.lifecycle.internal.LifecycleStarter.execute (LifecycleStarter.java:128)
[INFO] Exclude: .java-version
    at org.apache.maven.DefaultMaven.doExecute (DefaultMaven.java:305)
[INFO] 10 resources included (use -debug for more details)
    at org.apache.maven.DefaultMaven.doExecute (DefaultMaven.java:192)
[INFO] Rat check: Summary over all files. Unapproved: 1, unknown: 1, generated: 0, approved: 8 licenses.
    at org.apache.maven.DefaultMaven.execute (DefaultMaven.java:105)
[INFO] ------------------------------------------------------------------------
    at org.apache.maven.cli.MavenCli.execute (MavenCli.java:956)
[INFO] Reactor Summary for Maven Release 3.0.0-SNAPSHOT:
    at org.apache.maven.cli.MavenCli.doMain (MavenCli.java:288)
[INFO]
    at org.apache.maven.cli.MavenCli.main (MavenCli.java:192)
[INFO] Maven Release ...................................... FAILURE [  1.561 s]
    at sun.reflect.NativeMethodAccessorImpl.invoke0 (Native Method)
[INFO] Maven Release APIs ................................. SKIPPED
    at sun.reflect.NativeMethodAccessorImpl.invoke (NativeMethodAccessorImpl.java:62)
[INFO] Maven Release Manager .............................. SKIPPED
    at sun.reflect.DelegatingMethodAccessorImpl.invoke (DelegatingMethodAccessorImpl.java:43)
[INFO] Maven Release Plugin ............................... SKIPPED
    at java.lang.reflect.Method.invoke (Method.java:498)
[INFO] Maven Release Odd-Even Policy ...................... SKIPPED
    at org.codehaus.plexus.classworlds.launcher.Launcher.launchEnhanced (Launcher.java:282)
[INFO] Maven Release SemVer Policy ........................ SKIPPED
    at org.codehaus.plexus.classworlds.launcher.Launcher.launch (Launcher.java:225)
[INFO] ------------------------------------------------------------------------
    at org.codehaus.plexus.classworlds.launcher.Launcher.mainWithExitCode (Launcher.java:406)
[INFO] BUILD FAILURE
    at org.codehaus.plexus.classworlds.launcher.Launcher.main (Launcher.java:347)
[INFO] ------------------------------------------------------------------------
[INFO] Total time:  1.909 s
[INFO] Finished at: 2020-02-12T07:43:12Z
Caused by: org.apache.rat.mp.RatCheckException: Too many files with unapproved license: 1 See RAT report in: /home/jenkins/jenkins-slave/workspace/maven-box_maven-release_master@3/linux-jdk8-m3.6.x_build/target/rat.txt
[INFO] ------------------------------------------------------------------------
    at org.apache.rat.mp.RatCheckMojo.check (RatCheckMojo.java:183)
[INFO] [jenkins-event-spy] Generated /home/jenkins/jenkins-slave/workspace/maven-box_maven-release_master@2@2@tmp/withMaven407fe546/maven-spy-20200212-074310-4289288691500588172683.log
    at org.apache.rat.mp.RatCheckMojo.execute (RatCheckMojo.java:156)
    at org.apache.maven.plugin.DefaultBuildPluginManager.executeMojo (DefaultBuildPluginManager.java:137)
    at org.apache.maven.lifecycle.internal.MojoExecutor.execute (MojoExecutor.java:210)
[ERROR] Failed to execute goal org.apache.rat:apache-rat-plugin:0.12:check (rat-check) on project maven-release: Too many files with unapproved license: 1 See RAT report in: /home/jenkins/jenkins-slave/workspace/maven-box_maven-release_master@2@2/linux-jdk11-m3.6.x_build/target/rat.txt -> [Help 1]
    at org.apache.maven.lifecycle.internal.MojoExecutor.execute (MojoExecutor.java:156)
    at org.apache.maven.lifecycle.internal.MojoExecutor.execute (MojoExecutor.java:148)
org.apache.maven.lifecycle.LifecycleExecutionException: Failed to execute goal org.apache.rat:apache-rat-plugin:0.12:check (rat-check) on project maven-release: Too many files with unapproved license: 1 See RAT report in: /home/jenkins/jenkins-slave/workspace/maven-box_maven-release_master@2@2/linux-jdk11-m3.6.x_build/target/rat.txt
    at org.apache.maven.lifecycle.internal.LifecycleModuleBuilder.buildProject (LifecycleModuleBuilder.java:117)
    at org.apache.maven.lifecycle.internal.MojoExecutor.execute (MojoExecutor.java:215)
    at org.apache.maven.lifecycle.internal.LifecycleModuleBuilder.buildProject (LifecycleModuleBuilder.java:81)
    at org.apache.maven.lifecycle.internal.MojoExecutor.execute (MojoExecutor.java:156)
    at org.apache.maven.lifecycle.internal.builder.singlethreaded.SingleThreadedBuilder.build (SingleThreadedBuilder.java:56)
    at org.apache.maven.lifecycle.internal.MojoExecutor.execute (MojoExecutor.java:148)
    at org.apache.maven.lifecycle.internal.LifecycleStarter.execute (LifecycleStarter.java:128)
    at org.apache.maven.lifecycle.internal.LifecycleModuleBuilder.buildProject (LifecycleModuleBuilder.java:117)
    at org.apache.maven.DefaultMaven.doExecute (DefaultMaven.java:305)
    at org.apache.maven.lifecycle.internal.LifecycleModuleBuilder.buildProject (LifecycleModuleBuilder.java:81)
    at org.apache.maven.DefaultMaven.doExecute (DefaultMaven.java:192)
    at org.apache.maven.lifecycle.internal.builder.singlethreaded.SingleThreadedBuilder.build (SingleThreadedBuilder.java:56)
    at org.apache.maven.DefaultMaven.execute (DefaultMaven.java:105)
    at org.apache.maven.lifecycle.internal.LifecycleStarter.execute (LifecycleStarter.java:128)
    at org.apache.maven.cli.MavenCli.execute (MavenCli.java:956)
    at org.apache.maven.DefaultMaven.doExecute (DefaultMaven.java:305)
    at org.apache.maven.cli.MavenCli.doMain (MavenCli.java:288)
    at org.apache.maven.DefaultMaven.doExecute (DefaultMaven.java:192)
    at org.apache.maven.cli.MavenCli.main (MavenCli.java:192)
    at org.apache.maven.DefaultMaven.execute (DefaultMaven.java:105)
    at sun.reflect.NativeMethodAccessorImpl.invoke0 (Native Method)
    at org.apache.maven.cli.MavenCli.execute (MavenCli.java:956)
    at sun.reflect.NativeMethodAccessorImpl.invoke (NativeMethodAccessorImpl.java:62)
    at org.apache.maven.cli.MavenCli.doMain (MavenCli.java:288)
    at sun.reflect.DelegatingMethodAccessorImpl.invoke (DelegatingMethodAccessorImpl.java:43)
    at org.apache.maven.cli.MavenCli.main (MavenCli.java:192)
    at java.lang.reflect.Method.invoke (Method.java:498)
    at jdk.internal.reflect.NativeMethodAccessorImpl.invoke0 (Native Method)
    at org.codehaus.plexus.classworlds.launcher.Launcher.launchEnhanced (Launcher.java:282)
    at jdk.internal.reflect.NativeMethodAccessorImpl.invoke (NativeMethodAccessorImpl.java:62)
    at org.codehaus.plexus.classworlds.launcher.Launcher.launch (Launcher.java:225)
    at jdk.internal.reflect.DelegatingMethodAccessorImpl.invoke (DelegatingMethodAccessorImpl.java:43)
    at org.codehaus.plexus.classworlds.launcher.Launcher.mainWithExitCode (Launcher.java:406)
    at java.lang.reflect.Method.invoke (Method.java:566)
    at org.codehaus.plexus.classworlds.launcher.Launcher.main (Launcher.java:347)
    at org.codehaus.plexus.classworlds.launcher.Launcher.launchEnhanced (Launcher.java:282)
[ERROR]
    at org.codehaus.plexus.classworlds.launcher.Launcher.launch (Launcher.java:225)
[ERROR] Re-run Maven using the -X switch to enable full debug logging.
    at org.codehaus.plexus.classworlds.launcher.Launcher.mainWithExitCode (Launcher.java:406)
[ERROR]
    at org.codehaus.plexus.classworlds.launcher.Launcher.main (Launcher.java:347)
[ERROR] For more information about the errors and possible solutions, please read the following articles:
Caused by: org.apache.rat.mp.RatCheckException: Too many files with unapproved license: 1 See RAT report in: /home/jenkins/jenkins-slave/workspace/maven-box_maven-release_master@2@2/linux-jdk11-m3.6.x_build/target/rat.txt
[ERROR] [Help 1] http://cwiki.apache.org/confluence/display/MAVEN/MojoFailureException
    at org.apache.rat.mp.RatCheckMojo.check (RatCheckMojo.java:183)
    at org.apache.rat.mp.RatCheckMojo.execute (RatCheckMojo.java:156)
    at org.apache.maven.plugin.DefaultBuildPluginManager.executeMojo (DefaultBuildPluginManager.java:137)
    at org.apache.maven.lifecycle.internal.MojoExecutor.execute (MojoExecutor.java:210)
    at org.apache.maven.lifecycle.internal.MojoExecutor.execute (MojoExecutor.java:156)
    at org.apache.maven.lifecycle.internal.MojoExecutor.execute (MojoExecutor.java:148)
    at org.apache.maven.lifecycle.internal.LifecycleModuleBuilder.buildProject (LifecycleModuleBuilder.java:117)
    at org.apache.maven.lifecycle.internal.LifecycleModuleBuilder.buildProject (LifecycleModuleBuilder.java:81)
    at org.apache.maven.lifecycle.internal.builder.singlethreaded.SingleThreadedBuilder.build (SingleThreadedBuilder.java:56)
    at org.apache.maven.lifecycle.internal.LifecycleStarter.execute (LifecycleStarter.java:128)
    at org.apache.maven.DefaultMaven.doExecute (DefaultMaven.java:305)
    at org.apache.maven.DefaultMaven.doExecute (DefaultMaven.java:192)
    at org.apache.maven.DefaultMaven.execute (DefaultMaven.java:105)
    at org.apache.maven.cli.MavenCli.execute (MavenCli.java:956)
    at org.apache.maven.cli.MavenCli.doMain (MavenCli.java:288)
    at org.apache.maven.cli.MavenCli.main (MavenCli.java:192)
    at jdk.internal.reflect.NativeMethodAccessorImpl.invoke0 (Native Method)
    at jdk.internal.reflect.NativeMethodAccessorImpl.invoke (NativeMethodAccessorImpl.java:62)
    at jdk.internal.reflect.DelegatingMethodAccessorImpl.invoke (DelegatingMethodAccessorImpl.java:43)
    at java.lang.reflect.Method.invoke (Method.java:566)
    at org.codehaus.plexus.classworlds.launcher.Launcher.launchEnhanced (Launcher.java:282)
    at org.codehaus.plexus.classworlds.launcher.Launcher.launch (Launcher.java:225)
    at org.codehaus.plexus.classworlds.launcher.Launcher.mainWithExitCode (Launcher.java:406)
    at org.codehaus.plexus.classworlds.launcher.Launcher.main (Launcher.java:347)
[ERROR]
[ERROR] Re-run Maven using the -X switch to enable full debug logging.
[ERROR]
[ERROR] For more information about the errors and possible solutions, please read the following articles:
[ERROR] [Help 1] http://cwiki.apache.org/confluence/display/MAVEN/MojoFailureException
[WS-CLEANUP] Deleting project workspace...
[WS-CLEANUP] Deferred wipeout is used...
[Pipeline] }
[Pipeline] }
[Pipeline] // dir
[Pipeline] // dir
[Pipeline] }
[Pipeline] }
[WS-CLEANUP] done
[Pipeline] cleanWs
[WS-CLEANUP] Deleting project workspace...
[WS-CLEANUP] Deferred wipeout is used...
[WS-CLEANUP] done
[Pipeline] }
[Pipeline] // stage
[Pipeline] }
[Pipeline] // ws
[Pipeline] }
[Pipeline] // node
[Pipeline] }
Failed in branch linux-jdk7-m3.2.x_build
[withMaven] Publishers: Generated Artifacts Publisher: 319 ms, Open Task Scanner Publisher: 357 ms
[withMaven] Publishers: Generated Artifacts Publisher: 317 ms, Open Task Scanner Publisher: 357 ms
[Pipeline] // withMaven
[Pipeline] // withMaven
[Pipeline] cleanWs
[Pipeline] cleanWs
[WS-CLEANUP] Deleting project workspace...
[WS-CLEANUP] Deferred wipeout is used...
[WS-CLEANUP] Deleting project workspace...
[WS-CLEANUP] Deferred wipeout is used...
[WS-CLEANUP] done
[Pipeline] cleanWs
[WS-CLEANUP] done
[Pipeline] cleanWs
[WS-CLEANUP] Deleting project workspace...
[WS-CLEANUP] Deferred wipeout is used...
[WS-CLEANUP] Deleting project workspace...
[WS-CLEANUP] Deferred wipeout is used...
[WS-CLEANUP] done
[Pipeline] }
[WS-CLEANUP] done
[Pipeline] // stage
[Pipeline] }
[Pipeline] }
[Pipeline] // ws
[Pipeline] // stage
[Pipeline] }
[Pipeline] }
[Pipeline] // node
[Pipeline] // ws
[Pipeline] }
Failed in branch linux-jdk8-m3.6.x_build
[Pipeline] }
[Pipeline] // node
[Pipeline] }
Failed in branch linux-jdk11-m3.6.x_build
[Pipeline] // parallel
[Pipeline] stage
[Pipeline] { (Notifications)
[Pipeline] echo
Build result: FAILURE
[Pipeline] jiraIssueSelector
[Pipeline] echo
The authors of changes [hboutemy].
[Pipeline] echo
Sending email ...
[Pipeline] emailext
Reply | Threaded
Open this post in threaded view
|

Build succeeded in Jenkins: Maven TLP » maven-release » master #57

Apache Jenkins Server-2