Build failed in Jenkins: Maven TLP » maven-release » master #33

Previous Topic Next Topic
 
classic Classic list List threaded Threaded
2 messages Options
Reply | Threaded
Open this post in threaded view
|

Build failed in Jenkins: Maven TLP » maven-release » master #33

Apache Jenkins Server-2
See https://builds.apache.org/job/maven-box/job/maven-release/job/master/33/

Changes:

* Add JDK 10 b37 (early access build) (Windows Only)

No tests ran.

Build log:
[...truncated 12.94 KB...]
[linux-jdk7] Running in /home/jenkins/jenkins-slave/workspace/en-box_maven-release_master-OCKGULQBCZ67VBKJ7HF6E7KZUCKX7ZC6FX64GH66OHP7A4VAQBIQ/m
[Pipeline] [linux-jdk7] {
[Pipeline] [linux-jdk8] dir
[linux-jdk8] Running in /home/jenkins/jenkins-slave/workspace/en-box_maven-release_master-OCKGULQBCZ67VBKJ7HF6E7KZUCKX7ZC6FX64GH66OHP7A4VAQBIQ@2/m
[Pipeline] [linux-jdk8] {
[Pipeline] [linux-jdk9] dir
[linux-jdk9] Running in /home/jenkins/jenkins-slave/workspace/en-box_maven-release_master-OCKGULQBCZ67VBKJ7HF6E7KZUCKX7ZC6FX64GH66OHP7A4VAQBIQ/m
[Pipeline] [linux-jdk9] {
[Pipeline] [windows-jdk7] dir
[windows-jdk7] Running in f:\jenkins\jenkins-slave\workspace\en-box_maven-release_master-OCKGULQBCZ67VBKJ7HF6E7KZUCKX7ZC6FX64GH66OHP7A4VAQBIQ\m
[Pipeline] [windows-jdk7] {
[Pipeline] [windows-jdk8] dir
[windows-jdk8] Running in f:\jenkins\jenkins-slave\workspace\en-box_maven-release_master-OCKGULQBCZ67VBKJ7HF6E7KZUCKX7ZC6FX64GH66OHP7A4VAQBIQ\m
[Pipeline] [windows-jdk8] {
[Pipeline] [linux-jdk7] checkout
[Pipeline] [linux-jdk8] checkout
[Pipeline] [linux-jdk9] checkout
[Pipeline] [windows-jdk7] checkout
[Pipeline] [windows-jdk8] checkout
[linux-jdk7]  > git rev-parse --is-inside-work-tree # timeout=10
[linux-jdk7] Fetching changes from the remote Git repository
[linux-jdk7]  > git config remote.origin.url https://gitbox.apache.org/repos/asf/maven-release.git # timeout=10
[linux-jdk7] Fetching without tags
[linux-jdk7] Fetching upstream changes from https://gitbox.apache.org/repos/asf/maven-release.git
[linux-jdk7]  > git --version # timeout=10
[linux-jdk7]  > git fetch --no-tags --progress https://gitbox.apache.org/repos/asf/maven-release.git +refs/heads/*:refs/remotes/origin/*
[linux-jdk8]  > git rev-parse --is-inside-work-tree # timeout=10
[linux-jdk8] Fetching changes from the remote Git repository
[linux-jdk8]  > git config remote.origin.url https://gitbox.apache.org/repos/asf/maven-release.git # timeout=10
[linux-jdk8] Fetching without tags
[linux-jdk8] Fetching upstream changes from https://gitbox.apache.org/repos/asf/maven-release.git
[linux-jdk8]  > git --version # timeout=10
[linux-jdk8]  > git fetch --no-tags --progress https://gitbox.apache.org/repos/asf/maven-release.git +refs/heads/*:refs/remotes/origin/*
[windows-jdk7]  > git rev-parse --is-inside-work-tree # timeout=10
[linux-jdk7] ERROR: Error fetching remote repo 'origin'
[linux-jdk7] hudson.plugins.git.GitException: Failed to fetch from https://gitbox.apache.org/repos/asf/maven-release.git
[linux-jdk7] at hudson.plugins.git.GitSCM.fetchFrom(GitSCM.java:825)
[linux-jdk7] at hudson.plugins.git.GitSCM.retrieveChanges(GitSCM.java:1092)
[linux-jdk7] at hudson.plugins.git.GitSCM.checkout(GitSCM.java:1123)
[linux-jdk7] at org.jenkinsci.plugins.workflow.steps.scm.SCMStep.checkout(SCMStep.java:113)
[linux-jdk7] at org.jenkinsci.plugins.workflow.steps.scm.SCMStep$StepExecutionImpl.run(SCMStep.java:85)
[linux-jdk7] at org.jenkinsci.plugins.workflow.steps.scm.SCMStep$StepExecutionImpl.run(SCMStep.java:75)
[linux-jdk7] at org.jenkinsci.plugins.workflow.steps.AbstractSynchronousNonBlockingStepExecution$1$1.call(AbstractSynchronousNonBlockingStepExecution.java:47)
[linux-jdk7] at hudson.security.ACL.impersonate(ACL.java:260)
[linux-jdk7] at org.jenkinsci.plugins.workflow.steps.AbstractSynchronousNonBlockingStepExecution$1.run(AbstractSynchronousNonBlockingStepExecution.java:44)
[linux-jdk7] at java.util.concurrent.Executors$RunnableAdapter.call(Executors.java:511)
[linux-jdk7] at java.util.concurrent.FutureTask.run(FutureTask.java:266)
[linux-jdk7] at java.util.concurrent.ThreadPoolExecutor.runWorker(ThreadPoolExecutor.java:1149)
[linux-jdk7] at java.util.concurrent.ThreadPoolExecutor$Worker.run(ThreadPoolExecutor.java:624)
[linux-jdk7] at java.lang.Thread.run(Thread.java:748)
[linux-jdk7] Caused by: hudson.plugins.git.GitException: Command "git fetch --no-tags --progress https://gitbox.apache.org/repos/asf/maven-release.git +refs/heads/*:refs/remotes/origin/*" returned status code 128:
[linux-jdk7] stdout:
[linux-jdk7] stderr: fatal: unable to access 'https://gitbox.apache.org/repos/asf/maven-release.git/': gnutls_handshake() failed: Handshake failed
[linux-jdk7]
[linux-jdk7] at org.jenkinsci.plugins.gitclient.CliGitAPIImpl.launchCommandIn(CliGitAPIImpl.java:1970)
[linux-jdk7] at org.jenkinsci.plugins.gitclient.CliGitAPIImpl.launchCommandWithCredentials(CliGitAPIImpl.java:1689)
[linux-jdk7] at org.jenkinsci.plugins.gitclient.CliGitAPIImpl.access$300(CliGitAPIImpl.java:71)
[linux-jdk7] at org.jenkinsci.plugins.gitclient.CliGitAPIImpl$1.execute(CliGitAPIImpl.java:380)
[linux-jdk7] at org.jenkinsci.plugins.gitclient.RemoteGitImpl$CommandInvocationHandler$1.call(RemoteGitImpl.java:153)
[linux-jdk7] at org.jenkinsci.plugins.gitclient.RemoteGitImpl$CommandInvocationHandler$1.call(RemoteGitImpl.java:146)
[linux-jdk7] at hudson.remoting.UserRequest.perform(UserRequest.java:207)
[linux-jdk7] at hudson.remoting.UserRequest.perform(UserRequest.java:53)
[linux-jdk7] at hudson.remoting.Request$2.run(Request.java:358)
[linux-jdk7] at hudson.remoting.InterceptingExecutorService$1.call(InterceptingExecutorService.java:72)
[linux-jdk7] at java.util.concurrent.FutureTask.run(FutureTask.java:266)
[linux-jdk7] at java.util.concurrent.ThreadPoolExecutor.runWorker(ThreadPoolExecutor.java:1142)
[linux-jdk7] at java.util.concurrent.ThreadPoolExecutor$Worker.run(ThreadPoolExecutor.java:617)
[linux-jdk7] ... 1 more
[linux-jdk7] Suppressed: hudson.remoting.Channel$CallSiteStackTrace: Remote call to ubuntu-eu2
[linux-jdk7] at hudson.remoting.Channel.attachCallSiteStackTrace(Channel.java:1693)
[linux-jdk7] at hudson.remoting.UserResponse.retrieve(UserRequest.java:310)
[linux-jdk7] at hudson.remoting.Channel.call(Channel.java:908)
[linux-jdk7] at org.jenkinsci.plugins.gitclient.RemoteGitImpl$CommandInvocationHandler.execute(RemoteGitImpl.java:146)
[linux-jdk7] at sun.reflect.GeneratedMethodAccessor966.invoke(Unknown Source)
[linux-jdk7] at sun.reflect.DelegatingMethodAccessorImpl.invoke(DelegatingMethodAccessorImpl.java:43)
[linux-jdk7] at java.lang.reflect.Method.invoke(Method.java:498)
[linux-jdk7] at org.jenkinsci.plugins.gitclient.RemoteGitImpl$CommandInvocationHandler.invoke(RemoteGitImpl.java:132)
[linux-jdk7] at com.sun.proxy.$Proxy111.execute(Unknown Source)
[linux-jdk7] at hudson.plugins.git.GitSCM.fetchFrom(GitSCM.java:823)
[linux-jdk7] at hudson.plugins.git.GitSCM.retrieveChanges(GitSCM.java:1092)
[linux-jdk7] at hudson.plugins.git.GitSCM.checkout(GitSCM.java:1123)
[linux-jdk7] at org.jenkinsci.plugins.workflow.steps.scm.SCMStep.checkout(SCMStep.java:113)
[linux-jdk7] at org.jenkinsci.plugins.workflow.steps.scm.SCMStep$StepExecutionImpl.run(SCMStep.java:85)
[linux-jdk7] at org.jenkinsci.plugins.workflow.steps.scm.SCMStep$StepExecutionImpl.run(SCMStep.java:75)
[linux-jdk7] at org.jenkinsci.plugins.workflow.steps.AbstractSynchronousNonBlockingStepExecution$1$1.call(AbstractSynchronousNonBlockingStepExecution.java:47)
[linux-jdk7] at hudson.security.ACL.impersonate(ACL.java:260)
[linux-jdk7] at org.jenkinsci.plugins.workflow.steps.AbstractSynchronousNonBlockingStepExecution$1.run(AbstractSynchronousNonBlockingStepExecution.java:44)
[linux-jdk7] at java.util.concurrent.Executors$RunnableAdapter.call(Executors.java:511)
[linux-jdk7] at java.util.concurrent.FutureTask.run(FutureTask.java:266)
[linux-jdk7] at java.util.concurrent.ThreadPoolExecutor.runWorker(ThreadPoolExecutor.java:1149)
[linux-jdk7] at java.util.concurrent.ThreadPoolExecutor$Worker.run(ThreadPoolExecutor.java:624)
[linux-jdk7] ... 1 more
[linux-jdk8] ERROR: Error fetching remote repo 'origin'
[linux-jdk8] hudson.plugins.git.GitException: Failed to fetch from https://gitbox.apache.org/repos/asf/maven-release.git
[linux-jdk8] at hudson.plugins.git.GitSCM.fetchFrom(GitSCM.java:825)
[linux-jdk8] at hudson.plugins.git.GitSCM.retrieveChanges(GitSCM.java:1092)
[linux-jdk8] at hudson.plugins.git.GitSCM.checkout(GitSCM.java:1123)
[linux-jdk8] at org.jenkinsci.plugins.workflow.steps.scm.SCMStep.checkout(SCMStep.java:113)
[linux-jdk8] at org.jenkinsci.plugins.workflow.steps.scm.SCMStep$StepExecutionImpl.run(SCMStep.java:85)
[linux-jdk8] at org.jenkinsci.plugins.workflow.steps.scm.SCMStep$StepExecutionImpl.run(SCMStep.java:75)
[linux-jdk8] at org.jenkinsci.plugins.workflow.steps.AbstractSynchronousNonBlockingStepExecution$1$1.call(AbstractSynchronousNonBlockingStepExecution.java:47)
[linux-jdk8] at hudson.security.ACL.impersonate(ACL.java:260)
[linux-jdk8] at org.jenkinsci.plugins.workflow.steps.AbstractSynchronousNonBlockingStepExecution$1.run(AbstractSynchronousNonBlockingStepExecution.java:44)
[linux-jdk8] at java.util.concurrent.Executors$RunnableAdapter.call(Executors.java:511)
[linux-jdk8] at java.util.concurrent.FutureTask.run(FutureTask.java:266)
[linux-jdk8] at java.util.concurrent.ThreadPoolExecutor.runWorker(ThreadPoolExecutor.java:1149)
[linux-jdk8] at java.util.concurrent.ThreadPoolExecutor$Worker.run(ThreadPoolExecutor.java:624)
[linux-jdk8] at java.lang.Thread.run(Thread.java:748)
[linux-jdk8] Caused by: hudson.plugins.git.GitException: Command "git fetch --no-tags --progress https://gitbox.apache.org/repos/asf/maven-release.git +refs/heads/*:refs/remotes/origin/*" returned status code 128:
[linux-jdk8] stdout:
[linux-jdk8] stderr: fatal: unable to access 'https://gitbox.apache.org/repos/asf/maven-release.git/': gnutls_handshake() failed: Handshake failed
[linux-jdk8]
[linux-jdk8] at org.jenkinsci.plugins.gitclient.CliGitAPIImpl.launchCommandIn(CliGitAPIImpl.java:1970)
[linux-jdk8] at org.jenkinsci.plugins.gitclient.CliGitAPIImpl.launchCommandWithCredentials(CliGitAPIImpl.java:1689)
[linux-jdk8] at org.jenkinsci.plugins.gitclient.CliGitAPIImpl.access$300(CliGitAPIImpl.java:71)
[linux-jdk8] at org.jenkinsci.plugins.gitclient.CliGitAPIImpl$1.execute(CliGitAPIImpl.java:380)
[linux-jdk8] at org.jenkinsci.plugins.gitclient.RemoteGitImpl$CommandInvocationHandler$1.call(RemoteGitImpl.java:153)
[linux-jdk8] at org.jenkinsci.plugins.gitclient.RemoteGitImpl$CommandInvocationHandler$1.call(RemoteGitImpl.java:146)
[linux-jdk8] at hudson.remoting.UserRequest.perform(UserRequest.java:207)
[linux-jdk8] at hudson.remoting.UserRequest.perform(UserRequest.java:53)
[linux-jdk8] at hudson.remoting.Request$2.run(Request.java:358)
[linux-jdk8] at hudson.remoting.InterceptingExecutorService$1.call(InterceptingExecutorService.java:72)
[linux-jdk8] at java.util.concurrent.FutureTask.run(FutureTask.java:266)
[linux-jdk8] at java.util.concurrent.ThreadPoolExecutor.runWorker(ThreadPoolExecutor.java:1142)
[linux-jdk8] at java.util.concurrent.ThreadPoolExecutor$Worker.run(ThreadPoolExecutor.java:617)
[linux-jdk8] ... 1 more
[linux-jdk8] Suppressed: hudson.remoting.Channel$CallSiteStackTrace: Remote call to ubuntu-eu2
[linux-jdk8] at hudson.remoting.Channel.attachCallSiteStackTrace(Channel.java:1693)
[linux-jdk8] at hudson.remoting.UserResponse.retrieve(UserRequest.java:310)
[linux-jdk8] at hudson.remoting.Channel.call(Channel.java:908)
[linux-jdk8] at org.jenkinsci.plugins.gitclient.RemoteGitImpl$CommandInvocationHandler.execute(RemoteGitImpl.java:146)
[linux-jdk8] at sun.reflect.GeneratedMethodAccessor966.invoke(Unknown Source)
[linux-jdk8] at sun.reflect.DelegatingMethodAccessorImpl.invoke(DelegatingMethodAccessorImpl.java:43)
[linux-jdk8] at java.lang.reflect.Method.invoke(Method.java:498)
[linux-jdk8] at org.jenkinsci.plugins.gitclient.RemoteGitImpl$CommandInvocationHandler.invoke(RemoteGitImpl.java:132)
[linux-jdk8] at com.sun.proxy.$Proxy111.execute(Unknown Source)
[linux-jdk8] at hudson.plugins.git.GitSCM.fetchFrom(GitSCM.java:823)
[linux-jdk8] at hudson.plugins.git.GitSCM.retrieveChanges(GitSCM.java:1092)
[linux-jdk8] at hudson.plugins.git.GitSCM.checkout(GitSCM.java:1123)
[linux-jdk8] at org.jenkinsci.plugins.workflow.steps.scm.SCMStep.checkout(SCMStep.java:113)
[linux-jdk8] at org.jenkinsci.plugins.workflow.steps.scm.SCMStep$StepExecutionImpl.run(SCMStep.java:85)
[linux-jdk8] at org.jenkinsci.plugins.workflow.steps.scm.SCMStep$StepExecutionImpl.run(SCMStep.java:75)
[linux-jdk8] at org.jenkinsci.plugins.workflow.steps.AbstractSynchronousNonBlockingStepExecution$1$1.call(AbstractSynchronousNonBlockingStepExecution.java:47)
[linux-jdk8] at hudson.security.ACL.impersonate(ACL.java:260)
[linux-jdk8] at org.jenkinsci.plugins.workflow.steps.AbstractSynchronousNonBlockingStepExecution$1.run(AbstractSynchronousNonBlockingStepExecution.java:44)
[linux-jdk8] at java.util.concurrent.Executors$RunnableAdapter.call(Executors.java:511)
[linux-jdk8] at java.util.concurrent.FutureTask.run(FutureTask.java:266)
[linux-jdk8] at java.util.concurrent.ThreadPoolExecutor.runWorker(ThreadPoolExecutor.java:1149)
[linux-jdk8] at java.util.concurrent.ThreadPoolExecutor$Worker.run(ThreadPoolExecutor.java:624)
[linux-jdk8] ... 1 more
[windows-jdk7] Fetching changes from the remote Git repository
[windows-jdk7]  > git config remote.origin.url https://gitbox.apache.org/repos/asf/maven-release.git # timeout=10
[Pipeline] [linux-jdk7] }
[Pipeline] [linux-jdk8] }
[Pipeline] [linux-jdk7] // dir
[Pipeline] [linux-jdk8] // dir
[windows-jdk7] Fetching without tags
[Pipeline] [linux-jdk7] echo
[linux-jdk7] [FAIL FAST] This is the first failure and likely root cause
[Pipeline] [linux-jdk7] }
[Pipeline] [linux-jdk8] echo
[linux-jdk8] [FAIL FAST] linux-jdk7 had first failure, ignoring Error fetching remote repo 'origin'
[Pipeline] [linux-jdk8] }
[Pipeline] [linux-jdk7] // stage
[Pipeline] [linux-jdk8] // stage
[windows-jdk9] Running on windows-2012-1 in f:\jenkins\jenkins-slave\workspace\en-box_maven-release_master-OCKGULQBCZ67VBKJ7HF6E7KZUCKX7ZC6FX64GH66OHP7A4VAQBIQ
[windows-jdk7] Fetching upstream changes from https://gitbox.apache.org/repos/asf/maven-release.git
[windows-jdk7]  > git --version # timeout=10
[Pipeline] [linux-jdk7] }
[Pipeline] [linux-jdk8] stage
[Pipeline] [linux-jdk8] { (Build linux-jdk8)
[Pipeline] [linux-jdk7] // node
[Pipeline] [linux-jdk7] }
[linux-jdk7] Failed in branch linux-jdk7
[Pipeline] [linux-jdk8] echo
[linux-jdk8] [FAIL FAST] linux-jdk7 has failed. Skipping linux-jdk8.
[Pipeline] [linux-jdk8] }
[Pipeline] [windows-jdk9] {
[Pipeline] [windows-jdk9] stage
[Pipeline] [windows-jdk9] { (Checkout windows-jdk9)
[windows-jdk8]  > git rev-parse --is-inside-work-tree # timeout=10
[Pipeline] [linux-jdk8] // stage
[Pipeline] [linux-jdk8] }
[Pipeline] [windows-jdk9] }
[Pipeline] [linux-jdk9] }
[Pipeline] [windows-jdk7] }
[Pipeline] [windows-jdk8] }
[Pipeline] [linux-jdk8] // node
[Pipeline] [windows-jdk9] // stage
[Pipeline] [linux-jdk8] }
[Pipeline] [windows-jdk9] }
[Pipeline] [linux-jdk9] // dir
[Pipeline] [windows-jdk7] // dir
[Pipeline] [windows-jdk8] // dir
[Pipeline] [linux-jdk9] echo
[linux-jdk9] [FAIL FAST] linux-jdk7 had first failure, ignoring java.lang.InterruptedException
[Pipeline] [linux-jdk9] }
[Pipeline] [windows-jdk7] echo
[windows-jdk7] [FAIL FAST] linux-jdk7 had first failure, ignoring null
[Pipeline] [windows-jdk7] }
[Pipeline] [windows-jdk8] echo
[windows-jdk8] [FAIL FAST] linux-jdk7 had first failure, ignoring null
[Pipeline] [windows-jdk8] }
[Pipeline] [windows-jdk9] // node
[Pipeline] [windows-jdk9] }
[windows-jdk9] Failed in branch windows-jdk9
[Pipeline] [linux-jdk9] // stage
[Pipeline] [windows-jdk7] // stage
[Pipeline] [windows-jdk8] // stage
[Pipeline] [linux-jdk9] stage
[Pipeline] [linux-jdk9] { (Build linux-jdk9)
[Pipeline] [windows-jdk7] stage
[Pipeline] [windows-jdk7] { (Build windows-jdk7)
[Pipeline] [windows-jdk8] stage
[Pipeline] [windows-jdk8] { (Build windows-jdk8)
[Pipeline] [linux-jdk9] echo
[linux-jdk9] [FAIL FAST] linux-jdk7 has failed. Skipping linux-jdk9.
[Pipeline] [linux-jdk9] }
[Pipeline] [windows-jdk7] echo
[windows-jdk7] [FAIL FAST] linux-jdk7 has failed. Skipping windows-jdk7.
[Pipeline] [windows-jdk7] }
[Pipeline] [windows-jdk8] echo
[windows-jdk8] [FAIL FAST] linux-jdk7 has failed. Skipping windows-jdk8.
[Pipeline] [windows-jdk8] }
[Pipeline] [linux-jdk9] // stage
[Pipeline] [windows-jdk7] // stage
[Pipeline] [windows-jdk8] // stage
[Pipeline] [linux-jdk9] }
[Pipeline] [windows-jdk7] }
[Pipeline] [windows-jdk8] }
[Pipeline] [linux-jdk9] // node
[Pipeline] [windows-jdk7] // node
[Pipeline] [windows-jdk8] // node
[Pipeline] [linux-jdk9] }
[Pipeline] [windows-jdk7] }
[Pipeline] [windows-jdk8] }
[Pipeline] // parallel
[Pipeline] echo
***** FAST FAILURE *****

Fast failure triggered by linux-jdk7

***** FAST FAILURE *****
[Pipeline] stage
[Pipeline] { (Notifications)
[Pipeline] echo
Build result: FAILURE
[Pipeline] jiraIssueSelector
[Pipeline] emailext
Reply | Threaded
Open this post in threaded view
|

Build succeeded in Jenkins: Maven TLP » maven-release » master #34

Apache Jenkins Server-2
See https://builds.apache.org/job/maven-box/job/maven-release/job/master/34/

Changes:

* Don't reask resolve questions in case of multimodule projects
* No need for reflection anymore
* Fix mocking/stubbing tests
* [MRELEASE-601] The Maven 2 release plugin modifies CDATA elements in
* [MRELEASE-998] Add ability to create custom phases
* Don't reask resolve questions in case of multimodule projects
* No need for reflection anymore
* Fix mocking/stubbing tests
* [MRELEASE-601] The Maven 2 release plugin modifies CDATA elements in
* [MRELEASE-998] Add ability to create custom phases
* Don't reask resolve questions in case of multimodule projects
* No need for reflection anymore
* Fix mocking/stubbing tests
* [MRELEASE-601] The Maven 2 release plugin modifies CDATA elements in
* [MRELEASE-998] Add ability to create custom phases
* Don't reask resolve questions in case of multimodule projects
* No need for reflection anymore
* Fix mocking/stubbing tests
* [MRELEASE-601] The Maven 2 release plugin modifies CDATA elements in
* [MRELEASE-998] Add ability to create custom phases
* Don't reask resolve questions in case of multimodule projects
* No need for reflection anymore
* Fix mocking/stubbing tests
* [MRELEASE-601] The Maven 2 release plugin modifies CDATA elements in
* [MRELEASE-998] Add ability to create custom phases
* Don't reask resolve questions in case of multimodule projects
* No need for reflection anymore
* Fix mocking/stubbing tests
* [MRELEASE-601] The Maven 2 release plugin modifies CDATA elements in
* [MRELEASE-998] Add ability to create custom phases

All tests passed