Build failed in Jenkins: Maven TLP » maven-release » MRELEASE-1024 #6

classic Classic list List threaded Threaded
2 messages Options
Reply | Threaded
Open this post in threaded view
|

Build failed in Jenkins: Maven TLP » maven-release » MRELEASE-1024 #6

Apache Jenkins Server-2
See https://builds.apache.org/job/maven-box/job/maven-release/job/MRELEASE-1024/6/

No changes.

All tests passed

Build log:
[...truncated 24986 lines...]
         |  |            at org.apache.maven.DefaultMaven.doExecute (DefaultMaven.java:305)
         |  |            at org.apache.maven.DefaultMaven.doExecute (DefaultMaven.java:192)
         |  |            at org.apache.maven.DefaultMaven.execute (DefaultMaven.java:105)
         |  |            at org.apache.maven.cli.MavenCli.execute (MavenCli.java:956)
         |  |            at org.apache.maven.cli.MavenCli.doMain (MavenCli.java:288)
         |  |            at org.apache.maven.cli.MavenCli.main (MavenCli.java:192)
         |  |            at jdk.internal.reflect.NativeMethodAccessorImpl.invoke0 (Native Method)
         |  |            at jdk.internal.reflect.NativeMethodAccessorImpl.invoke (NativeMethodAccessorImpl.java:62)
         |  |            at jdk.internal.reflect.DelegatingMethodAccessorImpl.invoke (DelegatingMethodAccessorImpl.java:43)
         |  |            at java.lang.reflect.Method.invoke (Method.java:567)
         |  |            at org.codehaus.plexus.classworlds.launcher.Launcher.launchEnhanced (Launcher.java:289)
         |  |            at org.codehaus.plexus.classworlds.launcher.Launcher.launch (Launcher.java:229)
         |  |            at org.codehaus.plexus.classworlds.launcher.Launcher.mainWithExitCode (Launcher.java:415)
         |  |            at org.codehaus.plexus.classworlds.launcher.Launcher.main (Launcher.java:356)
         |  |        Caused by: java.io.IOException: There is not enough space on the disk
         |  |            at java.io.FileOutputStream.writeBytes (Native Method)
         |  |            at java.io.FileOutputStream.write (FileOutputStream.java:348)
         |  |            at sun.nio.cs.StreamEncoder.writeBytes (StreamEncoder.java:233)
         |  |            at sun.nio.cs.StreamEncoder.implFlushBuffer (StreamEncoder.java:312)
         |  |            at sun.nio.cs.StreamEncoder.implFlush (StreamEncoder.java:316)
         |  |            at sun.nio.cs.StreamEncoder.flush (StreamEncoder.java:153)
         |  |            at java.io.OutputStreamWriter.flush (OutputStreamWriter.java:254)
         |  |            at org.codehaus.plexus.util.xml.pull.MXSerializer.endDocument (MXSerializer.java:502)
         |  |            at org.apache.maven.settings.io.xpp3.SettingsXpp3Writer.write (SettingsXpp3Writer.java:87)
         |  |            at org.apache.maven.shared.release.exec.InvokerMavenExecutor.executeGoals (InvokerMavenExecutor.java:361)
         |  |            at org.apache.maven.shared.release.exec.AbstractMavenExecutor.executeGoals (AbstractMavenExecutor.java:89)
         |  |            at org.apache.maven.shared.release.phase.AbstractRunGoalsPhase.execute (AbstractRunGoalsPhase.java:83)
         |  |            at org.apache.maven.shared.release.phase.RunPrepareGoalsPhase.execute (RunPrepareGoalsPhase.java:46)
         |  |            at org.apache.maven.shared.release.phase.RunPrepareGoalsPhase.simulate (RunPrepareGoalsPhase.java:60)
         |  |            at org.apache.maven.shared.release.DefaultReleaseManager.prepare (DefaultReleaseManager.java:184)
         |  |            at org.apache.maven.shared.release.DefaultReleaseManager.prepare (DefaultReleaseManager.java:100)
         |  |            at org.apache.maven.plugins.release.PrepareReleaseMojo.prepareRelease (PrepareReleaseMojo.java:301)
         |  |            at org.apache.maven.plugins.release.PrepareReleaseMojo.execute (PrepareReleaseMojo.java:251)
         |  |            at org.apache.maven.plugin.DefaultBuildPluginManager.executeMojo (DefaultBuildPluginManager.java:137)
         |  |            at org.apache.maven.lifecycle.internal.MojoExecutor.execute (MojoExecutor.java:210)
         |  |            at org.apache.maven.lifecycle.internal.MojoExecutor.execute (MojoExecutor.java:156)
         |  |            at org.apache.maven.lifecycle.internal.MojoExecutor.execute (MojoExecutor.java:148)
         |  |            at org.apache.maven.lifecycle.internal.LifecycleModuleBuilder.buildProject (LifecycleModuleBuilder.java:117)
         |  |            at org.apache.maven.lifecycle.internal.LifecycleModuleBuilder.buildProject (LifecycleModuleBuilder.java:81)
         |  |            at org.apache.maven.lifecycle.internal.builder.singlethreaded.SingleThreadedBuilder.build (SingleThreadedBuilder.java:56)
         |  |            at org.apache.maven.lifecycle.internal.LifecycleStarter.execute (LifecycleStarter.java:128)
         |  |            at org.apache.maven.DefaultMaven.doExecute (DefaultMaven.java:305)
         |  |            at org.apache.maven.DefaultMaven.doExecute (DefaultMaven.java:192)
         |  |            at org.apache.maven.DefaultMaven.execute (DefaultMaven.java:105)
         |  |            at org.apache.maven.cli.MavenCli.execute (MavenCli.java:956)
         |  |            at org.apache.maven.cli.MavenCli.doMain (MavenCli.java:288)
         |  |            at org.apache.maven.cli.MavenCli.main (MavenCli.java:192)
         |  |            at jdk.internal.reflect.NativeMethodAccessorImpl.invoke0 (Native Method)
         |  |            at jdk.internal.reflect.NativeMethodAccessorImpl.invoke (NativeMethodAccessorImpl.java:62)
         |  |            at jdk.internal.reflect.DelegatingMethodAccessorImpl.invoke (DelegatingMethodAccessorImpl.java:43)
         |  |            at java.lang.reflect.Method.invoke (Method.java:567)
         |  |            at org.codehaus.plexus.classworlds.launcher.Launcher.launchEnhanced (Launcher.java:289)
         |  |            at org.codehaus.plexus.classworlds.launcher.Launcher.launch (Launcher.java:229)
         |  |            at org.codehaus.plexus.classworlds.launcher.Launcher.mainWithExitCode (Launcher.java:415)
         |  |            at org.codehaus.plexus.classworlds.launcher.Launcher.main (Launcher.java:356)
         |  |        [ERROR]
         |  |        [ERROR]
         |  |        [ERROR] For more information about the errors and possible solutions, please read the following articles:
         |  |        [ERROR] [Help 1] http://cwiki.apache.org/confluence/display/MAVEN/MojoExecutionException
         |  |        Running post-build script: F:\jenkins\jenkins-slave\workspace\-box_maven-release_MRELEASE-1024@2\windows-jdk13-m3.6.x_build\maven-release-plugin\target\it\projects\prepare\MRELEASE-966\verify.groovy
         |  F:\jenkins\jenkins-slave\workspace\-box_maven-release_MRELEASE-1024@2\windows-jdk13-m3.6.x_build\maven-release-plugin\target\it\projects\prepare\MRELEASE-966\build.log
         false
[INFO]           projects\prepare\MRELEASE-966\my-pom.xml ......... FAILED (3.6 s)
[INFO] Building: projects\prepare\MRELEASE-976\pom.xml
[INFO] run post-build script verify.groovy
[INFO]   The post-build script did not succeed. F:\jenkins\jenkins-slave\workspace\-box_maven-release_MRELEASE-1024@2\windows-jdk13-m3.6.x_build\maven-release-plugin\target\it\projects\prepare\MRELEASE-976\pom.xml.next (The system cannot find the file specified)
[INFO]           projects\prepare\MRELEASE-976\pom.xml ............ FAILED (4.4 s)
[INFO] Building: projects\prepare\regular-multi-module\pom.xml
[INFO] run post-build script verify.bsh
[INFO]   The post-build script returned false.
[INFO]           projects\prepare\regular-multi-module\pom.xml .... FAILED (12.8 s)
[INFO] Building: projects\prepare-with-pom\finalname-basic\pom.xml
[INFO] run post-build script verify.groovy
[INFO]   The build exited with code 1. See F:\jenkins\jenkins-slave\workspace\-box_maven-release_MRELEASE-1024@2\windows-jdk13-m3.6.x_build\maven-release-plugin\target\it\projects\prepare-with-pom\finalname-basic\build.log for details.
[INFO]           projects\prepare-with-pom\finalname-basic\pom.xml  FAILED (35.2 s)
[INFO] Building: projects\prepare-with-pom\finalname-multimodule\pom.xml
[INFO] run post-build script verify.groovy
[INFO]   The build exited with code 1. See F:\jenkins\jenkins-slave\workspace\-box_maven-release_MRELEASE-1024@2\windows-jdk13-m3.6.x_build\maven-release-plugin\target\it\projects\prepare-with-pom\finalname-multimodule\build.log for details.
[INFO]           projects\prepare-with-pom\finalname-multimodule\pom.xml FAILED (38.3 s)
[INFO] Building: projects\prepare-with-pom\MRELEASE-808\pom.xml
[INFO] run post-build script verify.groovy
[INFO]   The build exited with code 1. See F:\jenkins\jenkins-slave\workspace\-box_maven-release_MRELEASE-1024@2\windows-jdk13-m3.6.x_build\maven-release-plugin\target\it\projects\prepare-with-pom\MRELEASE-808\build.log for details.
[INFO]           projects\prepare-with-pom\MRELEASE-808\pom.xml ... FAILED (29.0 s)
[INFO] Building: projects\update-versions\MRELEASE-555\pom.xml
[INFO] run post-build script verify.groovy
[INFO]           projects\update-versions\MRELEASE-555\pom.xml .... SUCCESS (37.3 s)
[INFO] Building: projects\update-versions\MRELEASE-611\pom.xml
[INFO] run post-build script verify.groovy
[INFO]           projects\update-versions\MRELEASE-611\pom.xml .... SUCCESS (35.6 s)
[INFO] Building: projects\update-versions\MRELEASE-783\pom.xml
[INFO]           projects\update-versions\MRELEASE-783\pom.xml .... SUCCESS (61.0 s)
[INFO] Building: projects\update-versions\MRELEASE-976\pom.xml
[INFO] run post-build script verify.groovy
[INFO]           projects\update-versions\MRELEASE-976\pom.xml .... SUCCESS (11.6 s)
[INFO] -------------------------------------------------
[INFO] Build Summary:
[INFO]   Passed: 9, Failed: 25, Errors: 0, Skipped: 0
[INFO] -------------------------------------------------
[ERROR] The following builds failed:
[ERROR] *  projects\perform\MRELEASE-459\pom.xml
[ERROR] *  projects\perform\MRELEASE-592\pom.xml
[ERROR] *  projects\perform\MRELEASE-736\pom.xml
[ERROR] *  projects\perform\MRELEASE-818\pom.xml
[ERROR] *  projects\prepare\completion-goals\pom.xml
[ERROR] *  projects\prepare\flat-multi-module\parent-project\pom.xml
[ERROR] *  projects\prepare\forked-basic\pom.xml
[ERROR] *  projects\prepare\invoker-basic\pom.xml
[ERROR] *  projects\prepare\MRELEASE-128\pom.xml
[ERROR] *  projects\prepare\MRELEASE-156\pom.xml
[ERROR] *  projects\prepare\MRELEASE-161\pom.xml
[ERROR] *  projects\prepare\MRELEASE-161-dependencyManagement\pom.xml
[ERROR] *  projects\prepare\MRELEASE-420\pom.xml
[ERROR] *  projects\prepare\MRELEASE-483\pom.xml
[ERROR] *  projects\prepare\MRELEASE-533\other-pom.xml
[ERROR] *  projects\prepare\MRELEASE-571_M3\pom.xml
[ERROR] *  projects\prepare\MRELEASE-618\my-pom.xml
[ERROR] *  projects\prepare\MRELEASE-667\pom.xml
[ERROR] *  projects\prepare\MRELEASE-834\pom.xml
[ERROR] *  projects\prepare\MRELEASE-966\my-pom.xml
[ERROR] *  projects\prepare\MRELEASE-976\pom.xml
[ERROR] *  projects\prepare\regular-multi-module\pom.xml
[ERROR] *  projects\prepare-with-pom\finalname-basic\pom.xml
[ERROR] *  projects\prepare-with-pom\finalname-multimodule\pom.xml
[ERROR] *  projects\prepare-with-pom\MRELEASE-808\pom.xml
[INFO] -------------------------------------------------
[INFO] ------------------------------------------------------------------------
[INFO] Reactor Summary for Maven Release 3.0.0-SNAPSHOT:
[INFO]
[INFO] Maven Release ...................................... SUCCESS [ 54.099 s]
[INFO] Maven Release APIs ................................. SUCCESS [ 27.080 s]
[INFO] Maven Release Manager .............................. SUCCESS [ 17.956 s]
[INFO] Maven Release Plugin ............................... FAILURE [14:41 min]
[INFO] Maven Release Odd-Even Policy ...................... SKIPPED
[INFO] Maven Release SemVer Policy ........................ SKIPPED
[INFO] ------------------------------------------------------------------------
[INFO] BUILD FAILURE
[INFO] ------------------------------------------------------------------------
[INFO] Total time:  16:24 min
[INFO] Finished at: 2019-06-17T19:30:11Z
[INFO] ------------------------------------------------------------------------
[INFO] [jenkins-event-spy] Generated F:\jenkins\jenkins-slave\workspace\-box_maven-release_MRELEASE-1024@2@tmp\withMaven25214a26\maven-spy-20190617-191344-42213796672078920923153.log
[ERROR] Failed to execute goal org.apache.maven.plugins:maven-invoker-plugin:3.2.0:run (integration-test-prepare) on project maven-release-plugin: 25 builds failed. See console output above for details. -> [Help 1]
org.apache.maven.lifecycle.LifecycleExecutionException: Failed to execute goal org.apache.maven.plugins:maven-invoker-plugin:3.2.0:run (integration-test-prepare) on project maven-release-plugin: 25 builds failed. See console output above for details.
    at org.apache.maven.lifecycle.internal.MojoExecutor.execute (MojoExecutor.java:215)
    at org.apache.maven.lifecycle.internal.MojoExecutor.execute (MojoExecutor.java:156)
    at org.apache.maven.lifecycle.internal.MojoExecutor.execute (MojoExecutor.java:148)
    at org.apache.maven.lifecycle.internal.LifecycleModuleBuilder.buildProject (LifecycleModuleBuilder.java:117)
    at org.apache.maven.lifecycle.internal.LifecycleModuleBuilder.buildProject (LifecycleModuleBuilder.java:81)
    at org.apache.maven.lifecycle.internal.builder.singlethreaded.SingleThreadedBuilder.build (SingleThreadedBuilder.java:56)
    at org.apache.maven.lifecycle.internal.LifecycleStarter.execute (LifecycleStarter.java:128)
    at org.apache.maven.DefaultMaven.doExecute (DefaultMaven.java:305)
    at org.apache.maven.DefaultMaven.doExecute (DefaultMaven.java:192)
    at org.apache.maven.DefaultMaven.execute (DefaultMaven.java:105)
    at org.apache.maven.cli.MavenCli.execute (MavenCli.java:956)
    at org.apache.maven.cli.MavenCli.doMain (MavenCli.java:288)
    at org.apache.maven.cli.MavenCli.main (MavenCli.java:192)
    at jdk.internal.reflect.NativeMethodAccessorImpl.invoke0 (Native Method)
    at jdk.internal.reflect.NativeMethodAccessorImpl.invoke (NativeMethodAccessorImpl.java:62)
    at jdk.internal.reflect.DelegatingMethodAccessorImpl.invoke (DelegatingMethodAccessorImpl.java:43)
    at java.lang.reflect.Method.invoke (Method.java:567)
    at org.codehaus.plexus.classworlds.launcher.Launcher.launchEnhanced (Launcher.java:289)
    at org.codehaus.plexus.classworlds.launcher.Launcher.launch (Launcher.java:229)
    at org.codehaus.plexus.classworlds.launcher.Launcher.mainWithExitCode (Launcher.java:415)
    at org.codehaus.plexus.classworlds.launcher.Launcher.main (Launcher.java:356)
Caused by: org.apache.maven.plugin.MojoFailureException: 25 builds failed. See console output above for details.
    at org.apache.maven.plugins.invoker.InvokerSession.handleFailures (InvokerSession.java:260)
    at org.apache.maven.plugins.invoker.InvokerMojo.processResults (InvokerMojo.java:68)
    at org.apache.maven.plugins.invoker.AbstractInvokerMojo.execute (AbstractInvokerMojo.java:772)
    at org.apache.maven.plugin.DefaultBuildPluginManager.executeMojo (DefaultBuildPluginManager.java:137)
    at org.apache.maven.lifecycle.internal.MojoExecutor.execute (MojoExecutor.java:210)
    at org.apache.maven.lifecycle.internal.MojoExecutor.execute (MojoExecutor.java:156)
    at org.apache.maven.lifecycle.internal.MojoExecutor.execute (MojoExecutor.java:148)
    at org.apache.maven.lifecycle.internal.LifecycleModuleBuilder.buildProject (LifecycleModuleBuilder.java:117)
    at org.apache.maven.lifecycle.internal.LifecycleModuleBuilder.buildProject (LifecycleModuleBuilder.java:81)
    at org.apache.maven.lifecycle.internal.builder.singlethreaded.SingleThreadedBuilder.build (SingleThreadedBuilder.java:56)
    at org.apache.maven.lifecycle.internal.LifecycleStarter.execute (LifecycleStarter.java:128)
    at org.apache.maven.DefaultMaven.doExecute (DefaultMaven.java:305)
    at org.apache.maven.DefaultMaven.doExecute (DefaultMaven.java:192)
    at org.apache.maven.DefaultMaven.execute (DefaultMaven.java:105)
    at org.apache.maven.cli.MavenCli.execute (MavenCli.java:956)
    at org.apache.maven.cli.MavenCli.doMain (MavenCli.java:288)
    at org.apache.maven.cli.MavenCli.main (MavenCli.java:192)
    at jdk.internal.reflect.NativeMethodAccessorImpl.invoke0 (Native Method)
    at jdk.internal.reflect.NativeMethodAccessorImpl.invoke (NativeMethodAccessorImpl.java:62)
    at jdk.internal.reflect.DelegatingMethodAccessorImpl.invoke (DelegatingMethodAccessorImpl.java:43)
    at java.lang.reflect.Method.invoke (Method.java:567)
    at org.codehaus.plexus.classworlds.launcher.Launcher.launchEnhanced (Launcher.java:289)
    at org.codehaus.plexus.classworlds.launcher.Launcher.launch (Launcher.java:229)
    at org.codehaus.plexus.classworlds.launcher.Launcher.mainWithExitCode (Launcher.java:415)
    at org.codehaus.plexus.classworlds.launcher.Launcher.main (Launcher.java:356)
[ERROR]
[ERROR] Re-run Maven using the -X switch to enable full debug logging.
[ERROR]
[ERROR] For more information about the errors and possible solutions, please read the following articles:
[ERROR] [Help 1] http://cwiki.apache.org/confluence/display/MAVEN/MojoFailureException
[ERROR]
[ERROR] After correcting the problems, you can resume the build with the command
[ERROR]   mvn <goals> -rf :maven-release-plugin
[Pipeline] }
[Pipeline] // dir
[Pipeline] }
[withMaven] artifactsPublisher - Archive artifact windows-jdk13-m3.6.x_build\pom.xml under org\apache\maven\release\maven-release\3.0.0-SNAPSHOT\maven-release-3.0.0-SNAPSHOT.pom
[withMaven] artifactsPublisher - Archive artifact windows-jdk13-m3.6.x_build\target\maven-release-3.0.0-SNAPSHOT-site.xml under org\apache\maven\release\maven-release\3.0.0-SNAPSHOT\maven-release-3.0.0-SNAPSHOT-site.xml
[withMaven] artifactsPublisher - Archive artifact windows-jdk13-m3.6.x_build\maven-release-api\pom.xml under org\apache\maven\release\maven-release-api\3.0.0-SNAPSHOT\maven-release-api-3.0.0-SNAPSHOT.pom
[withMaven] artifactsPublisher - Archive artifact windows-jdk13-m3.6.x_build\maven-release-api\target\maven-release-api-3.0.0-SNAPSHOT.jar under org\apache\maven\release\maven-release-api\3.0.0-SNAPSHOT\maven-release-api-3.0.0-SNAPSHOT.jar
[withMaven] artifactsPublisher - Archive artifact windows-jdk13-m3.6.x_build\maven-release-manager\pom.xml under org\apache\maven\release\maven-release-manager\3.0.0-SNAPSHOT\maven-release-manager-3.0.0-SNAPSHOT.pom
[withMaven] artifactsPublisher - Archive artifact windows-jdk13-m3.6.x_build\maven-release-manager\target\maven-release-manager-3.0.0-SNAPSHOT.jar under org\apache\maven\release\maven-release-manager\3.0.0-SNAPSHOT\maven-release-manager-3.0.0-SNAPSHOT.jar
[withMaven] junitPublisher - Archive test results for Maven artifact org.apache.maven.release:maven-release-api:jar:3.0.0-SNAPSHOT generated by maven-surefire-plugin:test (default-test): windows-jdk13-m3.6.x_build\maven-release-api\target\surefire-reports\*.xml
[withMaven] junitPublisher - Archive test results for Maven artifact org.apache.maven.release:maven-release-manager:jar:3.0.0-SNAPSHOT generated by maven-surefire-plugin:test (default-test): windows-jdk13-m3.6.x_build\maven-release-manager\target\surefire-reports\*.xml
[withMaven] junitPublisher - Archive test results for Maven artifact org.apache.maven.plugins:maven-release-plugin:maven-plugin:3.0.0-SNAPSHOT generated by maven-surefire-plugin:test (default-test): windows-jdk13-m3.6.x_build\maven-release-plugin\target\surefire-reports\*.xml
Recording test results
None of the test reports contained any result
[withMaven] junitPublisher - Archive test results for Maven artifact org.apache.maven.release:maven-release-manager:jar:3.0.0-SNAPSHOT generated by maven-failsafe-plugin:integration-test (default): windows-jdk13-m3.6.x_build\maven-release-manager\target\failsafe-reports\*.xml
Recording test results
None of the test reports contained any result
[withMaven] openTasksPublisher - Scan Tasks for Maven artifact org.apache.maven.release:maven-release-api:jar:3.0.0-SNAPSHOT in source directory windows-jdk13-m3.6.x_build\maven-release-api\src\main\java
[withMaven] openTasksPublisher - Scan Tasks for Maven artifact org.apache.maven.release:maven-release-manager:jar:3.0.0-SNAPSHOT in source directory windows-jdk13-m3.6.x_build\maven-release-manager\src\main\java
[withMaven] openTasksPublisher - Scan Tasks for Maven artifact org.apache.maven.plugins:maven-release-plugin:maven-plugin:3.0.0-SNAPSHOT in source directory windows-jdk13-m3.6.x_build\maven-release-plugin\src\main\java
[TASKS] Scanning folder 'f:\jenkins\jenkins-slave\workspace\-box_maven-release_MRELEASE-1024@2' for files matching the pattern 'windows-jdk13-m3.6.x_build\maven-release-api\src\main\java\**\*,windows-jdk13-m3.6.x_build\maven-release-manager\src\main\java\**\*,windows-jdk13-m3.6.x_build\maven-release-plugin\src\main\java\**\*' - excludes: null
[TASKS] Found 127 files to scan for tasks
[TASKS] Found 21 open tasks.
Skipping warnings blame since pipelines do not have an SCM link.%n
[TASKS] Computing warning deltas based on reference build #5
[withMaven] invokerPublisher - Archive invoker results for Maven artifact MavenArtifact{org.apache.maven.plugins:maven-release-plugin:maven-plugin:3.0.0-SNAPSHOT(version: 3.0.0-SNAPSHOT, snapshot:false) } generated by PluginInvocation{org.apache.maven.plugins:maven-invoker-plugin:3.2.0@run  integration-test-prepare}: windows-jdk13-m3.6.x_build\maven-release-plugin\target\invoker-reports\*.xml
[withMaven] Publishers: Generated Artifacts Publisher: 1787 ms, Junit Publisher: 982 ms, Open Task Scanner Publisher: 2424 ms, Dependencies Fingerprint Publisher: 593 ms, Invoker Publisher: 31902 ms, Pipeline Graph Publisher: 3 ms
[Pipeline] // withMaven
[Pipeline] cleanWs
[WS-CLEANUP] Deleting project workspace...
[WS-CLEANUP] Deferred wipeout is used...
[WS-CLEANUP] done
[Pipeline] cleanWs
[WS-CLEANUP] Deleting project workspace...
[WS-CLEANUP] Deferred wipeout is used...
[WS-CLEANUP] done
[Pipeline] }
[Pipeline] // stage
[Pipeline] }
[Pipeline] // ws
[Pipeline] }
[Pipeline] // node
[Pipeline] }
Failed in branch windows-jdk13-m3.6.x_build
[Pipeline] // parallel
[Pipeline] stage
[Pipeline] { (Notifications)
[Pipeline] echo
Build result: FAILURE
[Pipeline] jiraIssueSelector
[Pipeline] emailext
Reply | Threaded
Open this post in threaded view
|

Build succeeded in Jenkins: Maven TLP » maven-release » MRELEASE-1024 #7

Apache Jenkins Server-2