Build failed in Jenkins: Maven TLP » maven-release » MRELEASE-1007 #11

classic Classic list List threaded Threaded
5 messages Options
Reply | Threaded
Open this post in threaded view
|

Build failed in Jenkins: Maven TLP » maven-release » MRELEASE-1007 #11

Apache Jenkins Server-2
See https://builds.apache.org/job/maven-box/job/maven-release/job/MRELEASE-1007/11/

Changes:

* Log unique commits
* Other attempt due to 'Scripts not permitted to use staticMethod
* Revert "Log unique commits"

All tests passed

Build log:
[...truncated 12196 lines...]
[INFO] run script verify.groovy
[INFO] ..SUCCESS (8.2 s)
[INFO] Building: projects\perform\MRELEASE-592\pom.xml
[INFO] ..SUCCESS (8.5 s)
[INFO] Building: projects\perform\MRELEASE-736\pom.xml
[INFO] ..SUCCESS (8.1 s)
[INFO] Building: projects\perform\MRELEASE-818\pom.xml
[INFO] run script verify.groovy
[INFO] ..SUCCESS (7.2 s)
[INFO] Building: projects\perform\MRELEASE-832\pom.xml
[INFO] run script verify.groovy
[INFO] ..SUCCESS (3.6 s)
[INFO] -------------------------------------------------
[INFO] Build Summary:
[INFO]   Passed: 5, Failed: 0, Errors: 0, Skipped: 0
[INFO] -------------------------------------------------
[INFO]
[INFO] --- maven-invoker-plugin:2.0.0:run (integration-test-update-versions) @ maven-release-plugin ---
[INFO] Building: projects\update-versions\MRELEASE-555\pom.xml
[INFO] run script verify.groovy
[INFO] ..SUCCESS (2.8 s)
[INFO] Building: projects\update-versions\MRELEASE-611\pom.xml
[INFO] run script verify.groovy
[INFO] ..SUCCESS (3.0 s)
[INFO] Building: projects\update-versions\MRELEASE-783\pom.xml
[INFO] ..SUCCESS (2.9 s)
[INFO] Building: projects\update-versions\MRELEASE-976\pom.xml
[INFO] run script verify.groovy
[INFO] ..SUCCESS (2.6 s)
[INFO] -------------------------------------------------
[INFO] Build Summary:
[INFO]   Passed: 4, Failed: 0, Errors: 0, Skipped: 0
[INFO] -------------------------------------------------
[INFO]
[INFO] --- maven-checkstyle-plugin:2.15:check (checkstyle-check) @ maven-release-plugin ---
[INFO]
[INFO] -------< org.apache.maven.release:maven-release-oddeven-policy >--------
[INFO] Building Maven Release Odd-Even Policy 3.0.0-SNAPSHOT              [5/6]
[INFO] --------------------------------[ jar ]---------------------------------
[INFO]
[INFO] --- maven-clean-plugin:2.5:clean (default-clean) @ maven-release-oddeven-policy ---
[INFO]
[INFO] --- maven-enforcer-plugin:1.3.1:enforce (enforce-bytecode-version) @ maven-release-oddeven-policy ---
[INFO]
[INFO] --- maven-enforcer-plugin:1.3.1:enforce (ban-known-bad-maven-versions) @ maven-release-oddeven-policy ---
[INFO]
[INFO] --- apache-rat-plugin:0.11:check (rat-check) @ maven-release-oddeven-policy ---
[INFO] 51 implicit excludes (use -debug for more details).
[INFO] Exclude: .repository
[INFO] Exclude: Jenkinsfile
[INFO] Exclude: DEPENDENCIES
[INFO] 4 resources included (use -debug for more details)
[INFO] Rat check: Summary of files. Unapproved: 0 unknown: 0 generated: 0 approved: 4 licence.
[INFO]
[INFO] --- maven-remote-resources-plugin:1.5:process (default) @ maven-release-oddeven-policy ---
[INFO]
[INFO] --- maven-resources-plugin:2.7:resources (default-resources) @ maven-release-oddeven-policy ---
[INFO] Using 'UTF-8' encoding to copy filtered resources.
[INFO] skip non existing resourceDirectory F:\jenkins\jenkins-slave\workspace\-box_maven-release_MRELEASE-1007@2\m\maven-release-policies\maven-release-oddeven-policy\src\main\resources
[INFO] Copying 3 resources
[INFO]
[INFO] --- maven-compiler-plugin:3.2:compile (default-compile) @ maven-release-oddeven-policy ---
[INFO] Changes detected - recompiling the module!
[INFO] Compiling 2 source files to F:\jenkins\jenkins-slave\workspace\-box_maven-release_MRELEASE-1007@2\m\maven-release-policies\maven-release-oddeven-policy\target\classes
[INFO]
[INFO] --- plexus-component-metadata:1.7.1:generate-metadata (process-classes) @ maven-release-oddeven-policy ---
[INFO] Discovered 1 component descriptors(s)
[INFO]
[INFO] --- maven-resources-plugin:2.7:testResources (default-testResources) @ maven-release-oddeven-policy ---
[INFO] Using 'UTF-8' encoding to copy filtered resources.
[INFO] skip non existing resourceDirectory F:\jenkins\jenkins-slave\workspace\-box_maven-release_MRELEASE-1007@2\m\maven-release-policies\maven-release-oddeven-policy\src\test\resources
[INFO] Copying 3 resources
[INFO]
[INFO] --- maven-compiler-plugin:3.2:testCompile (default-testCompile) @ maven-release-oddeven-policy ---
[INFO] Changes detected - recompiling the module!
[INFO] Compiling 1 source file to F:\jenkins\jenkins-slave\workspace\-box_maven-release_MRELEASE-1007@2\m\maven-release-policies\maven-release-oddeven-policy\target\test-classes
[INFO]
[INFO] --- maven-surefire-plugin:2.20.1:test (default-test) @ maven-release-oddeven-policy ---
[INFO]
[INFO] -------------------------------------------------------
[INFO]  T E S T S
[INFO] -------------------------------------------------------
[INFO] Running org.apache.maven.shared.release.policy.oddeven.OddEvenVersionPolicyTestCase
[INFO] Tests run: 3, Failures: 0, Errors: 0, Skipped: 0, Time elapsed: 0.063 s - in org.apache.maven.shared.release.policy.oddeven.OddEvenVersionPolicyTestCase
[INFO]
[INFO] Results:
[INFO]
[INFO] Tests run: 3, Failures: 0, Errors: 0, Skipped: 0
[INFO]
[INFO]
[INFO] --- maven-jar-plugin:2.5:jar (default-jar) @ maven-release-oddeven-policy ---
[INFO] Building jar: F:\jenkins\jenkins-slave\workspace\-box_maven-release_MRELEASE-1007@2\m\maven-release-policies\maven-release-oddeven-policy\target\maven-release-oddeven-policy-3.0.0-SNAPSHOT.jar
[INFO]
[INFO] --- maven-site-plugin:3.4:attach-descriptor (attach-descriptor) @ maven-release-oddeven-policy ---
[INFO]
[INFO] --- maven-checkstyle-plugin:2.15:check (checkstyle-check) @ maven-release-oddeven-policy ---
[INFO]
[INFO] --------< org.apache.maven.release:maven-release-semver-policy >--------
[INFO] Building Maven Release SemVer Policy 3.0.0-SNAPSHOT                [6/6]
[INFO] --------------------------------[ jar ]---------------------------------
[INFO] Downloading from central: https://repo.maven.apache.org/maven2/org/semver/api/0.9.33/api-0.9.33.pom
[INFO] Downloaded from central: https://repo.maven.apache.org/maven2/org/semver/api/0.9.33/api-0.9.33.pom (2.8 kB at 109 kB/s)
[INFO] Downloading from central: https://repo.maven.apache.org/maven2/org/semver/parent/0.9.33/parent-0.9.33.pom
[INFO] Downloaded from central: https://repo.maven.apache.org/maven2/org/semver/parent/0.9.33/parent-0.9.33.pom (1.3 kB at 57 kB/s)
[INFO] Downloading from central: https://repo.maven.apache.org/maven2/com/github/jeluard/oss-parent/9/oss-parent-9.pom
[INFO] Downloaded from central: https://repo.maven.apache.org/maven2/com/github/jeluard/oss-parent/9/oss-parent-9.pom (12 kB at 479 kB/s)
[INFO] Downloading from central: https://repo.maven.apache.org/maven2/com/google/code/findbugs/jsr305/2.0.0/jsr305-2.0.0.pom
[INFO] Downloaded from central: https://repo.maven.apache.org/maven2/com/google/code/findbugs/jsr305/2.0.0/jsr305-2.0.0.pom (965 B at 36 kB/s)
[INFO] Downloading from central: https://repo.maven.apache.org/maven2/org/ow2/asm/asm/5.0.3/asm-5.0.3.pom
[INFO] Downloaded from central: https://repo.maven.apache.org/maven2/org/ow2/asm/asm/5.0.3/asm-5.0.3.pom (1.9 kB at 92 kB/s)
[INFO] Downloading from central: https://repo.maven.apache.org/maven2/org/ow2/asm/asm-parent/5.0.3/asm-parent-5.0.3.pom
[INFO] Downloaded from central: https://repo.maven.apache.org/maven2/org/ow2/asm/asm-parent/5.0.3/asm-parent-5.0.3.pom (5.5 kB at 239 kB/s)
[INFO] Downloading from central: https://repo.maven.apache.org/maven2/org/ow2/asm/asm-commons/5.0.3/asm-commons-5.0.3.pom
[INFO] Downloaded from central: https://repo.maven.apache.org/maven2/org/ow2/asm/asm-commons/5.0.3/asm-commons-5.0.3.pom (2.1 kB at 91 kB/s)
[INFO] Downloading from central: https://repo.maven.apache.org/maven2/org/ow2/asm/asm-tree/5.0.3/asm-tree-5.0.3.pom
[INFO] Downloaded from central: https://repo.maven.apache.org/maven2/org/ow2/asm/asm-tree/5.0.3/asm-tree-5.0.3.pom (2.1 kB at 80 kB/s)
[INFO] Downloading from central: https://repo.maven.apache.org/maven2/commons-lang/commons-lang/1.0/commons-lang-1.0.pom
[INFO] Downloaded from central: https://repo.maven.apache.org/maven2/commons-lang/commons-lang/1.0/commons-lang-1.0.pom (2.5 kB at 112 kB/s)
[INFO] Downloading from central: https://repo.maven.apache.org/maven2/de/tototec/de.tototec.cmdoption/0.2.0/de.tototec.cmdoption-0.2.0.pom
[INFO] Downloaded from central: https://repo.maven.apache.org/maven2/de/tototec/de.tototec.cmdoption/0.2.0/de.tototec.cmdoption-0.2.0.pom (956 B at 38 kB/s)
[INFO] Downloading from central: https://repo.maven.apache.org/maven2/org/semver/api/0.9.33/api-0.9.33.jar
[INFO] Downloading from central: https://repo.maven.apache.org/maven2/org/ow2/asm/asm-commons/5.0.3/asm-commons-5.0.3.jar
[INFO] Downloading from central: https://repo.maven.apache.org/maven2/org/ow2/asm/asm-tree/5.0.3/asm-tree-5.0.3.jar
[INFO] Downloading from central: https://repo.maven.apache.org/maven2/org/ow2/asm/asm/5.0.3/asm-5.0.3.jar
[INFO] Downloading from central: https://repo.maven.apache.org/maven2/com/google/code/findbugs/jsr305/2.0.0/jsr305-2.0.0.jar
[INFO] Downloaded from central: https://repo.maven.apache.org/maven2/org/ow2/asm/asm-commons/5.0.3/asm-commons-5.0.3.jar (42 kB at 453 kB/s)
[INFO] Downloading from central: https://repo.maven.apache.org/maven2/commons-lang/commons-lang/1.0/commons-lang-1.0.jar
[INFO] Downloaded from central: https://repo.maven.apache.org/maven2/org/ow2/asm/asm-tree/5.0.3/asm-tree-5.0.3.jar (29 kB at 302 kB/s)
[INFO] Downloaded from central: https://repo.maven.apache.org/maven2/org/ow2/asm/asm/5.0.3/asm-5.0.3.jar (53 kB at 543 kB/s)
[INFO] Downloading from central: https://repo.maven.apache.org/maven2/de/tototec/de.tototec.cmdoption/0.2.0/de.tototec.cmdoption-0.2.0.jar
[INFO] Downloaded from central: https://repo.maven.apache.org/maven2/org/semver/api/0.9.33/api-0.9.33.jar (64 kB at 509 kB/s)
[INFO] Downloaded from central: https://repo.maven.apache.org/maven2/com/google/code/findbugs/jsr305/2.0.0/jsr305-2.0.0.jar (32 kB at 139 kB/s)
[INFO] Downloaded from central: https://repo.maven.apache.org/maven2/commons-lang/commons-lang/1.0/commons-lang-1.0.jar (64 kB at 229 kB/s)
[INFO] Downloaded from central: https://repo.maven.apache.org/maven2/de/tototec/de.tototec.cmdoption/0.2.0/de.tototec.cmdoption-0.2.0.jar (42 kB at 122 kB/s)
[INFO]
[INFO] --- maven-clean-plugin:2.5:clean (default-clean) @ maven-release-semver-policy ---
[INFO]
[INFO] --- maven-enforcer-plugin:1.3.1:enforce (enforce-bytecode-version) @ maven-release-semver-policy ---
[INFO]
[INFO] --- maven-enforcer-plugin:1.3.1:enforce (ban-known-bad-maven-versions) @ maven-release-semver-policy ---
[INFO]
[INFO] --- apache-rat-plugin:0.11:check (rat-check) @ maven-release-semver-policy ---
[INFO] 51 implicit excludes (use -debug for more details).
[INFO] Exclude: .repository
[INFO] Exclude: Jenkinsfile
[INFO] Exclude: DEPENDENCIES
[INFO] 3 resources included (use -debug for more details)
[INFO] Rat check: Summary of files. Unapproved: 0 unknown: 0 generated: 0 approved: 3 licence.
[INFO]
[INFO] --- maven-remote-resources-plugin:1.5:process (default) @ maven-release-semver-policy ---
[INFO]
[INFO] --- maven-resources-plugin:2.7:resources (default-resources) @ maven-release-semver-policy ---
[INFO] Using 'UTF-8' encoding to copy filtered resources.
[INFO] skip non existing resourceDirectory F:\jenkins\jenkins-slave\workspace\-box_maven-release_MRELEASE-1007@2\m\maven-release-policies\maven-release-semver-policy\src\main\resources
[INFO] Copying 3 resources
[INFO]
[INFO] --- maven-compiler-plugin:3.2:compile (default-compile) @ maven-release-semver-policy ---
[INFO] Changes detected - recompiling the module!
[INFO] Compiling 1 source file to F:\jenkins\jenkins-slave\workspace\-box_maven-release_MRELEASE-1007@2\m\maven-release-policies\maven-release-semver-policy\target\classes
[INFO]
[INFO] --- plexus-component-metadata:1.7.1:generate-metadata (process-classes) @ maven-release-semver-policy ---
[INFO] Discovered 1 component descriptors(s)
[INFO]
[INFO] --- maven-resources-plugin:2.7:testResources (default-testResources) @ maven-release-semver-policy ---
[INFO] Using 'UTF-8' encoding to copy filtered resources.
[INFO] skip non existing resourceDirectory F:\jenkins\jenkins-slave\workspace\-box_maven-release_MRELEASE-1007@2\m\maven-release-policies\maven-release-semver-policy\src\test\resources
[INFO] Copying 3 resources
[INFO]
[INFO] --- maven-compiler-plugin:3.2:testCompile (default-testCompile) @ maven-release-semver-policy ---
[INFO] Changes detected - recompiling the module!
[INFO] Compiling 1 source file to F:\jenkins\jenkins-slave\workspace\-box_maven-release_MRELEASE-1007@2\m\maven-release-policies\maven-release-semver-policy\target\test-classes
[INFO]
[INFO] --- maven-surefire-plugin:2.20.1:test (default-test) @ maven-release-semver-policy ---
[INFO]
[INFO] -------------------------------------------------------
[INFO]  T E S T S
[INFO] -------------------------------------------------------
[INFO] Running org.apache.maven.shared.release.policy.semver.SemVerVersionPolicyTest
[INFO] Tests run: 2, Failures: 0, Errors: 0, Skipped: 0, Time elapsed: 0.099 s - in org.apache.maven.shared.release.policy.semver.SemVerVersionPolicyTest
[INFO]
[INFO] Results:
[INFO]
[INFO] Tests run: 2, Failures: 0, Errors: 0, Skipped: 0
[INFO]
[INFO]
[INFO] --- maven-jar-plugin:2.5:jar (default-jar) @ maven-release-semver-policy ---
[INFO] Building jar: F:\jenkins\jenkins-slave\workspace\-box_maven-release_MRELEASE-1007@2\m\maven-release-policies\maven-release-semver-policy\target\maven-release-semver-policy-3.0.0-SNAPSHOT.jar
[INFO]
[INFO] --- maven-site-plugin:3.4:attach-descriptor (attach-descriptor) @ maven-release-semver-policy ---
[INFO]
[INFO] --- maven-checkstyle-plugin:2.15:check (checkstyle-check) @ maven-release-semver-policy ---
[INFO] ------------------------------------------------------------------------
[INFO] Reactor Summary for Maven Release 3.0.0-SNAPSHOT:
[INFO]
[INFO] Maven Release ...................................... SUCCESS [ 33.394 s]
[INFO] Maven Release APIs ................................. SUCCESS [  9.895 s]
[INFO] Maven Release Manager .............................. SUCCESS [02:02 min]
[INFO] Maven Release Plugin ............................... SUCCESS [04:33 min]
[INFO] Maven Release Odd-Even Policy ...................... SUCCESS [  1.762 s]
[INFO] Maven Release SemVer Policy ........................ SUCCESS [  3.036 s]
[INFO] ------------------------------------------------------------------------
[INFO] BUILD SUCCESS
[INFO] ------------------------------------------------------------------------
[INFO] Total time:  07:24 min
[INFO] Finished at: 2019-09-23T13:25:44-07:00
[INFO] ------------------------------------------------------------------------
[INFO] [jenkins-event-spy] Generated F:\jenkins\jenkins-slave\workspace\-box_maven-release_MRELEASE-1007@2@tmp\withMaven991a5e8b\maven-spy-20190923-131819-3134664965350035258585.log
Picked up JAVA_TOOL_OPTIONS: -Dmaven.ext.class.path="f:\jenkins\jenkins-slave\workspace\-box_maven-release_MRELEASE-1007@2@tmp\withMaven991a5e8b\pipeline-maven-spy.jar" -Dorg.jenkinsci.plugins.pipeline.maven.reportsFolder="f:\jenkins\jenkins-slave\workspace\-box_maven-release_MRELEASE-1007@2@tmp\withMaven991a5e8b"
[Pipeline] }
[Pipeline] // dir
[Pipeline] }
[withMaven] invokerPublisher - Archive invoker results for Maven artifact MavenArtifact{org.apache.maven.plugins:maven-release-plugin:maven-plugin:3.0.0-SNAPSHOT(version: 3.0.0-SNAPSHOT, snapshot:false) } generated by PluginInvocation{org.apache.maven.plugins:maven-invoker-plugin:2.0.0@run  integration-test-prepare}: m\maven-release-plugin\target\invoker-reports\*.xml
[withMaven] invokerPublisher - Archive invoker results for Maven artifact MavenArtifact{org.apache.maven.plugins:maven-release-plugin:maven-plugin:3.0.0-SNAPSHOT(version: 3.0.0-SNAPSHOT, snapshot:false) } generated by PluginInvocation{org.apache.maven.plugins:maven-invoker-plugin:2.0.0@run  integration-test-prepare-with-pom}: m\maven-release-plugin\target\invoker-reports\*.xml
[withMaven] invokerPublisher - Archive invoker results for Maven artifact MavenArtifact{org.apache.maven.plugins:maven-release-plugin:maven-plugin:3.0.0-SNAPSHOT(version: 3.0.0-SNAPSHOT, snapshot:false) } generated by PluginInvocation{org.apache.maven.plugins:maven-invoker-plugin:2.0.0@run  integration-test-branch}: m\maven-release-plugin\target\invoker-reports\*.xml
[withMaven] invokerPublisher - Archive invoker results for Maven artifact MavenArtifact{org.apache.maven.plugins:maven-release-plugin:maven-plugin:3.0.0-SNAPSHOT(version: 3.0.0-SNAPSHOT, snapshot:false) } generated by PluginInvocation{org.apache.maven.plugins:maven-invoker-plugin:2.0.0@run  integration-test-perform}: m\maven-release-plugin\target\invoker-reports\*.xml
[withMaven] invokerPublisher - Archive invoker results for Maven artifact MavenArtifact{org.apache.maven.plugins:maven-release-plugin:maven-plugin:3.0.0-SNAPSHOT(version: 3.0.0-SNAPSHOT, snapshot:false) } generated by PluginInvocation{org.apache.maven.plugins:maven-invoker-plugin:2.0.0@run  integration-test-update-versions}: m\maven-release-plugin\target\invoker-reports\*.xml
[withMaven] junitPublisher - Archive test results for Maven artifact org.apache.maven.release:maven-release-api:jar:3.0.0-SNAPSHOT generated by maven-surefire-plugin:test (default-test): m\maven-release-api\target\surefire-reports\*.xml
[withMaven] junitPublisher - Archive test results for Maven artifact org.apache.maven.release:maven-release-manager:jar:3.0.0-SNAPSHOT generated by maven-surefire-plugin:test (default-test): m\maven-release-manager\target\surefire-reports\*.xml
[withMaven] junitPublisher - Archive test results for Maven artifact org.apache.maven.plugins:maven-release-plugin:maven-plugin:3.0.0-SNAPSHOT generated by maven-surefire-plugin:test (default-test): m\maven-release-plugin\target\surefire-reports\*.xml
[withMaven] junitPublisher - Archive test results for Maven artifact org.apache.maven.release:maven-release-oddeven-policy:jar:3.0.0-SNAPSHOT generated by maven-surefire-plugin:test (default-test): m\maven-release-policies\maven-release-oddeven-policy\target\surefire-reports\*.xml
[withMaven] junitPublisher - Archive test results for Maven artifact org.apache.maven.release:maven-release-semver-policy:jar:3.0.0-SNAPSHOT generated by maven-surefire-plugin:test (default-test): m\maven-release-policies\maven-release-semver-policy\target\surefire-reports\*.xml
Recording test results
[withMaven] junitPublisher - Archive test results for Maven artifact org.apache.maven.release:maven-release-manager:jar:3.0.0-SNAPSHOT generated by maven-failsafe-plugin:integration-test (default): m\maven-release-manager\target\failsafe-reports\*.xml
Recording test results
[withMaven] Publishers: Pipeline Graph Publisher: 3 ms, Invoker Publisher: 68321 ms, Junit Publisher: 1098 ms, Dependencies Fingerprint Publisher: 109 ms
[withMaven] One or multiple Maven executions have been ignored by the Jenkins Pipeline Maven Plugin because they have been interrupted before completion (1). See Pipeline Maven Plugin FAQ for more details.
[Pipeline] // withMaven
[Pipeline] cleanWs
[WS-CLEANUP] Deleting project workspace...
[WS-CLEANUP] Deferred wipeout is used...
[WS-CLEANUP] done
[Pipeline] }
[Pipeline] // stage
[Pipeline] }
[Pipeline] // node
[Pipeline] }
[Pipeline] // parallel
[Pipeline] echo
[FAILURE-003] AbortException hudson.AbortException: Error cloning remote repo 'origin'
[Pipeline] stage
[Pipeline] { (Notifications)
[Pipeline] echo
Build result: FAILURE
[Pipeline] jiraIssueSelector
[Pipeline] echo
The authors of changes [rfscholte].
[Pipeline] echo
Sending email ...
[Pipeline] emailext
Reply | Threaded
Open this post in threaded view
|

Build failed in Jenkins: Maven TLP » maven-release » MRELEASE-1007 #12

Apache Jenkins Server-2
See https://builds.apache.org/job/maven-box/job/maven-release/job/MRELEASE-1007/12/

Changes:

* Apply Maven 3.6.2
* H29 has checkout issues...
* Issues with H28 too
* Seems like Maven 3.6.2 is not available on all Linux nodes yet
* Java 13 released: drop 12 + include 14 (-ea)

All tests passed

Build log:
[...truncated 27986 lines...]
[INFO] Downloading from central: https://repo.maven.apache.org/maven2/org/apache/geronimo/genesis/genesis-default-flava/2.0/genesis-default-flava-2.0.pom
[INFO] Downloaded from central: https://repo.maven.apache.org/maven2/org/apache/geronimo/genesis/genesis-default-flava/2.0/genesis-default-flava-2.0.pom (18 kB at 575 kB/s)
[INFO] Downloading from central: https://repo.maven.apache.org/maven2/org/apache/geronimo/genesis/genesis/2.0/genesis-2.0.pom
[INFO] Downloaded from central: https://repo.maven.apache.org/maven2/org/apache/geronimo/genesis/genesis/2.0/genesis-2.0.pom (18 kB at 558 kB/s)
[INFO] Downloading from central: https://repo.maven.apache.org/maven2/org/codehaus/modello/modello-plugin-converters/1.9.1/modello-plugin-converters-1.9.1.pom
[INFO] Downloaded from central: https://repo.maven.apache.org/maven2/org/codehaus/modello/modello-plugin-converters/1.9.1/modello-plugin-converters-1.9.1.pom (1.7 kB at 47 kB/s)
[INFO] Downloading from central: https://repo.maven.apache.org/maven2/org/codehaus/modello/modello-plugins/1.9.1/modello-plugins-1.9.1.pom
[INFO] Downloaded from central: https://repo.maven.apache.org/maven2/org/codehaus/modello/modello-plugins/1.9.1/modello-plugins-1.9.1.pom (2.6 kB at 80 kB/s)
[INFO] Downloading from central: https://repo.maven.apache.org/maven2/org/codehaus/modello/modello-plugin-java/1.9.1/modello-plugin-java-1.9.1.pom
[INFO] Downloaded from central: https://repo.maven.apache.org/maven2/org/codehaus/modello/modello-plugin-java/1.9.1/modello-plugin-java-1.9.1.pom (2.7 kB at 83 kB/s)
[INFO] Downloading from central: https://repo.maven.apache.org/maven2/org/codehaus/modello/modello-plugin-dom4j/1.9.1/modello-plugin-dom4j-1.9.1.pom
[INFO] Downloaded from central: https://repo.maven.apache.org/maven2/org/codehaus/modello/modello-plugin-dom4j/1.9.1/modello-plugin-dom4j-1.9.1.pom (1.6 kB at 56 kB/s)
[INFO] Downloading from central: https://repo.maven.apache.org/maven2/org/codehaus/modello/modello-plugin-xml/1.9.1/modello-plugin-xml-1.9.1.pom
[INFO] Downloaded from central: https://repo.maven.apache.org/maven2/org/codehaus/modello/modello-plugin-xml/1.9.1/modello-plugin-xml-1.9.1.pom (1.1 kB at 37 kB/s)
[INFO] Downloading from central: https://repo.maven.apache.org/maven2/org/codehaus/modello/modello-plugin-jackson/1.9.1/modello-plugin-jackson-1.9.1.pom
[INFO] Downloaded from central: https://repo.maven.apache.org/maven2/org/codehaus/modello/modello-plugin-jackson/1.9.1/modello-plugin-jackson-1.9.1.pom (1.9 kB at 7.2 kB/s)
[INFO] Downloading from central: https://repo.maven.apache.org/maven2/com/fasterxml/jackson/core/jackson-core/2.1.5/jackson-core-2.1.5.pom
[INFO] Downloaded from central: https://repo.maven.apache.org/maven2/com/fasterxml/jackson/core/jackson-core/2.1.5/jackson-core-2.1.5.pom (5.6 kB at 153 kB/s)
[INFO] Downloading from central: https://repo.maven.apache.org/maven2/com/fasterxml/oss-parent/4/oss-parent-4.pom
[INFO] Downloaded from central: https://repo.maven.apache.org/maven2/com/fasterxml/oss-parent/4/oss-parent-4.pom (18 kB at 594 kB/s)
[INFO] Downloading from central: https://repo.maven.apache.org/maven2/com/fasterxml/jackson/core/jackson-databind/2.1.5/jackson-databind-2.1.5.pom
[INFO] Downloaded from central: https://repo.maven.apache.org/maven2/com/fasterxml/jackson/core/jackson-databind/2.1.5/jackson-databind-2.1.5.pom (5.6 kB at 160 kB/s)
[INFO] Downloading from central: https://repo.maven.apache.org/maven2/com/fasterxml/jackson/core/jackson-annotations/2.1.5/jackson-annotations-2.1.5.pom
[INFO] Downloaded from central: https://repo.maven.apache.org/maven2/com/fasterxml/jackson/core/jackson-annotations/2.1.5/jackson-annotations-2.1.5.pom (1.9 kB at 52 kB/s)
[INFO] Downloading from central: https://repo.maven.apache.org/maven2/org/codehaus/modello/modello-plugin-jdom/1.9.1/modello-plugin-jdom-1.9.1.pom
[INFO] Downloaded from central: https://repo.maven.apache.org/maven2/org/codehaus/modello/modello-plugin-jdom/1.9.1/modello-plugin-jdom-1.9.1.pom (1.9 kB at 63 kB/s)
[INFO] Downloading from central: https://repo.maven.apache.org/maven2/org/codehaus/modello/modello-plugin-jsonschema/1.9.1/modello-plugin-jsonschema-1.9.1.pom
[INFO] Downloaded from central: https://repo.maven.apache.org/maven2/org/codehaus/modello/modello-plugin-jsonschema/1.9.1/modello-plugin-jsonschema-1.9.1.pom (1.5 kB at 47 kB/s)
[INFO] Downloading from central: https://repo.maven.apache.org/maven2/org/codehaus/modello/modello-plugin-sax/1.9.1/modello-plugin-sax-1.9.1.pom
[INFO] Downloaded from central: https://repo.maven.apache.org/maven2/org/codehaus/modello/modello-plugin-sax/1.9.1/modello-plugin-sax-1.9.1.pom (1.4 kB at 41 kB/s)
[INFO] Downloading from central: https://repo.maven.apache.org/maven2/org/codehaus/modello/modello-plugin-snakeyaml/1.9.1/modello-plugin-snakeyaml-1.9.1.pom
[INFO] Downloaded from central: https://repo.maven.apache.org/maven2/org/codehaus/modello/modello-plugin-snakeyaml/1.9.1/modello-plugin-snakeyaml-1.9.1.pom (1.2 kB at 40 kB/s)
[INFO] Downloading from central: https://repo.maven.apache.org/maven2/org/yaml/snakeyaml/1.12/snakeyaml-1.12.pom
[INFO] Downloaded from central: https://repo.maven.apache.org/maven2/org/yaml/snakeyaml/1.12/snakeyaml-1.12.pom (22 kB at 583 kB/s)
[INFO] Downloading from central: https://repo.maven.apache.org/maven2/org/codehaus/modello/modello-plugin-stax/1.9.1/modello-plugin-stax-1.9.1.pom
[INFO] Downloaded from central: https://repo.maven.apache.org/maven2/org/codehaus/modello/modello-plugin-stax/1.9.1/modello-plugin-stax-1.9.1.pom (2.4 kB at 63 kB/s)
[INFO] Downloading from central: https://repo.maven.apache.org/maven2/org/codehaus/modello/modello-plugin-xdoc/1.9.1/modello-plugin-xdoc-1.9.1.pom
[INFO] Downloaded from central: https://repo.maven.apache.org/maven2/org/codehaus/modello/modello-plugin-xdoc/1.9.1/modello-plugin-xdoc-1.9.1.pom (1.6 kB at 44 kB/s)
[INFO] Downloading from central: https://repo.maven.apache.org/maven2/org/codehaus/modello/modello-plugin-xsd/1.9.1/modello-plugin-xsd-1.9.1.pom
[INFO] Downloaded from central: https://repo.maven.apache.org/maven2/org/codehaus/modello/modello-plugin-xsd/1.9.1/modello-plugin-xsd-1.9.1.pom (1.4 kB at 39 kB/s)
[INFO] Downloading from central: https://repo.maven.apache.org/maven2/org/jsoup/jsoup/1.10.2/jsoup-1.10.2.pom
[INFO] Downloaded from central: https://repo.maven.apache.org/maven2/org/jsoup/jsoup/1.10.2/jsoup-1.10.2.pom (7.3 kB at 192 kB/s)
[INFO] Downloading from central: https://repo.maven.apache.org/maven2/org/codehaus/modello/modello-plugin-xpp3/1.9.1/modello-plugin-xpp3-1.9.1.pom
[INFO] Downloaded from central: https://repo.maven.apache.org/maven2/org/codehaus/modello/modello-plugin-xpp3/1.9.1/modello-plugin-xpp3-1.9.1.pom (1.5 kB at 49 kB/s)
[INFO] Downloading from central: https://repo.maven.apache.org/maven2/org/codehaus/modello/modello-core/1.9.1/modello-core-1.9.1.jar
[INFO] Downloading from central: https://repo.maven.apache.org/maven2/org/codehaus/modello/modello-plugin-converters/1.9.1/modello-plugin-converters-1.9.1.jar
[INFO] Downloading from central: https://repo.maven.apache.org/maven2/org/codehaus/plexus/plexus-utils/3.0.24/plexus-utils-3.0.24.jar
[INFO] Downloading from central: https://repo.maven.apache.org/maven2/org/apache/xbean/xbean-reflect/3.7/xbean-reflect-3.7.jar
[INFO] Downloading from central: https://repo.maven.apache.org/maven2/org/codehaus/plexus/plexus-container-default/1.7/plexus-container-default-1.7.jar
[INFO] Downloaded from central: https://repo.maven.apache.org/maven2/org/codehaus/modello/modello-plugin-converters/1.9.1/modello-plugin-converters-1.9.1.jar (9.5 kB at 53 kB/s)
[INFO] Downloading from central: https://repo.maven.apache.org/maven2/org/codehaus/modello/modello-plugin-dom4j/1.9.1/modello-plugin-dom4j-1.9.1.jar
[INFO] Downloaded from central: https://repo.maven.apache.org/maven2/org/codehaus/modello/modello-core/1.9.1/modello-core-1.9.1.jar (59 kB at 295 kB/s)
[INFO] Downloading from central: https://repo.maven.apache.org/maven2/org/codehaus/modello/modello-plugin-xml/1.9.1/modello-plugin-xml-1.9.1.jar
[INFO] Downloaded from central: https://repo.maven.apache.org/maven2/org/codehaus/plexus/plexus-container-default/1.7/plexus-container-default-1.7.jar (231 kB at 475 kB/s)
[INFO] Downloaded from central: https://repo.maven.apache.org/maven2/org/codehaus/modello/modello-plugin-xml/1.9.1/modello-plugin-xml-1.9.1.jar (15 kB at 32 kB/s)
[INFO] Downloaded from central: https://repo.maven.apache.org/maven2/org/apache/xbean/xbean-reflect/3.7/xbean-reflect-3.7.jar (148 kB at 305 kB/s)
[INFO] Downloaded from central: https://repo.maven.apache.org/maven2/org/codehaus/modello/modello-plugin-dom4j/1.9.1/modello-plugin-dom4j-1.9.1.jar (19 kB at 38 kB/s)
[INFO] Downloading from central: https://repo.maven.apache.org/maven2/com/fasterxml/jackson/core/jackson-databind/2.1.5/jackson-databind-2.1.5.jar
[INFO] Downloading from central: https://repo.maven.apache.org/maven2/com/fasterxml/jackson/core/jackson-core/2.1.5/jackson-core-2.1.5.jar
[INFO] Downloading from central: https://repo.maven.apache.org/maven2/org/codehaus/modello/modello-plugin-jackson/1.9.1/modello-plugin-jackson-1.9.1.jar
[INFO] Downloading from central: https://repo.maven.apache.org/maven2/com/fasterxml/jackson/core/jackson-annotations/2.1.5/jackson-annotations-2.1.5.jar
[INFO] Downloaded from central: https://repo.maven.apache.org/maven2/org/codehaus/plexus/plexus-utils/3.0.24/plexus-utils-3.0.24.jar (247 kB at 504 kB/s)
[INFO] Downloading from central: https://repo.maven.apache.org/maven2/org/codehaus/modello/modello-plugin-java/1.9.1/modello-plugin-java-1.9.1.jar
[INFO] Downloaded from central: https://repo.maven.apache.org/maven2/com/fasterxml/jackson/core/jackson-databind/2.1.5/jackson-databind-2.1.5.jar (927 kB at 1.7 MB/s)
[INFO] Downloading from central: https://repo.maven.apache.org/maven2/org/codehaus/modello/modello-plugin-jdom/1.9.1/modello-plugin-jdom-1.9.1.jar
[INFO] Downloaded from central: https://repo.maven.apache.org/maven2/org/codehaus/modello/modello-plugin-jackson/1.9.1/modello-plugin-jackson-1.9.1.jar (19 kB at 30 kB/s)
[INFO] Downloading from central: https://repo.maven.apache.org/maven2/org/codehaus/modello/modello-plugin-jsonschema/1.9.1/modello-plugin-jsonschema-1.9.1.jar
[INFO] Downloaded from central: https://repo.maven.apache.org/maven2/org/codehaus/modello/modello-plugin-jdom/1.9.1/modello-plugin-jdom-1.9.1.jar (14 kB at 22 kB/s)
[INFO] Downloading from central: https://repo.maven.apache.org/maven2/org/codehaus/modello/modello-plugin-sax/1.9.1/modello-plugin-sax-1.9.1.jar
[INFO] Downloaded from central: https://repo.maven.apache.org/maven2/org/codehaus/modello/modello-plugin-jsonschema/1.9.1/modello-plugin-jsonschema-1.9.1.jar (7.0 kB at 10 kB/s)
[INFO] Downloading from central: https://repo.maven.apache.org/maven2/org/codehaus/modello/modello-plugin-snakeyaml/1.9.1/modello-plugin-snakeyaml-1.9.1.jar
[INFO] Downloaded from central: https://repo.maven.apache.org/maven2/org/codehaus/modello/modello-plugin-sax/1.9.1/modello-plugin-sax-1.9.1.jar (11 kB at 15 kB/s)
[INFO] Downloading from central: https://repo.maven.apache.org/maven2/org/yaml/snakeyaml/1.12/snakeyaml-1.12.jar
[INFO] Downloaded from central: https://repo.maven.apache.org/maven2/com/fasterxml/jackson/core/jackson-annotations/2.1.5/jackson-annotations-2.1.5.jar (34 kB at 45 kB/s)
[INFO] Downloading from central: https://repo.maven.apache.org/maven2/org/codehaus/modello/modello-plugin-stax/1.9.1/modello-plugin-stax-1.9.1.jar
[INFO] Downloaded from central: https://repo.maven.apache.org/maven2/org/codehaus/modello/modello-plugin-java/1.9.1/modello-plugin-java-1.9.1.jar (90 kB at 118 kB/s)
[INFO] Downloading from central: https://repo.maven.apache.org/maven2/org/codehaus/modello/modello-plugin-xdoc/1.9.1/modello-plugin-xdoc-1.9.1.jar
[INFO] Downloaded from central: https://repo.maven.apache.org/maven2/org/yaml/snakeyaml/1.12/snakeyaml-1.12.jar (271 kB at 345 kB/s)
[INFO] Downloading from central: https://repo.maven.apache.org/maven2/org/jsoup/jsoup/1.10.2/jsoup-1.10.2.jar
[INFO] Downloaded from central: https://repo.maven.apache.org/maven2/org/jsoup/jsoup/1.10.2/jsoup-1.10.2.jar (351 kB at 430 kB/s)
[INFO] Downloading from central: https://repo.maven.apache.org/maven2/org/codehaus/modello/modello-plugin-xpp3/1.9.1/modello-plugin-xpp3-1.9.1.jar
[INFO] Downloaded from central: https://repo.maven.apache.org/maven2/org/codehaus/modello/modello-plugin-snakeyaml/1.9.1/modello-plugin-snakeyaml-1.9.1.jar (21 kB at 24 kB/s)
[INFO] Downloading from central: https://repo.maven.apache.org/maven2/org/codehaus/modello/modello-plugin-xsd/1.9.1/modello-plugin-xsd-1.9.1.jar
[INFO] Downloaded from central: https://repo.maven.apache.org/maven2/com/fasterxml/jackson/core/jackson-core/2.1.5/jackson-core-2.1.5.jar (207 kB at 234 kB/s)
[INFO] Downloading from central: https://repo.maven.apache.org/maven2/org/sonatype/plexus/plexus-build-api/0.0.7/plexus-build-api-0.0.7.jar
[INFO] Downloaded from central: https://repo.maven.apache.org/maven2/org/codehaus/modello/modello-plugin-xdoc/1.9.1/modello-plugin-xdoc-1.9.1.jar (15 kB at 17 kB/s)
[INFO] Downloaded from central: https://repo.maven.apache.org/maven2/org/sonatype/plexus/plexus-build-api/0.0.7/plexus-build-api-0.0.7.jar (8.5 kB at 8.8 kB/s)
[INFO] Downloaded from central: https://repo.maven.apache.org/maven2/org/codehaus/modello/modello-plugin-xsd/1.9.1/modello-plugin-xsd-1.9.1.jar (15 kB at 15 kB/s)
[INFO] Downloaded from central: https://repo.maven.apache.org/maven2/org/codehaus/modello/modello-plugin-stax/1.9.1/modello-plugin-stax-1.9.1.jar (38 kB at 37 kB/s)
[INFO] Downloaded from central: https://repo.maven.apache.org/maven2/org/codehaus/modello/modello-plugin-xpp3/1.9.1/modello-plugin-xpp3-1.9.1.jar (26 kB at 26 kB/s)
[INFO] outputDirectory: F:\jenkins\jenkins-slave\workspace\-box_maven-release_MRELEASE-1007\m\maven-release-manager\target\generated-sources\modello
[INFO] Working on model: src/main/mdo/release-descriptor.mdo
[INFO] Generating current version: 3.0.0
[INFO]
[INFO] --- modello-maven-plugin:1.9.1:java (default) @ maven-release-manager ---
[INFO] outputDirectory: F:\jenkins\jenkins-slave\workspace\-box_maven-release_MRELEASE-1007\m\maven-release-manager\target\generated-sources\modello
[INFO] Working on model: src/main/mdo/release-descriptor.mdo
[INFO] Generating current version: 3.0.0
[INFO]
[INFO] --- modello-maven-plugin:1.9.1:xpp3-writer (default) @ maven-release-manager ---
[INFO] outputDirectory: F:\jenkins\jenkins-slave\workspace\-box_maven-release_MRELEASE-1007\m\maven-release-manager\target\generated-sources\modello
[INFO] Working on model: src/main/mdo/release-descriptor.mdo
[INFO] Generating current version: 3.0.0
[INFO]
[INFO] --- maven-remote-resources-plugin:1.5:process (default) @ maven-release-manager ---
[INFO] Downloading from Nexus: http://repository.apache.org/snapshots/org/apache/maven/scm/maven-scm-providers-git/1.9.6-SNAPSHOT/maven-scm-providers-git-1.9.6-20180402.205845-16.pom
[INFO] Downloaded from Nexus: http://repository.apache.org/snapshots/org/apache/maven/scm/maven-scm-providers-git/1.9.6-SNAPSHOT/maven-scm-providers-git-1.9.6-20180402.205845-16.pom (0 B at 0 B/s)
[INFO] Downloading from Nexus: http://repository.apache.org/snapshots/org/apache/maven/scm/maven-scm-providers/1.9.6-SNAPSHOT/maven-scm-providers-1.9.6-20180402.205653-16.pom
[INFO] Downloaded from Nexus: http://repository.apache.org/snapshots/org/apache/maven/scm/maven-scm-providers/1.9.6-SNAPSHOT/maven-scm-providers-1.9.6-20180402.205653-16.pom (0 B at 0 B/s)
[INFO] Downloading from Nexus: http://repository.apache.org/snapshots/org/apache/maven/scm/maven-scm/1.9.6-SNAPSHOT/maven-scm-1.9.6-20180402.205557-20.pom
[INFO] Downloaded from Nexus: http://repository.apache.org/snapshots/org/apache/maven/scm/maven-scm/1.9.6-SNAPSHOT/maven-scm-1.9.6-20180402.205557-20.pom (0 B at 0 B/s)
[INFO] Downloading from Nexus: http://repository.apache.org/snapshots/org/apache/maven/scm/maven-scm-providers-svn/1.9.6-SNAPSHOT/maven-scm-providers-svn-1.9.6-20180402.210047-16.pom
[INFO] Downloaded from Nexus: http://repository.apache.org/snapshots/org/apache/maven/scm/maven-scm-providers-svn/1.9.6-SNAPSHOT/maven-scm-providers-svn-1.9.6-20180402.210047-16.pom (0 B at 0 B/s)
[INFO] Downloading from Nexus: http://repository.apache.org/snapshots/org/apache/maven/scm/maven-scm-providers-cvs/1.9.6-SNAPSHOT/maven-scm-providers-cvs-1.9.6-20180402.205740-16.pom
[INFO] Downloaded from Nexus: http://repository.apache.org/snapshots/org/apache/maven/scm/maven-scm-providers-cvs/1.9.6-SNAPSHOT/maven-scm-providers-cvs-1.9.6-20180402.205740-16.pom (0 B at 0 B/s)
[INFO]
[INFO] --- maven-resources-plugin:2.7:resources (default-resources) @ maven-release-manager ---
[INFO] Using 'UTF-8' encoding to copy filtered resources.
[INFO] Copying 3 resources
[INFO] Copying 3 resources
[INFO]
[INFO] --- maven-compiler-plugin:3.2:compile (default-compile) @ maven-release-manager ---
[INFO] Changes detected - recompiling the module!
[INFO] Compiling 100 source files to F:\jenkins\jenkins-slave\workspace\-box_maven-release_MRELEASE-1007\m\maven-release-manager\target\classes
[INFO] /F:/jenkins/jenkins-slave/workspace/-box_maven-release_MRELEASE-1007/m/maven-release-manager/src/main/java/org/apache/maven/shared/release/phase/AbstractRewritePomsPhase.java: Some input files use or override a deprecated API.
[INFO] /F:/jenkins/jenkins-slave/workspace/-box_maven-release_MRELEASE-1007/m/maven-release-manager/src/main/java/org/apache/maven/shared/release/phase/AbstractRewritePomsPhase.java: Recompile with -Xlint:deprecation for details.
[INFO] /F:/jenkins/jenkins-slave/workspace/-box_maven-release_MRELEASE-1007/m/maven-release-manager/src/main/java/org/apache/maven/shared/release/transform/jdom/JDomModel.java: Some input files use unchecked or unsafe operations.
[INFO] /F:/jenkins/jenkins-slave/workspace/-box_maven-release_MRELEASE-1007/m/maven-release-manager/src/main/java/org/apache/maven/shared/release/transform/jdom/JDomModel.java: Recompile with -Xlint:unchecked for details.
[INFO]
[INFO] --- plexus-component-metadata:1.7.1:generate-metadata (default) @ maven-release-manager ---
[INFO] Downloading from central: https://repo.maven.apache.org/maven2/org/codehaus/plexus/plexus-container-default/1.7.1/plexus-container-default-1.7.1.pom
[INFO] Downloaded from central: https://repo.maven.apache.org/maven2/org/codehaus/plexus/plexus-container-default/1.7.1/plexus-container-default-1.7.1.pom (2.8 kB at 89 kB/s)
[INFO] Downloading from central: https://repo.maven.apache.org/maven2/org/codehaus/plexus/plexus-component-annotations/1.7.1/plexus-component-annotations-1.7.1.pom
[INFO] Downloaded from central: https://repo.maven.apache.org/maven2/org/codehaus/plexus/plexus-component-annotations/1.7.1/plexus-component-annotations-1.7.1.pom (770 B at 25 kB/s)
[INFO] Downloading from central: https://repo.maven.apache.org/maven2/com/thoughtworks/qdox/qdox/2.0-M2/qdox-2.0-M2.pom
[INFO] Downloaded from central: https://repo.maven.apache.org/maven2/com/thoughtworks/qdox/qdox/2.0-M2/qdox-2.0-M2.pom (18 kB at 619 kB/s)
[INFO] Downloading from central: https://repo.maven.apache.org/maven2/org/jdom/jdom2/2.0.6/jdom2-2.0.6.pom
[INFO] Downloaded from central: https://repo.maven.apache.org/maven2/org/jdom/jdom2/2.0.6/jdom2-2.0.6.pom (4.6 kB at 177 kB/s)
[INFO] Downloading from central: https://repo.maven.apache.org/maven2/org/codehaus/plexus/plexus-cli/1.6/plexus-cli-1.6.pom
[INFO] Downloaded from central: https://repo.maven.apache.org/maven2/org/codehaus/plexus/plexus-cli/1.6/plexus-cli-1.6.pom (1.4 kB at 47 kB/s)
[INFO] Downloading from central: https://repo.maven.apache.org/maven2/org/codehaus/plexus/plexus-components/1.1.20/plexus-components-1.1.20.pom
[INFO] Downloaded from central: https://repo.maven.apache.org/maven2/org/codehaus/plexus/plexus-components/1.1.20/plexus-components-1.1.20.pom (3.0 kB at 121 kB/s)
[INFO] Downloading from central: https://repo.maven.apache.org/maven2/org/codehaus/plexus/plexus/3.1/plexus-3.1.pom
[INFO] Downloaded from central: https://repo.maven.apache.org/maven2/org/codehaus/plexus/plexus/3.1/plexus-3.1.pom (19 kB at 716 kB/s)
[INFO] Downloading from central: https://repo.maven.apache.org/maven2/org/ow2/asm/asm-all/5.1/asm-all-5.1.pom
[INFO] Downloaded from central: https://repo.maven.apache.org/maven2/org/ow2/asm/asm-all/5.1/asm-all-5.1.pom (2.0 kB at 86 kB/s)
[INFO] Downloading from central: https://repo.maven.apache.org/maven2/org/ow2/asm/asm-parent/5.1/asm-parent-5.1.pom
[INFO] Downloaded from central: https://repo.maven.apache.org/maven2/org/ow2/asm/asm-parent/5.1/asm-parent-5.1.pom (5.5 kB at 211 kB/s)
[INFO] Downloading from central: https://repo.maven.apache.org/maven2/org/codehaus/plexus/plexus-container-default/1.7.1/plexus-container-default-1.7.1.jar
[INFO] Downloading from central: https://repo.maven.apache.org/maven2/org/codehaus/plexus/plexus-classworlds/2.5.1/plexus-classworlds-2.5.1.jar
[INFO] Downloading from central: https://repo.maven.apache.org/maven2/org/codehaus/plexus/plexus-component-annotations/1.7.1/plexus-component-annotations-1.7.1.jar
[INFO] Downloading from central: https://repo.maven.apache.org/maven2/com/thoughtworks/qdox/qdox/2.0-M2/qdox-2.0-M2.jar
[INFO] Downloading from central: https://repo.maven.apache.org/maven2/org/jdom/jdom2/2.0.6/jdom2-2.0.6.jar
[INFO] Downloaded from central: https://repo.maven.apache.org/maven2/org/codehaus/plexus/plexus-component-annotations/1.7.1/plexus-component-annotations-1.7.1.jar (4.3 kB at 30 kB/s)
[INFO] Downloading from central: https://repo.maven.apache.org/maven2/org/codehaus/plexus/plexus-cli/1.6/plexus-cli-1.6.jar
[INFO] Downloaded from central: https://repo.maven.apache.org/maven2/org/jdom/jdom2/2.0.6/jdom2-2.0.6.jar (305 kB at 2.0 MB/s)
[INFO] Downloading from central: https://repo.maven.apache.org/maven2/org/ow2/asm/asm-all/5.1/asm-all-5.1.jar
[INFO] Downloaded from central: https://repo.maven.apache.org/maven2/org/codehaus/plexus/plexus-cli/1.6/plexus-cli-1.6.jar (7.4 kB at 30 kB/s)
[INFO] Downloaded from central: https://repo.maven.apache.org/maven2/org/codehaus/plexus/plexus-classworlds/2.5.1/plexus-classworlds-2.5.1.jar (50 kB at 95 kB/s)
[INFO] Downloaded from central: https://repo.maven.apache.org/maven2/org/codehaus/plexus/plexus-container-default/1.7.1/plexus-container-default-1.7.1.jar (231 kB at 382 kB/s)
[INFO] Downloaded from central: https://repo.maven.apache.org/maven2/com/thoughtworks/qdox/qdox/2.0-M2/qdox-2.0-M2.jar (292 kB at 403 kB/s)
[INFO] Downloaded from central: https://repo.maven.apache.org/maven2/org/ow2/asm/asm-all/5.1/asm-all-5.1.jar (248 kB at 315 kB/s)
[INFO] Discovered 34 component descriptors(s)
[INFO]
[INFO] --- plexus-component-metadata:1.7.1:merge-metadata (merge) @ maven-release-manager ---
[INFO]
[INFO] --- maven-resources-plugin:2.7:testResources (default-testResources) @ maven-release-manager ---
[INFO] Using 'UTF-8' encoding to copy filtered resources.
[INFO] Copying 892 resources
[INFO] Copying 3 resources
[INFO]
[INFO] --- maven-compiler-plugin:3.2:testCompile (default-testCompile) @ maven-release-manager ---
[INFO] Changes detected - recompiling the module!
[INFO] Compiling 68 source files to F:\jenkins\jenkins-slave\workspace\-box_maven-release_MRELEASE-1007\m\maven-release-manager\target\test-classes
[INFO] /F:/jenkins/jenkins-slave/workspace/-box_maven-release_MRELEASE-1007/m/maven-release-manager/src/test/java/org/apache/maven/shared/release/phase/AbstractReleaseTestCase.java: Some input files use or override a deprecated API.
[INFO] /F:/jenkins/jenkins-slave/workspace/-box_maven-release_MRELEASE-1007/m/maven-release-manager/src/test/java/org/apache/maven/shared/release/phase/AbstractReleaseTestCase.java: Recompile with -Xlint:deprecation for details.
[INFO] -------------------------------------------------------------
[ERROR] COMPILATION ERROR :
[INFO] -------------------------------------------------------------
[ERROR] /F:/jenkins/jenkins-slave/workspace/-box_maven-release_MRELEASE-1007/m/maven-release-manager/src/test/java/org/apache/maven/shared/release/transform/jdom/JDomPropertiesTest.java:[108,35] reference to storeToXML is ambiguous
  both method storeToXML(java.io.OutputStream,java.lang.String,java.nio.charset.Charset) in java.util.Properties and method storeToXML(java.io.OutputStream,java.lang.String,java.lang.String) in org.apache.maven.shared.release.transform.jdom.JDomProperties match
[INFO] 1 error
[INFO] -------------------------------------------------------------
[INFO] ------------------------------------------------------------------------
[INFO] Reactor Summary for Maven Release 3.0.0-SNAPSHOT:
[INFO]
[INFO] Maven Release ...................................... SUCCESS [ 44.624 s]
[INFO] Maven Release APIs ................................. SUCCESS [ 11.098 s]
[INFO] Maven Release Manager .............................. FAILURE [01:08 min]
[INFO] Maven Release Plugin ............................... SKIPPED
[INFO] Maven Release Odd-Even Policy ...................... SKIPPED
[INFO] Maven Release SemVer Policy ........................ SKIPPED
[INFO] ------------------------------------------------------------------------
[INFO] BUILD FAILURE
[INFO] ------------------------------------------------------------------------
[INFO] Total time:  02:05 min
[INFO] Finished at: 2019-09-30T20:38:19-07:00
[INFO] ------------------------------------------------------------------------
[INFO] [jenkins-event-spy] Generated F:\jenkins\jenkins-slave\workspace\-box_maven-release_MRELEASE-1007@tmp\withMaven79f57ad1\maven-spy-20190930-203613-26813955626995476419210.log
[ERROR] Failed to execute goal org.apache.maven.plugins:maven-compiler-plugin:3.2:testCompile (default-testCompile) on project maven-release-manager: Compilation failure
[ERROR] /F:/jenkins/jenkins-slave/workspace/-box_maven-release_MRELEASE-1007/m/maven-release-manager/src/test/java/org/apache/maven/shared/release/transform/jdom/JDomPropertiesTest.java:[108,35] reference to storeToXML is ambiguous
[ERROR]   both method storeToXML(java.io.OutputStream,java.lang.String,java.nio.charset.Charset) in java.util.Properties and method storeToXML(java.io.OutputStream,java.lang.String,java.lang.String) in org.apache.maven.shared.release.transform.jdom.JDomProperties match
[ERROR] -> [Help 1]
[ERROR]
[ERROR] To see the full stack trace of the errors, re-run Maven with the -e switch.
[ERROR] Re-run Maven using the -X switch to enable full debug logging.
[ERROR]
[ERROR] For more information about the errors and possible solutions, please read the following articles:
[ERROR] [Help 1] http://cwiki.apache.org/confluence/display/MAVEN/MojoFailureException
[ERROR]
[ERROR] After correcting the problems, you can resume the build with the command
[ERROR]   mvn <args> -rf :maven-release-manager
[Pipeline] }
[Pipeline] // dir
[Pipeline] }
[withMaven] junitPublisher - Archive test results for Maven artifact org.apache.maven.release:maven-release-api:jar:3.0.0-SNAPSHOT generated by maven-surefire-plugin:test (default-test): m\maven-release-api\target\surefire-reports\*.xml
Recording test results
None of the test reports contained any result
[withMaven] Publishers: Pipeline Graph Publisher: 3 ms, Junit Publisher: 155 ms, Dependencies Fingerprint Publisher: 55 ms
[Pipeline] // withMaven
[Pipeline] echo
[FAILURE-004] hudson.AbortException: script returned exit code 1
[Pipeline] cleanWs
[WS-CLEANUP] Deleting project workspace...
[WS-CLEANUP] Deferred wipeout is used...
[WS-CLEANUP] done
[Pipeline] cleanWs
[WS-CLEANUP] Deleting project workspace...
[WS-CLEANUP] Deferred wipeout is used...
[WS-CLEANUP] done
[Pipeline] }
[Pipeline] // stage
[Pipeline] }
[Pipeline] // node
[Pipeline] }
Failed in branch windows-jdk14
[Pipeline] // parallel
[Pipeline] echo
[FAILURE-003] AbortException hudson.AbortException: script returned exit code 1
[Pipeline] stage
[Pipeline] { (Notifications)
[Pipeline] echo
Build result: FAILURE
[Pipeline] jiraIssueSelector
[Pipeline] echo
The authors of changes [rfscholte].
[Pipeline] echo
Sending email ...
[Pipeline] emailext
Reply | Threaded
Open this post in threaded view
|

Build failed in Jenkins: Maven TLP » maven-release » MRELEASE-1007 #13

Apache Jenkins Server-2
See https://builds.apache.org/job/maven-box/job/maven-release/job/MRELEASE-1007/13/

No changes.

All tests passed

Build log:
[...truncated 27987 lines...]
[INFO] Downloading from central: https://repo.maven.apache.org/maven2/org/codehaus/plexus/plexus-containers/1.7/plexus-containers-1.7.pom
[INFO] Downloaded from central: https://repo.maven.apache.org/maven2/org/codehaus/plexus/plexus-containers/1.7/plexus-containers-1.7.pom (4.8 kB at 183 kB/s)
[INFO] Downloading from central: https://repo.maven.apache.org/maven2/org/codehaus/plexus/plexus-classworlds/2.5.1/plexus-classworlds-2.5.1.pom
[INFO] Downloaded from central: https://repo.maven.apache.org/maven2/org/codehaus/plexus/plexus-classworlds/2.5.1/plexus-classworlds-2.5.1.pom (5.0 kB at 417 kB/s)
[INFO] Downloading from central: https://repo.maven.apache.org/maven2/org/apache/xbean/xbean-reflect/3.7/xbean-reflect-3.7.pom
[INFO] Downloaded from central: https://repo.maven.apache.org/maven2/org/apache/xbean/xbean-reflect/3.7/xbean-reflect-3.7.pom (5.1 kB at 424 kB/s)
[INFO] Downloading from central: https://repo.maven.apache.org/maven2/org/apache/xbean/xbean/3.7/xbean-3.7.pom
[INFO] Downloaded from central: https://repo.maven.apache.org/maven2/org/apache/xbean/xbean/3.7/xbean-3.7.pom (15 kB at 1.3 MB/s)
[INFO] Downloading from central: https://repo.maven.apache.org/maven2/org/apache/geronimo/genesis/genesis-java5-flava/2.0/genesis-java5-flava-2.0.pom
[INFO] Downloaded from central: https://repo.maven.apache.org/maven2/org/apache/geronimo/genesis/genesis-java5-flava/2.0/genesis-java5-flava-2.0.pom (5.5 kB at 422 kB/s)
[INFO] Downloading from central: https://repo.maven.apache.org/maven2/org/apache/geronimo/genesis/genesis-default-flava/2.0/genesis-default-flava-2.0.pom
[INFO] Downloaded from central: https://repo.maven.apache.org/maven2/org/apache/geronimo/genesis/genesis-default-flava/2.0/genesis-default-flava-2.0.pom (18 kB at 1.4 MB/s)
[INFO] Downloading from central: https://repo.maven.apache.org/maven2/org/apache/geronimo/genesis/genesis/2.0/genesis-2.0.pom
[INFO] Downloaded from central: https://repo.maven.apache.org/maven2/org/apache/geronimo/genesis/genesis/2.0/genesis-2.0.pom (18 kB at 1.4 MB/s)
[INFO] Downloading from central: https://repo.maven.apache.org/maven2/org/codehaus/modello/modello-plugin-converters/1.9.1/modello-plugin-converters-1.9.1.pom
[INFO] Downloaded from central: https://repo.maven.apache.org/maven2/org/codehaus/modello/modello-plugin-converters/1.9.1/modello-plugin-converters-1.9.1.pom (1.7 kB at 138 kB/s)
[INFO] Downloading from central: https://repo.maven.apache.org/maven2/org/codehaus/modello/modello-plugins/1.9.1/modello-plugins-1.9.1.pom
[INFO] Downloaded from central: https://repo.maven.apache.org/maven2/org/codehaus/modello/modello-plugins/1.9.1/modello-plugins-1.9.1.pom (2.6 kB at 214 kB/s)
[INFO] Downloading from central: https://repo.maven.apache.org/maven2/org/codehaus/modello/modello-plugin-java/1.9.1/modello-plugin-java-1.9.1.pom
[INFO] Downloaded from central: https://repo.maven.apache.org/maven2/org/codehaus/modello/modello-plugin-java/1.9.1/modello-plugin-java-1.9.1.pom (2.7 kB at 205 kB/s)
[INFO] Downloading from central: https://repo.maven.apache.org/maven2/org/codehaus/modello/modello-plugin-dom4j/1.9.1/modello-plugin-dom4j-1.9.1.pom
[INFO] Downloaded from central: https://repo.maven.apache.org/maven2/org/codehaus/modello/modello-plugin-dom4j/1.9.1/modello-plugin-dom4j-1.9.1.pom (1.6 kB at 125 kB/s)
[INFO] Downloading from central: https://repo.maven.apache.org/maven2/org/codehaus/modello/modello-plugin-xml/1.9.1/modello-plugin-xml-1.9.1.pom
[INFO] Downloaded from central: https://repo.maven.apache.org/maven2/org/codehaus/modello/modello-plugin-xml/1.9.1/modello-plugin-xml-1.9.1.pom (1.1 kB at 77 kB/s)
[INFO] Downloading from central: https://repo.maven.apache.org/maven2/org/codehaus/modello/modello-plugin-jackson/1.9.1/modello-plugin-jackson-1.9.1.pom
[INFO] Downloaded from central: https://repo.maven.apache.org/maven2/org/codehaus/modello/modello-plugin-jackson/1.9.1/modello-plugin-jackson-1.9.1.pom (1.9 kB at 132 kB/s)
[INFO] Downloading from central: https://repo.maven.apache.org/maven2/com/fasterxml/jackson/core/jackson-core/2.1.5/jackson-core-2.1.5.pom
[INFO] Downloaded from central: https://repo.maven.apache.org/maven2/com/fasterxml/jackson/core/jackson-core/2.1.5/jackson-core-2.1.5.pom (5.6 kB at 377 kB/s)
[INFO] Downloading from central: https://repo.maven.apache.org/maven2/com/fasterxml/oss-parent/4/oss-parent-4.pom
[INFO] Downloaded from central: https://repo.maven.apache.org/maven2/com/fasterxml/oss-parent/4/oss-parent-4.pom (18 kB at 1.4 MB/s)
[INFO] Downloading from central: https://repo.maven.apache.org/maven2/com/fasterxml/jackson/core/jackson-databind/2.1.5/jackson-databind-2.1.5.pom
[INFO] Downloaded from central: https://repo.maven.apache.org/maven2/com/fasterxml/jackson/core/jackson-databind/2.1.5/jackson-databind-2.1.5.pom (5.6 kB at 431 kB/s)
[INFO] Downloading from central: https://repo.maven.apache.org/maven2/com/fasterxml/jackson/core/jackson-annotations/2.1.5/jackson-annotations-2.1.5.pom
[INFO] Downloaded from central: https://repo.maven.apache.org/maven2/com/fasterxml/jackson/core/jackson-annotations/2.1.5/jackson-annotations-2.1.5.pom (1.9 kB at 98 kB/s)
[INFO] Downloading from central: https://repo.maven.apache.org/maven2/org/codehaus/modello/modello-plugin-jdom/1.9.1/modello-plugin-jdom-1.9.1.pom
[INFO] Downloaded from central: https://repo.maven.apache.org/maven2/org/codehaus/modello/modello-plugin-jdom/1.9.1/modello-plugin-jdom-1.9.1.pom (1.9 kB at 139 kB/s)
[INFO] Downloading from central: https://repo.maven.apache.org/maven2/org/codehaus/modello/modello-plugin-jsonschema/1.9.1/modello-plugin-jsonschema-1.9.1.pom
[INFO] Downloaded from central: https://repo.maven.apache.org/maven2/org/codehaus/modello/modello-plugin-jsonschema/1.9.1/modello-plugin-jsonschema-1.9.1.pom (1.5 kB at 118 kB/s)
[INFO] Downloading from central: https://repo.maven.apache.org/maven2/org/codehaus/modello/modello-plugin-sax/1.9.1/modello-plugin-sax-1.9.1.pom
[INFO] Downloaded from central: https://repo.maven.apache.org/maven2/org/codehaus/modello/modello-plugin-sax/1.9.1/modello-plugin-sax-1.9.1.pom (1.4 kB at 99 kB/s)
[INFO] Downloading from central: https://repo.maven.apache.org/maven2/org/codehaus/modello/modello-plugin-snakeyaml/1.9.1/modello-plugin-snakeyaml-1.9.1.pom
[INFO] Downloaded from central: https://repo.maven.apache.org/maven2/org/codehaus/modello/modello-plugin-snakeyaml/1.9.1/modello-plugin-snakeyaml-1.9.1.pom (1.2 kB at 99 kB/s)
[INFO] Downloading from central: https://repo.maven.apache.org/maven2/org/yaml/snakeyaml/1.12/snakeyaml-1.12.pom
[INFO] Downloaded from central: https://repo.maven.apache.org/maven2/org/yaml/snakeyaml/1.12/snakeyaml-1.12.pom (22 kB at 1.7 MB/s)
[INFO] Downloading from central: https://repo.maven.apache.org/maven2/org/codehaus/modello/modello-plugin-stax/1.9.1/modello-plugin-stax-1.9.1.pom
[INFO] Downloaded from central: https://repo.maven.apache.org/maven2/org/codehaus/modello/modello-plugin-stax/1.9.1/modello-plugin-stax-1.9.1.pom (2.4 kB at 160 kB/s)
[INFO] Downloading from central: https://repo.maven.apache.org/maven2/org/codehaus/modello/modello-plugin-xdoc/1.9.1/modello-plugin-xdoc-1.9.1.pom
[INFO] Downloaded from central: https://repo.maven.apache.org/maven2/org/codehaus/modello/modello-plugin-xdoc/1.9.1/modello-plugin-xdoc-1.9.1.pom (1.6 kB at 107 kB/s)
[INFO] Downloading from central: https://repo.maven.apache.org/maven2/org/codehaus/modello/modello-plugin-xsd/1.9.1/modello-plugin-xsd-1.9.1.pom
[INFO] Downloaded from central: https://repo.maven.apache.org/maven2/org/codehaus/modello/modello-plugin-xsd/1.9.1/modello-plugin-xsd-1.9.1.pom (1.4 kB at 106 kB/s)
[INFO] Downloading from central: https://repo.maven.apache.org/maven2/org/jsoup/jsoup/1.10.2/jsoup-1.10.2.pom
[INFO] Downloaded from central: https://repo.maven.apache.org/maven2/org/jsoup/jsoup/1.10.2/jsoup-1.10.2.pom (7.3 kB at 663 kB/s)
[INFO] Downloading from central: https://repo.maven.apache.org/maven2/org/codehaus/modello/modello-plugin-xpp3/1.9.1/modello-plugin-xpp3-1.9.1.pom
[INFO] Downloaded from central: https://repo.maven.apache.org/maven2/org/codehaus/modello/modello-plugin-xpp3/1.9.1/modello-plugin-xpp3-1.9.1.pom (1.5 kB at 114 kB/s)
[INFO] Downloading from central: https://repo.maven.apache.org/maven2/org/codehaus/modello/modello-core/1.9.1/modello-core-1.9.1.jar
[INFO] Downloading from central: https://repo.maven.apache.org/maven2/org/apache/xbean/xbean-reflect/3.7/xbean-reflect-3.7.jar
[INFO] Downloading from central: https://repo.maven.apache.org/maven2/org/codehaus/plexus/plexus-container-default/1.7/plexus-container-default-1.7.jar
[INFO] Downloading from central: https://repo.maven.apache.org/maven2/org/codehaus/modello/modello-plugin-converters/1.9.1/modello-plugin-converters-1.9.1.jar
[INFO] Downloading from central: https://repo.maven.apache.org/maven2/org/codehaus/plexus/plexus-utils/3.0.24/plexus-utils-3.0.24.jar
[INFO] Downloaded from central: https://repo.maven.apache.org/maven2/org/codehaus/modello/modello-core/1.9.1/modello-core-1.9.1.jar (59 kB at 3.7 MB/s)
[INFO] Downloading from central: https://repo.maven.apache.org/maven2/org/codehaus/modello/modello-plugin-dom4j/1.9.1/modello-plugin-dom4j-1.9.1.jar
[INFO] Downloaded from central: https://repo.maven.apache.org/maven2/org/codehaus/modello/modello-plugin-converters/1.9.1/modello-plugin-converters-1.9.1.jar (9.5 kB at 560 kB/s)
[INFO] Downloading from central: https://repo.maven.apache.org/maven2/org/codehaus/modello/modello-plugin-xml/1.9.1/modello-plugin-xml-1.9.1.jar
[INFO] Downloaded from central: https://repo.maven.apache.org/maven2/org/apache/xbean/xbean-reflect/3.7/xbean-reflect-3.7.jar (148 kB at 7.1 MB/s)
[INFO] Downloading from central: https://repo.maven.apache.org/maven2/org/codehaus/modello/modello-plugin-jackson/1.9.1/modello-plugin-jackson-1.9.1.jar
[INFO] Downloaded from central: https://repo.maven.apache.org/maven2/org/codehaus/plexus/plexus-utils/3.0.24/plexus-utils-3.0.24.jar (247 kB at 11 MB/s)
[INFO] Downloading from central: https://repo.maven.apache.org/maven2/com/fasterxml/jackson/core/jackson-core/2.1.5/jackson-core-2.1.5.jar
[INFO] Downloaded from central: https://repo.maven.apache.org/maven2/org/codehaus/plexus/plexus-container-default/1.7/plexus-container-default-1.7.jar (231 kB at 9.2 MB/s)
[INFO] Downloading from central: https://repo.maven.apache.org/maven2/com/fasterxml/jackson/core/jackson-databind/2.1.5/jackson-databind-2.1.5.jar
[INFO] Downloaded from central: https://repo.maven.apache.org/maven2/org/codehaus/modello/modello-plugin-dom4j/1.9.1/modello-plugin-dom4j-1.9.1.jar (19 kB at 686 kB/s)
[INFO] Downloading from central: https://repo.maven.apache.org/maven2/com/fasterxml/jackson/core/jackson-annotations/2.1.5/jackson-annotations-2.1.5.jar
[INFO] Downloaded from central: https://repo.maven.apache.org/maven2/org/codehaus/modello/modello-plugin-xml/1.9.1/modello-plugin-xml-1.9.1.jar (15 kB at 478 kB/s)
[INFO] Downloading from central: https://repo.maven.apache.org/maven2/org/codehaus/modello/modello-plugin-java/1.9.1/modello-plugin-java-1.9.1.jar
[INFO] Downloaded from central: https://repo.maven.apache.org/maven2/org/codehaus/modello/modello-plugin-jackson/1.9.1/modello-plugin-jackson-1.9.1.jar (19 kB at 590 kB/s)
[INFO] Downloading from central: https://repo.maven.apache.org/maven2/org/codehaus/modello/modello-plugin-jdom/1.9.1/modello-plugin-jdom-1.9.1.jar
[INFO] Downloaded from central: https://repo.maven.apache.org/maven2/com/fasterxml/jackson/core/jackson-core/2.1.5/jackson-core-2.1.5.jar (207 kB at 4.8 MB/s)
[INFO] Downloading from central: https://repo.maven.apache.org/maven2/org/codehaus/modello/modello-plugin-jsonschema/1.9.1/modello-plugin-jsonschema-1.9.1.jar
[INFO] Downloaded from central: https://repo.maven.apache.org/maven2/com/fasterxml/jackson/core/jackson-annotations/2.1.5/jackson-annotations-2.1.5.jar (34 kB at 784 kB/s)
[INFO] Downloading from central: https://repo.maven.apache.org/maven2/org/codehaus/modello/modello-plugin-sax/1.9.1/modello-plugin-sax-1.9.1.jar
[INFO] Downloaded from central: https://repo.maven.apache.org/maven2/org/codehaus/modello/modello-plugin-java/1.9.1/modello-plugin-java-1.9.1.jar (90 kB at 1.8 MB/s)
[INFO] Downloading from central: https://repo.maven.apache.org/maven2/org/codehaus/modello/modello-plugin-snakeyaml/1.9.1/modello-plugin-snakeyaml-1.9.1.jar
[INFO] Downloaded from central: https://repo.maven.apache.org/maven2/org/codehaus/modello/modello-plugin-jdom/1.9.1/modello-plugin-jdom-1.9.1.jar (14 kB at 288 kB/s)
[INFO] Downloading from central: https://repo.maven.apache.org/maven2/org/yaml/snakeyaml/1.12/snakeyaml-1.12.jar
[INFO] Downloaded from central: https://repo.maven.apache.org/maven2/org/codehaus/modello/modello-plugin-jsonschema/1.9.1/modello-plugin-jsonschema-1.9.1.jar (7.0 kB at 122 kB/s)
[INFO] Downloading from central: https://repo.maven.apache.org/maven2/org/codehaus/modello/modello-plugin-stax/1.9.1/modello-plugin-stax-1.9.1.jar
[INFO] Downloaded from central: https://repo.maven.apache.org/maven2/org/codehaus/modello/modello-plugin-sax/1.9.1/modello-plugin-sax-1.9.1.jar (11 kB at 182 kB/s)
[INFO] Downloading from central: https://repo.maven.apache.org/maven2/org/codehaus/modello/modello-plugin-xdoc/1.9.1/modello-plugin-xdoc-1.9.1.jar
[INFO] Downloaded from central: https://repo.maven.apache.org/maven2/org/codehaus/modello/modello-plugin-snakeyaml/1.9.1/modello-plugin-snakeyaml-1.9.1.jar (21 kB at 330 kB/s)
[INFO] Downloading from central: https://repo.maven.apache.org/maven2/org/jsoup/jsoup/1.10.2/jsoup-1.10.2.jar
[INFO] Downloaded from central: https://repo.maven.apache.org/maven2/com/fasterxml/jackson/core/jackson-databind/2.1.5/jackson-databind-2.1.5.jar (927 kB at 14 MB/s)
[INFO] Downloading from central: https://repo.maven.apache.org/maven2/org/codehaus/modello/modello-plugin-xpp3/1.9.1/modello-plugin-xpp3-1.9.1.jar
[INFO] Downloaded from central: https://repo.maven.apache.org/maven2/org/codehaus/modello/modello-plugin-stax/1.9.1/modello-plugin-stax-1.9.1.jar (38 kB at 525 kB/s)
[INFO] Downloading from central: https://repo.maven.apache.org/maven2/org/codehaus/modello/modello-plugin-xsd/1.9.1/modello-plugin-xsd-1.9.1.jar
[INFO] Downloaded from central: https://repo.maven.apache.org/maven2/org/yaml/snakeyaml/1.12/snakeyaml-1.12.jar (271 kB at 3.7 MB/s)
[INFO] Downloading from central: https://repo.maven.apache.org/maven2/org/sonatype/plexus/plexus-build-api/0.0.7/plexus-build-api-0.0.7.jar
[INFO] Downloaded from central: https://repo.maven.apache.org/maven2/org/codehaus/modello/modello-plugin-xdoc/1.9.1/modello-plugin-xdoc-1.9.1.jar (15 kB at 197 kB/s)
[INFO] Downloaded from central: https://repo.maven.apache.org/maven2/org/codehaus/modello/modello-plugin-xpp3/1.9.1/modello-plugin-xpp3-1.9.1.jar (26 kB at 328 kB/s)
[INFO] Downloaded from central: https://repo.maven.apache.org/maven2/org/sonatype/plexus/plexus-build-api/0.0.7/plexus-build-api-0.0.7.jar (8.5 kB at 99 kB/s)
[INFO] Downloaded from central: https://repo.maven.apache.org/maven2/org/codehaus/modello/modello-plugin-xsd/1.9.1/modello-plugin-xsd-1.9.1.jar (15 kB at 167 kB/s)
[INFO] Downloaded from central: https://repo.maven.apache.org/maven2/org/jsoup/jsoup/1.10.2/jsoup-1.10.2.jar (351 kB at 3.9 MB/s)
[INFO] outputDirectory: /home/jenkins/jenkins-slave/workspace/_box_maven-release_MRELEASE-1007/m/maven-release-manager/target/generated-sources/modello
[INFO] Working on model: src/main/mdo/release-descriptor.mdo
[INFO] Generating current version: 3.0.0
[INFO]
[INFO] --- modello-maven-plugin:1.9.1:java (default) @ maven-release-manager ---
[INFO] outputDirectory: /home/jenkins/jenkins-slave/workspace/_box_maven-release_MRELEASE-1007/m/maven-release-manager/target/generated-sources/modello
[INFO] Working on model: src/main/mdo/release-descriptor.mdo
[INFO] Generating current version: 3.0.0
[INFO]
[INFO] --- modello-maven-plugin:1.9.1:xpp3-writer (default) @ maven-release-manager ---
[INFO] outputDirectory: /home/jenkins/jenkins-slave/workspace/_box_maven-release_MRELEASE-1007/m/maven-release-manager/target/generated-sources/modello
[INFO] Working on model: src/main/mdo/release-descriptor.mdo
[INFO] Generating current version: 3.0.0
[INFO]
[INFO] --- maven-remote-resources-plugin:1.5:process (default) @ maven-release-manager ---
[INFO]
[INFO] --- maven-resources-plugin:2.7:resources (default-resources) @ maven-release-manager ---
[INFO] Using 'UTF-8' encoding to copy filtered resources.
[INFO] Copying 3 resources
[INFO] Copying 3 resources
[INFO]
[INFO] --- maven-compiler-plugin:3.2:compile (default-compile) @ maven-release-manager ---
[INFO] Changes detected - recompiling the module!
[INFO] Compiling 100 source files to /home/jenkins/jenkins-slave/workspace/_box_maven-release_MRELEASE-1007/m/maven-release-manager/target/classes
[INFO] /home/jenkins/jenkins-slave/workspace/_box_maven-release_MRELEASE-1007/m/maven-release-manager/src/main/java/org/apache/maven/shared/release/phase/AbstractRewritePomsPhase.java: Some input files use or override a deprecated API.
[INFO] /home/jenkins/jenkins-slave/workspace/_box_maven-release_MRELEASE-1007/m/maven-release-manager/src/main/java/org/apache/maven/shared/release/phase/AbstractRewritePomsPhase.java: Recompile with -Xlint:deprecation for details.
[INFO] /home/jenkins/jenkins-slave/workspace/_box_maven-release_MRELEASE-1007/m/maven-release-manager/src/main/java/org/apache/maven/shared/release/transform/jdom/JDomPlugin.java: Some input files use unchecked or unsafe operations.
[INFO] /home/jenkins/jenkins-slave/workspace/_box_maven-release_MRELEASE-1007/m/maven-release-manager/src/main/java/org/apache/maven/shared/release/transform/jdom/JDomPlugin.java: Recompile with -Xlint:unchecked for details.
[INFO]
[INFO] --- plexus-component-metadata:1.7.1:generate-metadata (default) @ maven-release-manager ---
[INFO] Downloading from central: https://repo.maven.apache.org/maven2/org/codehaus/plexus/plexus-container-default/1.7.1/plexus-container-default-1.7.1.pom
[INFO] Downloaded from central: https://repo.maven.apache.org/maven2/org/codehaus/plexus/plexus-container-default/1.7.1/plexus-container-default-1.7.1.pom (2.8 kB at 212 kB/s)
[INFO] Downloading from central: https://repo.maven.apache.org/maven2/org/codehaus/plexus/plexus-component-annotations/1.7.1/plexus-component-annotations-1.7.1.pom
[INFO] Downloaded from central: https://repo.maven.apache.org/maven2/org/codehaus/plexus/plexus-component-annotations/1.7.1/plexus-component-annotations-1.7.1.pom (770 B at 64 kB/s)
[INFO] Downloading from central: https://repo.maven.apache.org/maven2/com/thoughtworks/qdox/qdox/2.0-M2/qdox-2.0-M2.pom
[INFO] Downloaded from central: https://repo.maven.apache.org/maven2/com/thoughtworks/qdox/qdox/2.0-M2/qdox-2.0-M2.pom (18 kB at 1.4 MB/s)
[INFO] Downloading from central: https://repo.maven.apache.org/maven2/org/jdom/jdom2/2.0.6/jdom2-2.0.6.pom
[INFO] Downloaded from central: https://repo.maven.apache.org/maven2/org/jdom/jdom2/2.0.6/jdom2-2.0.6.pom (4.6 kB at 328 kB/s)
[INFO] Downloading from central: https://repo.maven.apache.org/maven2/org/codehaus/plexus/plexus-cli/1.6/plexus-cli-1.6.pom
[INFO] Downloaded from central: https://repo.maven.apache.org/maven2/org/codehaus/plexus/plexus-cli/1.6/plexus-cli-1.6.pom (1.4 kB at 117 kB/s)
[INFO] Downloading from central: https://repo.maven.apache.org/maven2/org/codehaus/plexus/plexus-components/1.1.20/plexus-components-1.1.20.pom
[INFO] Downloaded from central: https://repo.maven.apache.org/maven2/org/codehaus/plexus/plexus-components/1.1.20/plexus-components-1.1.20.pom (3.0 kB at 201 kB/s)
[INFO] Downloading from central: https://repo.maven.apache.org/maven2/org/codehaus/plexus/plexus/3.1/plexus-3.1.pom
[INFO] Downloaded from central: https://repo.maven.apache.org/maven2/org/codehaus/plexus/plexus/3.1/plexus-3.1.pom (19 kB at 1.3 MB/s)
[INFO] Downloading from central: https://repo.maven.apache.org/maven2/org/ow2/asm/asm-all/5.1/asm-all-5.1.pom
[INFO] Downloaded from central: https://repo.maven.apache.org/maven2/org/ow2/asm/asm-all/5.1/asm-all-5.1.pom (2.0 kB at 116 kB/s)
[INFO] Downloading from central: https://repo.maven.apache.org/maven2/org/ow2/asm/asm-parent/5.1/asm-parent-5.1.pom
[INFO] Downloaded from central: https://repo.maven.apache.org/maven2/org/ow2/asm/asm-parent/5.1/asm-parent-5.1.pom (5.5 kB at 423 kB/s)
[INFO] Downloading from central: https://repo.maven.apache.org/maven2/org/codehaus/plexus/plexus-container-default/1.7.1/plexus-container-default-1.7.1.jar
[INFO] Downloading from central: https://repo.maven.apache.org/maven2/org/codehaus/plexus/plexus-component-annotations/1.7.1/plexus-component-annotations-1.7.1.jar
[INFO] Downloading from central: https://repo.maven.apache.org/maven2/org/codehaus/plexus/plexus-classworlds/2.5.1/plexus-classworlds-2.5.1.jar
[INFO] Downloading from central: https://repo.maven.apache.org/maven2/org/jdom/jdom2/2.0.6/jdom2-2.0.6.jar
[INFO] Downloading from central: https://repo.maven.apache.org/maven2/com/thoughtworks/qdox/qdox/2.0-M2/qdox-2.0-M2.jar
[INFO] Downloaded from central: https://repo.maven.apache.org/maven2/org/codehaus/plexus/plexus-component-annotations/1.7.1/plexus-component-annotations-1.7.1.jar (4.3 kB at 268 kB/s)
[INFO] Downloading from central: https://repo.maven.apache.org/maven2/org/codehaus/plexus/plexus-cli/1.6/plexus-cli-1.6.jar
[INFO] Downloaded from central: https://repo.maven.apache.org/maven2/org/codehaus/plexus/plexus-classworlds/2.5.1/plexus-classworlds-2.5.1.jar (50 kB at 2.8 MB/s)
[INFO] Downloading from central: https://repo.maven.apache.org/maven2/org/ow2/asm/asm-all/5.1/asm-all-5.1.jar
[INFO] Downloaded from central: https://repo.maven.apache.org/maven2/org/codehaus/plexus/plexus-container-default/1.7.1/plexus-container-default-1.7.1.jar (231 kB at 12 MB/s)
[INFO] Downloaded from central: https://repo.maven.apache.org/maven2/org/jdom/jdom2/2.0.6/jdom2-2.0.6.jar (305 kB at 13 MB/s)
[INFO] Downloaded from central: https://repo.maven.apache.org/maven2/com/thoughtworks/qdox/qdox/2.0-M2/qdox-2.0-M2.jar (292 kB at 11 MB/s)
[INFO] Downloaded from central: https://repo.maven.apache.org/maven2/org/codehaus/plexus/plexus-cli/1.6/plexus-cli-1.6.jar (7.4 kB at 246 kB/s)
[INFO] Downloaded from central: https://repo.maven.apache.org/maven2/org/ow2/asm/asm-all/5.1/asm-all-5.1.jar (248 kB at 6.9 MB/s)
[INFO] Discovered 34 component descriptors(s)
[INFO]
[INFO] --- plexus-component-metadata:1.7.1:merge-metadata (merge) @ maven-release-manager ---
[INFO]
[INFO] --- maven-resources-plugin:2.7:testResources (default-testResources) @ maven-release-manager ---
[INFO] Using 'UTF-8' encoding to copy filtered resources.
[INFO] Copying 892 resources
[INFO] Copying 3 resources
[INFO]
[INFO] --- maven-compiler-plugin:3.2:testCompile (default-testCompile) @ maven-release-manager ---
[INFO] Changes detected - recompiling the module!
[INFO] Compiling 68 source files to /home/jenkins/jenkins-slave/workspace/_box_maven-release_MRELEASE-1007/m/maven-release-manager/target/test-classes
[INFO] /home/jenkins/jenkins-slave/workspace/_box_maven-release_MRELEASE-1007/m/maven-release-manager/src/test/java/org/apache/maven/shared/release/phase/AbstractReleaseTestCase.java: Some input files use or override a deprecated API.
[INFO] /home/jenkins/jenkins-slave/workspace/_box_maven-release_MRELEASE-1007/m/maven-release-manager/src/test/java/org/apache/maven/shared/release/phase/AbstractReleaseTestCase.java: Recompile with -Xlint:deprecation for details.
[INFO] -------------------------------------------------------------
[ERROR] COMPILATION ERROR :
[INFO] -------------------------------------------------------------
[ERROR] /home/jenkins/jenkins-slave/workspace/_box_maven-release_MRELEASE-1007/m/maven-release-manager/src/test/java/org/apache/maven/shared/release/transform/jdom/JDomPropertiesTest.java:[108,35] reference to storeToXML is ambiguous
  both method storeToXML(java.io.OutputStream,java.lang.String,java.nio.charset.Charset) in java.util.Properties and method storeToXML(java.io.OutputStream,java.lang.String,java.lang.String) in org.apache.maven.shared.release.transform.jdom.JDomProperties match
[INFO] 1 error
[INFO] -------------------------------------------------------------
[INFO] ------------------------------------------------------------------------
[INFO] Reactor Summary for Maven Release 3.0.0-SNAPSHOT:
[INFO]
[INFO] Maven Release ...................................... SUCCESS [ 12.007 s]
[INFO] Maven Release APIs ................................. SUCCESS [  4.061 s]
[INFO] Maven Release Manager .............................. FAILURE [ 29.074 s]
[INFO] Maven Release Plugin ............................... SKIPPED
[INFO] Maven Release Odd-Even Policy ...................... SKIPPED
[INFO] Maven Release SemVer Policy ........................ SKIPPED
[INFO] ------------------------------------------------------------------------
[INFO] BUILD FAILURE
[INFO] ------------------------------------------------------------------------
[INFO] Total time:  46.197 s
[INFO] Finished at: 2019-10-04T03:58:00Z
[INFO] ------------------------------------------------------------------------
[INFO] [jenkins-event-spy] Generated /home/jenkins/jenkins-slave/workspace/_box_maven-release_MRELEASE-1007@tmp/withMaven202c07f4/maven-spy-20191004-035714-39415201198773934658706.log
[ERROR] Failed to execute goal org.apache.maven.plugins:maven-compiler-plugin:3.2:testCompile (default-testCompile) on project maven-release-manager: Compilation failure
[ERROR] /home/jenkins/jenkins-slave/workspace/_box_maven-release_MRELEASE-1007/m/maven-release-manager/src/test/java/org/apache/maven/shared/release/transform/jdom/JDomPropertiesTest.java:[108,35] reference to storeToXML is ambiguous
[ERROR]   both method storeToXML(java.io.OutputStream,java.lang.String,java.nio.charset.Charset) in java.util.Properties and method storeToXML(java.io.OutputStream,java.lang.String,java.lang.String) in org.apache.maven.shared.release.transform.jdom.JDomProperties match
[ERROR] -> [Help 1]
[ERROR]
[ERROR] To see the full stack trace of the errors, re-run Maven with the -e switch.
[ERROR] Re-run Maven using the -X switch to enable full debug logging.
[ERROR]
[ERROR] For more information about the errors and possible solutions, please read the following articles:
[ERROR] [Help 1] http://cwiki.apache.org/confluence/display/MAVEN/MojoFailureException
[ERROR]
[ERROR] After correcting the problems, you can resume the build with the command
[ERROR]   mvn <goals> -rf :maven-release-manager
[Pipeline] }
[Pipeline] // dir
[Pipeline] }
[withMaven] junitPublisher - Archive test results for Maven artifact org.apache.maven.release:maven-release-api:jar:3.0.0-SNAPSHOT generated by maven-surefire-plugin:test (default-test): m/maven-release-api/target/surefire-reports/*.xml
Recording test results
None of the test reports contained any result
[withMaven] Publishers: Pipeline Graph Publisher: 4 ms, Junit Publisher: 307 ms, Dependencies Fingerprint Publisher: 939 ms
[Pipeline] // withMaven
[Pipeline] echo
[FAILURE-004] hudson.AbortException: script returned exit code 1
[Pipeline] cleanWs
[WS-CLEANUP] Deleting project workspace...
[WS-CLEANUP] Deferred wipeout is used...
[WS-CLEANUP] done
[Pipeline] cleanWs
[WS-CLEANUP] Deleting project workspace...
[WS-CLEANUP] Deferred wipeout is used...
[WS-CLEANUP] done
[Pipeline] }
[Pipeline] // stage
[Pipeline] }
[Pipeline] // node
[Pipeline] }
Failed in branch linux-jdk14
[Pipeline] // parallel
[Pipeline] echo
[FAILURE-003] AbortException hudson.AbortException: script returned exit code 1
[Pipeline] stage
[Pipeline] { (Notifications)
[Pipeline] echo
Build result: FAILURE
[Pipeline] jiraIssueSelector
[Pipeline] echo
The authors of changes [].
[Pipeline] echo
Sending email ...
[Pipeline] emailext
Reply | Threaded
Open this post in threaded view
|

Build failed in Jenkins: Maven TLP » maven-release » MRELEASE-1007 #14

Apache Jenkins Server-2
See https://builds.apache.org/job/maven-box/job/maven-release/job/MRELEASE-1007/14/

Changes:

* [INFRA-19273] Maven 3.6.0 dropped, update to 3.6.2

All tests passed

Build log:
[...truncated 27986 lines...]
[INFO] Downloading from central: https://repo.maven.apache.org/maven2/org/apache/geronimo/genesis/genesis-default-flava/2.0/genesis-default-flava-2.0.pom
[INFO] Downloaded from central: https://repo.maven.apache.org/maven2/org/apache/geronimo/genesis/genesis-default-flava/2.0/genesis-default-flava-2.0.pom (18 kB at 509 kB/s)
[INFO] Downloading from central: https://repo.maven.apache.org/maven2/org/apache/geronimo/genesis/genesis/2.0/genesis-2.0.pom
[INFO] Downloaded from central: https://repo.maven.apache.org/maven2/org/apache/geronimo/genesis/genesis/2.0/genesis-2.0.pom (18 kB at 512 kB/s)
[INFO] Downloading from central: https://repo.maven.apache.org/maven2/org/codehaus/modello/modello-plugin-converters/1.9.1/modello-plugin-converters-1.9.1.pom
[INFO] Downloaded from central: https://repo.maven.apache.org/maven2/org/codehaus/modello/modello-plugin-converters/1.9.1/modello-plugin-converters-1.9.1.pom (1.7 kB at 52 kB/s)
[INFO] Downloading from central: https://repo.maven.apache.org/maven2/org/codehaus/modello/modello-plugins/1.9.1/modello-plugins-1.9.1.pom
[INFO] Downloaded from central: https://repo.maven.apache.org/maven2/org/codehaus/modello/modello-plugins/1.9.1/modello-plugins-1.9.1.pom (2.6 kB at 78 kB/s)
[INFO] Downloading from central: https://repo.maven.apache.org/maven2/org/codehaus/modello/modello-plugin-java/1.9.1/modello-plugin-java-1.9.1.pom
[INFO] Downloaded from central: https://repo.maven.apache.org/maven2/org/codehaus/modello/modello-plugin-java/1.9.1/modello-plugin-java-1.9.1.pom (2.7 kB at 81 kB/s)
[INFO] Downloading from central: https://repo.maven.apache.org/maven2/org/codehaus/modello/modello-plugin-dom4j/1.9.1/modello-plugin-dom4j-1.9.1.pom
[INFO] Downloaded from central: https://repo.maven.apache.org/maven2/org/codehaus/modello/modello-plugin-dom4j/1.9.1/modello-plugin-dom4j-1.9.1.pom (1.6 kB at 51 kB/s)
[INFO] Downloading from central: https://repo.maven.apache.org/maven2/org/codehaus/modello/modello-plugin-xml/1.9.1/modello-plugin-xml-1.9.1.pom
[INFO] Downloaded from central: https://repo.maven.apache.org/maven2/org/codehaus/modello/modello-plugin-xml/1.9.1/modello-plugin-xml-1.9.1.pom (1.1 kB at 33 kB/s)
[INFO] Downloading from central: https://repo.maven.apache.org/maven2/org/codehaus/modello/modello-plugin-jackson/1.9.1/modello-plugin-jackson-1.9.1.pom
[INFO] Downloaded from central: https://repo.maven.apache.org/maven2/org/codehaus/modello/modello-plugin-jackson/1.9.1/modello-plugin-jackson-1.9.1.pom (1.9 kB at 5.8 kB/s)
[INFO] Downloading from central: https://repo.maven.apache.org/maven2/com/fasterxml/jackson/core/jackson-core/2.1.5/jackson-core-2.1.5.pom
[INFO] Downloaded from central: https://repo.maven.apache.org/maven2/com/fasterxml/jackson/core/jackson-core/2.1.5/jackson-core-2.1.5.pom (5.6 kB at 153 kB/s)
[INFO] Downloading from central: https://repo.maven.apache.org/maven2/com/fasterxml/oss-parent/4/oss-parent-4.pom
[INFO] Downloaded from central: https://repo.maven.apache.org/maven2/com/fasterxml/oss-parent/4/oss-parent-4.pom (18 kB at 526 kB/s)
[INFO] Downloading from central: https://repo.maven.apache.org/maven2/com/fasterxml/jackson/core/jackson-databind/2.1.5/jackson-databind-2.1.5.pom
[INFO] Downloaded from central: https://repo.maven.apache.org/maven2/com/fasterxml/jackson/core/jackson-databind/2.1.5/jackson-databind-2.1.5.pom (5.6 kB at 165 kB/s)
[INFO] Downloading from central: https://repo.maven.apache.org/maven2/com/fasterxml/jackson/core/jackson-annotations/2.1.5/jackson-annotations-2.1.5.pom
[INFO] Downloaded from central: https://repo.maven.apache.org/maven2/com/fasterxml/jackson/core/jackson-annotations/2.1.5/jackson-annotations-2.1.5.pom (1.9 kB at 55 kB/s)
[INFO] Downloading from central: https://repo.maven.apache.org/maven2/org/codehaus/modello/modello-plugin-jdom/1.9.1/modello-plugin-jdom-1.9.1.pom
[INFO] Downloaded from central: https://repo.maven.apache.org/maven2/org/codehaus/modello/modello-plugin-jdom/1.9.1/modello-plugin-jdom-1.9.1.pom (1.9 kB at 61 kB/s)
[INFO] Downloading from central: https://repo.maven.apache.org/maven2/org/codehaus/modello/modello-plugin-jsonschema/1.9.1/modello-plugin-jsonschema-1.9.1.pom
[INFO] Downloaded from central: https://repo.maven.apache.org/maven2/org/codehaus/modello/modello-plugin-jsonschema/1.9.1/modello-plugin-jsonschema-1.9.1.pom (1.5 kB at 47 kB/s)
[INFO] Downloading from central: https://repo.maven.apache.org/maven2/org/codehaus/modello/modello-plugin-sax/1.9.1/modello-plugin-sax-1.9.1.pom
[INFO] Downloaded from central: https://repo.maven.apache.org/maven2/org/codehaus/modello/modello-plugin-sax/1.9.1/modello-plugin-sax-1.9.1.pom (1.4 kB at 43 kB/s)
[INFO] Downloading from central: https://repo.maven.apache.org/maven2/org/codehaus/modello/modello-plugin-snakeyaml/1.9.1/modello-plugin-snakeyaml-1.9.1.pom
[INFO] Downloaded from central: https://repo.maven.apache.org/maven2/org/codehaus/modello/modello-plugin-snakeyaml/1.9.1/modello-plugin-snakeyaml-1.9.1.pom (1.2 kB at 36 kB/s)
[INFO] Downloading from central: https://repo.maven.apache.org/maven2/org/yaml/snakeyaml/1.12/snakeyaml-1.12.pom
[INFO] Downloaded from central: https://repo.maven.apache.org/maven2/org/yaml/snakeyaml/1.12/snakeyaml-1.12.pom (22 kB at 599 kB/s)
[INFO] Downloading from central: https://repo.maven.apache.org/maven2/org/codehaus/modello/modello-plugin-stax/1.9.1/modello-plugin-stax-1.9.1.pom
[INFO] Downloaded from central: https://repo.maven.apache.org/maven2/org/codehaus/modello/modello-plugin-stax/1.9.1/modello-plugin-stax-1.9.1.pom (2.4 kB at 75 kB/s)
[INFO] Downloading from central: https://repo.maven.apache.org/maven2/org/codehaus/modello/modello-plugin-xdoc/1.9.1/modello-plugin-xdoc-1.9.1.pom
[INFO] Downloaded from central: https://repo.maven.apache.org/maven2/org/codehaus/modello/modello-plugin-xdoc/1.9.1/modello-plugin-xdoc-1.9.1.pom (1.6 kB at 48 kB/s)
[INFO] Downloading from central: https://repo.maven.apache.org/maven2/org/codehaus/modello/modello-plugin-xsd/1.9.1/modello-plugin-xsd-1.9.1.pom
[INFO] Downloaded from central: https://repo.maven.apache.org/maven2/org/codehaus/modello/modello-plugin-xsd/1.9.1/modello-plugin-xsd-1.9.1.pom (1.4 kB at 43 kB/s)
[INFO] Downloading from central: https://repo.maven.apache.org/maven2/org/jsoup/jsoup/1.10.2/jsoup-1.10.2.pom
[INFO] Downloaded from central: https://repo.maven.apache.org/maven2/org/jsoup/jsoup/1.10.2/jsoup-1.10.2.pom (7.3 kB at 214 kB/s)
[INFO] Downloading from central: https://repo.maven.apache.org/maven2/org/codehaus/modello/modello-plugin-xpp3/1.9.1/modello-plugin-xpp3-1.9.1.pom
[INFO] Downloaded from central: https://repo.maven.apache.org/maven2/org/codehaus/modello/modello-plugin-xpp3/1.9.1/modello-plugin-xpp3-1.9.1.pom (1.5 kB at 45 kB/s)
[INFO] Downloading from central: https://repo.maven.apache.org/maven2/org/codehaus/modello/modello-core/1.9.1/modello-core-1.9.1.jar
[INFO] Downloading from central: https://repo.maven.apache.org/maven2/org/codehaus/modello/modello-plugin-converters/1.9.1/modello-plugin-converters-1.9.1.jar
[INFO] Downloading from central: https://repo.maven.apache.org/maven2/org/apache/xbean/xbean-reflect/3.7/xbean-reflect-3.7.jar
[INFO] Downloading from central: https://repo.maven.apache.org/maven2/org/codehaus/plexus/plexus-utils/3.0.24/plexus-utils-3.0.24.jar
[INFO] Downloading from central: https://repo.maven.apache.org/maven2/org/codehaus/plexus/plexus-container-default/1.7/plexus-container-default-1.7.jar
[INFO] Downloaded from central: https://repo.maven.apache.org/maven2/org/apache/xbean/xbean-reflect/3.7/xbean-reflect-3.7.jar (148 kB at 3.0 MB/s)
[INFO] Downloading from central: https://repo.maven.apache.org/maven2/org/codehaus/modello/modello-plugin-dom4j/1.9.1/modello-plugin-dom4j-1.9.1.jar
[INFO] Downloaded from central: https://repo.maven.apache.org/maven2/org/codehaus/modello/modello-core/1.9.1/modello-core-1.9.1.jar (59 kB at 969 kB/s)
[INFO] Downloaded from central: https://repo.maven.apache.org/maven2/org/codehaus/plexus/plexus-utils/3.0.24/plexus-utils-3.0.24.jar (247 kB at 4.1 MB/s)
[INFO] Downloading from central: https://repo.maven.apache.org/maven2/org/codehaus/modello/modello-plugin-xml/1.9.1/modello-plugin-xml-1.9.1.jar
[INFO] Downloading from central: https://repo.maven.apache.org/maven2/org/codehaus/modello/modello-plugin-jackson/1.9.1/modello-plugin-jackson-1.9.1.jar
[INFO] Downloaded from central: https://repo.maven.apache.org/maven2/org/codehaus/plexus/plexus-container-default/1.7/plexus-container-default-1.7.jar (231 kB at 3.3 MB/s)
[INFO] Downloading from central: https://repo.maven.apache.org/maven2/com/fasterxml/jackson/core/jackson-core/2.1.5/jackson-core-2.1.5.jar
[INFO] Downloaded from central: https://repo.maven.apache.org/maven2/com/fasterxml/jackson/core/jackson-core/2.1.5/jackson-core-2.1.5.jar (207 kB at 1.8 MB/s)
[INFO] Downloading from central: https://repo.maven.apache.org/maven2/com/fasterxml/jackson/core/jackson-databind/2.1.5/jackson-databind-2.1.5.jar
[INFO] Downloaded from central: https://repo.maven.apache.org/maven2/org/codehaus/modello/modello-plugin-converters/1.9.1/modello-plugin-converters-1.9.1.jar (9.5 kB at 74 kB/s)
[INFO] Downloading from central: https://repo.maven.apache.org/maven2/com/fasterxml/jackson/core/jackson-annotations/2.1.5/jackson-annotations-2.1.5.jar
[INFO] Downloaded from central: https://repo.maven.apache.org/maven2/com/fasterxml/jackson/core/jackson-databind/2.1.5/jackson-databind-2.1.5.jar (927 kB at 5.2 MB/s)
[INFO] Downloading from central: https://repo.maven.apache.org/maven2/org/codehaus/modello/modello-plugin-java/1.9.1/modello-plugin-java-1.9.1.jar
[INFO] Downloaded from central: https://repo.maven.apache.org/maven2/org/codehaus/modello/modello-plugin-dom4j/1.9.1/modello-plugin-dom4j-1.9.1.jar (19 kB at 102 kB/s)
[INFO] Downloading from central: https://repo.maven.apache.org/maven2/org/codehaus/modello/modello-plugin-jdom/1.9.1/modello-plugin-jdom-1.9.1.jar
[INFO] Downloaded from central: https://repo.maven.apache.org/maven2/org/codehaus/modello/modello-plugin-jackson/1.9.1/modello-plugin-jackson-1.9.1.jar (19 kB at 95 kB/s)
[INFO] Downloading from central: https://repo.maven.apache.org/maven2/org/codehaus/modello/modello-plugin-jsonschema/1.9.1/modello-plugin-jsonschema-1.9.1.jar
[INFO] Downloaded from central: https://repo.maven.apache.org/maven2/org/codehaus/modello/modello-plugin-java/1.9.1/modello-plugin-java-1.9.1.jar (90 kB at 440 kB/s)
[INFO] Downloading from central: https://repo.maven.apache.org/maven2/org/codehaus/modello/modello-plugin-sax/1.9.1/modello-plugin-sax-1.9.1.jar
[INFO] Downloaded from central: https://repo.maven.apache.org/maven2/org/codehaus/modello/modello-plugin-xml/1.9.1/modello-plugin-xml-1.9.1.jar (15 kB at 65 kB/s)
[INFO] Downloading from central: https://repo.maven.apache.org/maven2/org/codehaus/modello/modello-plugin-snakeyaml/1.9.1/modello-plugin-snakeyaml-1.9.1.jar
[INFO] Downloaded from central: https://repo.maven.apache.org/maven2/org/codehaus/modello/modello-plugin-jsonschema/1.9.1/modello-plugin-jsonschema-1.9.1.jar (7.0 kB at 27 kB/s)
[INFO] Downloading from central: https://repo.maven.apache.org/maven2/org/yaml/snakeyaml/1.12/snakeyaml-1.12.jar
[INFO] Downloaded from central: https://repo.maven.apache.org/maven2/org/codehaus/modello/modello-plugin-sax/1.9.1/modello-plugin-sax-1.9.1.jar (11 kB at 38 kB/s)
[INFO] Downloading from central: https://repo.maven.apache.org/maven2/org/codehaus/modello/modello-plugin-stax/1.9.1/modello-plugin-stax-1.9.1.jar
[INFO] Downloaded from central: https://repo.maven.apache.org/maven2/org/yaml/snakeyaml/1.12/snakeyaml-1.12.jar (271 kB at 903 kB/s)
[INFO] Downloading from central: https://repo.maven.apache.org/maven2/org/codehaus/modello/modello-plugin-xdoc/1.9.1/modello-plugin-xdoc-1.9.1.jar
[INFO] Downloaded from central: https://repo.maven.apache.org/maven2/org/codehaus/modello/modello-plugin-jdom/1.9.1/modello-plugin-jdom-1.9.1.jar (14 kB at 46 kB/s)
[INFO] Downloading from central: https://repo.maven.apache.org/maven2/org/jsoup/jsoup/1.10.2/jsoup-1.10.2.jar
[INFO] Downloaded from central: https://repo.maven.apache.org/maven2/org/codehaus/modello/modello-plugin-snakeyaml/1.9.1/modello-plugin-snakeyaml-1.9.1.jar (21 kB at 58 kB/s)
[INFO] Downloading from central: https://repo.maven.apache.org/maven2/org/codehaus/modello/modello-plugin-xpp3/1.9.1/modello-plugin-xpp3-1.9.1.jar
[INFO] Downloaded from central: https://repo.maven.apache.org/maven2/com/fasterxml/jackson/core/jackson-annotations/2.1.5/jackson-annotations-2.1.5.jar (34 kB at 80 kB/s)
[INFO] Downloaded from central: https://repo.maven.apache.org/maven2/org/codehaus/modello/modello-plugin-xdoc/1.9.1/modello-plugin-xdoc-1.9.1.jar (15 kB at 35 kB/s)
[INFO] Downloading from central: https://repo.maven.apache.org/maven2/org/codehaus/modello/modello-plugin-xsd/1.9.1/modello-plugin-xsd-1.9.1.jar
[INFO] Downloading from central: https://repo.maven.apache.org/maven2/org/sonatype/plexus/plexus-build-api/0.0.7/plexus-build-api-0.0.7.jar
[INFO] Downloaded from central: https://repo.maven.apache.org/maven2/org/codehaus/modello/modello-plugin-stax/1.9.1/modello-plugin-stax-1.9.1.jar (38 kB at 86 kB/s)
[INFO] Downloaded from central: https://repo.maven.apache.org/maven2/org/jsoup/jsoup/1.10.2/jsoup-1.10.2.jar (351 kB at 735 kB/s)
[INFO] Downloaded from central: https://repo.maven.apache.org/maven2/org/sonatype/plexus/plexus-build-api/0.0.7/plexus-build-api-0.0.7.jar (8.5 kB at 15 kB/s)
[INFO] Downloaded from central: https://repo.maven.apache.org/maven2/org/codehaus/modello/modello-plugin-xsd/1.9.1/modello-plugin-xsd-1.9.1.jar (15 kB at 25 kB/s)
[INFO] Downloaded from central: https://repo.maven.apache.org/maven2/org/codehaus/modello/modello-plugin-xpp3/1.9.1/modello-plugin-xpp3-1.9.1.jar (26 kB at 45 kB/s)
[INFO] outputDirectory: F:\jenkins\jenkins-slave\workspace\-box_maven-release_MRELEASE-1007\m\maven-release-manager\target\generated-sources\modello
[INFO] Working on model: src/main/mdo/release-descriptor.mdo
[INFO] Generating current version: 3.0.0
[INFO]
[INFO] --- modello-maven-plugin:1.9.1:java (default) @ maven-release-manager ---
[INFO] outputDirectory: F:\jenkins\jenkins-slave\workspace\-box_maven-release_MRELEASE-1007\m\maven-release-manager\target\generated-sources\modello
[INFO] Working on model: src/main/mdo/release-descriptor.mdo
[INFO] Generating current version: 3.0.0
[INFO]
[INFO] --- modello-maven-plugin:1.9.1:xpp3-writer (default) @ maven-release-manager ---
[INFO] outputDirectory: F:\jenkins\jenkins-slave\workspace\-box_maven-release_MRELEASE-1007\m\maven-release-manager\target\generated-sources\modello
[INFO] Working on model: src/main/mdo/release-descriptor.mdo
[INFO] Generating current version: 3.0.0
[INFO]
[INFO] --- maven-remote-resources-plugin:1.5:process (default) @ maven-release-manager ---
[INFO] Downloading from Nexus: http://repository.apache.org/snapshots/org/apache/maven/scm/maven-scm-providers-git/1.9.6-SNAPSHOT/maven-scm-providers-git-1.9.6-20180402.205845-16.pom
[INFO] Downloaded from Nexus: http://repository.apache.org/snapshots/org/apache/maven/scm/maven-scm-providers-git/1.9.6-SNAPSHOT/maven-scm-providers-git-1.9.6-20180402.205845-16.pom (0 B at 0 B/s)
[INFO] Downloading from Nexus: http://repository.apache.org/snapshots/org/apache/maven/scm/maven-scm-providers/1.9.6-SNAPSHOT/maven-scm-providers-1.9.6-20180402.205653-16.pom
[INFO] Downloaded from Nexus: http://repository.apache.org/snapshots/org/apache/maven/scm/maven-scm-providers/1.9.6-SNAPSHOT/maven-scm-providers-1.9.6-20180402.205653-16.pom (0 B at 0 B/s)
[INFO] Downloading from Nexus: http://repository.apache.org/snapshots/org/apache/maven/scm/maven-scm/1.9.6-SNAPSHOT/maven-scm-1.9.6-20180402.205557-20.pom
[INFO] Downloaded from Nexus: http://repository.apache.org/snapshots/org/apache/maven/scm/maven-scm/1.9.6-SNAPSHOT/maven-scm-1.9.6-20180402.205557-20.pom (0 B at 0 B/s)
[INFO] Downloading from Nexus: http://repository.apache.org/snapshots/org/apache/maven/scm/maven-scm-providers-svn/1.9.6-SNAPSHOT/maven-scm-providers-svn-1.9.6-20180402.210047-16.pom
[INFO] Downloaded from Nexus: http://repository.apache.org/snapshots/org/apache/maven/scm/maven-scm-providers-svn/1.9.6-SNAPSHOT/maven-scm-providers-svn-1.9.6-20180402.210047-16.pom (0 B at 0 B/s)
[INFO] Downloading from Nexus: http://repository.apache.org/snapshots/org/apache/maven/scm/maven-scm-providers-cvs/1.9.6-SNAPSHOT/maven-scm-providers-cvs-1.9.6-20180402.205740-16.pom
[INFO] Downloaded from Nexus: http://repository.apache.org/snapshots/org/apache/maven/scm/maven-scm-providers-cvs/1.9.6-SNAPSHOT/maven-scm-providers-cvs-1.9.6-20180402.205740-16.pom (0 B at 0 B/s)
[INFO]
[INFO] --- maven-resources-plugin:2.7:resources (default-resources) @ maven-release-manager ---
[INFO] Using 'UTF-8' encoding to copy filtered resources.
[INFO] Copying 3 resources
[INFO] Copying 3 resources
[INFO]
[INFO] --- maven-compiler-plugin:3.2:compile (default-compile) @ maven-release-manager ---
[INFO] Changes detected - recompiling the module!
[INFO] Compiling 100 source files to F:\jenkins\jenkins-slave\workspace\-box_maven-release_MRELEASE-1007\m\maven-release-manager\target\classes
[INFO] /F:/jenkins/jenkins-slave/workspace/-box_maven-release_MRELEASE-1007/m/maven-release-manager/src/main/java/org/apache/maven/shared/release/phase/AbstractRewritePomsPhase.java: Some input files use or override a deprecated API.
[INFO] /F:/jenkins/jenkins-slave/workspace/-box_maven-release_MRELEASE-1007/m/maven-release-manager/src/main/java/org/apache/maven/shared/release/phase/AbstractRewritePomsPhase.java: Recompile with -Xlint:deprecation for details.
[INFO] /F:/jenkins/jenkins-slave/workspace/-box_maven-release_MRELEASE-1007/m/maven-release-manager/src/main/java/org/apache/maven/shared/release/transform/jdom/JDomModel.java: Some input files use unchecked or unsafe operations.
[INFO] /F:/jenkins/jenkins-slave/workspace/-box_maven-release_MRELEASE-1007/m/maven-release-manager/src/main/java/org/apache/maven/shared/release/transform/jdom/JDomModel.java: Recompile with -Xlint:unchecked for details.
[INFO]
[INFO] --- plexus-component-metadata:1.7.1:generate-metadata (default) @ maven-release-manager ---
[INFO] Downloading from central: https://repo.maven.apache.org/maven2/org/codehaus/plexus/plexus-container-default/1.7.1/plexus-container-default-1.7.1.pom
[INFO] Downloaded from central: https://repo.maven.apache.org/maven2/org/codehaus/plexus/plexus-container-default/1.7.1/plexus-container-default-1.7.1.pom (2.8 kB at 72 kB/s)
[INFO] Downloading from central: https://repo.maven.apache.org/maven2/org/codehaus/plexus/plexus-component-annotations/1.7.1/plexus-component-annotations-1.7.1.pom
[INFO] Downloaded from central: https://repo.maven.apache.org/maven2/org/codehaus/plexus/plexus-component-annotations/1.7.1/plexus-component-annotations-1.7.1.pom (770 B at 24 kB/s)
[INFO] Downloading from central: https://repo.maven.apache.org/maven2/com/thoughtworks/qdox/qdox/2.0-M2/qdox-2.0-M2.pom
[INFO] Downloaded from central: https://repo.maven.apache.org/maven2/com/thoughtworks/qdox/qdox/2.0-M2/qdox-2.0-M2.pom (18 kB at 499 kB/s)
[INFO] Downloading from central: https://repo.maven.apache.org/maven2/org/jdom/jdom2/2.0.6/jdom2-2.0.6.pom
[INFO] Downloaded from central: https://repo.maven.apache.org/maven2/org/jdom/jdom2/2.0.6/jdom2-2.0.6.pom (4.6 kB at 153 kB/s)
[INFO] Downloading from central: https://repo.maven.apache.org/maven2/org/codehaus/plexus/plexus-cli/1.6/plexus-cli-1.6.pom
[INFO] Downloaded from central: https://repo.maven.apache.org/maven2/org/codehaus/plexus/plexus-cli/1.6/plexus-cli-1.6.pom (1.4 kB at 39 kB/s)
[INFO] Downloading from central: https://repo.maven.apache.org/maven2/org/codehaus/plexus/plexus-components/1.1.20/plexus-components-1.1.20.pom
[INFO] Downloaded from central: https://repo.maven.apache.org/maven2/org/codehaus/plexus/plexus-components/1.1.20/plexus-components-1.1.20.pom (3.0 kB at 86 kB/s)
[INFO] Downloading from central: https://repo.maven.apache.org/maven2/org/codehaus/plexus/plexus/3.1/plexus-3.1.pom
[INFO] Downloaded from central: https://repo.maven.apache.org/maven2/org/codehaus/plexus/plexus/3.1/plexus-3.1.pom (19 kB at 454 kB/s)
[INFO] Downloading from central: https://repo.maven.apache.org/maven2/org/ow2/asm/asm-all/5.1/asm-all-5.1.pom
[INFO] Downloaded from central: https://repo.maven.apache.org/maven2/org/ow2/asm/asm-all/5.1/asm-all-5.1.pom (2.0 kB at 64 kB/s)
[INFO] Downloading from central: https://repo.maven.apache.org/maven2/org/ow2/asm/asm-parent/5.1/asm-parent-5.1.pom
[INFO] Downloaded from central: https://repo.maven.apache.org/maven2/org/ow2/asm/asm-parent/5.1/asm-parent-5.1.pom (5.5 kB at 183 kB/s)
[INFO] Downloading from central: https://repo.maven.apache.org/maven2/org/codehaus/plexus/plexus-component-annotations/1.7.1/plexus-component-annotations-1.7.1.jar
[INFO] Downloading from central: https://repo.maven.apache.org/maven2/org/codehaus/plexus/plexus-container-default/1.7.1/plexus-container-default-1.7.1.jar
[INFO] Downloading from central: https://repo.maven.apache.org/maven2/com/thoughtworks/qdox/qdox/2.0-M2/qdox-2.0-M2.jar
[INFO] Downloading from central: https://repo.maven.apache.org/maven2/org/codehaus/plexus/plexus-classworlds/2.5.1/plexus-classworlds-2.5.1.jar
[INFO] Downloading from central: https://repo.maven.apache.org/maven2/org/jdom/jdom2/2.0.6/jdom2-2.0.6.jar
[INFO] Downloaded from central: https://repo.maven.apache.org/maven2/com/thoughtworks/qdox/qdox/2.0-M2/qdox-2.0-M2.jar (292 kB at 3.6 MB/s)
[INFO] Downloading from central: https://repo.maven.apache.org/maven2/org/codehaus/plexus/plexus-cli/1.6/plexus-cli-1.6.jar
[INFO] Downloaded from central: https://repo.maven.apache.org/maven2/org/jdom/jdom2/2.0.6/jdom2-2.0.6.jar (305 kB at 3.9 MB/s)
[INFO] Downloading from central: https://repo.maven.apache.org/maven2/org/ow2/asm/asm-all/5.1/asm-all-5.1.jar
[INFO] Downloaded from central: https://repo.maven.apache.org/maven2/org/codehaus/plexus/plexus-container-default/1.7.1/plexus-container-default-1.7.1.jar (231 kB at 2.4 MB/s)
[INFO] Downloaded from central: https://repo.maven.apache.org/maven2/org/codehaus/plexus/plexus-component-annotations/1.7.1/plexus-component-annotations-1.7.1.jar (4.3 kB at 39 kB/s)
[INFO] Downloaded from central: https://repo.maven.apache.org/maven2/org/ow2/asm/asm-all/5.1/asm-all-5.1.jar (248 kB at 1.8 MB/s)
[INFO] Downloaded from central: https://repo.maven.apache.org/maven2/org/codehaus/plexus/plexus-cli/1.6/plexus-cli-1.6.jar (7.4 kB at 46 kB/s)
[INFO] Downloaded from central: https://repo.maven.apache.org/maven2/org/codehaus/plexus/plexus-classworlds/2.5.1/plexus-classworlds-2.5.1.jar (50 kB at 134 kB/s)
[INFO] Discovered 34 component descriptors(s)
[INFO]
[INFO] --- plexus-component-metadata:1.7.1:merge-metadata (merge) @ maven-release-manager ---
[INFO]
[INFO] --- maven-resources-plugin:2.7:testResources (default-testResources) @ maven-release-manager ---
[INFO] Using 'UTF-8' encoding to copy filtered resources.
[INFO] Copying 892 resources
[INFO] Copying 3 resources
[INFO]
[INFO] --- maven-compiler-plugin:3.2:testCompile (default-testCompile) @ maven-release-manager ---
[INFO] Changes detected - recompiling the module!
[INFO] Compiling 68 source files to F:\jenkins\jenkins-slave\workspace\-box_maven-release_MRELEASE-1007\m\maven-release-manager\target\test-classes
[INFO] /F:/jenkins/jenkins-slave/workspace/-box_maven-release_MRELEASE-1007/m/maven-release-manager/src/test/java/org/apache/maven/shared/release/phase/AbstractReleaseTestCase.java: Some input files use or override a deprecated API.
[INFO] /F:/jenkins/jenkins-slave/workspace/-box_maven-release_MRELEASE-1007/m/maven-release-manager/src/test/java/org/apache/maven/shared/release/phase/AbstractReleaseTestCase.java: Recompile with -Xlint:deprecation for details.
[INFO] -------------------------------------------------------------
[ERROR] COMPILATION ERROR :
[INFO] -------------------------------------------------------------
[ERROR] /F:/jenkins/jenkins-slave/workspace/-box_maven-release_MRELEASE-1007/m/maven-release-manager/src/test/java/org/apache/maven/shared/release/transform/jdom/JDomPropertiesTest.java:[108,35] reference to storeToXML is ambiguous
  both method storeToXML(java.io.OutputStream,java.lang.String,java.nio.charset.Charset) in java.util.Properties and method storeToXML(java.io.OutputStream,java.lang.String,java.lang.String) in org.apache.maven.shared.release.transform.jdom.JDomProperties match
[INFO] 1 error
[INFO] -------------------------------------------------------------
[INFO] ------------------------------------------------------------------------
[INFO] Reactor Summary for Maven Release 3.0.0-SNAPSHOT:
[INFO]
[INFO] Maven Release ...................................... SUCCESS [ 39.643 s]
[INFO] Maven Release APIs ................................. SUCCESS [  8.949 s]
[INFO] Maven Release Manager .............................. FAILURE [01:02 min]
[INFO] Maven Release Plugin ............................... SKIPPED
[INFO] Maven Release Odd-Even Policy ...................... SKIPPED
[INFO] Maven Release SemVer Policy ........................ SKIPPED
[INFO] ------------------------------------------------------------------------
[INFO] BUILD FAILURE
[INFO] ------------------------------------------------------------------------
[INFO] Total time:  01:51 min
[INFO] Finished at: 2019-10-26T03:55:30-07:00
[INFO] ------------------------------------------------------------------------
[INFO] [jenkins-event-spy] Generated F:\jenkins\jenkins-slave\workspace\-box_maven-release_MRELEASE-1007@tmp\withMavenbe467da5\maven-spy-20191026-035338-2234483540415498033220.log
[ERROR] Failed to execute goal org.apache.maven.plugins:maven-compiler-plugin:3.2:testCompile (default-testCompile) on project maven-release-manager: Compilation failure
[ERROR] /F:/jenkins/jenkins-slave/workspace/-box_maven-release_MRELEASE-1007/m/maven-release-manager/src/test/java/org/apache/maven/shared/release/transform/jdom/JDomPropertiesTest.java:[108,35] reference to storeToXML is ambiguous
[ERROR]   both method storeToXML(java.io.OutputStream,java.lang.String,java.nio.charset.Charset) in java.util.Properties and method storeToXML(java.io.OutputStream,java.lang.String,java.lang.String) in org.apache.maven.shared.release.transform.jdom.JDomProperties match
[ERROR] -> [Help 1]
[ERROR]
[ERROR] To see the full stack trace of the errors, re-run Maven with the -e switch.
[ERROR] Re-run Maven using the -X switch to enable full debug logging.
[ERROR]
[ERROR] For more information about the errors and possible solutions, please read the following articles:
[ERROR] [Help 1] http://cwiki.apache.org/confluence/display/MAVEN/MojoFailureException
[ERROR]
[ERROR] After correcting the problems, you can resume the build with the command
[ERROR]   mvn <args> -rf :maven-release-manager
[Pipeline] }
[Pipeline] // dir
[Pipeline] }
[withMaven] junitPublisher - Archive test results for Maven artifact org.apache.maven.release:maven-release-api:jar:3.0.0-SNAPSHOT generated by maven-surefire-plugin:test (default-test): m\maven-release-api\target\surefire-reports\*.xml
Recording test results
None of the test reports contained any result
[withMaven] Publishers: Pipeline Graph Publisher: 2 ms, Junit Publisher: 100 ms, Dependencies Fingerprint Publisher: 46 ms
[Pipeline] // withMaven
[Pipeline] echo
[FAILURE-004] hudson.AbortException: script returned exit code 1
[Pipeline] cleanWs
[WS-CLEANUP] Deleting project workspace...
[WS-CLEANUP] Deferred wipeout is used...
[WS-CLEANUP] done
[Pipeline] cleanWs
[WS-CLEANUP] Deleting project workspace...
[WS-CLEANUP] Deferred wipeout is used...
[WS-CLEANUP] done
[Pipeline] }
[Pipeline] // stage
[Pipeline] }
[Pipeline] // node
[Pipeline] }
Failed in branch windows-jdk14
[Pipeline] // parallel
[Pipeline] echo
[FAILURE-003] AbortException hudson.AbortException: script returned exit code 1
[Pipeline] stage
[Pipeline] { (Notifications)
[Pipeline] echo
Build result: FAILURE
[Pipeline] jiraIssueSelector
[Pipeline] echo
The authors of changes [rfscholte].
[Pipeline] echo
Sending email ...
[Pipeline] emailext
Reply | Threaded
Open this post in threaded view
|

Build failed in Jenkins: Maven TLP » maven-release » MRELEASE-1007 #15

Apache Jenkins Server-2
See https://builds.apache.org/job/maven-box/job/maven-release/job/MRELEASE-1007/15/

Changes:

* H31 gives OOME (let's see if others are stable again...)
* echo NODE_NAME

All tests passed

Build log:
[...truncated 28006 lines...]
[INFO] -------------------------------------------------
[INFO] Build Summary:
[INFO]   Passed: 4, Failed: 0, Errors: 0, Skipped: 0
[INFO] -------------------------------------------------
[INFO]
[INFO] --- maven-checkstyle-plugin:2.15:check (checkstyle-check) @ maven-release-plugin ---
[INFO]
[INFO] -------< org.apache.maven.release:maven-release-oddeven-policy >--------
[INFO] Building Maven Release Odd-Even Policy 3.0.0-SNAPSHOT              [5/6]
[INFO] --------------------------------[ jar ]---------------------------------
[INFO]
[INFO] --- maven-clean-plugin:2.5:clean (default-clean) @ maven-release-oddeven-policy ---
[INFO]
[INFO] --- maven-enforcer-plugin:1.3.1:enforce (enforce-bytecode-version) @ maven-release-oddeven-policy ---
[INFO]
[INFO] --- maven-enforcer-plugin:1.3.1:enforce (ban-known-bad-maven-versions) @ maven-release-oddeven-policy ---
[INFO]
[INFO] --- apache-rat-plugin:0.11:check (rat-check) @ maven-release-oddeven-policy ---
[INFO] 51 implicit excludes (use -debug for more details).
[INFO] Exclude: .repository
[INFO] Exclude: Jenkinsfile
[INFO] Exclude: DEPENDENCIES
[INFO] 4 resources included (use -debug for more details)
[INFO] Rat check: Summary of files. Unapproved: 0 unknown: 0 generated: 0 approved: 4 licence.
[INFO]
[INFO] --- maven-remote-resources-plugin:1.5:process (default) @ maven-release-oddeven-policy ---
[INFO]
[INFO] --- maven-resources-plugin:2.7:resources (default-resources) @ maven-release-oddeven-policy ---
[INFO] Using 'UTF-8' encoding to copy filtered resources.
[INFO] skip non existing resourceDirectory /home/jenkins/jenkins-slave/workspace/_box_maven-release_MRELEASE-1007/m/maven-release-policies/maven-release-oddeven-policy/src/main/resources
[INFO] Copying 3 resources
[INFO]
[INFO] --- maven-compiler-plugin:3.2:compile (default-compile) @ maven-release-oddeven-policy ---
[INFO] Changes detected - recompiling the module!
[INFO] Compiling 2 source files to /home/jenkins/jenkins-slave/workspace/_box_maven-release_MRELEASE-1007/m/maven-release-policies/maven-release-oddeven-policy/target/classes
[INFO]
[INFO] --- plexus-component-metadata:1.7.1:generate-metadata (process-classes) @ maven-release-oddeven-policy ---
[INFO] Discovered 1 component descriptors(s)
[INFO]
[INFO] --- maven-resources-plugin:2.7:testResources (default-testResources) @ maven-release-oddeven-policy ---
[INFO] Using 'UTF-8' encoding to copy filtered resources.
[INFO] skip non existing resourceDirectory /home/jenkins/jenkins-slave/workspace/_box_maven-release_MRELEASE-1007/m/maven-release-policies/maven-release-oddeven-policy/src/test/resources
[INFO] Copying 3 resources
[INFO]
[INFO] --- maven-compiler-plugin:3.2:testCompile (default-testCompile) @ maven-release-oddeven-policy ---
[INFO] Changes detected - recompiling the module!
[INFO] Compiling 1 source file to /home/jenkins/jenkins-slave/workspace/_box_maven-release_MRELEASE-1007/m/maven-release-policies/maven-release-oddeven-policy/target/test-classes
[INFO]
[INFO] --- maven-surefire-plugin:2.20.1:test (default-test) @ maven-release-oddeven-policy ---
[INFO]
[INFO] -------------------------------------------------------
[INFO]  T E S T S
[INFO] -------------------------------------------------------
[INFO] Running org.apache.maven.shared.release.policy.oddeven.OddEvenVersionPolicyTestCase
[INFO] Tests run: 3, Failures: 0, Errors: 0, Skipped: 0, Time elapsed: 0.118 s - in org.apache.maven.shared.release.policy.oddeven.OddEvenVersionPolicyTestCase
[INFO]
[INFO] Results:
[INFO]
[INFO] Tests run: 3, Failures: 0, Errors: 0, Skipped: 0
[INFO]
[INFO]
[INFO] --- maven-jar-plugin:2.5:jar (default-jar) @ maven-release-oddeven-policy ---
[INFO] Building jar: /home/jenkins/jenkins-slave/workspace/_box_maven-release_MRELEASE-1007/m/maven-release-policies/maven-release-oddeven-policy/target/maven-release-oddeven-policy-3.0.0-SNAPSHOT.jar
[INFO]
[INFO] --- maven-site-plugin:3.4:attach-descriptor (attach-descriptor) @ maven-release-oddeven-policy ---
[INFO]
[INFO] --- maven-checkstyle-plugin:2.15:check (checkstyle-check) @ maven-release-oddeven-policy ---
[INFO]
[INFO] --------< org.apache.maven.release:maven-release-semver-policy >--------
[INFO] Building Maven Release SemVer Policy 3.0.0-SNAPSHOT                [6/6]
[INFO] --------------------------------[ jar ]---------------------------------
[INFO] Downloading from central: https://repo.maven.apache.org/maven2/org/semver/api/0.9.33/api-0.9.33.pom
[INFO] Downloaded from central: https://repo.maven.apache.org/maven2/org/semver/api/0.9.33/api-0.9.33.pom (2.8 kB at 51 kB/s)
[INFO] Downloading from central: https://repo.maven.apache.org/maven2/org/semver/parent/0.9.33/parent-0.9.33.pom
[INFO] Downloaded from central: https://repo.maven.apache.org/maven2/org/semver/parent/0.9.33/parent-0.9.33.pom (1.3 kB at 84 kB/s)
[INFO] Downloading from central: https://repo.maven.apache.org/maven2/com/github/jeluard/oss-parent/9/oss-parent-9.pom
[INFO] Downloaded from central: https://repo.maven.apache.org/maven2/com/github/jeluard/oss-parent/9/oss-parent-9.pom (12 kB at 831 kB/s)
[INFO] Downloading from central: https://repo.maven.apache.org/maven2/com/google/code/findbugs/jsr305/2.0.0/jsr305-2.0.0.pom
[INFO] Downloaded from central: https://repo.maven.apache.org/maven2/com/google/code/findbugs/jsr305/2.0.0/jsr305-2.0.0.pom (965 B at 69 kB/s)
[INFO] Downloading from central: https://repo.maven.apache.org/maven2/org/ow2/asm/asm/5.0.3/asm-5.0.3.pom
[INFO] Downloaded from central: https://repo.maven.apache.org/maven2/org/ow2/asm/asm/5.0.3/asm-5.0.3.pom (1.9 kB at 149 kB/s)
[INFO] Downloading from central: https://repo.maven.apache.org/maven2/org/ow2/asm/asm-parent/5.0.3/asm-parent-5.0.3.pom
[INFO] Downloaded from central: https://repo.maven.apache.org/maven2/org/ow2/asm/asm-parent/5.0.3/asm-parent-5.0.3.pom (5.5 kB at 392 kB/s)
[INFO] Downloading from central: https://repo.maven.apache.org/maven2/org/ow2/asm/asm-commons/5.0.3/asm-commons-5.0.3.pom
[INFO] Downloaded from central: https://repo.maven.apache.org/maven2/org/ow2/asm/asm-commons/5.0.3/asm-commons-5.0.3.pom (2.1 kB at 150 kB/s)
[INFO] Downloading from central: https://repo.maven.apache.org/maven2/org/ow2/asm/asm-tree/5.0.3/asm-tree-5.0.3.pom
[INFO] Downloaded from central: https://repo.maven.apache.org/maven2/org/ow2/asm/asm-tree/5.0.3/asm-tree-5.0.3.pom (2.1 kB at 149 kB/s)
[INFO] Downloading from central: https://repo.maven.apache.org/maven2/commons-lang/commons-lang/1.0/commons-lang-1.0.pom
[INFO] Downloaded from central: https://repo.maven.apache.org/maven2/commons-lang/commons-lang/1.0/commons-lang-1.0.pom (2.5 kB at 164 kB/s)
[INFO] Downloading from central: https://repo.maven.apache.org/maven2/de/tototec/de.tototec.cmdoption/0.2.0/de.tototec.cmdoption-0.2.0.pom
[INFO] Downloaded from central: https://repo.maven.apache.org/maven2/de/tototec/de.tototec.cmdoption/0.2.0/de.tototec.cmdoption-0.2.0.pom (956 B at 64 kB/s)
[INFO] Downloading from central: https://repo.maven.apache.org/maven2/org/semver/api/0.9.33/api-0.9.33.jar
[INFO] Downloading from central: https://repo.maven.apache.org/maven2/org/ow2/asm/asm-commons/5.0.3/asm-commons-5.0.3.jar
[INFO] Downloading from central: https://repo.maven.apache.org/maven2/org/ow2/asm/asm/5.0.3/asm-5.0.3.jar
[INFO] Downloading from central: https://repo.maven.apache.org/maven2/com/google/code/findbugs/jsr305/2.0.0/jsr305-2.0.0.jar
[INFO] Downloading from central: https://repo.maven.apache.org/maven2/org/ow2/asm/asm-tree/5.0.3/asm-tree-5.0.3.jar
[INFO] Downloaded from central: https://repo.maven.apache.org/maven2/org/semver/api/0.9.33/api-0.9.33.jar (64 kB at 2.5 MB/s)
[INFO] Downloading from central: https://repo.maven.apache.org/maven2/commons-lang/commons-lang/1.0/commons-lang-1.0.jar
[INFO] Downloaded from central: https://repo.maven.apache.org/maven2/org/ow2/asm/asm-commons/5.0.3/asm-commons-5.0.3.jar (42 kB at 1.1 MB/s)
[INFO] Downloading from central: https://repo.maven.apache.org/maven2/de/tototec/de.tototec.cmdoption/0.2.0/de.tototec.cmdoption-0.2.0.jar
[INFO] Downloaded from central: https://repo.maven.apache.org/maven2/org/ow2/asm/asm-tree/5.0.3/asm-tree-5.0.3.jar (29 kB at 726 kB/s)
[INFO] Downloaded from central: https://repo.maven.apache.org/maven2/com/google/code/findbugs/jsr305/2.0.0/jsr305-2.0.0.jar (32 kB at 759 kB/s)
[INFO] Downloaded from central: https://repo.maven.apache.org/maven2/org/ow2/asm/asm/5.0.3/asm-5.0.3.jar (53 kB at 1.2 MB/s)
[INFO] Downloaded from central: https://repo.maven.apache.org/maven2/commons-lang/commons-lang/1.0/commons-lang-1.0.jar (64 kB at 1.4 MB/s)
[INFO] Downloaded from central: https://repo.maven.apache.org/maven2/de/tototec/de.tototec.cmdoption/0.2.0/de.tototec.cmdoption-0.2.0.jar (42 kB at 726 kB/s)
[INFO]
[INFO] --- maven-clean-plugin:2.5:clean (default-clean) @ maven-release-semver-policy ---
[INFO]
[INFO] --- maven-enforcer-plugin:1.3.1:enforce (enforce-bytecode-version) @ maven-release-semver-policy ---
[INFO]
[INFO] --- maven-enforcer-plugin:1.3.1:enforce (ban-known-bad-maven-versions) @ maven-release-semver-policy ---
[INFO]
[INFO] --- apache-rat-plugin:0.11:check (rat-check) @ maven-release-semver-policy ---
[INFO] 51 implicit excludes (use -debug for more details).
[INFO] Exclude: .repository
[INFO] Exclude: Jenkinsfile
[INFO] Exclude: DEPENDENCIES
[INFO] 3 resources included (use -debug for more details)
[INFO] Rat check: Summary of files. Unapproved: 0 unknown: 0 generated: 0 approved: 3 licence.
[INFO]
[INFO] --- maven-remote-resources-plugin:1.5:process (default) @ maven-release-semver-policy ---
[INFO]
[INFO] --- maven-resources-plugin:2.7:resources (default-resources) @ maven-release-semver-policy ---
[INFO] Using 'UTF-8' encoding to copy filtered resources.
[INFO] skip non existing resourceDirectory /home/jenkins/jenkins-slave/workspace/_box_maven-release_MRELEASE-1007/m/maven-release-policies/maven-release-semver-policy/src/main/resources
[INFO] Copying 3 resources
[INFO]
[INFO] --- maven-compiler-plugin:3.2:compile (default-compile) @ maven-release-semver-policy ---
[INFO] Changes detected - recompiling the module!
[INFO] Compiling 1 source file to /home/jenkins/jenkins-slave/workspace/_box_maven-release_MRELEASE-1007/m/maven-release-policies/maven-release-semver-policy/target/classes
[INFO]
[INFO] --- plexus-component-metadata:1.7.1:generate-metadata (process-classes) @ maven-release-semver-policy ---
[INFO] Discovered 1 component descriptors(s)
[INFO]
[INFO] --- maven-resources-plugin:2.7:testResources (default-testResources) @ maven-release-semver-policy ---
[INFO] Using 'UTF-8' encoding to copy filtered resources.
[INFO] skip non existing resourceDirectory /home/jenkins/jenkins-slave/workspace/_box_maven-release_MRELEASE-1007/m/maven-release-policies/maven-release-semver-policy/src/test/resources
[INFO] Copying 3 resources
[INFO]
[INFO] --- maven-compiler-plugin:3.2:testCompile (default-testCompile) @ maven-release-semver-policy ---
[INFO] Changes detected - recompiling the module!
[INFO] Compiling 1 source file to /home/jenkins/jenkins-slave/workspace/_box_maven-release_MRELEASE-1007/m/maven-release-policies/maven-release-semver-policy/target/test-classes
[INFO]
[INFO] --- maven-surefire-plugin:2.20.1:test (default-test) @ maven-release-semver-policy ---
[INFO]
[INFO] -------------------------------------------------------
[INFO]  T E S T S
[INFO] -------------------------------------------------------
[INFO] Running org.apache.maven.shared.release.policy.semver.SemVerVersionPolicyTest
[INFO] Tests run: 2, Failures: 0, Errors: 0, Skipped: 0, Time elapsed: 0.1 s - in org.apache.maven.shared.release.policy.semver.SemVerVersionPolicyTest
[INFO]
[INFO] Results:
[INFO]
[INFO] Tests run: 2, Failures: 0, Errors: 0, Skipped: 0
[INFO]
[INFO]
[INFO] --- maven-jar-plugin:2.5:jar (default-jar) @ maven-release-semver-policy ---
[INFO] Building jar: /home/jenkins/jenkins-slave/workspace/_box_maven-release_MRELEASE-1007/m/maven-release-policies/maven-release-semver-policy/target/maven-release-semver-policy-3.0.0-SNAPSHOT.jar
[INFO]
[INFO] --- maven-site-plugin:3.4:attach-descriptor (attach-descriptor) @ maven-release-semver-policy ---
[INFO]
[INFO] --- maven-checkstyle-plugin:2.15:check (checkstyle-check) @ maven-release-semver-policy ---
[INFO] ------------------------------------------------------------------------
[INFO] Reactor Summary for Maven Release 3.0.0-SNAPSHOT:
[INFO]
[INFO] Maven Release ...................................... SUCCESS [ 15.113 s]
[INFO] Maven Release APIs ................................. SUCCESS [  5.407 s]
[INFO] Maven Release Manager .............................. SUCCESS [01:44 min]
[INFO] Maven Release Plugin ............................... SUCCESS [05:39 min]
[INFO] Maven Release Odd-Even Policy ...................... SUCCESS [  1.686 s]
[INFO] Maven Release SemVer Policy ........................ SUCCESS [  2.317 s]
[INFO] ------------------------------------------------------------------------
[INFO] BUILD SUCCESS
[INFO] ------------------------------------------------------------------------
[INFO] Total time:  07:50 min
[INFO] Finished at: 2019-11-27T07:33:05Z
[INFO] ------------------------------------------------------------------------
[INFO] [jenkins-event-spy] Generated /home/jenkins/jenkins-slave/workspace/_box_maven-release_MRELEASE-1007@tmp/withMaven3dd9eaa8/maven-spy-20191127-072514-2678867492167096906695.log
[Pipeline] }
[Pipeline] // dir
[Pipeline] }
[withMaven] invokerPublisher - Archive invoker results for Maven artifact MavenArtifact{org.apache.maven.plugins:maven-release-plugin:maven-plugin:3.0.0-SNAPSHOT(version: 3.0.0-SNAPSHOT, snapshot:false) } generated by PluginInvocation{org.apache.maven.plugins:maven-invoker-plugin:2.0.0@run  integration-test-prepare}: m/maven-release-plugin/target/invoker-reports/*.xml
[withMaven] invokerPublisher - Archive invoker results for Maven artifact MavenArtifact{org.apache.maven.plugins:maven-release-plugin:maven-plugin:3.0.0-SNAPSHOT(version: 3.0.0-SNAPSHOT, snapshot:false) } generated by PluginInvocation{org.apache.maven.plugins:maven-invoker-plugin:2.0.0@run  integration-test-update-versions}: m/maven-release-plugin/target/invoker-reports/*.xml
[withMaven] junitPublisher - Archive test results for Maven artifact org.apache.maven.release:maven-release-api:jar:3.0.0-SNAPSHOT generated by maven-surefire-plugin:test (default-test): m/maven-release-api/target/surefire-reports/*.xml
[withMaven] junitPublisher - Archive test results for Maven artifact org.apache.maven.release:maven-release-manager:jar:3.0.0-SNAPSHOT generated by maven-surefire-plugin:test (default-test): m/maven-release-manager/target/surefire-reports/*.xml
[withMaven] junitPublisher - Archive test results for Maven artifact org.apache.maven.plugins:maven-release-plugin:maven-plugin:3.0.0-SNAPSHOT generated by maven-surefire-plugin:test (default-test): m/maven-release-plugin/target/surefire-reports/*.xml
[withMaven] junitPublisher - Archive test results for Maven artifact org.apache.maven.release:maven-release-oddeven-policy:jar:3.0.0-SNAPSHOT generated by maven-surefire-plugin:test (default-test): m/maven-release-policies/maven-release-oddeven-policy/target/surefire-reports/*.xml
[withMaven] junitPublisher - Archive test results for Maven artifact org.apache.maven.release:maven-release-semver-policy:jar:3.0.0-SNAPSHOT generated by maven-surefire-plugin:test (default-test): m/maven-release-policies/maven-release-semver-policy/target/surefire-reports/*.xml
Recording test results
[withMaven] junitPublisher - Archive test results for Maven artifact org.apache.maven.release:maven-release-manager:jar:3.0.0-SNAPSHOT generated by maven-failsafe-plugin:integration-test (default): m/maven-release-manager/target/failsafe-reports/*.xml
Recording test results
[withMaven] invokerPublisher - Archive invoker results for Maven artifact MavenArtifact{org.apache.maven.plugins:maven-release-plugin:maven-plugin:3.0.0-SNAPSHOT(version: 3.0.0-SNAPSHOT, snapshot:false) } generated by PluginInvocation{org.apache.maven.plugins:maven-invoker-plugin:2.0.0@run  integration-test-prepare-with-pom}: m/maven-release-plugin/target/invoker-reports/*.xml
[withMaven] openTasksPublisher - Scan Tasks for Maven artifact org.apache.maven.release:maven-release-api:jar:3.0.0-SNAPSHOT in source directory m/maven-release-api/src/main/java
[withMaven] openTasksPublisher - Scan Tasks for Maven artifact org.apache.maven.release:maven-release-manager:jar:3.0.0-SNAPSHOT in source directory m/maven-release-manager/src/main/java
[withMaven] openTasksPublisher - Scan Tasks for Maven artifact org.apache.maven.plugins:maven-release-plugin:maven-plugin:3.0.0-SNAPSHOT in source directory m/maven-release-plugin/src/main/java
[withMaven] openTasksPublisher - Scan Tasks for Maven artifact org.apache.maven.release:maven-release-oddeven-policy:jar:3.0.0-SNAPSHOT in source directory m/maven-release-policies/maven-release-oddeven-policy/src/main/java
[withMaven] openTasksPublisher - Scan Tasks for Maven artifact org.apache.maven.release:maven-release-semver-policy:jar:3.0.0-SNAPSHOT in source directory m/maven-release-policies/maven-release-semver-policy/src/main/java
[TASKS] Scanning folder '/home/jenkins/jenkins-slave/workspace/_box_maven-release_MRELEASE-1007' for files matching the pattern 'm/maven-release-api/src/main/java/**/*,m/maven-release-manager/src/main/java/**/*,m/maven-release-plugin/src/main/java/**/*,m/maven-release-policies/maven-release-oddeven-policy/src/main/java/**/*,m/maven-release-policies/maven-release-semver-policy/src/main/java/**/*' - excludes: null
[TASKS] Found 130 files to scan for tasks
[TASKS] Found 21 open tasks.
Skipping warnings blame since pipelines do not have an SCM link.%n
[withMaven] Publishers: Pipeline Graph Publisher: 7 ms, Generated Artifacts Publisher: 5068 ms, Invoker Publisher: 191794 ms, Junit Publisher: 28570 ms, Dependencies Fingerprint Publisher: 2904 ms, Open Task Scanner Publisher: 3583 ms
[withMaven] One or multiple Maven executions have been ignored by the Jenkins Pipeline Maven Plugin because they have been interrupted before completion (1). See Pipeline Maven Plugin FAQ for more details.
[Pipeline] // withMaven
[Pipeline] cleanWs
[WS-CLEANUP] Deleting project workspace...
[WS-CLEANUP] Deferred wipeout is used...
[WS-CLEANUP] done
[Pipeline] }
[Pipeline] // stage
[Pipeline] }
[Pipeline] // node
[Pipeline] }
[withMaven] invokerPublisher - Archive invoker results for Maven artifact MavenArtifact{org.apache.maven.plugins:maven-release-plugin:maven-plugin:3.0.0-SNAPSHOT(version: 3.0.0-SNAPSHOT, snapshot:false) } generated by PluginInvocation{org.apache.maven.plugins:maven-invoker-plugin:2.0.0@run  integration-test-branch}: m/maven-release-plugin/target/invoker-reports/*.xml
[withMaven] invokerPublisher - Archive invoker results for Maven artifact MavenArtifact{org.apache.maven.plugins:maven-release-plugin:maven-plugin:3.0.0-SNAPSHOT(version: 3.0.0-SNAPSHOT, snapshot:false) } generated by PluginInvocation{org.apache.maven.plugins:maven-invoker-plugin:2.0.0@run  integration-test-perform}: m/maven-release-plugin/target/invoker-reports/*.xml
[withMaven] invokerPublisher - Archive invoker results for Maven artifact MavenArtifact{org.apache.maven.plugins:maven-release-plugin:maven-plugin:3.0.0-SNAPSHOT(version: 3.0.0-SNAPSHOT, snapshot:false) } generated by PluginInvocation{org.apache.maven.plugins:maven-invoker-plugin:2.0.0@run  integration-test-update-versions}: m/maven-release-plugin/target/invoker-reports/*.xml
[withMaven] junitPublisher - Archive test results for Maven artifact org.apache.maven.release:maven-release-api:jar:3.0.0-SNAPSHOT generated by maven-surefire-plugin:test (default-test): m/maven-release-api/target/surefire-reports/*.xml
[withMaven] junitPublisher - Archive test results for Maven artifact org.apache.maven.release:maven-release-manager:jar:3.0.0-SNAPSHOT generated by maven-surefire-plugin:test (default-test): m/maven-release-manager/target/surefire-reports/*.xml
[withMaven] junitPublisher - Archive test results for Maven artifact org.apache.maven.plugins:maven-release-plugin:maven-plugin:3.0.0-SNAPSHOT generated by maven-surefire-plugin:test (default-test): m/maven-release-plugin/target/surefire-reports/*.xml
[withMaven] junitPublisher - Archive test results for Maven artifact org.apache.maven.release:maven-release-oddeven-policy:jar:3.0.0-SNAPSHOT generated by maven-surefire-plugin:test (default-test): m/maven-release-policies/maven-release-oddeven-policy/target/surefire-reports/*.xml
[withMaven] junitPublisher - Archive test results for Maven artifact org.apache.maven.release:maven-release-semver-policy:jar:3.0.0-SNAPSHOT generated by maven-surefire-plugin:test (default-test): m/maven-release-policies/maven-release-semver-policy/target/surefire-reports/*.xml
Recording test results
[withMaven] junitPublisher - Archive test results for Maven artifact org.apache.maven.release:maven-release-manager:jar:3.0.0-SNAPSHOT generated by maven-failsafe-plugin:integration-test (default): m/maven-release-manager/target/failsafe-reports/*.xml
Recording test results
[withMaven] Publishers: Pipeline Graph Publisher: 7 ms, Invoker Publisher: 375617 ms, Junit Publisher: 33247 ms, Dependencies Fingerprint Publisher: 3666 ms
[withMaven] One or multiple Maven executions have been ignored by the Jenkins Pipeline Maven Plugin because they have been interrupted before completion (1). See Pipeline Maven Plugin FAQ for more details.
[Pipeline] // withMaven
[Pipeline] cleanWs
[WS-CLEANUP] Deleting project workspace...
[WS-CLEANUP] Deferred wipeout is used...
[WS-CLEANUP] done
[Pipeline] }
[Pipeline] // stage
[Pipeline] }
[Pipeline] // node
[Pipeline] }
[Pipeline] // parallel
[Pipeline] echo
[FAILURE-003] AbortException hudson.AbortException: script returned exit code 1
[Pipeline] stage
[Pipeline] { (Notifications)
[Pipeline] echo
Build result: FAILURE
[Pipeline] jiraIssueSelector
[Pipeline] echo
The authors of changes [rfscholte, hboutemy].
[Pipeline] echo
Sending email ...
[Pipeline] emailext