Build failed in Jenkins: Maven TLP » maven-release » MRELEASE-1007 #1

classic Classic list List threaded Threaded
9 messages Options
Reply | Threaded
Open this post in threaded view
|

Build failed in Jenkins: Maven TLP » maven-release » MRELEASE-1007 #1

Apache Jenkins Server-2
See https://builds.apache.org/job/maven-box/job/maven-release/job/MRELEASE-1007/1/

No changes.

All tests passed

Build log:
[...truncated 19429 lines...]
[INFO] Building: projects\perform\MRELEASE-592\pom.xml
[INFO] ..SUCCESS (13.1 s)
[INFO] Building: projects\perform\MRELEASE-736\pom.xml
[INFO] ..SUCCESS (14.9 s)
[INFO] Building: projects\perform\MRELEASE-818\pom.xml
[INFO] run script verify.groovy
[INFO] ..SUCCESS (13.8 s)
[INFO] Building: projects\perform\MRELEASE-832\pom.xml
[INFO] run script verify.groovy
[INFO] ..SUCCESS (5.7 s)
[INFO] -------------------------------------------------
[INFO] Build Summary:
[INFO]   Passed: 5, Failed: 0, Errors: 0, Skipped: 0
[INFO] -------------------------------------------------
[INFO]
[INFO] --- maven-invoker-plugin:2.0.0:run (integration-test-update-versions) @ maven-release-plugin ---
[INFO] Building: projects\update-versions\MRELEASE-555\pom.xml
[INFO] run script verify.groovy
[INFO] ..SUCCESS (6.6 s)
[INFO] Building: projects\update-versions\MRELEASE-611\pom.xml
[INFO] run script verify.groovy
[INFO] ..SUCCESS (6.2 s)
[INFO] Building: projects\update-versions\MRELEASE-783\pom.xml
[INFO] ..SUCCESS (5.8 s)
[INFO] Building: projects\update-versions\MRELEASE-976\pom.xml
[INFO] run script verify.groovy
[INFO] ..SUCCESS (6.1 s)
[INFO] -------------------------------------------------
[INFO] Build Summary:
[INFO]   Passed: 4, Failed: 0, Errors: 0, Skipped: 0
[INFO] -------------------------------------------------
[INFO]
[INFO] --- maven-checkstyle-plugin:2.15:check (checkstyle-check) @ maven-release-plugin ---
[INFO]
[INFO] ------------------------------------------------------------------------
[INFO] Building Maven Release Odd-Even Policy 3.0.0-SNAPSHOT
[INFO] ------------------------------------------------------------------------
[INFO]
[INFO] --- maven-clean-plugin:2.5:clean (default-clean) @ maven-release-oddeven-policy ---
[INFO]
[INFO] --- maven-enforcer-plugin:1.3.1:enforce (enforce-bytecode-version) @ maven-release-oddeven-policy ---
[INFO]
[INFO] --- maven-enforcer-plugin:1.3.1:enforce (ban-known-bad-maven-versions) @ maven-release-oddeven-policy ---
[INFO]
[INFO] --- apache-rat-plugin:0.11:check (rat-check) @ maven-release-oddeven-policy ---
[INFO] 51 implicit excludes (use -debug for more details).
[INFO] Exclude: .repository
[INFO] Exclude: Jenkinsfile
[INFO] Exclude: DEPENDENCIES
[INFO] 4 resources included (use -debug for more details)
[INFO] Rat check: Summary of files. Unapproved: 0 unknown: 0 generated: 0 approved: 4 licence.
[INFO]
[INFO] --- maven-remote-resources-plugin:1.5:process (default) @ maven-release-oddeven-policy ---
[INFO]
[INFO] --- maven-resources-plugin:2.7:resources (default-resources) @ maven-release-oddeven-policy ---
[INFO] Using 'UTF-8' encoding to copy filtered resources.
[INFO] skip non existing resourceDirectory F:\jenkins\jenkins-slave\workspace\-box_maven-release_MRELEASE-1007\m\maven-release-policies\maven-release-oddeven-policy\src\main\resources
[INFO] Copying 3 resources
[INFO]
[INFO] --- maven-compiler-plugin:3.2:compile (default-compile) @ maven-release-oddeven-policy ---
[INFO] Changes detected - recompiling the module!
[INFO] Compiling 2 source files to F:\jenkins\jenkins-slave\workspace\-box_maven-release_MRELEASE-1007\m\maven-release-policies\maven-release-oddeven-policy\target\classes
[INFO]
[INFO] --- plexus-component-metadata:1.7.1:generate-metadata (process-classes) @ maven-release-oddeven-policy ---
[INFO] Discovered 1 component descriptors(s)
[INFO]
[INFO] --- maven-resources-plugin:2.7:testResources (default-testResources) @ maven-release-oddeven-policy ---
[INFO] Using 'UTF-8' encoding to copy filtered resources.
[INFO] skip non existing resourceDirectory F:\jenkins\jenkins-slave\workspace\-box_maven-release_MRELEASE-1007\m\maven-release-policies\maven-release-oddeven-policy\src\test\resources
[INFO] Copying 3 resources
[INFO]
[INFO] --- maven-compiler-plugin:3.2:testCompile (default-testCompile) @ maven-release-oddeven-policy ---
[INFO] Changes detected - recompiling the module!
[INFO] Compiling 1 source file to F:\jenkins\jenkins-slave\workspace\-box_maven-release_MRELEASE-1007\m\maven-release-policies\maven-release-oddeven-policy\target\test-classes
[INFO]
[INFO] --- maven-surefire-plugin:2.20.1:test (default-test) @ maven-release-oddeven-policy ---
[INFO]
[INFO] -------------------------------------------------------
[INFO]  T E S T S
[INFO] -------------------------------------------------------
[INFO] Running org.apache.maven.shared.release.policy.oddeven.OddEvenVersionPolicyTestCase
[INFO] Tests run: 3, Failures: 0, Errors: 0, Skipped: 0, Time elapsed: 0.182 s - in org.apache.maven.shared.release.policy.oddeven.OddEvenVersionPolicyTestCase
[INFO]
[INFO] Results:
[INFO]
[INFO] Tests run: 3, Failures: 0, Errors: 0, Skipped: 0
[INFO]
[INFO]
[INFO] --- maven-jar-plugin:2.5:jar (default-jar) @ maven-release-oddeven-policy ---
[INFO] Building jar: F:\jenkins\jenkins-slave\workspace\-box_maven-release_MRELEASE-1007\m\maven-release-policies\maven-release-oddeven-policy\target\maven-release-oddeven-policy-3.0.0-SNAPSHOT.jar
[INFO]
[INFO] --- maven-site-plugin:3.4:attach-descriptor (attach-descriptor) @ maven-release-oddeven-policy ---
[INFO]
[INFO] --- maven-checkstyle-plugin:2.15:check (checkstyle-check) @ maven-release-oddeven-policy ---
[INFO]
[INFO] ------------------------------------------------------------------------
[INFO] Building Maven Release SemVer Policy 3.0.0-SNAPSHOT
[INFO] ------------------------------------------------------------------------
[INFO] Downloading from central: https://repo.maven.apache.org/maven2/org/semver/api/0.9.33/api-0.9.33.pom
[INFO] Downloaded from central: https://repo.maven.apache.org/maven2/org/semver/api/0.9.33/api-0.9.33.pom (2.8 kB at 105 kB/s)
[INFO] Downloading from central: https://repo.maven.apache.org/maven2/org/semver/parent/0.9.33/parent-0.9.33.pom
[INFO] Downloaded from central: https://repo.maven.apache.org/maven2/org/semver/parent/0.9.33/parent-0.9.33.pom (1.3 kB at 57 kB/s)
[INFO] Downloading from central: https://repo.maven.apache.org/maven2/com/github/jeluard/oss-parent/9/oss-parent-9.pom
[INFO] Downloaded from central: https://repo.maven.apache.org/maven2/com/github/jeluard/oss-parent/9/oss-parent-9.pom (12 kB at 462 kB/s)
[INFO] Downloading from central: https://repo.maven.apache.org/maven2/com/google/code/findbugs/jsr305/2.0.0/jsr305-2.0.0.pom
[INFO] Downloaded from central: https://repo.maven.apache.org/maven2/com/google/code/findbugs/jsr305/2.0.0/jsr305-2.0.0.pom (965 B at 32 kB/s)
[INFO] Downloading from central: https://repo.maven.apache.org/maven2/org/ow2/asm/asm/5.0.3/asm-5.0.3.pom
[INFO] Downloaded from central: https://repo.maven.apache.org/maven2/org/ow2/asm/asm/5.0.3/asm-5.0.3.pom (1.9 kB at 88 kB/s)
[INFO] Downloading from central: https://repo.maven.apache.org/maven2/org/ow2/asm/asm-parent/5.0.3/asm-parent-5.0.3.pom
[INFO] Downloaded from central: https://repo.maven.apache.org/maven2/org/ow2/asm/asm-parent/5.0.3/asm-parent-5.0.3.pom (5.5 kB at 204 kB/s)
[INFO] Downloading from central: https://repo.maven.apache.org/maven2/org/ow2/asm/asm-commons/5.0.3/asm-commons-5.0.3.pom
[INFO] Downloaded from central: https://repo.maven.apache.org/maven2/org/ow2/asm/asm-commons/5.0.3/asm-commons-5.0.3.pom (2.1 kB at 72 kB/s)
[INFO] Downloading from central: https://repo.maven.apache.org/maven2/org/ow2/asm/asm-tree/5.0.3/asm-tree-5.0.3.pom
[INFO] Downloaded from central: https://repo.maven.apache.org/maven2/org/ow2/asm/asm-tree/5.0.3/asm-tree-5.0.3.pom (2.1 kB at 95 kB/s)
[INFO] Downloading from central: https://repo.maven.apache.org/maven2/commons-lang/commons-lang/1.0/commons-lang-1.0.pom
[INFO] Downloaded from central: https://repo.maven.apache.org/maven2/commons-lang/commons-lang/1.0/commons-lang-1.0.pom (2.5 kB at 112 kB/s)
[INFO] Downloading from central: https://repo.maven.apache.org/maven2/de/tototec/de.tototec.cmdoption/0.2.0/de.tototec.cmdoption-0.2.0.pom
[INFO] Downloaded from central: https://repo.maven.apache.org/maven2/de/tototec/de.tototec.cmdoption/0.2.0/de.tototec.cmdoption-0.2.0.pom (956 B at 46 kB/s)
[INFO] Downloading from central: https://repo.maven.apache.org/maven2/org/semver/api/0.9.33/api-0.9.33.jar
[INFO] Downloading from central: https://repo.maven.apache.org/maven2/com/google/code/findbugs/jsr305/2.0.0/jsr305-2.0.0.jar
[INFO] Downloading from central: https://repo.maven.apache.org/maven2/org/ow2/asm/asm/5.0.3/asm-5.0.3.jar
[INFO] Downloading from central: https://repo.maven.apache.org/maven2/org/ow2/asm/asm-commons/5.0.3/asm-commons-5.0.3.jar
[INFO] Downloading from central: https://repo.maven.apache.org/maven2/org/ow2/asm/asm-tree/5.0.3/asm-tree-5.0.3.jar
[INFO] Downloaded from central: https://repo.maven.apache.org/maven2/org/ow2/asm/asm-tree/5.0.3/asm-tree-5.0.3.jar (29 kB at 880 kB/s)
[INFO] Downloading from central: https://repo.maven.apache.org/maven2/commons-lang/commons-lang/1.0/commons-lang-1.0.jar
[INFO] Downloaded from central: https://repo.maven.apache.org/maven2/org/ow2/asm/asm-commons/5.0.3/asm-commons-5.0.3.jar (42 kB at 851 kB/s)
[INFO] Downloading from central: https://repo.maven.apache.org/maven2/de/tototec/de.tototec.cmdoption/0.2.0/de.tototec.cmdoption-0.2.0.jar
[INFO] Downloaded from central: https://repo.maven.apache.org/maven2/org/ow2/asm/asm/5.0.3/asm-5.0.3.jar (53 kB at 739 kB/s)
[INFO] Downloaded from central: https://repo.maven.apache.org/maven2/org/semver/api/0.9.33/api-0.9.33.jar (64 kB at 389 kB/s)
[INFO] Downloaded from central: https://repo.maven.apache.org/maven2/commons-lang/commons-lang/1.0/commons-lang-1.0.jar (64 kB at 345 kB/s)
[INFO] Downloaded from central: https://repo.maven.apache.org/maven2/com/google/code/findbugs/jsr305/2.0.0/jsr305-2.0.0.jar (32 kB at 107 kB/s)
[INFO] Downloaded from central: https://repo.maven.apache.org/maven2/de/tototec/de.tototec.cmdoption/0.2.0/de.tototec.cmdoption-0.2.0.jar (42 kB at 138 kB/s)
[INFO]
[INFO] --- maven-clean-plugin:2.5:clean (default-clean) @ maven-release-semver-policy ---
[INFO]
[INFO] --- maven-enforcer-plugin:1.3.1:enforce (enforce-bytecode-version) @ maven-release-semver-policy ---
[INFO]
[INFO] --- maven-enforcer-plugin:1.3.1:enforce (ban-known-bad-maven-versions) @ maven-release-semver-policy ---
[INFO]
[INFO] --- apache-rat-plugin:0.11:check (rat-check) @ maven-release-semver-policy ---
[INFO] 51 implicit excludes (use -debug for more details).
[INFO] Exclude: .repository
[INFO] Exclude: Jenkinsfile
[INFO] Exclude: DEPENDENCIES
[INFO] 3 resources included (use -debug for more details)
[INFO] Rat check: Summary of files. Unapproved: 0 unknown: 0 generated: 0 approved: 3 licence.
[INFO]
[INFO] --- maven-remote-resources-plugin:1.5:process (default) @ maven-release-semver-policy ---
[INFO]
[INFO] --- maven-resources-plugin:2.7:resources (default-resources) @ maven-release-semver-policy ---
[INFO] Using 'UTF-8' encoding to copy filtered resources.
[INFO] skip non existing resourceDirectory F:\jenkins\jenkins-slave\workspace\-box_maven-release_MRELEASE-1007\m\maven-release-policies\maven-release-semver-policy\src\main\resources
[INFO] Copying 3 resources
[INFO]
[INFO] --- maven-compiler-plugin:3.2:compile (default-compile) @ maven-release-semver-policy ---
[INFO] Changes detected - recompiling the module!
[INFO] Compiling 1 source file to F:\jenkins\jenkins-slave\workspace\-box_maven-release_MRELEASE-1007\m\maven-release-policies\maven-release-semver-policy\target\classes
[INFO]
[INFO] --- plexus-component-metadata:1.7.1:generate-metadata (process-classes) @ maven-release-semver-policy ---
[INFO] Discovered 1 component descriptors(s)
[INFO]
[INFO] --- maven-resources-plugin:2.7:testResources (default-testResources) @ maven-release-semver-policy ---
[INFO] Using 'UTF-8' encoding to copy filtered resources.
[INFO] skip non existing resourceDirectory F:\jenkins\jenkins-slave\workspace\-box_maven-release_MRELEASE-1007\m\maven-release-policies\maven-release-semver-policy\src\test\resources
[INFO] Copying 3 resources
[INFO]
[INFO] --- maven-compiler-plugin:3.2:testCompile (default-testCompile) @ maven-release-semver-policy ---
[INFO] Changes detected - recompiling the module!
[INFO] Compiling 1 source file to F:\jenkins\jenkins-slave\workspace\-box_maven-release_MRELEASE-1007\m\maven-release-policies\maven-release-semver-policy\target\test-classes
[INFO]
[INFO] --- maven-surefire-plugin:2.20.1:test (default-test) @ maven-release-semver-policy ---
[INFO]
[INFO] -------------------------------------------------------
[INFO]  T E S T S
[INFO] -------------------------------------------------------
[INFO] Running org.apache.maven.shared.release.policy.semver.SemVerVersionPolicyTest
[INFO] Tests run: 2, Failures: 0, Errors: 0, Skipped: 0, Time elapsed: 0.112 s - in org.apache.maven.shared.release.policy.semver.SemVerVersionPolicyTest
[INFO]
[INFO] Results:
[INFO]
[INFO] Tests run: 2, Failures: 0, Errors: 0, Skipped: 0
[INFO]
[INFO]
[INFO] --- maven-jar-plugin:2.5:jar (default-jar) @ maven-release-semver-policy ---
[INFO] Building jar: F:\jenkins\jenkins-slave\workspace\-box_maven-release_MRELEASE-1007\m\maven-release-policies\maven-release-semver-policy\target\maven-release-semver-policy-3.0.0-SNAPSHOT.jar
[INFO]
[INFO] --- maven-site-plugin:3.4:attach-descriptor (attach-descriptor) @ maven-release-semver-policy ---
[INFO]
[INFO] --- maven-checkstyle-plugin:2.15:check (checkstyle-check) @ maven-release-semver-policy ---
[INFO] ------------------------------------------------------------------------
[INFO] Reactor Summary:
[INFO]
[INFO] Maven Release ...................................... SUCCESS [ 39.985 s]
[INFO] Maven Release APIs ................................. SUCCESS [ 14.208 s]
[INFO] Maven Release Manager .............................. SUCCESS [02:40 min]
[INFO] Maven Release Plugin ............................... SUCCESS [08:24 min]
[INFO] Maven Release Odd-Even Policy ...................... SUCCESS [  2.805 s]
[INFO] Maven Release SemVer Policy ........................ SUCCESS [  4.373 s]
[INFO] ------------------------------------------------------------------------
[INFO] BUILD SUCCESS
[INFO] ------------------------------------------------------------------------
[INFO] Total time: 12:08 min
[INFO] Finished at: 2019-02-28T19:51:23-08:00
[INFO] Final Memory: 82M/972M
[INFO] ------------------------------------------------------------------------
[INFO] [jenkins-event-spy] Generated F:\jenkins\jenkins-slave\workspace\-box_maven-release_MRELEASE-1007@tmp\withMavenebf4fb4f\maven-spy-20190228-193914-3288216591400088293748.log
Picked up JAVA_TOOL_OPTIONS: -Dmaven.ext.class.path="f:\jenkins\jenkins-slave\workspace\-box_maven-release_MRELEASE-1007@tmp\withMavenebf4fb4f\pipeline-maven-spy.jar" -Dorg.jenkinsci.plugins.pipeline.maven.reportsFolder="f:\jenkins\jenkins-slave\workspace\-box_maven-release_MRELEASE-1007@tmp\withMavenebf4fb4f"
[Pipeline] }
[Pipeline] // dir
[Pipeline] }
[withMaven] invokerPublisher - Archive invoker results for Maven artifact MavenArtifact{org.apache.maven.plugins:maven-release-plugin:maven-plugin:3.0.0-SNAPSHOT(version: 3.0.0-SNAPSHOT, snapshot:false) } generated by PluginInvocation{org.apache.maven.plugins:maven-invoker-plugin:2.0.0@run  integration-test-prepare}: m\maven-release-plugin\target\invoker-reports\*.xml
[withMaven] invokerPublisher - Archive invoker results for Maven artifact MavenArtifact{org.apache.maven.plugins:maven-release-plugin:maven-plugin:3.0.0-SNAPSHOT(version: 3.0.0-SNAPSHOT, snapshot:false) } generated by PluginInvocation{org.apache.maven.plugins:maven-invoker-plugin:2.0.0@run  integration-test-prepare-with-pom}: m\maven-release-plugin\target\invoker-reports\*.xml
[withMaven] invokerPublisher - Archive invoker results for Maven artifact MavenArtifact{org.apache.maven.plugins:maven-release-plugin:maven-plugin:3.0.0-SNAPSHOT(version: 3.0.0-SNAPSHOT, snapshot:false) } generated by PluginInvocation{org.apache.maven.plugins:maven-invoker-plugin:2.0.0@run  integration-test-branch}: m\maven-release-plugin\target\invoker-reports\*.xml
[withMaven] invokerPublisher - Archive invoker results for Maven artifact MavenArtifact{org.apache.maven.plugins:maven-release-plugin:maven-plugin:3.0.0-SNAPSHOT(version: 3.0.0-SNAPSHOT, snapshot:false) } generated by PluginInvocation{org.apache.maven.plugins:maven-invoker-plugin:2.0.0@run  integration-test-perform}: m\maven-release-plugin\target\invoker-reports\*.xml
[withMaven] invokerPublisher - Archive invoker results for Maven artifact MavenArtifact{org.apache.maven.plugins:maven-release-plugin:maven-plugin:3.0.0-SNAPSHOT(version: 3.0.0-SNAPSHOT, snapshot:false) } generated by PluginInvocation{org.apache.maven.plugins:maven-invoker-plugin:2.0.0@run  integration-test-update-versions}: m\maven-release-plugin\target\invoker-reports\*.xml
[withMaven] junitPublisher - Archive test results for Maven artifact org.apache.maven.release:maven-release-api:jar:3.0.0-SNAPSHOT generated by maven-surefire-plugin:test (default-test): m\maven-release-api\target\surefire-reports\*.xml
Recording test results
None of the test reports contained any result
[withMaven] junitPublisher - Archive test results for Maven artifact org.apache.maven.release:maven-release-manager:jar:3.0.0-SNAPSHOT generated by maven-surefire-plugin:test (default-test): m\maven-release-manager\target\surefire-reports\*.xml
Recording test results
[withMaven] junitPublisher - Archive test results for Maven artifact org.apache.maven.plugins:maven-release-plugin:maven-plugin:3.0.0-SNAPSHOT generated by maven-surefire-plugin:test (default-test): m\maven-release-plugin\target\surefire-reports\*.xml
Recording test results
[withMaven] junitPublisher - Archive test results for Maven artifact org.apache.maven.release:maven-release-oddeven-policy:jar:3.0.0-SNAPSHOT generated by maven-surefire-plugin:test (default-test): m\maven-release-policies\maven-release-oddeven-policy\target\surefire-reports\*.xml
Recording test results
[withMaven] junitPublisher - Archive test results for Maven artifact org.apache.maven.release:maven-release-semver-policy:jar:3.0.0-SNAPSHOT generated by maven-surefire-plugin:test (default-test): m\maven-release-policies\maven-release-semver-policy\target\surefire-reports\*.xml
Recording test results
[withMaven] junitPublisher - Archive test results for Maven artifact org.apache.maven.release:maven-release-manager:jar:3.0.0-SNAPSHOT generated by maven-failsafe-plugin:integration-test (default): m\maven-release-manager\target\failsafe-reports\*.xml
Recording test results
[withMaven] Publishers: Pipeline Graph Publisher: 4 ms, Invoker Publisher: 108231 ms, Junit Publisher: 3242 ms, Dependencies Fingerprint Publisher: 273 ms
[withMaven] One or multiple Maven executions have been ignored by the Jenkins Pipeline Maven Plugin because they have been interrupted before completion (1). See Pipeline Maven Plugin FAQ for more details.
[Pipeline] // withMaven
[Pipeline] cleanWs
[WS-CLEANUP] Deleting project workspace...
[WS-CLEANUP] Deferred wipeout is used...
[WS-CLEANUP] done
[Pipeline] }
[Pipeline] // stage
[Pipeline] }
[Pipeline] // node
[Pipeline] }
[Pipeline] // parallel
[Pipeline] echo
[FAILURE-001] org.jenkinsci.plugins.scriptsecurity.sandbox.RejectedAccessException: Scripts not permitted to use method org.jenkinsci.plugins.workflow.support.steps.build.RunWrapper getRawBuild
[Pipeline] stage
[Pipeline] { (Notifications)
[Pipeline] echo
Build result: FAILURE
[Pipeline] jiraIssueSelector
[Pipeline] emailext
Reply | Threaded
Open this post in threaded view
|

Build failed in Jenkins: Maven TLP » maven-release » MRELEASE-1007 #2

Apache Jenkins Server-2
See https://builds.apache.org/job/maven-box/job/maven-release/job/MRELEASE-1007/2/

No changes.

All tests passed

Build log:
[...truncated 19410 lines...]
[INFO] Building: projects\perform\MRELEASE-592\pom.xml
[INFO] ..SUCCESS (11.9 s)
[INFO] Building: projects\perform\MRELEASE-736\pom.xml
[INFO] ..SUCCESS (12.9 s)
[INFO] Building: projects\perform\MRELEASE-818\pom.xml
[INFO] run script verify.groovy
[INFO] ..SUCCESS (13.0 s)
[INFO] Building: projects\perform\MRELEASE-832\pom.xml
[INFO] run script verify.groovy
[INFO] ..SUCCESS (5.9 s)
[INFO] -------------------------------------------------
[INFO] Build Summary:
[INFO]   Passed: 5, Failed: 0, Errors: 0, Skipped: 0
[INFO] -------------------------------------------------
[INFO]
[INFO] --- maven-invoker-plugin:2.0.0:run (integration-test-update-versions) @ maven-release-plugin ---
[INFO] Building: projects\update-versions\MRELEASE-555\pom.xml
[INFO] run script verify.groovy
[INFO] ..SUCCESS (5.9 s)
[INFO] Building: projects\update-versions\MRELEASE-611\pom.xml
[INFO] run script verify.groovy
[INFO] ..SUCCESS (5.8 s)
[INFO] Building: projects\update-versions\MRELEASE-783\pom.xml
[INFO] ..SUCCESS (5.8 s)
[INFO] Building: projects\update-versions\MRELEASE-976\pom.xml
[INFO] run script verify.groovy
[INFO] ..SUCCESS (5.9 s)
[INFO] -------------------------------------------------
[INFO] Build Summary:
[INFO]   Passed: 4, Failed: 0, Errors: 0, Skipped: 0
[INFO] -------------------------------------------------
[INFO]
[INFO] --- maven-checkstyle-plugin:2.15:check (checkstyle-check) @ maven-release-plugin ---
[INFO]
[INFO] ------------------------------------------------------------------------
[INFO] Building Maven Release Odd-Even Policy 3.0.0-SNAPSHOT
[INFO] ------------------------------------------------------------------------
[INFO]
[INFO] --- maven-clean-plugin:2.5:clean (default-clean) @ maven-release-oddeven-policy ---
[INFO]
[INFO] --- maven-enforcer-plugin:1.3.1:enforce (enforce-bytecode-version) @ maven-release-oddeven-policy ---
[INFO]
[INFO] --- maven-enforcer-plugin:1.3.1:enforce (ban-known-bad-maven-versions) @ maven-release-oddeven-policy ---
[INFO]
[INFO] --- apache-rat-plugin:0.11:check (rat-check) @ maven-release-oddeven-policy ---
[INFO] 51 implicit excludes (use -debug for more details).
[INFO] Exclude: .repository
[INFO] Exclude: Jenkinsfile
[INFO] Exclude: DEPENDENCIES
[INFO] 4 resources included (use -debug for more details)
[INFO] Rat check: Summary of files. Unapproved: 0 unknown: 0 generated: 0 approved: 4 licence.
[INFO]
[INFO] --- maven-remote-resources-plugin:1.5:process (default) @ maven-release-oddeven-policy ---
[INFO]
[INFO] --- maven-resources-plugin:2.7:resources (default-resources) @ maven-release-oddeven-policy ---
[INFO] Using 'UTF-8' encoding to copy filtered resources.
[INFO] skip non existing resourceDirectory F:\jenkins\jenkins-slave\workspace\-box_maven-release_MRELEASE-1007\m\maven-release-policies\maven-release-oddeven-policy\src\main\resources
[INFO] Copying 3 resources
[INFO]
[INFO] --- maven-compiler-plugin:3.2:compile (default-compile) @ maven-release-oddeven-policy ---
[INFO] Changes detected - recompiling the module!
[INFO] Compiling 2 source files to F:\jenkins\jenkins-slave\workspace\-box_maven-release_MRELEASE-1007\m\maven-release-policies\maven-release-oddeven-policy\target\classes
[INFO]
[INFO] --- plexus-component-metadata:1.7.1:generate-metadata (process-classes) @ maven-release-oddeven-policy ---
[INFO] Discovered 1 component descriptors(s)
[INFO]
[INFO] --- maven-resources-plugin:2.7:testResources (default-testResources) @ maven-release-oddeven-policy ---
[INFO] Using 'UTF-8' encoding to copy filtered resources.
[INFO] skip non existing resourceDirectory F:\jenkins\jenkins-slave\workspace\-box_maven-release_MRELEASE-1007\m\maven-release-policies\maven-release-oddeven-policy\src\test\resources
[INFO] Copying 3 resources
[INFO]
[INFO] --- maven-compiler-plugin:3.2:testCompile (default-testCompile) @ maven-release-oddeven-policy ---
[INFO] Changes detected - recompiling the module!
[INFO] Compiling 1 source file to F:\jenkins\jenkins-slave\workspace\-box_maven-release_MRELEASE-1007\m\maven-release-policies\maven-release-oddeven-policy\target\test-classes
[INFO]
[INFO] --- maven-surefire-plugin:2.20.1:test (default-test) @ maven-release-oddeven-policy ---
[INFO]
[INFO] -------------------------------------------------------
[INFO]  T E S T S
[INFO] -------------------------------------------------------
[INFO] Running org.apache.maven.shared.release.policy.oddeven.OddEvenVersionPolicyTestCase
[INFO] Tests run: 3, Failures: 0, Errors: 0, Skipped: 0, Time elapsed: 0.195 s - in org.apache.maven.shared.release.policy.oddeven.OddEvenVersionPolicyTestCase
[INFO]
[INFO] Results:
[INFO]
[INFO] Tests run: 3, Failures: 0, Errors: 0, Skipped: 0
[INFO]
[INFO]
[INFO] --- maven-jar-plugin:2.5:jar (default-jar) @ maven-release-oddeven-policy ---
[INFO] Building jar: F:\jenkins\jenkins-slave\workspace\-box_maven-release_MRELEASE-1007\m\maven-release-policies\maven-release-oddeven-policy\target\maven-release-oddeven-policy-3.0.0-SNAPSHOT.jar
[INFO]
[INFO] --- maven-site-plugin:3.4:attach-descriptor (attach-descriptor) @ maven-release-oddeven-policy ---
[INFO]
[INFO] --- maven-checkstyle-plugin:2.15:check (checkstyle-check) @ maven-release-oddeven-policy ---
[INFO]
[INFO] ------------------------------------------------------------------------
[INFO] Building Maven Release SemVer Policy 3.0.0-SNAPSHOT
[INFO] ------------------------------------------------------------------------
[INFO] Downloading from central: https://repo.maven.apache.org/maven2/org/semver/api/0.9.33/api-0.9.33.pom
[INFO] Downloaded from central: https://repo.maven.apache.org/maven2/org/semver/api/0.9.33/api-0.9.33.pom (2.8 kB at 218 kB/s)
[INFO] Downloading from central: https://repo.maven.apache.org/maven2/org/semver/parent/0.9.33/parent-0.9.33.pom
[INFO] Downloaded from central: https://repo.maven.apache.org/maven2/org/semver/parent/0.9.33/parent-0.9.33.pom (1.3 kB at 180 kB/s)
[INFO] Downloading from central: https://repo.maven.apache.org/maven2/com/github/jeluard/oss-parent/9/oss-parent-9.pom
[INFO] Downloaded from central: https://repo.maven.apache.org/maven2/com/github/jeluard/oss-parent/9/oss-parent-9.pom (12 kB at 1.8 MB/s)
[INFO] Downloading from central: https://repo.maven.apache.org/maven2/com/google/code/findbugs/jsr305/2.0.0/jsr305-2.0.0.pom
[INFO] Downloaded from central: https://repo.maven.apache.org/maven2/com/google/code/findbugs/jsr305/2.0.0/jsr305-2.0.0.pom (965 B at 107 kB/s)
[INFO] Downloading from central: https://repo.maven.apache.org/maven2/org/ow2/asm/asm/5.0.3/asm-5.0.3.pom
[INFO] Downloaded from central: https://repo.maven.apache.org/maven2/org/ow2/asm/asm/5.0.3/asm-5.0.3.pom (1.9 kB at 242 kB/s)
[INFO] Downloading from central: https://repo.maven.apache.org/maven2/org/ow2/asm/asm-parent/5.0.3/asm-parent-5.0.3.pom
[INFO] Downloaded from central: https://repo.maven.apache.org/maven2/org/ow2/asm/asm-parent/5.0.3/asm-parent-5.0.3.pom (5.5 kB at 785 kB/s)
[INFO] Downloading from central: https://repo.maven.apache.org/maven2/org/ow2/asm/asm-commons/5.0.3/asm-commons-5.0.3.pom
[INFO] Downloaded from central: https://repo.maven.apache.org/maven2/org/ow2/asm/asm-commons/5.0.3/asm-commons-5.0.3.pom (2.1 kB at 349 kB/s)
[INFO] Downloading from central: https://repo.maven.apache.org/maven2/org/ow2/asm/asm-tree/5.0.3/asm-tree-5.0.3.pom
[INFO] Downloaded from central: https://repo.maven.apache.org/maven2/org/ow2/asm/asm-tree/5.0.3/asm-tree-5.0.3.pom (2.1 kB at 347 kB/s)
[INFO] Downloading from central: https://repo.maven.apache.org/maven2/commons-lang/commons-lang/1.0/commons-lang-1.0.pom
[INFO] Downloaded from central: https://repo.maven.apache.org/maven2/commons-lang/commons-lang/1.0/commons-lang-1.0.pom (2.5 kB at 273 kB/s)
[INFO] Downloading from central: https://repo.maven.apache.org/maven2/de/tototec/de.tototec.cmdoption/0.2.0/de.tototec.cmdoption-0.2.0.pom
[INFO] Downloaded from central: https://repo.maven.apache.org/maven2/de/tototec/de.tototec.cmdoption/0.2.0/de.tototec.cmdoption-0.2.0.pom (956 B at 120 kB/s)
[INFO] Downloading from central: https://repo.maven.apache.org/maven2/org/ow2/asm/asm-commons/5.0.3/asm-commons-5.0.3.jar
[INFO] Downloading from central: https://repo.maven.apache.org/maven2/org/semver/api/0.9.33/api-0.9.33.jar
[INFO] Downloading from central: https://repo.maven.apache.org/maven2/org/ow2/asm/asm/5.0.3/asm-5.0.3.jar
[INFO] Downloading from central: https://repo.maven.apache.org/maven2/com/google/code/findbugs/jsr305/2.0.0/jsr305-2.0.0.jar
[INFO] Downloading from central: https://repo.maven.apache.org/maven2/org/ow2/asm/asm-tree/5.0.3/asm-tree-5.0.3.jar
[INFO] Downloaded from central: https://repo.maven.apache.org/maven2/org/ow2/asm/asm-commons/5.0.3/asm-commons-5.0.3.jar (42 kB at 2.6 MB/s)
[INFO] Downloading from central: https://repo.maven.apache.org/maven2/commons-lang/commons-lang/1.0/commons-lang-1.0.jar
[INFO] Downloaded from central: https://repo.maven.apache.org/maven2/com/google/code/findbugs/jsr305/2.0.0/jsr305-2.0.0.jar (32 kB at 1.8 MB/s)
[INFO] Downloading from central: https://repo.maven.apache.org/maven2/de/tototec/de.tototec.cmdoption/0.2.0/de.tototec.cmdoption-0.2.0.jar
[INFO] Downloaded from central: https://repo.maven.apache.org/maven2/org/ow2/asm/asm-tree/5.0.3/asm-tree-5.0.3.jar (29 kB at 1.3 MB/s)
[INFO] Downloaded from central: https://repo.maven.apache.org/maven2/org/ow2/asm/asm/5.0.3/asm-5.0.3.jar (53 kB at 2.2 MB/s)
[INFO] Downloaded from central: https://repo.maven.apache.org/maven2/org/semver/api/0.9.33/api-0.9.33.jar (64 kB at 2.2 MB/s)
[INFO] Downloaded from central: https://repo.maven.apache.org/maven2/commons-lang/commons-lang/1.0/commons-lang-1.0.jar (64 kB at 2.1 MB/s)
[INFO] Downloaded from central: https://repo.maven.apache.org/maven2/de/tototec/de.tototec.cmdoption/0.2.0/de.tototec.cmdoption-0.2.0.jar (42 kB at 1.3 MB/s)
[INFO]
[INFO] --- maven-clean-plugin:2.5:clean (default-clean) @ maven-release-semver-policy ---
[INFO]
[INFO] --- maven-enforcer-plugin:1.3.1:enforce (enforce-bytecode-version) @ maven-release-semver-policy ---
[INFO]
[INFO] --- maven-enforcer-plugin:1.3.1:enforce (ban-known-bad-maven-versions) @ maven-release-semver-policy ---
[INFO]
[INFO] --- apache-rat-plugin:0.11:check (rat-check) @ maven-release-semver-policy ---
[INFO] 51 implicit excludes (use -debug for more details).
[INFO] Exclude: .repository
[INFO] Exclude: Jenkinsfile
[INFO] Exclude: DEPENDENCIES
[INFO] 3 resources included (use -debug for more details)
[INFO] Rat check: Summary of files. Unapproved: 0 unknown: 0 generated: 0 approved: 3 licence.
[INFO]
[INFO] --- maven-remote-resources-plugin:1.5:process (default) @ maven-release-semver-policy ---
[INFO]
[INFO] --- maven-resources-plugin:2.7:resources (default-resources) @ maven-release-semver-policy ---
[INFO] Using 'UTF-8' encoding to copy filtered resources.
[INFO] skip non existing resourceDirectory F:\jenkins\jenkins-slave\workspace\-box_maven-release_MRELEASE-1007\m\maven-release-policies\maven-release-semver-policy\src\main\resources
[INFO] Copying 3 resources
[INFO]
[INFO] --- maven-compiler-plugin:3.2:compile (default-compile) @ maven-release-semver-policy ---
[INFO] Changes detected - recompiling the module!
[INFO] Compiling 1 source file to F:\jenkins\jenkins-slave\workspace\-box_maven-release_MRELEASE-1007\m\maven-release-policies\maven-release-semver-policy\target\classes
[INFO]
[INFO] --- plexus-component-metadata:1.7.1:generate-metadata (process-classes) @ maven-release-semver-policy ---
[INFO] Discovered 1 component descriptors(s)
[INFO]
[INFO] --- maven-resources-plugin:2.7:testResources (default-testResources) @ maven-release-semver-policy ---
[INFO] Using 'UTF-8' encoding to copy filtered resources.
[INFO] skip non existing resourceDirectory F:\jenkins\jenkins-slave\workspace\-box_maven-release_MRELEASE-1007\m\maven-release-policies\maven-release-semver-policy\src\test\resources
[INFO] Copying 3 resources
[INFO]
[INFO] --- maven-compiler-plugin:3.2:testCompile (default-testCompile) @ maven-release-semver-policy ---
[INFO] Changes detected - recompiling the module!
[INFO] Compiling 1 source file to F:\jenkins\jenkins-slave\workspace\-box_maven-release_MRELEASE-1007\m\maven-release-policies\maven-release-semver-policy\target\test-classes
[INFO]
[INFO] --- maven-surefire-plugin:2.20.1:test (default-test) @ maven-release-semver-policy ---
[INFO]
[INFO] -------------------------------------------------------
[INFO]  T E S T S
[INFO] -------------------------------------------------------
[INFO] Running org.apache.maven.shared.release.policy.semver.SemVerVersionPolicyTest
[INFO] Tests run: 2, Failures: 0, Errors: 0, Skipped: 0, Time elapsed: 0.139 s - in org.apache.maven.shared.release.policy.semver.SemVerVersionPolicyTest
[INFO]
[INFO] Results:
[INFO]
[INFO] Tests run: 2, Failures: 0, Errors: 0, Skipped: 0
[INFO]
[INFO]
[INFO] --- maven-jar-plugin:2.5:jar (default-jar) @ maven-release-semver-policy ---
[INFO] Building jar: F:\jenkins\jenkins-slave\workspace\-box_maven-release_MRELEASE-1007\m\maven-release-policies\maven-release-semver-policy\target\maven-release-semver-policy-3.0.0-SNAPSHOT.jar
[INFO]
[INFO] --- maven-site-plugin:3.4:attach-descriptor (attach-descriptor) @ maven-release-semver-policy ---
[INFO]
[INFO] --- maven-checkstyle-plugin:2.15:check (checkstyle-check) @ maven-release-semver-policy ---
[INFO] ------------------------------------------------------------------------
[INFO] Reactor Summary:
[INFO]
[INFO] Maven Release ...................................... SUCCESS [ 15.139 s]
[INFO] Maven Release APIs ................................. SUCCESS [  5.926 s]
[INFO] Maven Release Manager .............................. SUCCESS [01:55 min]
[INFO] Maven Release Plugin ............................... SUCCESS [07:17 min]
[INFO] Maven Release Odd-Even Policy ...................... SUCCESS [  2.499 s]
[INFO] Maven Release SemVer Policy ........................ SUCCESS [  3.326 s]
[INFO] ------------------------------------------------------------------------
[INFO] BUILD SUCCESS
[INFO] ------------------------------------------------------------------------
[INFO] Total time: 09:41 min
[INFO] Finished at: 2019-03-15T18:28:29Z
[INFO] Final Memory: 84M/1081M
[INFO] ------------------------------------------------------------------------
[INFO] [jenkins-event-spy] Generated F:\jenkins\jenkins-slave\workspace\-box_maven-release_MRELEASE-1007@tmp\withMaven834463d5\maven-spy-20190315-181846-678844989170842702711.log
Picked up JAVA_TOOL_OPTIONS: -Dmaven.ext.class.path="f:\jenkins\jenkins-slave\workspace\-box_maven-release_MRELEASE-1007@tmp\withMaven834463d5\pipeline-maven-spy.jar" -Dorg.jenkinsci.plugins.pipeline.maven.reportsFolder="f:\jenkins\jenkins-slave\workspace\-box_maven-release_MRELEASE-1007@tmp\withMaven834463d5"
[Pipeline] }
[Pipeline] // dir
[Pipeline] }
[withMaven] invokerPublisher - Archive invoker results for Maven artifact MavenArtifact{org.apache.maven.plugins:maven-release-plugin:maven-plugin:3.0.0-SNAPSHOT(version: 3.0.0-SNAPSHOT, snapshot:false) } generated by PluginInvocation{org.apache.maven.plugins:maven-invoker-plugin:2.0.0@run  integration-test-prepare}: m\maven-release-plugin\target\invoker-reports\*.xml
[withMaven] invokerPublisher - Archive invoker results for Maven artifact MavenArtifact{org.apache.maven.plugins:maven-release-plugin:maven-plugin:3.0.0-SNAPSHOT(version: 3.0.0-SNAPSHOT, snapshot:false) } generated by PluginInvocation{org.apache.maven.plugins:maven-invoker-plugin:2.0.0@run  integration-test-prepare-with-pom}: m\maven-release-plugin\target\invoker-reports\*.xml
[withMaven] invokerPublisher - Archive invoker results for Maven artifact MavenArtifact{org.apache.maven.plugins:maven-release-plugin:maven-plugin:3.0.0-SNAPSHOT(version: 3.0.0-SNAPSHOT, snapshot:false) } generated by PluginInvocation{org.apache.maven.plugins:maven-invoker-plugin:2.0.0@run  integration-test-branch}: m\maven-release-plugin\target\invoker-reports\*.xml
[withMaven] invokerPublisher - Archive invoker results for Maven artifact MavenArtifact{org.apache.maven.plugins:maven-release-plugin:maven-plugin:3.0.0-SNAPSHOT(version: 3.0.0-SNAPSHOT, snapshot:false) } generated by PluginInvocation{org.apache.maven.plugins:maven-invoker-plugin:2.0.0@run  integration-test-perform}: m\maven-release-plugin\target\invoker-reports\*.xml
[withMaven] invokerPublisher - Archive invoker results for Maven artifact MavenArtifact{org.apache.maven.plugins:maven-release-plugin:maven-plugin:3.0.0-SNAPSHOT(version: 3.0.0-SNAPSHOT, snapshot:false) } generated by PluginInvocation{org.apache.maven.plugins:maven-invoker-plugin:2.0.0@run  integration-test-update-versions}: m\maven-release-plugin\target\invoker-reports\*.xml
[withMaven] junitPublisher - Archive test results for Maven artifact org.apache.maven.release:maven-release-api:jar:3.0.0-SNAPSHOT generated by maven-surefire-plugin:test (default-test): m\maven-release-api\target\surefire-reports\*.xml
Recording test results
None of the test reports contained any result
[withMaven] junitPublisher - Archive test results for Maven artifact org.apache.maven.release:maven-release-manager:jar:3.0.0-SNAPSHOT generated by maven-surefire-plugin:test (default-test): m\maven-release-manager\target\surefire-reports\*.xml
Recording test results
[withMaven] junitPublisher - Archive test results for Maven artifact org.apache.maven.plugins:maven-release-plugin:maven-plugin:3.0.0-SNAPSHOT generated by maven-surefire-plugin:test (default-test): m\maven-release-plugin\target\surefire-reports\*.xml
Recording test results
[withMaven] junitPublisher - Archive test results for Maven artifact org.apache.maven.release:maven-release-oddeven-policy:jar:3.0.0-SNAPSHOT generated by maven-surefire-plugin:test (default-test): m\maven-release-policies\maven-release-oddeven-policy\target\surefire-reports\*.xml
Recording test results
[withMaven] junitPublisher - Archive test results for Maven artifact org.apache.maven.release:maven-release-semver-policy:jar:3.0.0-SNAPSHOT generated by maven-surefire-plugin:test (default-test): m\maven-release-policies\maven-release-semver-policy\target\surefire-reports\*.xml
Recording test results
[withMaven] junitPublisher - Archive test results for Maven artifact org.apache.maven.release:maven-release-manager:jar:3.0.0-SNAPSHOT generated by maven-failsafe-plugin:integration-test (default): m\maven-release-manager\target\failsafe-reports\*.xml
Recording test results
[withMaven] Publishers: Pipeline Graph Publisher: 3 ms, Invoker Publisher: 84288 ms, Junit Publisher: 3630 ms, Dependencies Fingerprint Publisher: 302 ms
[withMaven] One or multiple Maven executions have been ignored by the Jenkins Pipeline Maven Plugin because they have been interrupted before completion (1). See Pipeline Maven Plugin FAQ for more details.
[Pipeline] // withMaven
[Pipeline] cleanWs
[WS-CLEANUP] Deleting project workspace...
[WS-CLEANUP] Deferred wipeout is used...
[WS-CLEANUP] done
[Pipeline] }
[Pipeline] // stage
[Pipeline] }
[Pipeline] // node
[Pipeline] }
[Pipeline] // parallel
[Pipeline] echo
[FAILURE-001] org.jenkinsci.plugins.scriptsecurity.sandbox.RejectedAccessException: Scripts not permitted to use method org.jenkinsci.plugins.workflow.support.steps.build.RunWrapper getRawBuild
[Pipeline] stage
[Pipeline] { (Notifications)
[Pipeline] echo
Build result: FAILURE
[Pipeline] jiraIssueSelector
[Pipeline] emailext
Reply | Threaded
Open this post in threaded view
|

Build failed in Jenkins: Maven TLP » maven-release » MRELEASE-1007 #3

Apache Jenkins Server-2
See https://builds.apache.org/job/maven-box/job/maven-release/job/MRELEASE-1007/3/

Changes:

* [INFRA-18014] Provide GPG on Jenkins Windows nodes
* Switch back to Windows label
* Change workspace path for Windows
* Shorten wsDir
* Fix groovy script
* rewrite groovy statement
* Keep original stageId
* Reduce stageDir
* More shortening of path
* maven-invoker keeps lock on jar (under investigation), so can't fully

All tests passed

Build log:
[...truncated 19413 lines...]
[INFO] Building: projects\perform\MRELEASE-592\pom.xml
[INFO] ..SUCCESS (11.6 s)
[INFO] Building: projects\perform\MRELEASE-736\pom.xml
[INFO] ..SUCCESS (13.5 s)
[INFO] Building: projects\perform\MRELEASE-818\pom.xml
[INFO] run script verify.groovy
[INFO] ..SUCCESS (12.6 s)
[INFO] Building: projects\perform\MRELEASE-832\pom.xml
[INFO] run script verify.groovy
[INFO] ..SUCCESS (5.4 s)
[INFO] -------------------------------------------------
[INFO] Build Summary:
[INFO]   Passed: 5, Failed: 0, Errors: 0, Skipped: 0
[INFO] -------------------------------------------------
[INFO]
[INFO] --- maven-invoker-plugin:2.0.0:run (integration-test-update-versions) @ maven-release-plugin ---
[INFO] Building: projects\update-versions\MRELEASE-555\pom.xml
[INFO] run script verify.groovy
[INFO] ..SUCCESS (6.2 s)
[INFO] Building: projects\update-versions\MRELEASE-611\pom.xml
[INFO] run script verify.groovy
[INFO] ..SUCCESS (5.8 s)
[INFO] Building: projects\update-versions\MRELEASE-783\pom.xml
[INFO] ..SUCCESS (5.8 s)
[INFO] Building: projects\update-versions\MRELEASE-976\pom.xml
[INFO] run script verify.groovy
[INFO] ..SUCCESS (6.0 s)
[INFO] -------------------------------------------------
[INFO] Build Summary:
[INFO]   Passed: 4, Failed: 0, Errors: 0, Skipped: 0
[INFO] -------------------------------------------------
[INFO]
[INFO] --- maven-checkstyle-plugin:2.15:check (checkstyle-check) @ maven-release-plugin ---
[INFO]
[INFO] ------------------------------------------------------------------------
[INFO] Building Maven Release Odd-Even Policy 3.0.0-SNAPSHOT
[INFO] ------------------------------------------------------------------------
[INFO]
[INFO] --- maven-clean-plugin:2.5:clean (default-clean) @ maven-release-oddeven-policy ---
[INFO]
[INFO] --- maven-enforcer-plugin:1.3.1:enforce (enforce-bytecode-version) @ maven-release-oddeven-policy ---
[INFO]
[INFO] --- maven-enforcer-plugin:1.3.1:enforce (ban-known-bad-maven-versions) @ maven-release-oddeven-policy ---
[INFO]
[INFO] --- apache-rat-plugin:0.11:check (rat-check) @ maven-release-oddeven-policy ---
[INFO] 51 implicit excludes (use -debug for more details).
[INFO] Exclude: .repository
[INFO] Exclude: Jenkinsfile
[INFO] Exclude: DEPENDENCIES
[INFO] 4 resources included (use -debug for more details)
[INFO] Rat check: Summary of files. Unapproved: 0 unknown: 0 generated: 0 approved: 4 licence.
[INFO]
[INFO] --- maven-remote-resources-plugin:1.5:process (default) @ maven-release-oddeven-policy ---
[INFO]
[INFO] --- maven-resources-plugin:2.7:resources (default-resources) @ maven-release-oddeven-policy ---
[INFO] Using 'UTF-8' encoding to copy filtered resources.
[INFO] skip non existing resourceDirectory F:\jenkins\jenkins-slave\workspace\-box_maven-release_MRELEASE-1007\m\maven-release-policies\maven-release-oddeven-policy\src\main\resources
[INFO] Copying 3 resources
[INFO]
[INFO] --- maven-compiler-plugin:3.2:compile (default-compile) @ maven-release-oddeven-policy ---
[INFO] Changes detected - recompiling the module!
[INFO] Compiling 2 source files to F:\jenkins\jenkins-slave\workspace\-box_maven-release_MRELEASE-1007\m\maven-release-policies\maven-release-oddeven-policy\target\classes
[INFO]
[INFO] --- plexus-component-metadata:1.7.1:generate-metadata (process-classes) @ maven-release-oddeven-policy ---
[INFO] Discovered 1 component descriptors(s)
[INFO]
[INFO] --- maven-resources-plugin:2.7:testResources (default-testResources) @ maven-release-oddeven-policy ---
[INFO] Using 'UTF-8' encoding to copy filtered resources.
[INFO] skip non existing resourceDirectory F:\jenkins\jenkins-slave\workspace\-box_maven-release_MRELEASE-1007\m\maven-release-policies\maven-release-oddeven-policy\src\test\resources
[INFO] Copying 3 resources
[INFO]
[INFO] --- maven-compiler-plugin:3.2:testCompile (default-testCompile) @ maven-release-oddeven-policy ---
[INFO] Changes detected - recompiling the module!
[INFO] Compiling 1 source file to F:\jenkins\jenkins-slave\workspace\-box_maven-release_MRELEASE-1007\m\maven-release-policies\maven-release-oddeven-policy\target\test-classes
[INFO]
[INFO] --- maven-surefire-plugin:2.20.1:test (default-test) @ maven-release-oddeven-policy ---
[INFO]
[INFO] -------------------------------------------------------
[INFO]  T E S T S
[INFO] -------------------------------------------------------
[INFO] Running org.apache.maven.shared.release.policy.oddeven.OddEvenVersionPolicyTestCase
[INFO] Tests run: 3, Failures: 0, Errors: 0, Skipped: 0, Time elapsed: 0.177 s - in org.apache.maven.shared.release.policy.oddeven.OddEvenVersionPolicyTestCase
[INFO]
[INFO] Results:
[INFO]
[INFO] Tests run: 3, Failures: 0, Errors: 0, Skipped: 0
[INFO]
[INFO]
[INFO] --- maven-jar-plugin:2.5:jar (default-jar) @ maven-release-oddeven-policy ---
[INFO] Building jar: F:\jenkins\jenkins-slave\workspace\-box_maven-release_MRELEASE-1007\m\maven-release-policies\maven-release-oddeven-policy\target\maven-release-oddeven-policy-3.0.0-SNAPSHOT.jar
[INFO]
[INFO] --- maven-site-plugin:3.4:attach-descriptor (attach-descriptor) @ maven-release-oddeven-policy ---
[INFO]
[INFO] --- maven-checkstyle-plugin:2.15:check (checkstyle-check) @ maven-release-oddeven-policy ---
[INFO]
[INFO] ------------------------------------------------------------------------
[INFO] Building Maven Release SemVer Policy 3.0.0-SNAPSHOT
[INFO] ------------------------------------------------------------------------
[INFO] Downloading from central: https://repo.maven.apache.org/maven2/org/semver/api/0.9.33/api-0.9.33.pom
[INFO] Downloaded from central: https://repo.maven.apache.org/maven2/org/semver/api/0.9.33/api-0.9.33.pom (2.8 kB at 283 kB/s)
[INFO] Downloading from central: https://repo.maven.apache.org/maven2/org/semver/parent/0.9.33/parent-0.9.33.pom
[INFO] Downloaded from central: https://repo.maven.apache.org/maven2/org/semver/parent/0.9.33/parent-0.9.33.pom (1.3 kB at 210 kB/s)
[INFO] Downloading from central: https://repo.maven.apache.org/maven2/com/github/jeluard/oss-parent/9/oss-parent-9.pom
[INFO] Downloaded from central: https://repo.maven.apache.org/maven2/com/github/jeluard/oss-parent/9/oss-parent-9.pom (12 kB at 2.1 MB/s)
[INFO] Downloading from central: https://repo.maven.apache.org/maven2/com/google/code/findbugs/jsr305/2.0.0/jsr305-2.0.0.pom
[INFO] Downloaded from central: https://repo.maven.apache.org/maven2/com/google/code/findbugs/jsr305/2.0.0/jsr305-2.0.0.pom (965 B at 161 kB/s)
[INFO] Downloading from central: https://repo.maven.apache.org/maven2/org/ow2/asm/asm/5.0.3/asm-5.0.3.pom
[INFO] Downloaded from central: https://repo.maven.apache.org/maven2/org/ow2/asm/asm/5.0.3/asm-5.0.3.pom (1.9 kB at 322 kB/s)
[INFO] Downloading from central: https://repo.maven.apache.org/maven2/org/ow2/asm/asm-parent/5.0.3/asm-parent-5.0.3.pom
[INFO] Downloaded from central: https://repo.maven.apache.org/maven2/org/ow2/asm/asm-parent/5.0.3/asm-parent-5.0.3.pom (5.5 kB at 916 kB/s)
[INFO] Downloading from central: https://repo.maven.apache.org/maven2/org/ow2/asm/asm-commons/5.0.3/asm-commons-5.0.3.pom
[INFO] Downloaded from central: https://repo.maven.apache.org/maven2/org/ow2/asm/asm-commons/5.0.3/asm-commons-5.0.3.pom (2.1 kB at 419 kB/s)
[INFO] Downloading from central: https://repo.maven.apache.org/maven2/org/ow2/asm/asm-tree/5.0.3/asm-tree-5.0.3.pom
[INFO] Downloaded from central: https://repo.maven.apache.org/maven2/org/ow2/asm/asm-tree/5.0.3/asm-tree-5.0.3.pom (2.1 kB at 298 kB/s)
[INFO] Downloading from central: https://repo.maven.apache.org/maven2/commons-lang/commons-lang/1.0/commons-lang-1.0.pom
[INFO] Downloaded from central: https://repo.maven.apache.org/maven2/commons-lang/commons-lang/1.0/commons-lang-1.0.pom (2.5 kB at 410 kB/s)
[INFO] Downloading from central: https://repo.maven.apache.org/maven2/de/tototec/de.tototec.cmdoption/0.2.0/de.tototec.cmdoption-0.2.0.pom
[INFO] Downloaded from central: https://repo.maven.apache.org/maven2/de/tototec/de.tototec.cmdoption/0.2.0/de.tototec.cmdoption-0.2.0.pom (956 B at 159 kB/s)
[INFO] Downloading from central: https://repo.maven.apache.org/maven2/org/semver/api/0.9.33/api-0.9.33.jar
[INFO] Downloading from central: https://repo.maven.apache.org/maven2/org/ow2/asm/asm/5.0.3/asm-5.0.3.jar
[INFO] Downloading from central: https://repo.maven.apache.org/maven2/org/ow2/asm/asm-tree/5.0.3/asm-tree-5.0.3.jar
[INFO] Downloading from central: https://repo.maven.apache.org/maven2/org/ow2/asm/asm-commons/5.0.3/asm-commons-5.0.3.jar
[INFO] Downloading from central: https://repo.maven.apache.org/maven2/com/google/code/findbugs/jsr305/2.0.0/jsr305-2.0.0.jar
[INFO] Downloaded from central: https://repo.maven.apache.org/maven2/org/ow2/asm/asm-tree/5.0.3/asm-tree-5.0.3.jar (29 kB at 1.2 MB/s)
[INFO] Downloading from central: https://repo.maven.apache.org/maven2/commons-lang/commons-lang/1.0/commons-lang-1.0.jar
[INFO] Downloaded from central: https://repo.maven.apache.org/maven2/org/semver/api/0.9.33/api-0.9.33.jar (64 kB at 1.3 MB/s)
[INFO] Downloading from central: https://repo.maven.apache.org/maven2/de/tototec/de.tototec.cmdoption/0.2.0/de.tototec.cmdoption-0.2.0.jar
[INFO] Downloaded from central: https://repo.maven.apache.org/maven2/com/google/code/findbugs/jsr305/2.0.0/jsr305-2.0.0.jar (32 kB at 601 kB/s)
[INFO] Downloaded from central: https://repo.maven.apache.org/maven2/org/ow2/asm/asm-commons/5.0.3/asm-commons-5.0.3.jar (42 kB at 802 kB/s)
[INFO] Downloaded from central: https://repo.maven.apache.org/maven2/org/ow2/asm/asm/5.0.3/asm-5.0.3.jar (53 kB at 902 kB/s)
[INFO] Downloaded from central: https://repo.maven.apache.org/maven2/de/tototec/de.tototec.cmdoption/0.2.0/de.tototec.cmdoption-0.2.0.jar (42 kB at 1.1 MB/s)
[INFO] Downloaded from central: https://repo.maven.apache.org/maven2/commons-lang/commons-lang/1.0/commons-lang-1.0.jar (64 kB at 1.6 MB/s)
[INFO]
[INFO] --- maven-clean-plugin:2.5:clean (default-clean) @ maven-release-semver-policy ---
[INFO]
[INFO] --- maven-enforcer-plugin:1.3.1:enforce (enforce-bytecode-version) @ maven-release-semver-policy ---
[INFO]
[INFO] --- maven-enforcer-plugin:1.3.1:enforce (ban-known-bad-maven-versions) @ maven-release-semver-policy ---
[INFO]
[INFO] --- apache-rat-plugin:0.11:check (rat-check) @ maven-release-semver-policy ---
[INFO] 51 implicit excludes (use -debug for more details).
[INFO] Exclude: .repository
[INFO] Exclude: Jenkinsfile
[INFO] Exclude: DEPENDENCIES
[INFO] 3 resources included (use -debug for more details)
[INFO] Rat check: Summary of files. Unapproved: 0 unknown: 0 generated: 0 approved: 3 licence.
[INFO]
[INFO] --- maven-remote-resources-plugin:1.5:process (default) @ maven-release-semver-policy ---
[INFO]
[INFO] --- maven-resources-plugin:2.7:resources (default-resources) @ maven-release-semver-policy ---
[INFO] Using 'UTF-8' encoding to copy filtered resources.
[INFO] skip non existing resourceDirectory F:\jenkins\jenkins-slave\workspace\-box_maven-release_MRELEASE-1007\m\maven-release-policies\maven-release-semver-policy\src\main\resources
[INFO] Copying 3 resources
[INFO]
[INFO] --- maven-compiler-plugin:3.2:compile (default-compile) @ maven-release-semver-policy ---
[INFO] Changes detected - recompiling the module!
[INFO] Compiling 1 source file to F:\jenkins\jenkins-slave\workspace\-box_maven-release_MRELEASE-1007\m\maven-release-policies\maven-release-semver-policy\target\classes
[INFO]
[INFO] --- plexus-component-metadata:1.7.1:generate-metadata (process-classes) @ maven-release-semver-policy ---
[INFO] Discovered 1 component descriptors(s)
[INFO]
[INFO] --- maven-resources-plugin:2.7:testResources (default-testResources) @ maven-release-semver-policy ---
[INFO] Using 'UTF-8' encoding to copy filtered resources.
[INFO] skip non existing resourceDirectory F:\jenkins\jenkins-slave\workspace\-box_maven-release_MRELEASE-1007\m\maven-release-policies\maven-release-semver-policy\src\test\resources
[INFO] Copying 3 resources
[INFO]
[INFO] --- maven-compiler-plugin:3.2:testCompile (default-testCompile) @ maven-release-semver-policy ---
[INFO] Changes detected - recompiling the module!
[INFO] Compiling 1 source file to F:\jenkins\jenkins-slave\workspace\-box_maven-release_MRELEASE-1007\m\maven-release-policies\maven-release-semver-policy\target\test-classes
[INFO]
[INFO] --- maven-surefire-plugin:2.20.1:test (default-test) @ maven-release-semver-policy ---
[INFO]
[INFO] -------------------------------------------------------
[INFO]  T E S T S
[INFO] -------------------------------------------------------
[INFO] Running org.apache.maven.shared.release.policy.semver.SemVerVersionPolicyTest
[INFO] Tests run: 2, Failures: 0, Errors: 0, Skipped: 0, Time elapsed: 0.124 s - in org.apache.maven.shared.release.policy.semver.SemVerVersionPolicyTest
[INFO]
[INFO] Results:
[INFO]
[INFO] Tests run: 2, Failures: 0, Errors: 0, Skipped: 0
[INFO]
[INFO]
[INFO] --- maven-jar-plugin:2.5:jar (default-jar) @ maven-release-semver-policy ---
[INFO] Building jar: F:\jenkins\jenkins-slave\workspace\-box_maven-release_MRELEASE-1007\m\maven-release-policies\maven-release-semver-policy\target\maven-release-semver-policy-3.0.0-SNAPSHOT.jar
[INFO]
[INFO] --- maven-site-plugin:3.4:attach-descriptor (attach-descriptor) @ maven-release-semver-policy ---
[INFO]
[INFO] --- maven-checkstyle-plugin:2.15:check (checkstyle-check) @ maven-release-semver-policy ---
[INFO] ------------------------------------------------------------------------
[INFO] Reactor Summary:
[INFO]
[INFO] Maven Release ...................................... SUCCESS [ 14.169 s]
[INFO] Maven Release APIs ................................. SUCCESS [  6.231 s]
[INFO] Maven Release Manager .............................. SUCCESS [01:47 min]
[INFO] Maven Release Plugin ............................... SUCCESS [07:01 min]
[INFO] Maven Release Odd-Even Policy ...................... SUCCESS [  1.902 s]
[INFO] Maven Release SemVer Policy ........................ SUCCESS [  2.674 s]
[INFO] ------------------------------------------------------------------------
[INFO] BUILD SUCCESS
[INFO] ------------------------------------------------------------------------
[INFO] Total time: 09:15 min
[INFO] Finished at: 2019-04-10T22:32:38Z
[INFO] Final Memory: 76M/1170M
[INFO] ------------------------------------------------------------------------
[INFO] [jenkins-event-spy] Generated F:\jenkins\jenkins-slave\workspace\-box_maven-release_MRELEASE-1007@tmp\withMavendbaa12b9\maven-spy-20190410-222322-1691155079776291476111.log
Picked up JAVA_TOOL_OPTIONS: -Dmaven.ext.class.path="f:\jenkins\jenkins-slave\workspace\-box_maven-release_MRELEASE-1007@tmp\withMavendbaa12b9\pipeline-maven-spy.jar" -Dorg.jenkinsci.plugins.pipeline.maven.reportsFolder="f:\jenkins\jenkins-slave\workspace\-box_maven-release_MRELEASE-1007@tmp\withMavendbaa12b9"
[Pipeline] }
[Pipeline] // dir
[Pipeline] }
[withMaven] invokerPublisher - Archive invoker results for Maven artifact MavenArtifact{org.apache.maven.plugins:maven-release-plugin:maven-plugin:3.0.0-SNAPSHOT(version: 3.0.0-SNAPSHOT, snapshot:false) } generated by PluginInvocation{org.apache.maven.plugins:maven-invoker-plugin:2.0.0@run  integration-test-prepare}: m\maven-release-plugin\target\invoker-reports\*.xml
[withMaven] invokerPublisher - Archive invoker results for Maven artifact MavenArtifact{org.apache.maven.plugins:maven-release-plugin:maven-plugin:3.0.0-SNAPSHOT(version: 3.0.0-SNAPSHOT, snapshot:false) } generated by PluginInvocation{org.apache.maven.plugins:maven-invoker-plugin:2.0.0@run  integration-test-prepare-with-pom}: m\maven-release-plugin\target\invoker-reports\*.xml
[withMaven] invokerPublisher - Archive invoker results for Maven artifact MavenArtifact{org.apache.maven.plugins:maven-release-plugin:maven-plugin:3.0.0-SNAPSHOT(version: 3.0.0-SNAPSHOT, snapshot:false) } generated by PluginInvocation{org.apache.maven.plugins:maven-invoker-plugin:2.0.0@run  integration-test-branch}: m\maven-release-plugin\target\invoker-reports\*.xml
[withMaven] invokerPublisher - Archive invoker results for Maven artifact MavenArtifact{org.apache.maven.plugins:maven-release-plugin:maven-plugin:3.0.0-SNAPSHOT(version: 3.0.0-SNAPSHOT, snapshot:false) } generated by PluginInvocation{org.apache.maven.plugins:maven-invoker-plugin:2.0.0@run  integration-test-perform}: m\maven-release-plugin\target\invoker-reports\*.xml
[withMaven] invokerPublisher - Archive invoker results for Maven artifact MavenArtifact{org.apache.maven.plugins:maven-release-plugin:maven-plugin:3.0.0-SNAPSHOT(version: 3.0.0-SNAPSHOT, snapshot:false) } generated by PluginInvocation{org.apache.maven.plugins:maven-invoker-plugin:2.0.0@run  integration-test-update-versions}: m\maven-release-plugin\target\invoker-reports\*.xml
[withMaven] junitPublisher - Archive test results for Maven artifact org.apache.maven.release:maven-release-api:jar:3.0.0-SNAPSHOT generated by maven-surefire-plugin:test (default-test): m\maven-release-api\target\surefire-reports\*.xml
Recording test results
None of the test reports contained any result
[withMaven] junitPublisher - Archive test results for Maven artifact org.apache.maven.release:maven-release-manager:jar:3.0.0-SNAPSHOT generated by maven-surefire-plugin:test (default-test): m\maven-release-manager\target\surefire-reports\*.xml
Recording test results
[withMaven] junitPublisher - Archive test results for Maven artifact org.apache.maven.plugins:maven-release-plugin:maven-plugin:3.0.0-SNAPSHOT generated by maven-surefire-plugin:test (default-test): m\maven-release-plugin\target\surefire-reports\*.xml
Recording test results
[withMaven] junitPublisher - Archive test results for Maven artifact org.apache.maven.release:maven-release-oddeven-policy:jar:3.0.0-SNAPSHOT generated by maven-surefire-plugin:test (default-test): m\maven-release-policies\maven-release-oddeven-policy\target\surefire-reports\*.xml
Recording test results
[withMaven] junitPublisher - Archive test results for Maven artifact org.apache.maven.release:maven-release-semver-policy:jar:3.0.0-SNAPSHOT generated by maven-surefire-plugin:test (default-test): m\maven-release-policies\maven-release-semver-policy\target\surefire-reports\*.xml
Recording test results
[withMaven] junitPublisher - Archive test results for Maven artifact org.apache.maven.release:maven-release-manager:jar:3.0.0-SNAPSHOT generated by maven-failsafe-plugin:integration-test (default): m\maven-release-manager\target\failsafe-reports\*.xml
Recording test results
[withMaven] Publishers: Pipeline Graph Publisher: 71 ms, Invoker Publisher: 158402 ms, Junit Publisher: 3962 ms, Dependencies Fingerprint Publisher: 341 ms
[withMaven] One or multiple Maven executions have been ignored by the Jenkins Pipeline Maven Plugin because they have been interrupted before completion (1). See Pipeline Maven Plugin FAQ for more details.
[Pipeline] // withMaven
[Pipeline] cleanWs
[WS-CLEANUP] Deleting project workspace...
[WS-CLEANUP] Deferred wipeout is used...
[WS-CLEANUP] done
[Pipeline] }
[Pipeline] // stage
[Pipeline] }
[Pipeline] // node
[Pipeline] }
[Pipeline] // parallel
[Pipeline] echo
[FAILURE-001] org.jenkinsci.plugins.scriptsecurity.sandbox.RejectedAccessException: Scripts not permitted to use method org.jenkinsci.plugins.workflow.support.steps.build.RunWrapper getRawBuild
[Pipeline] stage
[Pipeline] { (Notifications)
[Pipeline] echo
Build result: FAILURE
[Pipeline] jiraIssueSelector
[Pipeline] emailext
Reply | Threaded
Open this post in threaded view
|

Build failed in Jenkins: Maven TLP » maven-release » MRELEASE-1007 #4

Apache Jenkins Server-2
See https://builds.apache.org/job/maven-box/job/maven-release/job/MRELEASE-1007/4/

No changes.

All tests passed

Build log:
[...truncated 19410 lines...]
[INFO] Building: projects\perform\MRELEASE-592\pom.xml
[INFO] ..SUCCESS (24.9 s)
[INFO] Building: projects\perform\MRELEASE-736\pom.xml
[INFO] ..SUCCESS (25.4 s)
[INFO] Building: projects\perform\MRELEASE-818\pom.xml
[INFO] run script verify.groovy
[INFO] ..SUCCESS (25.0 s)
[INFO] Building: projects\perform\MRELEASE-832\pom.xml
[INFO] run script verify.groovy
[INFO] ..SUCCESS (10.8 s)
[INFO] -------------------------------------------------
[INFO] Build Summary:
[INFO]   Passed: 5, Failed: 0, Errors: 0, Skipped: 0
[INFO] -------------------------------------------------
[INFO]
[INFO] --- maven-invoker-plugin:2.0.0:run (integration-test-update-versions) @ maven-release-plugin ---
[INFO] Building: projects\update-versions\MRELEASE-555\pom.xml
[INFO] run script verify.groovy
[INFO] ..SUCCESS (11.4 s)
[INFO] Building: projects\update-versions\MRELEASE-611\pom.xml
[INFO] run script verify.groovy
[INFO] ..SUCCESS (11.3 s)
[INFO] Building: projects\update-versions\MRELEASE-783\pom.xml
[INFO] ..SUCCESS (11.5 s)
[INFO] Building: projects\update-versions\MRELEASE-976\pom.xml
[INFO] run script verify.groovy
[INFO] ..SUCCESS (11.5 s)
[INFO] -------------------------------------------------
[INFO] Build Summary:
[INFO]   Passed: 4, Failed: 0, Errors: 0, Skipped: 0
[INFO] -------------------------------------------------
[INFO]
[INFO] --- maven-checkstyle-plugin:2.15:check (checkstyle-check) @ maven-release-plugin ---
[INFO]
[INFO] ------------------------------------------------------------------------
[INFO] Building Maven Release Odd-Even Policy 3.0.0-SNAPSHOT
[INFO] ------------------------------------------------------------------------
[INFO]
[INFO] --- maven-clean-plugin:2.5:clean (default-clean) @ maven-release-oddeven-policy ---
[INFO]
[INFO] --- maven-enforcer-plugin:1.3.1:enforce (enforce-bytecode-version) @ maven-release-oddeven-policy ---
[INFO]
[INFO] --- maven-enforcer-plugin:1.3.1:enforce (ban-known-bad-maven-versions) @ maven-release-oddeven-policy ---
[INFO]
[INFO] --- apache-rat-plugin:0.11:check (rat-check) @ maven-release-oddeven-policy ---
[INFO] 51 implicit excludes (use -debug for more details).
[INFO] Exclude: .repository
[INFO] Exclude: Jenkinsfile
[INFO] Exclude: DEPENDENCIES
[INFO] 4 resources included (use -debug for more details)
[INFO] Rat check: Summary of files. Unapproved: 0 unknown: 0 generated: 0 approved: 4 licence.
[INFO]
[INFO] --- maven-remote-resources-plugin:1.5:process (default) @ maven-release-oddeven-policy ---
[INFO]
[INFO] --- maven-resources-plugin:2.7:resources (default-resources) @ maven-release-oddeven-policy ---
[INFO] Using 'UTF-8' encoding to copy filtered resources.
[INFO] skip non existing resourceDirectory F:\jenkins\jenkins-slave\workspace\-box_maven-release_MRELEASE-1007\m\maven-release-policies\maven-release-oddeven-policy\src\main\resources
[INFO] Copying 3 resources
[INFO]
[INFO] --- maven-compiler-plugin:3.2:compile (default-compile) @ maven-release-oddeven-policy ---
[INFO] Changes detected - recompiling the module!
[INFO] Compiling 2 source files to F:\jenkins\jenkins-slave\workspace\-box_maven-release_MRELEASE-1007\m\maven-release-policies\maven-release-oddeven-policy\target\classes
[INFO]
[INFO] --- plexus-component-metadata:1.7.1:generate-metadata (process-classes) @ maven-release-oddeven-policy ---
[INFO] Discovered 1 component descriptors(s)
[INFO]
[INFO] --- maven-resources-plugin:2.7:testResources (default-testResources) @ maven-release-oddeven-policy ---
[INFO] Using 'UTF-8' encoding to copy filtered resources.
[INFO] skip non existing resourceDirectory F:\jenkins\jenkins-slave\workspace\-box_maven-release_MRELEASE-1007\m\maven-release-policies\maven-release-oddeven-policy\src\test\resources
[INFO] Copying 3 resources
[INFO]
[INFO] --- maven-compiler-plugin:3.2:testCompile (default-testCompile) @ maven-release-oddeven-policy ---
[INFO] Changes detected - recompiling the module!
[INFO] Compiling 1 source file to F:\jenkins\jenkins-slave\workspace\-box_maven-release_MRELEASE-1007\m\maven-release-policies\maven-release-oddeven-policy\target\test-classes
[INFO]
[INFO] --- maven-surefire-plugin:2.20.1:test (default-test) @ maven-release-oddeven-policy ---
[INFO]
[INFO] -------------------------------------------------------
[INFO]  T E S T S
[INFO] -------------------------------------------------------
[INFO] Running org.apache.maven.shared.release.policy.oddeven.OddEvenVersionPolicyTestCase
[INFO] Tests run: 3, Failures: 0, Errors: 0, Skipped: 0, Time elapsed: 0.314 s - in org.apache.maven.shared.release.policy.oddeven.OddEvenVersionPolicyTestCase
[INFO]
[INFO] Results:
[INFO]
[INFO] Tests run: 3, Failures: 0, Errors: 0, Skipped: 0
[INFO]
[INFO]
[INFO] --- maven-jar-plugin:2.5:jar (default-jar) @ maven-release-oddeven-policy ---
[INFO] Building jar: F:\jenkins\jenkins-slave\workspace\-box_maven-release_MRELEASE-1007\m\maven-release-policies\maven-release-oddeven-policy\target\maven-release-oddeven-policy-3.0.0-SNAPSHOT.jar
[INFO]
[INFO] --- maven-site-plugin:3.4:attach-descriptor (attach-descriptor) @ maven-release-oddeven-policy ---
[INFO]
[INFO] --- maven-checkstyle-plugin:2.15:check (checkstyle-check) @ maven-release-oddeven-policy ---
[INFO]
[INFO] ------------------------------------------------------------------------
[INFO] Building Maven Release SemVer Policy 3.0.0-SNAPSHOT
[INFO] ------------------------------------------------------------------------
[INFO] Downloading from central: https://repo.maven.apache.org/maven2/org/semver/api/0.9.33/api-0.9.33.pom
[INFO] Downloaded from central: https://repo.maven.apache.org/maven2/org/semver/api/0.9.33/api-0.9.33.pom (2.8 kB at 22 kB/s)
[INFO] Downloading from central: https://repo.maven.apache.org/maven2/org/semver/parent/0.9.33/parent-0.9.33.pom
[INFO] Downloaded from central: https://repo.maven.apache.org/maven2/org/semver/parent/0.9.33/parent-0.9.33.pom (1.3 kB at 97 kB/s)
[INFO] Downloading from central: https://repo.maven.apache.org/maven2/com/github/jeluard/oss-parent/9/oss-parent-9.pom
[INFO] Downloaded from central: https://repo.maven.apache.org/maven2/com/github/jeluard/oss-parent/9/oss-parent-9.pom (12 kB at 959 kB/s)
[INFO] Downloading from central: https://repo.maven.apache.org/maven2/com/google/code/findbugs/jsr305/2.0.0/jsr305-2.0.0.pom
[INFO] Downloaded from central: https://repo.maven.apache.org/maven2/com/google/code/findbugs/jsr305/2.0.0/jsr305-2.0.0.pom (965 B at 80 kB/s)
[INFO] Downloading from central: https://repo.maven.apache.org/maven2/org/ow2/asm/asm/5.0.3/asm-5.0.3.pom
[INFO] Downloaded from central: https://repo.maven.apache.org/maven2/org/ow2/asm/asm/5.0.3/asm-5.0.3.pom (1.9 kB at 176 kB/s)
[INFO] Downloading from central: https://repo.maven.apache.org/maven2/org/ow2/asm/asm-parent/5.0.3/asm-parent-5.0.3.pom
[INFO] Downloaded from central: https://repo.maven.apache.org/maven2/org/ow2/asm/asm-parent/5.0.3/asm-parent-5.0.3.pom (5.5 kB at 423 kB/s)
[INFO] Downloading from central: https://repo.maven.apache.org/maven2/org/ow2/asm/asm-commons/5.0.3/asm-commons-5.0.3.pom
[INFO] Downloaded from central: https://repo.maven.apache.org/maven2/org/ow2/asm/asm-commons/5.0.3/asm-commons-5.0.3.pom (2.1 kB at 174 kB/s)
[INFO] Downloading from central: https://repo.maven.apache.org/maven2/org/ow2/asm/asm-tree/5.0.3/asm-tree-5.0.3.pom
[INFO] Downloaded from central: https://repo.maven.apache.org/maven2/org/ow2/asm/asm-tree/5.0.3/asm-tree-5.0.3.pom (2.1 kB at 160 kB/s)
[INFO] Downloading from central: https://repo.maven.apache.org/maven2/commons-lang/commons-lang/1.0/commons-lang-1.0.pom
[INFO] Downloaded from central: https://repo.maven.apache.org/maven2/commons-lang/commons-lang/1.0/commons-lang-1.0.pom (2.5 kB at 189 kB/s)
[INFO] Downloading from central: https://repo.maven.apache.org/maven2/de/tototec/de.tototec.cmdoption/0.2.0/de.tototec.cmdoption-0.2.0.pom
[INFO] Downloaded from central: https://repo.maven.apache.org/maven2/de/tototec/de.tototec.cmdoption/0.2.0/de.tototec.cmdoption-0.2.0.pom (956 B at 60 kB/s)
[INFO] Downloading from central: https://repo.maven.apache.org/maven2/org/ow2/asm/asm-tree/5.0.3/asm-tree-5.0.3.jar
[INFO] Downloading from central: https://repo.maven.apache.org/maven2/com/google/code/findbugs/jsr305/2.0.0/jsr305-2.0.0.jar
[INFO] Downloading from central: https://repo.maven.apache.org/maven2/org/semver/api/0.9.33/api-0.9.33.jar
[INFO] Downloading from central: https://repo.maven.apache.org/maven2/org/ow2/asm/asm/5.0.3/asm-5.0.3.jar
[INFO] Downloading from central: https://repo.maven.apache.org/maven2/org/ow2/asm/asm-commons/5.0.3/asm-commons-5.0.3.jar
[INFO] Downloaded from central: https://repo.maven.apache.org/maven2/com/google/code/findbugs/jsr305/2.0.0/jsr305-2.0.0.jar (32 kB at 861 kB/s)
[INFO] Downloading from central: https://repo.maven.apache.org/maven2/commons-lang/commons-lang/1.0/commons-lang-1.0.jar
[INFO] Downloaded from central: https://repo.maven.apache.org/maven2/org/ow2/asm/asm-commons/5.0.3/asm-commons-5.0.3.jar (42 kB at 571 kB/s)
[INFO] Downloading from central: https://repo.maven.apache.org/maven2/de/tototec/de.tototec.cmdoption/0.2.0/de.tototec.cmdoption-0.2.0.jar
[INFO] Downloaded from central: https://repo.maven.apache.org/maven2/org/ow2/asm/asm-tree/5.0.3/asm-tree-5.0.3.jar (29 kB at 346 kB/s)
[INFO] Downloaded from central: https://repo.maven.apache.org/maven2/commons-lang/commons-lang/1.0/commons-lang-1.0.jar (64 kB at 760 kB/s)
[INFO] Downloaded from central: https://repo.maven.apache.org/maven2/org/ow2/asm/asm/5.0.3/asm-5.0.3.jar (53 kB at 626 kB/s)
[INFO] Downloaded from central: https://repo.maven.apache.org/maven2/de/tototec/de.tototec.cmdoption/0.2.0/de.tototec.cmdoption-0.2.0.jar (42 kB at 425 kB/s)
[INFO] Downloaded from central: https://repo.maven.apache.org/maven2/org/semver/api/0.9.33/api-0.9.33.jar (64 kB at 629 kB/s)
[INFO]
[INFO] --- maven-clean-plugin:2.5:clean (default-clean) @ maven-release-semver-policy ---
[INFO]
[INFO] --- maven-enforcer-plugin:1.3.1:enforce (enforce-bytecode-version) @ maven-release-semver-policy ---
[INFO]
[INFO] --- maven-enforcer-plugin:1.3.1:enforce (ban-known-bad-maven-versions) @ maven-release-semver-policy ---
[INFO]
[INFO] --- apache-rat-plugin:0.11:check (rat-check) @ maven-release-semver-policy ---
[INFO] 51 implicit excludes (use -debug for more details).
[INFO] Exclude: .repository
[INFO] Exclude: Jenkinsfile
[INFO] Exclude: DEPENDENCIES
[INFO] 3 resources included (use -debug for more details)
[INFO] Rat check: Summary of files. Unapproved: 0 unknown: 0 generated: 0 approved: 3 licence.
[INFO]
[INFO] --- maven-remote-resources-plugin:1.5:process (default) @ maven-release-semver-policy ---
[INFO]
[INFO] --- maven-resources-plugin:2.7:resources (default-resources) @ maven-release-semver-policy ---
[INFO] Using 'UTF-8' encoding to copy filtered resources.
[INFO] skip non existing resourceDirectory F:\jenkins\jenkins-slave\workspace\-box_maven-release_MRELEASE-1007\m\maven-release-policies\maven-release-semver-policy\src\main\resources
[INFO] Copying 3 resources
[INFO]
[INFO] --- maven-compiler-plugin:3.2:compile (default-compile) @ maven-release-semver-policy ---
[INFO] Changes detected - recompiling the module!
[INFO] Compiling 1 source file to F:\jenkins\jenkins-slave\workspace\-box_maven-release_MRELEASE-1007\m\maven-release-policies\maven-release-semver-policy\target\classes
[INFO]
[INFO] --- plexus-component-metadata:1.7.1:generate-metadata (process-classes) @ maven-release-semver-policy ---
[INFO] Discovered 1 component descriptors(s)
[INFO]
[INFO] --- maven-resources-plugin:2.7:testResources (default-testResources) @ maven-release-semver-policy ---
[INFO] Using 'UTF-8' encoding to copy filtered resources.
[INFO] skip non existing resourceDirectory F:\jenkins\jenkins-slave\workspace\-box_maven-release_MRELEASE-1007\m\maven-release-policies\maven-release-semver-policy\src\test\resources
[INFO] Copying 3 resources
[INFO]
[INFO] --- maven-compiler-plugin:3.2:testCompile (default-testCompile) @ maven-release-semver-policy ---
[INFO] Changes detected - recompiling the module!
[INFO] Compiling 1 source file to F:\jenkins\jenkins-slave\workspace\-box_maven-release_MRELEASE-1007\m\maven-release-policies\maven-release-semver-policy\target\test-classes
[INFO]
[INFO] --- maven-surefire-plugin:2.20.1:test (default-test) @ maven-release-semver-policy ---
[INFO]
[INFO] -------------------------------------------------------
[INFO]  T E S T S
[INFO] -------------------------------------------------------
[INFO] Running org.apache.maven.shared.release.policy.semver.SemVerVersionPolicyTest
[INFO] Tests run: 2, Failures: 0, Errors: 0, Skipped: 0, Time elapsed: 0.722 s - in org.apache.maven.shared.release.policy.semver.SemVerVersionPolicyTest
[INFO]
[INFO] Results:
[INFO]
[INFO] Tests run: 2, Failures: 0, Errors: 0, Skipped: 0
[INFO]
[INFO]
[INFO] --- maven-jar-plugin:2.5:jar (default-jar) @ maven-release-semver-policy ---
[INFO] Building jar: F:\jenkins\jenkins-slave\workspace\-box_maven-release_MRELEASE-1007\m\maven-release-policies\maven-release-semver-policy\target\maven-release-semver-policy-3.0.0-SNAPSHOT.jar
[INFO]
[INFO] --- maven-site-plugin:3.4:attach-descriptor (attach-descriptor) @ maven-release-semver-policy ---
[INFO]
[INFO] --- maven-checkstyle-plugin:2.15:check (checkstyle-check) @ maven-release-semver-policy ---
[INFO] ------------------------------------------------------------------------
[INFO] Reactor Summary:
[INFO]
[INFO] Maven Release ...................................... SUCCESS [ 27.082 s]
[INFO] Maven Release APIs ................................. SUCCESS [ 12.596 s]
[INFO] Maven Release Manager .............................. SUCCESS [04:11 min]
[INFO] Maven Release Plugin ............................... SUCCESS [12:53 min]
[INFO] Maven Release Odd-Even Policy ...................... SUCCESS [  3.323 s]
[INFO] Maven Release SemVer Policy ........................ SUCCESS [  6.159 s]
[INFO] ------------------------------------------------------------------------
[INFO] BUILD SUCCESS
[INFO] ------------------------------------------------------------------------
[INFO] Total time: 17:59 min
[INFO] Finished at: 2019-04-15T12:29:02Z
[INFO] Final Memory: 85M/1219M
[INFO] ------------------------------------------------------------------------
[INFO] [jenkins-event-spy] Generated F:\jenkins\jenkins-slave\workspace\-box_maven-release_MRELEASE-1007@tmp\withMavena5d7b95b\maven-spy-20190415-121101-8992002910322034211394.log
Picked up JAVA_TOOL_OPTIONS: -Dmaven.ext.class.path="f:\jenkins\jenkins-slave\workspace\-box_maven-release_MRELEASE-1007@tmp\withMavena5d7b95b\pipeline-maven-spy.jar" -Dorg.jenkinsci.plugins.pipeline.maven.reportsFolder="f:\jenkins\jenkins-slave\workspace\-box_maven-release_MRELEASE-1007@tmp\withMavena5d7b95b"
[Pipeline] }
[Pipeline] // dir
[Pipeline] }
[withMaven] invokerPublisher - Archive invoker results for Maven artifact MavenArtifact{org.apache.maven.plugins:maven-release-plugin:maven-plugin:3.0.0-SNAPSHOT(version: 3.0.0-SNAPSHOT, snapshot:false) } generated by PluginInvocation{org.apache.maven.plugins:maven-invoker-plugin:2.0.0@run  integration-test-prepare}: m\maven-release-plugin\target\invoker-reports\*.xml
[withMaven] invokerPublisher - Archive invoker results for Maven artifact MavenArtifact{org.apache.maven.plugins:maven-release-plugin:maven-plugin:3.0.0-SNAPSHOT(version: 3.0.0-SNAPSHOT, snapshot:false) } generated by PluginInvocation{org.apache.maven.plugins:maven-invoker-plugin:2.0.0@run  integration-test-prepare-with-pom}: m\maven-release-plugin\target\invoker-reports\*.xml
[withMaven] invokerPublisher - Archive invoker results for Maven artifact MavenArtifact{org.apache.maven.plugins:maven-release-plugin:maven-plugin:3.0.0-SNAPSHOT(version: 3.0.0-SNAPSHOT, snapshot:false) } generated by PluginInvocation{org.apache.maven.plugins:maven-invoker-plugin:2.0.0@run  integration-test-branch}: m\maven-release-plugin\target\invoker-reports\*.xml
[withMaven] invokerPublisher - Archive invoker results for Maven artifact MavenArtifact{org.apache.maven.plugins:maven-release-plugin:maven-plugin:3.0.0-SNAPSHOT(version: 3.0.0-SNAPSHOT, snapshot:false) } generated by PluginInvocation{org.apache.maven.plugins:maven-invoker-plugin:2.0.0@run  integration-test-perform}: m\maven-release-plugin\target\invoker-reports\*.xml
[withMaven] invokerPublisher - Archive invoker results for Maven artifact MavenArtifact{org.apache.maven.plugins:maven-release-plugin:maven-plugin:3.0.0-SNAPSHOT(version: 3.0.0-SNAPSHOT, snapshot:false) } generated by PluginInvocation{org.apache.maven.plugins:maven-invoker-plugin:2.0.0@run  integration-test-update-versions}: m\maven-release-plugin\target\invoker-reports\*.xml
[withMaven] junitPublisher - Archive test results for Maven artifact org.apache.maven.release:maven-release-api:jar:3.0.0-SNAPSHOT generated by maven-surefire-plugin:test (default-test): m\maven-release-api\target\surefire-reports\*.xml
Recording test results
None of the test reports contained any result
[withMaven] junitPublisher - Archive test results for Maven artifact org.apache.maven.release:maven-release-manager:jar:3.0.0-SNAPSHOT generated by maven-surefire-plugin:test (default-test): m\maven-release-manager\target\surefire-reports\*.xml
Recording test results
[withMaven] junitPublisher - Archive test results for Maven artifact org.apache.maven.plugins:maven-release-plugin:maven-plugin:3.0.0-SNAPSHOT generated by maven-surefire-plugin:test (default-test): m\maven-release-plugin\target\surefire-reports\*.xml
Recording test results
[withMaven] junitPublisher - Archive test results for Maven artifact org.apache.maven.release:maven-release-oddeven-policy:jar:3.0.0-SNAPSHOT generated by maven-surefire-plugin:test (default-test): m\maven-release-policies\maven-release-oddeven-policy\target\surefire-reports\*.xml
Recording test results
[withMaven] junitPublisher - Archive test results for Maven artifact org.apache.maven.release:maven-release-semver-policy:jar:3.0.0-SNAPSHOT generated by maven-surefire-plugin:test (default-test): m\maven-release-policies\maven-release-semver-policy\target\surefire-reports\*.xml
Recording test results
[withMaven] junitPublisher - Archive test results for Maven artifact org.apache.maven.release:maven-release-manager:jar:3.0.0-SNAPSHOT generated by maven-failsafe-plugin:integration-test (default): m\maven-release-manager\target\failsafe-reports\*.xml
Recording test results
[withMaven] Publishers: Pipeline Graph Publisher: 7 ms, Invoker Publisher: 145255 ms, Junit Publisher: 4467 ms, Concordion Publisher: 1 ms, Dependencies Fingerprint Publisher: 372 ms
[withMaven] One or multiple Maven executions have been ignored by the Jenkins Pipeline Maven Plugin because they have been interrupted before completion (1). See Pipeline Maven Plugin FAQ for more details.
[Pipeline] // withMaven
[Pipeline] cleanWs
[WS-CLEANUP] Deleting project workspace...
[WS-CLEANUP] Deferred wipeout is used...
[WS-CLEANUP] done
[Pipeline] }
[Pipeline] // stage
[Pipeline] }
[Pipeline] // node
[Pipeline] }
[Pipeline] // parallel
[Pipeline] echo
[FAILURE-001] org.jenkinsci.plugins.scriptsecurity.sandbox.RejectedAccessException: Scripts not permitted to use method org.jenkinsci.plugins.workflow.support.steps.build.RunWrapper getRawBuild
[Pipeline] stage
[Pipeline] { (Notifications)
[Pipeline] echo
Build result: FAILURE
[Pipeline] jiraIssueSelector
[Pipeline] emailext
Reply | Threaded
Open this post in threaded view
|

Build failed in Jenkins: Maven TLP » maven-release » MRELEASE-1007 #5

Apache Jenkins Server-2
See https://builds.apache.org/job/maven-box/job/maven-release/job/MRELEASE-1007/5/

Changes:

* [MNG-6573] Use Maven 3.6.0 as default
* H39 has weird issues, exclude it for now
* Fix no access to currentBuild.rawBuild
* fixed typo
* Include more recent JDKs

All tests passed

Build log:
[...truncated 23688 lines...]
[INFO]
[INFO] --- maven-invoker-plugin:2.0.0:run (integration-test-perform) @ maven-release-plugin ---
[INFO] Building: projects\perform\MRELEASE-459\pom.xml
[INFO] run script verify.groovy
[INFO] ..SUCCESS (12.2 s)
[INFO] Building: projects\perform\MRELEASE-592\pom.xml
[INFO] ..SUCCESS (11.2 s)
[INFO] Building: projects\perform\MRELEASE-736\pom.xml
[INFO] ..SUCCESS (12.1 s)
[INFO] Building: projects\perform\MRELEASE-818\pom.xml
[INFO] run script verify.groovy
[INFO] ..SUCCESS (13.8 s)
[INFO] Building: projects\perform\MRELEASE-832\pom.xml
[INFO] run script verify.groovy
[INFO] ..SUCCESS (5.8 s)
[INFO] -------------------------------------------------
[INFO] Build Summary:
[INFO]   Passed: 5, Failed: 0, Errors: 0, Skipped: 0
[INFO] -------------------------------------------------
[INFO]
[INFO] --- maven-invoker-plugin:2.0.0:run (integration-test-update-versions) @ maven-release-plugin ---
[INFO] Building: projects\update-versions\MRELEASE-555\pom.xml
[INFO] run script verify.groovy
[INFO] ..SUCCESS (7.4 s)
[INFO] Building: projects\update-versions\MRELEASE-611\pom.xml
[INFO] run script verify.groovy
[INFO] ..SUCCESS (7.0 s)
[INFO] Building: projects\update-versions\MRELEASE-783\pom.xml
[INFO] ..SUCCESS (6.2 s)
[INFO] Building: projects\update-versions\MRELEASE-976\pom.xml
[INFO] run script verify.groovy
[INFO] ..SUCCESS (7.0 s)
[INFO] -------------------------------------------------
[INFO] Build Summary:
[INFO]   Passed: 4, Failed: 0, Errors: 0, Skipped: 0
[INFO] -------------------------------------------------
[INFO]
[INFO] --- maven-checkstyle-plugin:2.15:check (checkstyle-check) @ maven-release-plugin ---
[INFO]
[INFO] -------< org.apache.maven.release:maven-release-oddeven-policy >--------
[INFO] Building Maven Release Odd-Even Policy 3.0.0-SNAPSHOT              [5/6]
[INFO] --------------------------------[ jar ]---------------------------------
[INFO]
[INFO] --- maven-clean-plugin:2.5:clean (default-clean) @ maven-release-oddeven-policy ---
[INFO]
[INFO] --- maven-enforcer-plugin:1.3.1:enforce (enforce-bytecode-version) @ maven-release-oddeven-policy ---
[INFO]
[INFO] --- maven-enforcer-plugin:1.3.1:enforce (ban-known-bad-maven-versions) @ maven-release-oddeven-policy ---
[INFO]
[INFO] --- apache-rat-plugin:0.11:check (rat-check) @ maven-release-oddeven-policy ---
[INFO] 51 implicit excludes (use -debug for more details).
[INFO] Exclude: .repository
[INFO] Exclude: Jenkinsfile
[INFO] Exclude: DEPENDENCIES
[INFO] 4 resources included (use -debug for more details)
[INFO] Rat check: Summary of files. Unapproved: 0 unknown: 0 generated: 0 approved: 4 licence.
[INFO]
[INFO] --- maven-remote-resources-plugin:1.5:process (default) @ maven-release-oddeven-policy ---
[INFO]
[INFO] --- maven-resources-plugin:2.7:resources (default-resources) @ maven-release-oddeven-policy ---
[INFO] Using 'UTF-8' encoding to copy filtered resources.
[INFO] skip non existing resourceDirectory F:\jenkins\jenkins-slave\workspace\-box_maven-release_MRELEASE-1007\m\maven-release-policies\maven-release-oddeven-policy\src\main\resources
[INFO] Copying 3 resources
[INFO]
[INFO] --- maven-compiler-plugin:3.2:compile (default-compile) @ maven-release-oddeven-policy ---
[INFO] Changes detected - recompiling the module!
[INFO] Compiling 2 source files to F:\jenkins\jenkins-slave\workspace\-box_maven-release_MRELEASE-1007\m\maven-release-policies\maven-release-oddeven-policy\target\classes
[INFO]
[INFO] --- plexus-component-metadata:1.7.1:generate-metadata (process-classes) @ maven-release-oddeven-policy ---
[INFO] Discovered 1 component descriptors(s)
[INFO]
[INFO] --- maven-resources-plugin:2.7:testResources (default-testResources) @ maven-release-oddeven-policy ---
[INFO] Using 'UTF-8' encoding to copy filtered resources.
[INFO] skip non existing resourceDirectory F:\jenkins\jenkins-slave\workspace\-box_maven-release_MRELEASE-1007\m\maven-release-policies\maven-release-oddeven-policy\src\test\resources
[INFO] Copying 3 resources
[INFO]
[INFO] --- maven-compiler-plugin:3.2:testCompile (default-testCompile) @ maven-release-oddeven-policy ---
[INFO] Changes detected - recompiling the module!
[INFO] Compiling 1 source file to F:\jenkins\jenkins-slave\workspace\-box_maven-release_MRELEASE-1007\m\maven-release-policies\maven-release-oddeven-policy\target\test-classes
[INFO]
[INFO] --- maven-surefire-plugin:2.20.1:test (default-test) @ maven-release-oddeven-policy ---
[INFO]
[INFO] -------------------------------------------------------
[INFO]  T E S T S
[INFO] -------------------------------------------------------
[INFO] Running org.apache.maven.shared.release.policy.oddeven.OddEvenVersionPolicyTestCase
[INFO] Tests run: 3, Failures: 0, Errors: 0, Skipped: 0, Time elapsed: 0.267 s - in org.apache.maven.shared.release.policy.oddeven.OddEvenVersionPolicyTestCase
[INFO]
[INFO] Results:
[INFO]
[INFO] Tests run: 3, Failures: 0, Errors: 0, Skipped: 0
[INFO]
[INFO]
[INFO] --- maven-jar-plugin:2.5:jar (default-jar) @ maven-release-oddeven-policy ---
[INFO] Building jar: F:\jenkins\jenkins-slave\workspace\-box_maven-release_MRELEASE-1007\m\maven-release-policies\maven-release-oddeven-policy\target\maven-release-oddeven-policy-3.0.0-SNAPSHOT.jar
[INFO]
[INFO] --- maven-site-plugin:3.4:attach-descriptor (attach-descriptor) @ maven-release-oddeven-policy ---
[INFO]
[INFO] --- maven-checkstyle-plugin:2.15:check (checkstyle-check) @ maven-release-oddeven-policy ---
[INFO]
[INFO] --------< org.apache.maven.release:maven-release-semver-policy >--------
[INFO] Building Maven Release SemVer Policy 3.0.0-SNAPSHOT                [6/6]
[INFO] --------------------------------[ jar ]---------------------------------
[INFO] Downloading from central: https://repo.maven.apache.org/maven2/org/semver/api/0.9.33/api-0.9.33.pom
[INFO] Downloaded from central: https://repo.maven.apache.org/maven2/org/semver/api/0.9.33/api-0.9.33.pom (2.8 kB at 315 kB/s)
[INFO] Downloading from central: https://repo.maven.apache.org/maven2/org/semver/parent/0.9.33/parent-0.9.33.pom
[INFO] Downloaded from central: https://repo.maven.apache.org/maven2/org/semver/parent/0.9.33/parent-0.9.33.pom (1.3 kB at 180 kB/s)
[INFO] Downloading from central: https://repo.maven.apache.org/maven2/com/github/jeluard/oss-parent/9/oss-parent-9.pom
[INFO] Downloaded from central: https://repo.maven.apache.org/maven2/com/github/jeluard/oss-parent/9/oss-parent-9.pom (12 kB at 1.8 MB/s)
[INFO] Downloading from central: https://repo.maven.apache.org/maven2/com/google/code/findbugs/jsr305/2.0.0/jsr305-2.0.0.pom
[INFO] Downloaded from central: https://repo.maven.apache.org/maven2/com/google/code/findbugs/jsr305/2.0.0/jsr305-2.0.0.pom (965 B at 161 kB/s)
[INFO] Downloading from central: https://repo.maven.apache.org/maven2/org/ow2/asm/asm/5.0.3/asm-5.0.3.pom
[INFO] Downloaded from central: https://repo.maven.apache.org/maven2/org/ow2/asm/asm/5.0.3/asm-5.0.3.pom (1.9 kB at 322 kB/s)
[INFO] Downloading from central: https://repo.maven.apache.org/maven2/org/ow2/asm/asm-parent/5.0.3/asm-parent-5.0.3.pom
[INFO] Downloaded from central: https://repo.maven.apache.org/maven2/org/ow2/asm/asm-parent/5.0.3/asm-parent-5.0.3.pom (5.5 kB at 423 kB/s)
[INFO] Downloading from central: https://repo.maven.apache.org/maven2/org/ow2/asm/asm-commons/5.0.3/asm-commons-5.0.3.pom
[INFO] Downloaded from central: https://repo.maven.apache.org/maven2/org/ow2/asm/asm-commons/5.0.3/asm-commons-5.0.3.pom (2.1 kB at 233 kB/s)
[INFO] Downloading from central: https://repo.maven.apache.org/maven2/org/ow2/asm/asm-tree/5.0.3/asm-tree-5.0.3.pom
[INFO] Downloaded from central: https://repo.maven.apache.org/maven2/org/ow2/asm/asm-tree/5.0.3/asm-tree-5.0.3.pom (2.1 kB at 260 kB/s)
[INFO] Downloading from central: https://repo.maven.apache.org/maven2/commons-lang/commons-lang/1.0/commons-lang-1.0.pom
[INFO] Downloaded from central: https://repo.maven.apache.org/maven2/commons-lang/commons-lang/1.0/commons-lang-1.0.pom (2.5 kB at 307 kB/s)
[INFO] Downloading from central: https://repo.maven.apache.org/maven2/de/tototec/de.tototec.cmdoption/0.2.0/de.tototec.cmdoption-0.2.0.pom
[INFO] Downloaded from central: https://repo.maven.apache.org/maven2/de/tototec/de.tototec.cmdoption/0.2.0/de.tototec.cmdoption-0.2.0.pom (956 B at 106 kB/s)
[INFO] Downloading from central: https://repo.maven.apache.org/maven2/org/ow2/asm/asm/5.0.3/asm-5.0.3.jar
[INFO] Downloading from central: https://repo.maven.apache.org/maven2/org/semver/api/0.9.33/api-0.9.33.jar
[INFO] Downloading from central: https://repo.maven.apache.org/maven2/org/ow2/asm/asm-commons/5.0.3/asm-commons-5.0.3.jar
[INFO] Downloading from central: https://repo.maven.apache.org/maven2/org/ow2/asm/asm-tree/5.0.3/asm-tree-5.0.3.jar
[INFO] Downloading from central: https://repo.maven.apache.org/maven2/com/google/code/findbugs/jsr305/2.0.0/jsr305-2.0.0.jar
[INFO] Downloaded from central: https://repo.maven.apache.org/maven2/com/google/code/findbugs/jsr305/2.0.0/jsr305-2.0.0.jar (32 kB at 910 kB/s)
[INFO] Downloading from central: https://repo.maven.apache.org/maven2/commons-lang/commons-lang/1.0/commons-lang-1.0.jar
[INFO] Downloaded from central: https://repo.maven.apache.org/maven2/org/ow2/asm/asm-tree/5.0.3/asm-tree-5.0.3.jar (29 kB at 830 kB/s)
[INFO] Downloading from central: https://repo.maven.apache.org/maven2/de/tototec/de.tototec.cmdoption/0.2.0/de.tototec.cmdoption-0.2.0.jar
[INFO] Downloaded from central: https://repo.maven.apache.org/maven2/org/semver/api/0.9.33/api-0.9.33.jar (64 kB at 1.7 MB/s)
[INFO] Downloaded from central: https://repo.maven.apache.org/maven2/org/ow2/asm/asm-commons/5.0.3/asm-commons-5.0.3.jar (42 kB at 1.1 MB/s)
[INFO] Downloaded from central: https://repo.maven.apache.org/maven2/org/ow2/asm/asm/5.0.3/asm-5.0.3.jar (53 kB at 1.2 MB/s)
[INFO] Downloaded from central: https://repo.maven.apache.org/maven2/de/tototec/de.tototec.cmdoption/0.2.0/de.tototec.cmdoption-0.2.0.jar (42 kB at 896 kB/s)
[INFO] Downloaded from central: https://repo.maven.apache.org/maven2/commons-lang/commons-lang/1.0/commons-lang-1.0.jar (64 kB at 1.3 MB/s)
[INFO]
[INFO] --- maven-clean-plugin:2.5:clean (default-clean) @ maven-release-semver-policy ---
[INFO]
[INFO] --- maven-enforcer-plugin:1.3.1:enforce (enforce-bytecode-version) @ maven-release-semver-policy ---
[INFO]
[INFO] --- maven-enforcer-plugin:1.3.1:enforce (ban-known-bad-maven-versions) @ maven-release-semver-policy ---
[INFO]
[INFO] --- apache-rat-plugin:0.11:check (rat-check) @ maven-release-semver-policy ---
[INFO] 51 implicit excludes (use -debug for more details).
[INFO] Exclude: .repository
[INFO] Exclude: Jenkinsfile
[INFO] Exclude: DEPENDENCIES
[INFO] 3 resources included (use -debug for more details)
[INFO] Rat check: Summary of files. Unapproved: 0 unknown: 0 generated: 0 approved: 3 licence.
[INFO]
[INFO] --- maven-remote-resources-plugin:1.5:process (default) @ maven-release-semver-policy ---
[INFO]
[INFO] --- maven-resources-plugin:2.7:resources (default-resources) @ maven-release-semver-policy ---
[INFO] Using 'UTF-8' encoding to copy filtered resources.
[INFO] skip non existing resourceDirectory F:\jenkins\jenkins-slave\workspace\-box_maven-release_MRELEASE-1007\m\maven-release-policies\maven-release-semver-policy\src\main\resources
[INFO] Copying 3 resources
[INFO]
[INFO] --- maven-compiler-plugin:3.2:compile (default-compile) @ maven-release-semver-policy ---
[INFO] Changes detected - recompiling the module!
[INFO] Compiling 1 source file to F:\jenkins\jenkins-slave\workspace\-box_maven-release_MRELEASE-1007\m\maven-release-policies\maven-release-semver-policy\target\classes
[INFO]
[INFO] --- plexus-component-metadata:1.7.1:generate-metadata (process-classes) @ maven-release-semver-policy ---
[INFO] Discovered 1 component descriptors(s)
[INFO]
[INFO] --- maven-resources-plugin:2.7:testResources (default-testResources) @ maven-release-semver-policy ---
[INFO] Using 'UTF-8' encoding to copy filtered resources.
[INFO] skip non existing resourceDirectory F:\jenkins\jenkins-slave\workspace\-box_maven-release_MRELEASE-1007\m\maven-release-policies\maven-release-semver-policy\src\test\resources
[INFO] Copying 3 resources
[INFO]
[INFO] --- maven-compiler-plugin:3.2:testCompile (default-testCompile) @ maven-release-semver-policy ---
[INFO] Changes detected - recompiling the module!
[INFO] Compiling 1 source file to F:\jenkins\jenkins-slave\workspace\-box_maven-release_MRELEASE-1007\m\maven-release-policies\maven-release-semver-policy\target\test-classes
[INFO]
[INFO] --- maven-surefire-plugin:2.20.1:test (default-test) @ maven-release-semver-policy ---
[INFO]
[INFO] -------------------------------------------------------
[INFO]  T E S T S
[INFO] -------------------------------------------------------
[INFO] Running org.apache.maven.shared.release.policy.semver.SemVerVersionPolicyTest
[INFO] Tests run: 2, Failures: 0, Errors: 0, Skipped: 0, Time elapsed: 0.141 s - in org.apache.maven.shared.release.policy.semver.SemVerVersionPolicyTest
[INFO]
[INFO] Results:
[INFO]
[INFO] Tests run: 2, Failures: 0, Errors: 0, Skipped: 0
[INFO]
[INFO]
[INFO] --- maven-jar-plugin:2.5:jar (default-jar) @ maven-release-semver-policy ---
[INFO] Building jar: F:\jenkins\jenkins-slave\workspace\-box_maven-release_MRELEASE-1007\m\maven-release-policies\maven-release-semver-policy\target\maven-release-semver-policy-3.0.0-SNAPSHOT.jar
[INFO]
[INFO] --- maven-site-plugin:3.4:attach-descriptor (attach-descriptor) @ maven-release-semver-policy ---
[INFO]
[INFO] --- maven-checkstyle-plugin:2.15:check (checkstyle-check) @ maven-release-semver-policy ---
[INFO] ------------------------------------------------------------------------
[INFO] Reactor Summary for Maven Release 3.0.0-SNAPSHOT:
[INFO]
[INFO] Maven Release ...................................... SUCCESS [ 14.427 s]
[INFO] Maven Release APIs ................................. SUCCESS [  6.269 s]
[INFO] Maven Release Manager .............................. SUCCESS [01:54 min]
[INFO] Maven Release Plugin ............................... SUCCESS [06:58 min]
[INFO] Maven Release Odd-Even Policy ...................... SUCCESS [  2.984 s]
[INFO] Maven Release SemVer Policy ........................ SUCCESS [  3.060 s]
[INFO] ------------------------------------------------------------------------
[INFO] BUILD SUCCESS
[INFO] ------------------------------------------------------------------------
[INFO] Total time:  09:21 min
[INFO] Finished at: 2019-06-04T11:45:44Z
[INFO] ------------------------------------------------------------------------
[INFO] [jenkins-event-spy] Generated F:\jenkins\jenkins-slave\workspace\-box_maven-release_MRELEASE-1007@tmp\withMavend791af8b\maven-spy-20190604-113622-9851201400563692038552.log
Picked up JAVA_TOOL_OPTIONS: -Dmaven.ext.class.path="f:\jenkins\jenkins-slave\workspace\-box_maven-release_MRELEASE-1007@tmp\withMavend791af8b\pipeline-maven-spy.jar" -Dorg.jenkinsci.plugins.pipeline.maven.reportsFolder="f:\jenkins\jenkins-slave\workspace\-box_maven-release_MRELEASE-1007@tmp\withMavend791af8b"
[Pipeline] }
[Pipeline] // dir
[Pipeline] }
[withMaven] invokerPublisher - Archive invoker results for Maven artifact MavenArtifact{org.apache.maven.plugins:maven-release-plugin:maven-plugin:3.0.0-SNAPSHOT(version: 3.0.0-SNAPSHOT, snapshot:false) } generated by PluginInvocation{org.apache.maven.plugins:maven-invoker-plugin:2.0.0@run  integration-test-prepare}: m\maven-release-plugin\target\invoker-reports\*.xml
[withMaven] invokerPublisher - Archive invoker results for Maven artifact MavenArtifact{org.apache.maven.plugins:maven-release-plugin:maven-plugin:3.0.0-SNAPSHOT(version: 3.0.0-SNAPSHOT, snapshot:false) } generated by PluginInvocation{org.apache.maven.plugins:maven-invoker-plugin:2.0.0@run  integration-test-prepare-with-pom}: m\maven-release-plugin\target\invoker-reports\*.xml
[withMaven] invokerPublisher - Archive invoker results for Maven artifact MavenArtifact{org.apache.maven.plugins:maven-release-plugin:maven-plugin:3.0.0-SNAPSHOT(version: 3.0.0-SNAPSHOT, snapshot:false) } generated by PluginInvocation{org.apache.maven.plugins:maven-invoker-plugin:2.0.0@run  integration-test-branch}: m\maven-release-plugin\target\invoker-reports\*.xml
[withMaven] invokerPublisher - Archive invoker results for Maven artifact MavenArtifact{org.apache.maven.plugins:maven-release-plugin:maven-plugin:3.0.0-SNAPSHOT(version: 3.0.0-SNAPSHOT, snapshot:false) } generated by PluginInvocation{org.apache.maven.plugins:maven-invoker-plugin:2.0.0@run  integration-test-perform}: m\maven-release-plugin\target\invoker-reports\*.xml
[withMaven] invokerPublisher - Archive invoker results for Maven artifact MavenArtifact{org.apache.maven.plugins:maven-release-plugin:maven-plugin:3.0.0-SNAPSHOT(version: 3.0.0-SNAPSHOT, snapshot:false) } generated by PluginInvocation{org.apache.maven.plugins:maven-invoker-plugin:2.0.0@run  integration-test-update-versions}: m\maven-release-plugin\target\invoker-reports\*.xml
[withMaven] junitPublisher - Archive test results for Maven artifact org.apache.maven.release:maven-release-api:jar:3.0.0-SNAPSHOT generated by maven-surefire-plugin:test (default-test): m\maven-release-api\target\surefire-reports\*.xml
[withMaven] junitPublisher - Archive test results for Maven artifact org.apache.maven.release:maven-release-manager:jar:3.0.0-SNAPSHOT generated by maven-surefire-plugin:test (default-test): m\maven-release-manager\target\surefire-reports\*.xml
[withMaven] junitPublisher - Archive test results for Maven artifact org.apache.maven.plugins:maven-release-plugin:maven-plugin:3.0.0-SNAPSHOT generated by maven-surefire-plugin:test (default-test): m\maven-release-plugin\target\surefire-reports\*.xml
[withMaven] junitPublisher - Archive test results for Maven artifact org.apache.maven.release:maven-release-oddeven-policy:jar:3.0.0-SNAPSHOT generated by maven-surefire-plugin:test (default-test): m\maven-release-policies\maven-release-oddeven-policy\target\surefire-reports\*.xml
[withMaven] junitPublisher - Archive test results for Maven artifact org.apache.maven.release:maven-release-semver-policy:jar:3.0.0-SNAPSHOT generated by maven-surefire-plugin:test (default-test): m\maven-release-policies\maven-release-semver-policy\target\surefire-reports\*.xml
Recording test results
[withMaven] junitPublisher - Archive test results for Maven artifact org.apache.maven.release:maven-release-manager:jar:3.0.0-SNAPSHOT generated by maven-failsafe-plugin:integration-test (default): m\maven-release-manager\target\failsafe-reports\*.xml
Recording test results
[withMaven] Publishers: Pipeline Graph Publisher: 9 ms, Invoker Publisher: 73570 ms, Junit Publisher: 3881 ms, Dependencies Fingerprint Publisher: 406 ms
[withMaven] One or multiple Maven executions have been ignored by the Jenkins Pipeline Maven Plugin because they have been interrupted before completion (1). See Pipeline Maven Plugin FAQ for more details.
[Pipeline] // withMaven
[Pipeline] cleanWs
[WS-CLEANUP] Deleting project workspace...
[WS-CLEANUP] Deferred wipeout is used...
[WS-CLEANUP] done
[Pipeline] }
[Pipeline] // stage
[Pipeline] }
[Pipeline] // node
[Pipeline] }
[Pipeline] // parallel
[Pipeline] echo
[FAILURE-003] AbortException hudson.AbortException: script returned exit code 1
[Pipeline] stage
[Pipeline] { (Notifications)
[Pipeline] echo
Build result: FAILURE
[Pipeline] jiraIssueSelector
[Pipeline] jiraComment
[Pipeline] emailext
Reply | Threaded
Open this post in threaded view
|

Build failed in Jenkins: Maven TLP » maven-release » MRELEASE-1007 #6

Apache Jenkins Server-2
See https://builds.apache.org/job/maven-box/job/maven-release/job/MRELEASE-1007/6/

No changes.

All tests passed

Build log:
[...truncated 23687 lines...]
[INFO] -------------------------------------------------
[INFO]
[INFO] --- maven-invoker-plugin:2.0.0:run (integration-test-perform) @ maven-release-plugin ---
[INFO] Building: projects\perform\MRELEASE-459\pom.xml
[INFO] run script verify.groovy
[INFO] ..SUCCESS (15.0 s)
[INFO] Building: projects\perform\MRELEASE-592\pom.xml
[INFO] ..SUCCESS (13.6 s)
[INFO] Building: projects\perform\MRELEASE-736\pom.xml
[INFO] ..SUCCESS (14.6 s)
[INFO] Building: projects\perform\MRELEASE-818\pom.xml
[INFO] run script verify.groovy
[INFO] ..SUCCESS (13.4 s)
[INFO] Building: projects\perform\MRELEASE-832\pom.xml
[INFO] run script verify.groovy
[INFO] ..SUCCESS (6.3 s)
[INFO] -------------------------------------------------
[INFO] Build Summary:
[INFO]   Passed: 5, Failed: 0, Errors: 0, Skipped: 0
[INFO] -------------------------------------------------
[INFO]
[INFO] --- maven-invoker-plugin:2.0.0:run (integration-test-update-versions) @ maven-release-plugin ---
[INFO] Building: projects\update-versions\MRELEASE-555\pom.xml
[INFO] run script verify.groovy
[INFO] ..SUCCESS (7.4 s)
[INFO] Building: projects\update-versions\MRELEASE-611\pom.xml
[INFO] run script verify.groovy
[INFO] ..SUCCESS (5.9 s)
[INFO] Building: projects\update-versions\MRELEASE-783\pom.xml
[INFO] ..SUCCESS (6.6 s)
[INFO] Building: projects\update-versions\MRELEASE-976\pom.xml
[INFO] run script verify.groovy
[INFO] ..SUCCESS (7.2 s)
[INFO] -------------------------------------------------
[INFO] Build Summary:
[INFO]   Passed: 4, Failed: 0, Errors: 0, Skipped: 0
[INFO] -------------------------------------------------
[INFO]
[INFO] --- maven-checkstyle-plugin:2.15:check (checkstyle-check) @ maven-release-plugin ---
[INFO]
[INFO] -------< org.apache.maven.release:maven-release-oddeven-policy >--------
[INFO] Building Maven Release Odd-Even Policy 3.0.0-SNAPSHOT              [5/6]
[INFO] --------------------------------[ jar ]---------------------------------
[INFO]
[INFO] --- maven-clean-plugin:2.5:clean (default-clean) @ maven-release-oddeven-policy ---
[INFO]
[INFO] --- maven-enforcer-plugin:1.3.1:enforce (enforce-bytecode-version) @ maven-release-oddeven-policy ---
[INFO]
[INFO] --- maven-enforcer-plugin:1.3.1:enforce (ban-known-bad-maven-versions) @ maven-release-oddeven-policy ---
[INFO]
[INFO] --- apache-rat-plugin:0.11:check (rat-check) @ maven-release-oddeven-policy ---
[INFO] 51 implicit excludes (use -debug for more details).
[INFO] Exclude: .repository
[INFO] Exclude: Jenkinsfile
[INFO] Exclude: DEPENDENCIES
[INFO] 4 resources included (use -debug for more details)
[INFO] Rat check: Summary of files. Unapproved: 0 unknown: 0 generated: 0 approved: 4 licence.
[INFO]
[INFO] --- maven-remote-resources-plugin:1.5:process (default) @ maven-release-oddeven-policy ---
[INFO]
[INFO] --- maven-resources-plugin:2.7:resources (default-resources) @ maven-release-oddeven-policy ---
[INFO] Using 'UTF-8' encoding to copy filtered resources.
[INFO] skip non existing resourceDirectory F:\jenkins\jenkins-slave\workspace\-box_maven-release_MRELEASE-1007\m\maven-release-policies\maven-release-oddeven-policy\src\main\resources
[INFO] Copying 3 resources
[INFO]
[INFO] --- maven-compiler-plugin:3.2:compile (default-compile) @ maven-release-oddeven-policy ---
[INFO] Changes detected - recompiling the module!
[INFO] Compiling 2 source files to F:\jenkins\jenkins-slave\workspace\-box_maven-release_MRELEASE-1007\m\maven-release-policies\maven-release-oddeven-policy\target\classes
[INFO]
[INFO] --- plexus-component-metadata:1.7.1:generate-metadata (process-classes) @ maven-release-oddeven-policy ---
[INFO] Discovered 1 component descriptors(s)
[INFO]
[INFO] --- maven-resources-plugin:2.7:testResources (default-testResources) @ maven-release-oddeven-policy ---
[INFO] Using 'UTF-8' encoding to copy filtered resources.
[INFO] skip non existing resourceDirectory F:\jenkins\jenkins-slave\workspace\-box_maven-release_MRELEASE-1007\m\maven-release-policies\maven-release-oddeven-policy\src\test\resources
[INFO] Copying 3 resources
[INFO]
[INFO] --- maven-compiler-plugin:3.2:testCompile (default-testCompile) @ maven-release-oddeven-policy ---
[INFO] Changes detected - recompiling the module!
[INFO] Compiling 1 source file to F:\jenkins\jenkins-slave\workspace\-box_maven-release_MRELEASE-1007\m\maven-release-policies\maven-release-oddeven-policy\target\test-classes
[INFO]
[INFO] --- maven-surefire-plugin:2.20.1:test (default-test) @ maven-release-oddeven-policy ---
[INFO]
[INFO] -------------------------------------------------------
[INFO]  T E S T S
[INFO] -------------------------------------------------------
[INFO] Running org.apache.maven.shared.release.policy.oddeven.OddEvenVersionPolicyTestCase
[INFO] Tests run: 3, Failures: 0, Errors: 0, Skipped: 0, Time elapsed: 0.303 s - in org.apache.maven.shared.release.policy.oddeven.OddEvenVersionPolicyTestCase
[INFO]
[INFO] Results:
[INFO]
[INFO] Tests run: 3, Failures: 0, Errors: 0, Skipped: 0
[INFO]
[INFO]
[INFO] --- maven-jar-plugin:2.5:jar (default-jar) @ maven-release-oddeven-policy ---
[INFO] Building jar: F:\jenkins\jenkins-slave\workspace\-box_maven-release_MRELEASE-1007\m\maven-release-policies\maven-release-oddeven-policy\target\maven-release-oddeven-policy-3.0.0-SNAPSHOT.jar
[INFO]
[INFO] --- maven-site-plugin:3.4:attach-descriptor (attach-descriptor) @ maven-release-oddeven-policy ---
[INFO]
[INFO] --- maven-checkstyle-plugin:2.15:check (checkstyle-check) @ maven-release-oddeven-policy ---
[INFO]
[INFO] --------< org.apache.maven.release:maven-release-semver-policy >--------
[INFO] Building Maven Release SemVer Policy 3.0.0-SNAPSHOT                [6/6]
[INFO] --------------------------------[ jar ]---------------------------------
[INFO] Downloading from central: https://repo.maven.apache.org/maven2/org/semver/api/0.9.33/api-0.9.33.pom
[INFO] Downloaded from central: https://repo.maven.apache.org/maven2/org/semver/api/0.9.33/api-0.9.33.pom (2.8 kB at 354 kB/s)
[INFO] Downloading from central: https://repo.maven.apache.org/maven2/org/semver/parent/0.9.33/parent-0.9.33.pom
[INFO] Downloaded from central: https://repo.maven.apache.org/maven2/org/semver/parent/0.9.33/parent-0.9.33.pom (1.3 kB at 140 kB/s)
[INFO] Downloading from central: https://repo.maven.apache.org/maven2/com/github/jeluard/oss-parent/9/oss-parent-9.pom
[INFO] Downloaded from central: https://repo.maven.apache.org/maven2/com/github/jeluard/oss-parent/9/oss-parent-9.pom (12 kB at 1.4 MB/s)
[INFO] Downloading from central: https://repo.maven.apache.org/maven2/com/google/code/findbugs/jsr305/2.0.0/jsr305-2.0.0.pom
[INFO] Downloaded from central: https://repo.maven.apache.org/maven2/com/google/code/findbugs/jsr305/2.0.0/jsr305-2.0.0.pom (965 B at 121 kB/s)
[INFO] Downloading from central: https://repo.maven.apache.org/maven2/org/ow2/asm/asm/5.0.3/asm-5.0.3.pom
[INFO] Downloaded from central: https://repo.maven.apache.org/maven2/org/ow2/asm/asm/5.0.3/asm-5.0.3.pom (1.9 kB at 194 kB/s)
[INFO] Downloading from central: https://repo.maven.apache.org/maven2/org/ow2/asm/asm-parent/5.0.3/asm-parent-5.0.3.pom
[INFO] Downloaded from central: https://repo.maven.apache.org/maven2/org/ow2/asm/asm-parent/5.0.3/asm-parent-5.0.3.pom (5.5 kB at 550 kB/s)
[INFO] Downloading from central: https://repo.maven.apache.org/maven2/org/ow2/asm/asm-commons/5.0.3/asm-commons-5.0.3.pom
[INFO] Downloaded from central: https://repo.maven.apache.org/maven2/org/ow2/asm/asm-commons/5.0.3/asm-commons-5.0.3.pom (2.1 kB at 349 kB/s)
[INFO] Downloading from central: https://repo.maven.apache.org/maven2/org/ow2/asm/asm-tree/5.0.3/asm-tree-5.0.3.pom
[INFO] Downloaded from central: https://repo.maven.apache.org/maven2/org/ow2/asm/asm-tree/5.0.3/asm-tree-5.0.3.pom (2.1 kB at 347 kB/s)
[INFO] Downloading from central: https://repo.maven.apache.org/maven2/commons-lang/commons-lang/1.0/commons-lang-1.0.pom
[INFO] Downloaded from central: https://repo.maven.apache.org/maven2/commons-lang/commons-lang/1.0/commons-lang-1.0.pom (2.5 kB at 136 kB/s)
[INFO] Downloading from central: https://repo.maven.apache.org/maven2/de/tototec/de.tototec.cmdoption/0.2.0/de.tototec.cmdoption-0.2.0.pom
[INFO] Downloaded from central: https://repo.maven.apache.org/maven2/de/tototec/de.tototec.cmdoption/0.2.0/de.tototec.cmdoption-0.2.0.pom (956 B at 120 kB/s)
[INFO] Downloading from central: https://repo.maven.apache.org/maven2/org/ow2/asm/asm-commons/5.0.3/asm-commons-5.0.3.jar
[INFO] Downloading from central: https://repo.maven.apache.org/maven2/org/ow2/asm/asm-tree/5.0.3/asm-tree-5.0.3.jar
[INFO] Downloading from central: https://repo.maven.apache.org/maven2/org/semver/api/0.9.33/api-0.9.33.jar
[INFO] Downloading from central: https://repo.maven.apache.org/maven2/com/google/code/findbugs/jsr305/2.0.0/jsr305-2.0.0.jar
[INFO] Downloading from central: https://repo.maven.apache.org/maven2/org/ow2/asm/asm/5.0.3/asm-5.0.3.jar
[INFO] Downloaded from central: https://repo.maven.apache.org/maven2/org/ow2/asm/asm-commons/5.0.3/asm-commons-5.0.3.jar (42 kB at 3.0 MB/s)
[INFO] Downloading from central: https://repo.maven.apache.org/maven2/commons-lang/commons-lang/1.0/commons-lang-1.0.jar
[INFO] Downloaded from central: https://repo.maven.apache.org/maven2/org/ow2/asm/asm-tree/5.0.3/asm-tree-5.0.3.jar (29 kB at 1.9 MB/s)
[INFO] Downloading from central: https://repo.maven.apache.org/maven2/de/tototec/de.tototec.cmdoption/0.2.0/de.tototec.cmdoption-0.2.0.jar
[INFO] Downloaded from central: https://repo.maven.apache.org/maven2/com/google/code/findbugs/jsr305/2.0.0/jsr305-2.0.0.jar (32 kB at 1.7 MB/s)
[INFO] Downloaded from central: https://repo.maven.apache.org/maven2/org/ow2/asm/asm/5.0.3/asm-5.0.3.jar (53 kB at 2.7 MB/s)
[INFO] Downloaded from central: https://repo.maven.apache.org/maven2/org/semver/api/0.9.33/api-0.9.33.jar (64 kB at 2.9 MB/s)
[INFO] Downloaded from central: https://repo.maven.apache.org/maven2/commons-lang/commons-lang/1.0/commons-lang-1.0.jar (64 kB at 2.7 MB/s)
[INFO] Downloaded from central: https://repo.maven.apache.org/maven2/de/tototec/de.tototec.cmdoption/0.2.0/de.tototec.cmdoption-0.2.0.jar (42 kB at 1.6 MB/s)
[INFO]
[INFO] --- maven-clean-plugin:2.5:clean (default-clean) @ maven-release-semver-policy ---
[INFO]
[INFO] --- maven-enforcer-plugin:1.3.1:enforce (enforce-bytecode-version) @ maven-release-semver-policy ---
[INFO]
[INFO] --- maven-enforcer-plugin:1.3.1:enforce (ban-known-bad-maven-versions) @ maven-release-semver-policy ---
[INFO]
[INFO] --- apache-rat-plugin:0.11:check (rat-check) @ maven-release-semver-policy ---
[INFO] 51 implicit excludes (use -debug for more details).
[INFO] Exclude: .repository
[INFO] Exclude: Jenkinsfile
[INFO] Exclude: DEPENDENCIES
[INFO] 3 resources included (use -debug for more details)
[INFO] Rat check: Summary of files. Unapproved: 0 unknown: 0 generated: 0 approved: 3 licence.
[INFO]
[INFO] --- maven-remote-resources-plugin:1.5:process (default) @ maven-release-semver-policy ---
[INFO]
[INFO] --- maven-resources-plugin:2.7:resources (default-resources) @ maven-release-semver-policy ---
[INFO] Using 'UTF-8' encoding to copy filtered resources.
[INFO] skip non existing resourceDirectory F:\jenkins\jenkins-slave\workspace\-box_maven-release_MRELEASE-1007\m\maven-release-policies\maven-release-semver-policy\src\main\resources
[INFO] Copying 3 resources
[INFO]
[INFO] --- maven-compiler-plugin:3.2:compile (default-compile) @ maven-release-semver-policy ---
[INFO] Changes detected - recompiling the module!
[INFO] Compiling 1 source file to F:\jenkins\jenkins-slave\workspace\-box_maven-release_MRELEASE-1007\m\maven-release-policies\maven-release-semver-policy\target\classes
[INFO]
[INFO] --- plexus-component-metadata:1.7.1:generate-metadata (process-classes) @ maven-release-semver-policy ---
[INFO] Discovered 1 component descriptors(s)
[INFO]
[INFO] --- maven-resources-plugin:2.7:testResources (default-testResources) @ maven-release-semver-policy ---
[INFO] Using 'UTF-8' encoding to copy filtered resources.
[INFO] skip non existing resourceDirectory F:\jenkins\jenkins-slave\workspace\-box_maven-release_MRELEASE-1007\m\maven-release-policies\maven-release-semver-policy\src\test\resources
[INFO] Copying 3 resources
[INFO]
[INFO] --- maven-compiler-plugin:3.2:testCompile (default-testCompile) @ maven-release-semver-policy ---
[INFO] Changes detected - recompiling the module!
[INFO] Compiling 1 source file to F:\jenkins\jenkins-slave\workspace\-box_maven-release_MRELEASE-1007\m\maven-release-policies\maven-release-semver-policy\target\test-classes
[INFO]
[INFO] --- maven-surefire-plugin:2.20.1:test (default-test) @ maven-release-semver-policy ---
[INFO]
[INFO] -------------------------------------------------------
[INFO]  T E S T S
[INFO] -------------------------------------------------------
[INFO] Running org.apache.maven.shared.release.policy.semver.SemVerVersionPolicyTest
[INFO] Tests run: 2, Failures: 0, Errors: 0, Skipped: 0, Time elapsed: 0.167 s - in org.apache.maven.shared.release.policy.semver.SemVerVersionPolicyTest
[INFO]
[INFO] Results:
[INFO]
[INFO] Tests run: 2, Failures: 0, Errors: 0, Skipped: 0
[INFO]
[INFO]
[INFO] --- maven-jar-plugin:2.5:jar (default-jar) @ maven-release-semver-policy ---
[INFO] Building jar: F:\jenkins\jenkins-slave\workspace\-box_maven-release_MRELEASE-1007\m\maven-release-policies\maven-release-semver-policy\target\maven-release-semver-policy-3.0.0-SNAPSHOT.jar
[INFO]
[INFO] --- maven-site-plugin:3.4:attach-descriptor (attach-descriptor) @ maven-release-semver-policy ---
[INFO]
[INFO] --- maven-checkstyle-plugin:2.15:check (checkstyle-check) @ maven-release-semver-policy ---
[INFO] ------------------------------------------------------------------------
[INFO] Reactor Summary for Maven Release 3.0.0-SNAPSHOT:
[INFO]
[INFO] Maven Release ...................................... SUCCESS [ 16.029 s]
[INFO] Maven Release APIs ................................. SUCCESS [  5.990 s]
[INFO] Maven Release Manager .............................. SUCCESS [02:06 min]
[INFO] Maven Release Plugin ............................... SUCCESS [07:23 min]
[INFO] Maven Release Odd-Even Policy ...................... SUCCESS [  2.692 s]
[INFO] Maven Release SemVer Policy ........................ SUCCESS [  3.223 s]
[INFO] ------------------------------------------------------------------------
[INFO] BUILD SUCCESS
[INFO] ------------------------------------------------------------------------
[INFO] Total time:  10:00 min
[INFO] Finished at: 2019-06-10T16:07:07Z
[INFO] ------------------------------------------------------------------------
[INFO] [jenkins-event-spy] Generated F:\jenkins\jenkins-slave\workspace\-box_maven-release_MRELEASE-1007@tmp\withMaven9f19ddba\maven-spy-20190610-155706-9686595820584971640105.log
Picked up JAVA_TOOL_OPTIONS: -Dmaven.ext.class.path="f:\jenkins\jenkins-slave\workspace\-box_maven-release_MRELEASE-1007@tmp\withMaven9f19ddba\pipeline-maven-spy.jar" -Dorg.jenkinsci.plugins.pipeline.maven.reportsFolder="f:\jenkins\jenkins-slave\workspace\-box_maven-release_MRELEASE-1007@tmp\withMaven9f19ddba"
[Pipeline] }
[Pipeline] // dir
[Pipeline] }
[withMaven] invokerPublisher - Archive invoker results for Maven artifact MavenArtifact{org.apache.maven.plugins:maven-release-plugin:maven-plugin:3.0.0-SNAPSHOT(version: 3.0.0-SNAPSHOT, snapshot:false) } generated by PluginInvocation{org.apache.maven.plugins:maven-invoker-plugin:2.0.0@run  integration-test-prepare}: m\maven-release-plugin\target\invoker-reports\*.xml
[withMaven] invokerPublisher - Archive invoker results for Maven artifact MavenArtifact{org.apache.maven.plugins:maven-release-plugin:maven-plugin:3.0.0-SNAPSHOT(version: 3.0.0-SNAPSHOT, snapshot:false) } generated by PluginInvocation{org.apache.maven.plugins:maven-invoker-plugin:2.0.0@run  integration-test-prepare-with-pom}: m\maven-release-plugin\target\invoker-reports\*.xml
[withMaven] invokerPublisher - Archive invoker results for Maven artifact MavenArtifact{org.apache.maven.plugins:maven-release-plugin:maven-plugin:3.0.0-SNAPSHOT(version: 3.0.0-SNAPSHOT, snapshot:false) } generated by PluginInvocation{org.apache.maven.plugins:maven-invoker-plugin:2.0.0@run  integration-test-branch}: m\maven-release-plugin\target\invoker-reports\*.xml
[withMaven] invokerPublisher - Archive invoker results for Maven artifact MavenArtifact{org.apache.maven.plugins:maven-release-plugin:maven-plugin:3.0.0-SNAPSHOT(version: 3.0.0-SNAPSHOT, snapshot:false) } generated by PluginInvocation{org.apache.maven.plugins:maven-invoker-plugin:2.0.0@run  integration-test-perform}: m\maven-release-plugin\target\invoker-reports\*.xml
[withMaven] invokerPublisher - Archive invoker results for Maven artifact MavenArtifact{org.apache.maven.plugins:maven-release-plugin:maven-plugin:3.0.0-SNAPSHOT(version: 3.0.0-SNAPSHOT, snapshot:false) } generated by PluginInvocation{org.apache.maven.plugins:maven-invoker-plugin:2.0.0@run  integration-test-update-versions}: m\maven-release-plugin\target\invoker-reports\*.xml
[withMaven] junitPublisher - Archive test results for Maven artifact org.apache.maven.release:maven-release-api:jar:3.0.0-SNAPSHOT generated by maven-surefire-plugin:test (default-test): m\maven-release-api\target\surefire-reports\*.xml
[withMaven] junitPublisher - Archive test results for Maven artifact org.apache.maven.release:maven-release-manager:jar:3.0.0-SNAPSHOT generated by maven-surefire-plugin:test (default-test): m\maven-release-manager\target\surefire-reports\*.xml
[withMaven] junitPublisher - Archive test results for Maven artifact org.apache.maven.plugins:maven-release-plugin:maven-plugin:3.0.0-SNAPSHOT generated by maven-surefire-plugin:test (default-test): m\maven-release-plugin\target\surefire-reports\*.xml
[withMaven] junitPublisher - Archive test results for Maven artifact org.apache.maven.release:maven-release-oddeven-policy:jar:3.0.0-SNAPSHOT generated by maven-surefire-plugin:test (default-test): m\maven-release-policies\maven-release-oddeven-policy\target\surefire-reports\*.xml
[withMaven] junitPublisher - Archive test results for Maven artifact org.apache.maven.release:maven-release-semver-policy:jar:3.0.0-SNAPSHOT generated by maven-surefire-plugin:test (default-test): m\maven-release-policies\maven-release-semver-policy\target\surefire-reports\*.xml
Recording test results
[withMaven] junitPublisher - Archive test results for Maven artifact org.apache.maven.release:maven-release-manager:jar:3.0.0-SNAPSHOT generated by maven-failsafe-plugin:integration-test (default): m\maven-release-manager\target\failsafe-reports\*.xml
Recording test results
[withMaven] Publishers: Pipeline Graph Publisher: 7 ms, Invoker Publisher: 75688 ms, Junit Publisher: 2899 ms, Dependencies Fingerprint Publisher: 268 ms
[withMaven] One or multiple Maven executions have been ignored by the Jenkins Pipeline Maven Plugin because they have been interrupted before completion (1). See Pipeline Maven Plugin FAQ for more details.
[Pipeline] // withMaven
[Pipeline] cleanWs
[WS-CLEANUP] Deleting project workspace...
[WS-CLEANUP] Deferred wipeout is used...
[WS-CLEANUP] done
[Pipeline] }
[Pipeline] // stage
[Pipeline] }
[Pipeline] // node
[Pipeline] }
[Pipeline] // parallel
[Pipeline] echo
[FAILURE-003] AbortException hudson.AbortException: script returned exit code 1
[Pipeline] stage
[Pipeline] { (Notifications)
[Pipeline] echo
Build result: FAILURE
[Pipeline] jiraIssueSelector
[Pipeline] emailext
Reply | Threaded
Open this post in threaded view
|

Build failed in Jenkins: Maven TLP » maven-release » MRELEASE-1007 #7

Apache Jenkins Server-2
See https://builds.apache.org/job/maven-box/job/maven-release/job/MRELEASE-1007/7/

No changes.

All tests passed

Build log:
[...truncated 22901 lines...]
        at org.apache.maven.plugin.surefire.booterclient.ForkStarter.run(ForkStarter.java:245)
        at org.apache.maven.plugin.surefire.AbstractSurefireMojo.executeProvider(AbstractSurefireMojo.java:1124)
        at org.apache.maven.plugin.surefire.AbstractSurefireMojo.executeAfterPreconditionsChecked(AbstractSurefireMojo.java:954)
        at org.apache.maven.plugin.surefire.AbstractSurefireMojo.execute(AbstractSurefireMojo.java:832)
        at org.apache.maven.plugin.DefaultBuildPluginManager.executeMojo(DefaultBuildPluginManager.java:137)
        at org.apache.maven.lifecycle.internal.MojoExecutor.execute(MojoExecutor.java:210)
        at org.apache.maven.lifecycle.internal.MojoExecutor.execute(MojoExecutor.java:156)
        at org.apache.maven.lifecycle.internal.MojoExecutor.execute(MojoExecutor.java:148)
        at org.apache.maven.lifecycle.internal.LifecycleModuleBuilder.buildProject(LifecycleModuleBuilder.java:117)
        at org.apache.maven.lifecycle.internal.LifecycleModuleBuilder.buildProject(LifecycleModuleBuilder.java:81)
        at org.apache.maven.lifecycle.internal.builder.singlethreaded.SingleThreadedBuilder.build(SingleThreadedBuilder.java:56)
        at org.apache.maven.lifecycle.internal.LifecycleStarter.execute(LifecycleStarter.java:128)
        at org.apache.maven.DefaultMaven.doExecute(DefaultMaven.java:305)
        at org.apache.maven.DefaultMaven.doExecute(DefaultMaven.java:192)
        at org.apache.maven.DefaultMaven.execute(DefaultMaven.java:105)
        at org.apache.maven.cli.MavenCli.execute(MavenCli.java:956)
        at org.apache.maven.cli.MavenCli.doMain(MavenCli.java:288)
        at org.apache.maven.cli.MavenCli.main(MavenCli.java:192)
        at sun.reflect.NativeMethodAccessorImpl.invoke0(Native Method)
        at sun.reflect.NativeMethodAccessorImpl.invoke(NativeMethodAccessorImpl.java:57)
        at sun.reflect.DelegatingMethodAccessorImpl.invoke(DelegatingMethodAccessorImpl.java:43)
        at java.lang.reflect.Method.invoke(Method.java:606)
        at org.codehaus.plexus.classworlds.launcher.Launcher.launchEnhanced(Launcher.java:289)
        at org.codehaus.plexus.classworlds.launcher.Launcher.launch(Launcher.java:229)
        at org.codehaus.plexus.classworlds.launcher.Launcher.mainWithExitCode(Launcher.java:415)
        at org.codehaus.plexus.classworlds.launcher.Launcher.main(Launcher.java:356)
Caused by: java.io.IOException: There is not enough space on the disk
        at java.io.FileOutputStream.writeBytes(Native Method)
        at java.io.FileOutputStream.write(FileOutputStream.java:345)
        at sun.nio.cs.StreamEncoder.writeBytes(StreamEncoder.java:221)
        at sun.nio.cs.StreamEncoder.implFlushBuffer(StreamEncoder.java:291)
        at sun.nio.cs.StreamEncoder.implFlush(StreamEncoder.java:295)
        at sun.nio.cs.StreamEncoder.flush(StreamEncoder.java:141)
        at java.io.OutputStreamWriter.flush(OutputStreamWriter.java:229)
        at java.io.BufferedWriter.flush(BufferedWriter.java:254)
        at java.util.Properties.store0(Properties.java:838)
        at java.util.Properties.store(Properties.java:812)
        at org.apache.maven.surefire.booter.SystemPropertyManager.writePropertiesFile(SystemPropertyManager.java:100)
        at org.apache.maven.surefire.booter.SystemPropertyManager.writePropertiesFile(SystemPropertyManager.java:88)
        at org.apache.maven.plugin.surefire.booterclient.BooterSerializer.serialize(BooterSerializer.java:147)
        at org.apache.maven.plugin.surefire.booterclient.ForkStarter.fork(ForkStarter.java:557)
        ... 28 more

[INFO]
[INFO] --- maven-jar-plugin:2.5:jar (default-jar) @ maven-release-oddeven-policy ---
[INFO] Building jar: F:\jenkins\jenkins-slave\workspace\-box_maven-release_MRELEASE-1007\m\maven-release-policies\maven-release-oddeven-policy\target\maven-release-oddeven-policy-3.0.0-SNAPSHOT.jar
[INFO]
[INFO] --- maven-site-plugin:3.4:attach-descriptor (attach-descriptor) @ maven-release-oddeven-policy ---
[INFO]
[INFO] --- maven-checkstyle-plugin:2.15:check (checkstyle-check) @ maven-release-oddeven-policy ---
[INFO]
[INFO] --------< org.apache.maven.release:maven-release-semver-policy >--------
[INFO] Building Maven Release SemVer Policy 3.0.0-SNAPSHOT                [6/6]
[INFO] --------------------------------[ jar ]---------------------------------
[INFO] Downloading from central: https://repo.maven.apache.org/maven2/org/semver/api/0.9.33/api-0.9.33.pom
[INFO] Downloaded from central: https://repo.maven.apache.org/maven2/org/semver/api/0.9.33/api-0.9.33.pom (2.8 kB at 129 kB/s)
[INFO] Downloading from central: https://repo.maven.apache.org/maven2/org/semver/parent/0.9.33/parent-0.9.33.pom
[INFO] Downloaded from central: https://repo.maven.apache.org/maven2/org/semver/parent/0.9.33/parent-0.9.33.pom (1.3 kB at 251 kB/s)
[INFO] Downloading from central: https://repo.maven.apache.org/maven2/com/github/jeluard/oss-parent/9/oss-parent-9.pom
[INFO] Downloaded from central: https://repo.maven.apache.org/maven2/com/github/jeluard/oss-parent/9/oss-parent-9.pom (12 kB at 1.8 MB/s)
[INFO] Downloading from central: https://repo.maven.apache.org/maven2/com/google/code/findbugs/jsr305/2.0.0/jsr305-2.0.0.pom
[INFO] Downloaded from central: https://repo.maven.apache.org/maven2/com/google/code/findbugs/jsr305/2.0.0/jsr305-2.0.0.pom (965 B at 193 kB/s)
[INFO] Downloading from central: https://repo.maven.apache.org/maven2/org/ow2/asm/asm/5.0.3/asm-5.0.3.pom
[INFO] Downloaded from central: https://repo.maven.apache.org/maven2/org/ow2/asm/asm/5.0.3/asm-5.0.3.pom (1.9 kB at 387 kB/s)
[INFO] Downloading from central: https://repo.maven.apache.org/maven2/org/ow2/asm/asm-parent/5.0.3/asm-parent-5.0.3.pom
[INFO] Downloaded from central: https://repo.maven.apache.org/maven2/org/ow2/asm/asm-parent/5.0.3/asm-parent-5.0.3.pom (5.5 kB at 1.1 MB/s)
[INFO] Downloading from central: https://repo.maven.apache.org/maven2/org/ow2/asm/asm-commons/5.0.3/asm-commons-5.0.3.pom
[INFO] Downloaded from central: https://repo.maven.apache.org/maven2/org/ow2/asm/asm-commons/5.0.3/asm-commons-5.0.3.pom (2.1 kB at 419 kB/s)
[INFO] Downloading from central: https://repo.maven.apache.org/maven2/org/ow2/asm/asm-tree/5.0.3/asm-tree-5.0.3.pom
[INFO] Downloaded from central: https://repo.maven.apache.org/maven2/org/ow2/asm/asm-tree/5.0.3/asm-tree-5.0.3.pom (2.1 kB at 417 kB/s)
[INFO] Downloading from central: https://repo.maven.apache.org/maven2/commons-lang/commons-lang/1.0/commons-lang-1.0.pom
[INFO] Downloaded from central: https://repo.maven.apache.org/maven2/commons-lang/commons-lang/1.0/commons-lang-1.0.pom (2.5 kB at 410 kB/s)
[INFO] Downloading from central: https://repo.maven.apache.org/maven2/de/tototec/de.tototec.cmdoption/0.2.0/de.tototec.cmdoption-0.2.0.pom
[INFO] Downloaded from central: https://repo.maven.apache.org/maven2/de/tototec/de.tototec.cmdoption/0.2.0/de.tototec.cmdoption-0.2.0.pom (956 B at 137 kB/s)
[INFO] Downloading from central: https://repo.maven.apache.org/maven2/org/semver/api/0.9.33/api-0.9.33.jar
[INFO] Downloading from central: https://repo.maven.apache.org/maven2/org/ow2/asm/asm-commons/5.0.3/asm-commons-5.0.3.jar
[INFO] Downloading from central: https://repo.maven.apache.org/maven2/org/ow2/asm/asm-tree/5.0.3/asm-tree-5.0.3.jar
[INFO] Downloading from central: https://repo.maven.apache.org/maven2/com/google/code/findbugs/jsr305/2.0.0/jsr305-2.0.0.jar
[INFO] Downloading from central: https://repo.maven.apache.org/maven2/org/ow2/asm/asm/5.0.3/asm-5.0.3.jar
[INFO] Downloaded from central: https://repo.maven.apache.org/maven2/org/ow2/asm/asm-tree/5.0.3/asm-tree-5.0.3.jar (29 kB at 1.9 MB/s)
[INFO] Downloading from central: https://repo.maven.apache.org/maven2/commons-lang/commons-lang/1.0/commons-lang-1.0.jar
[INFO] Downloaded from central: https://repo.maven.apache.org/maven2/org/semver/api/0.9.33/api-0.9.33.jar (64 kB at 3.6 MB/s)
[INFO] Downloading from central: https://repo.maven.apache.org/maven2/de/tototec/de.tototec.cmdoption/0.2.0/de.tototec.cmdoption-0.2.0.jar
[INFO] Downloaded from central: https://repo.maven.apache.org/maven2/org/ow2/asm/asm-commons/5.0.3/asm-commons-5.0.3.jar (42 kB at 2.2 MB/s)
[INFO] Downloaded from central: https://repo.maven.apache.org/maven2/org/ow2/asm/asm/5.0.3/asm-5.0.3.jar (53 kB at 2.2 MB/s)
[INFO] Downloaded from central: https://repo.maven.apache.org/maven2/com/google/code/findbugs/jsr305/2.0.0/jsr305-2.0.0.jar (32 kB at 1.2 MB/s)
[INFO] Downloaded from central: https://repo.maven.apache.org/maven2/commons-lang/commons-lang/1.0/commons-lang-1.0.jar (64 kB at 2.2 MB/s)
[INFO] Downloaded from central: https://repo.maven.apache.org/maven2/de/tototec/de.tototec.cmdoption/0.2.0/de.tototec.cmdoption-0.2.0.jar (42 kB at 1.4 MB/s)
[INFO]
[INFO] --- maven-clean-plugin:2.5:clean (default-clean) @ maven-release-semver-policy ---
[INFO]
[INFO] --- maven-enforcer-plugin:1.3.1:enforce (enforce-bytecode-version) @ maven-release-semver-policy ---
[INFO]
[INFO] --- maven-enforcer-plugin:1.3.1:enforce (ban-known-bad-maven-versions) @ maven-release-semver-policy ---
[INFO]
[INFO] --- apache-rat-plugin:0.11:check (rat-check) @ maven-release-semver-policy ---
[INFO] 51 implicit excludes (use -debug for more details).
[INFO] Exclude: .repository
[INFO] Exclude: Jenkinsfile
[INFO] Exclude: DEPENDENCIES
[INFO] 3 resources included (use -debug for more details)
[INFO] Rat check: Summary of files. Unapproved: 0 unknown: 0 generated: 0 approved: 3 licence.
[INFO]
[INFO] --- maven-remote-resources-plugin:1.5:process (default) @ maven-release-semver-policy ---
[INFO]
[INFO] --- maven-resources-plugin:2.7:resources (default-resources) @ maven-release-semver-policy ---
[INFO] Using 'UTF-8' encoding to copy filtered resources.
[INFO] skip non existing resourceDirectory F:\jenkins\jenkins-slave\workspace\-box_maven-release_MRELEASE-1007\m\maven-release-policies\maven-release-semver-policy\src\main\resources
[INFO] Copying 3 resources
[INFO]
[INFO] --- maven-compiler-plugin:3.2:compile (default-compile) @ maven-release-semver-policy ---
[INFO] Changes detected - recompiling the module!
[INFO] Compiling 1 source file to F:\jenkins\jenkins-slave\workspace\-box_maven-release_MRELEASE-1007\m\maven-release-policies\maven-release-semver-policy\target\classes
[INFO]
[INFO] --- plexus-component-metadata:1.7.1:generate-metadata (process-classes) @ maven-release-semver-policy ---
[INFO] Discovered 1 component descriptors(s)
[INFO]
[INFO] --- maven-resources-plugin:2.7:testResources (default-testResources) @ maven-release-semver-policy ---
[INFO] Using 'UTF-8' encoding to copy filtered resources.
[INFO] skip non existing resourceDirectory F:\jenkins\jenkins-slave\workspace\-box_maven-release_MRELEASE-1007\m\maven-release-policies\maven-release-semver-policy\src\test\resources
[INFO] Copying 3 resources
[INFO]
[INFO] --- maven-compiler-plugin:3.2:testCompile (default-testCompile) @ maven-release-semver-policy ---
[INFO] Changes detected - recompiling the module!
[INFO] Compiling 1 source file to F:\jenkins\jenkins-slave\workspace\-box_maven-release_MRELEASE-1007\m\maven-release-policies\maven-release-semver-policy\target\test-classes
[INFO]
[INFO] --- maven-surefire-plugin:2.20.1:test (default-test) @ maven-release-semver-policy ---
[INFO]
[INFO] -------------------------------------------------------
[INFO]  T E S T S
[INFO] -------------------------------------------------------
[INFO]
[INFO] Results:
[INFO]
[INFO] Tests run: 0, Failures: 0, Errors: 0, Skipped: 0
[INFO]
[ERROR] There are test failures.

Please refer to F:\jenkins\jenkins-slave\workspace\-box_maven-release_MRELEASE-1007\m\maven-release-policies\maven-release-semver-policy\target\surefire-reports for the individual test results.
Please refer to dump files (if any exist) [date]-jvmRun[N].dump, [date].dumpstream and [date]-jvmRun[N].dumpstream.
Error creating properties files for forking
org.apache.maven.surefire.booter.SurefireBooterForkException: Error creating properties files for forking
        at org.apache.maven.plugin.surefire.booterclient.ForkStarter.fork(ForkStarter.java:580)
        at org.apache.maven.plugin.surefire.booterclient.ForkStarter.fork(ForkStarter.java:535)
        at org.apache.maven.plugin.surefire.booterclient.ForkStarter.run(ForkStarter.java:280)
        at org.apache.maven.plugin.surefire.booterclient.ForkStarter.run(ForkStarter.java:245)
        at org.apache.maven.plugin.surefire.AbstractSurefireMojo.executeProvider(AbstractSurefireMojo.java:1124)
        at org.apache.maven.plugin.surefire.AbstractSurefireMojo.executeAfterPreconditionsChecked(AbstractSurefireMojo.java:954)
        at org.apache.maven.plugin.surefire.AbstractSurefireMojo.execute(AbstractSurefireMojo.java:832)
        at org.apache.maven.plugin.DefaultBuildPluginManager.executeMojo(DefaultBuildPluginManager.java:137)
        at org.apache.maven.lifecycle.internal.MojoExecutor.execute(MojoExecutor.java:210)
        at org.apache.maven.lifecycle.internal.MojoExecutor.execute(MojoExecutor.java:156)
        at org.apache.maven.lifecycle.internal.MojoExecutor.execute(MojoExecutor.java:148)
        at org.apache.maven.lifecycle.internal.LifecycleModuleBuilder.buildProject(LifecycleModuleBuilder.java:117)
        at org.apache.maven.lifecycle.internal.LifecycleModuleBuilder.buildProject(LifecycleModuleBuilder.java:81)
        at org.apache.maven.lifecycle.internal.builder.singlethreaded.SingleThreadedBuilder.build(SingleThreadedBuilder.java:56)
        at org.apache.maven.lifecycle.internal.LifecycleStarter.execute(LifecycleStarter.java:128)
        at org.apache.maven.DefaultMaven.doExecute(DefaultMaven.java:305)
        at org.apache.maven.DefaultMaven.doExecute(DefaultMaven.java:192)
        at org.apache.maven.DefaultMaven.execute(DefaultMaven.java:105)
        at org.apache.maven.cli.MavenCli.execute(MavenCli.java:956)
        at org.apache.maven.cli.MavenCli.doMain(MavenCli.java:288)
        at org.apache.maven.cli.MavenCli.main(MavenCli.java:192)
        at sun.reflect.NativeMethodAccessorImpl.invoke0(Native Method)
        at sun.reflect.NativeMethodAccessorImpl.invoke(NativeMethodAccessorImpl.java:57)
        at sun.reflect.DelegatingMethodAccessorImpl.invoke(DelegatingMethodAccessorImpl.java:43)
        at java.lang.reflect.Method.invoke(Method.java:606)
        at org.codehaus.plexus.classworlds.launcher.Launcher.launchEnhanced(Launcher.java:289)
        at org.codehaus.plexus.classworlds.launcher.Launcher.launch(Launcher.java:229)
        at org.codehaus.plexus.classworlds.launcher.Launcher.mainWithExitCode(Launcher.java:415)
        at org.codehaus.plexus.classworlds.launcher.Launcher.main(Launcher.java:356)
Caused by: java.io.IOException: There is not enough space on the disk
        at java.io.FileOutputStream.writeBytes(Native Method)
        at java.io.FileOutputStream.write(FileOutputStream.java:345)
        at sun.nio.cs.StreamEncoder.writeBytes(StreamEncoder.java:221)
        at sun.nio.cs.StreamEncoder.implFlushBuffer(StreamEncoder.java:291)
        at sun.nio.cs.StreamEncoder.implFlush(StreamEncoder.java:295)
        at sun.nio.cs.StreamEncoder.flush(StreamEncoder.java:141)
        at java.io.OutputStreamWriter.flush(OutputStreamWriter.java:229)
        at java.io.BufferedWriter.flush(BufferedWriter.java:254)
        at java.util.Properties.store0(Properties.java:838)
        at java.util.Properties.store(Properties.java:812)
        at org.apache.maven.surefire.booter.SystemPropertyManager.writePropertiesFile(SystemPropertyManager.java:100)
        at org.apache.maven.surefire.booter.SystemPropertyManager.writePropertiesFile(SystemPropertyManager.java:88)
        at org.apache.maven.plugin.surefire.booterclient.BooterSerializer.serialize(BooterSerializer.java:147)
        at org.apache.maven.plugin.surefire.booterclient.ForkStarter.fork(ForkStarter.java:557)
        ... 28 more

[INFO]
[INFO] --- maven-jar-plugin:2.5:jar (default-jar) @ maven-release-semver-policy ---
[INFO] Building jar: F:\jenkins\jenkins-slave\workspace\-box_maven-release_MRELEASE-1007\m\maven-release-policies\maven-release-semver-policy\target\maven-release-semver-policy-3.0.0-SNAPSHOT.jar
[INFO]
[INFO] --- maven-site-plugin:3.4:attach-descriptor (attach-descriptor) @ maven-release-semver-policy ---
[INFO]
[INFO] --- maven-checkstyle-plugin:2.15:check (checkstyle-check) @ maven-release-semver-policy ---
[INFO] ------------------------------------------------------------------------
[INFO] Reactor Summary for Maven Release 3.0.0-SNAPSHOT:
[INFO]
[INFO] Maven Release ...................................... SUCCESS [02:21 min]
[INFO] Maven Release APIs ................................. SUCCESS [ 30.076 s]
[INFO] Maven Release Manager .............................. SUCCESS [ 19.005 s]
[INFO] Maven Release Plugin ............................... SUCCESS [10:14 min]
[INFO] Maven Release Odd-Even Policy ...................... SUCCESS [  0.606 s]
[INFO] Maven Release SemVer Policy ........................ SUCCESS [  0.958 s]
[INFO] ------------------------------------------------------------------------
[INFO] BUILD SUCCESS
[INFO] ------------------------------------------------------------------------
[INFO] Total time:  13:37 min
[INFO] Finished at: 2019-06-13T09:40:46Z
[INFO] ------------------------------------------------------------------------
[INFO] [jenkins-event-spy] Generated F:\jenkins\jenkins-slave\workspace\-box_maven-release_MRELEASE-1007@tmp\withMaven2a0c200d\maven-spy-20190613-092706-7611180785527958514709.log
Picked up JAVA_TOOL_OPTIONS: -Dmaven.ext.class.path="f:\jenkins\jenkins-slave\workspace\-box_maven-release_MRELEASE-1007@tmp\withMaven2a0c200d\pipeline-maven-spy.jar" -Dorg.jenkinsci.plugins.pipeline.maven.reportsFolder="f:\jenkins\jenkins-slave\workspace\-box_maven-release_MRELEASE-1007@tmp\withMaven2a0c200d"
[Pipeline] }
[Pipeline] // dir
[Pipeline] }
[withMaven] invokerPublisher - Archive invoker results for Maven artifact MavenArtifact{org.apache.maven.plugins:maven-release-plugin:maven-plugin:3.0.0-SNAPSHOT(version: 3.0.0-SNAPSHOT, snapshot:false) } generated by PluginInvocation{org.apache.maven.plugins:maven-invoker-plugin:2.0.0@run  integration-test-prepare}: m\maven-release-plugin\target\invoker-reports\*.xml
[withMaven] invokerPublisher - Archive invoker results for Maven artifact MavenArtifact{org.apache.maven.plugins:maven-release-plugin:maven-plugin:3.0.0-SNAPSHOT(version: 3.0.0-SNAPSHOT, snapshot:false) } generated by PluginInvocation{org.apache.maven.plugins:maven-invoker-plugin:2.0.0@run  integration-test-prepare-with-pom}: m\maven-release-plugin\target\invoker-reports\*.xml
[withMaven] invokerPublisher - Archive invoker results for Maven artifact MavenArtifact{org.apache.maven.plugins:maven-release-plugin:maven-plugin:3.0.0-SNAPSHOT(version: 3.0.0-SNAPSHOT, snapshot:false) } generated by PluginInvocation{org.apache.maven.plugins:maven-invoker-plugin:2.0.0@run  integration-test-branch}: m\maven-release-plugin\target\invoker-reports\*.xml
[withMaven] invokerPublisher - Archive invoker results for Maven artifact MavenArtifact{org.apache.maven.plugins:maven-release-plugin:maven-plugin:3.0.0-SNAPSHOT(version: 3.0.0-SNAPSHOT, snapshot:false) } generated by PluginInvocation{org.apache.maven.plugins:maven-invoker-plugin:2.0.0@run  integration-test-perform}: m\maven-release-plugin\target\invoker-reports\*.xml
[withMaven] invokerPublisher - Archive invoker results for Maven artifact MavenArtifact{org.apache.maven.plugins:maven-release-plugin:maven-plugin:3.0.0-SNAPSHOT(version: 3.0.0-SNAPSHOT, snapshot:false) } generated by PluginInvocation{org.apache.maven.plugins:maven-invoker-plugin:2.0.0@run  integration-test-update-versions}: m\maven-release-plugin\target\invoker-reports\*.xml
[withMaven] junitPublisher - Archive test results for Maven artifact org.apache.maven.release:maven-release-api:jar:3.0.0-SNAPSHOT generated by maven-surefire-plugin:test (default-test): m\maven-release-api\target\surefire-reports\*.xml
[withMaven] junitPublisher - Archive test results for Maven artifact org.apache.maven.release:maven-release-manager:jar:3.0.0-SNAPSHOT generated by maven-surefire-plugin:test (default-test): m\maven-release-manager\target\surefire-reports\*.xml
[withMaven] junitPublisher - Archive test results for Maven artifact org.apache.maven.plugins:maven-release-plugin:maven-plugin:3.0.0-SNAPSHOT generated by maven-surefire-plugin:test (default-test): m\maven-release-plugin\target\surefire-reports\*.xml
[withMaven] junitPublisher - Archive test results for Maven artifact org.apache.maven.release:maven-release-oddeven-policy:jar:3.0.0-SNAPSHOT generated by maven-surefire-plugin:test (default-test): m\maven-release-policies\maven-release-oddeven-policy\target\surefire-reports\*.xml
[withMaven] junitPublisher - Archive test results for Maven artifact org.apache.maven.release:maven-release-semver-policy:jar:3.0.0-SNAPSHOT generated by maven-surefire-plugin:test (default-test): m\maven-release-policies\maven-release-semver-policy\target\surefire-reports\*.xml
Recording test results
None of the test reports contained any result
[withMaven] junitPublisher - Archive test results for Maven artifact org.apache.maven.release:maven-release-manager:jar:3.0.0-SNAPSHOT generated by maven-failsafe-plugin:integration-test (default): m\maven-release-manager\target\failsafe-reports\*.xml
Recording test results
[withMaven] Publishers: Pipeline Graph Publisher: 7 ms, Invoker Publisher: 426097 ms, Junit Publisher: 849 ms, Dependencies Fingerprint Publisher: 1727 ms
[Pipeline] // withMaven
[Pipeline] cleanWs
[WS-CLEANUP] Deleting project workspace...
[WS-CLEANUP] Deferred wipeout is used...
[WS-CLEANUP] done
[Pipeline] }
[Pipeline] // stage
[Pipeline] }
[Pipeline] // node
[Pipeline] }
[Pipeline] // parallel
[Pipeline] echo
[FAILURE-003] AbortException hudson.AbortException: script returned exit code 1
[Pipeline] stage
[Pipeline] { (Notifications)
[Pipeline] echo
Build result: FAILURE
[Pipeline] jiraIssueSelector
[Pipeline] emailext
Reply | Threaded
Open this post in threaded view
|

Build failed in Jenkins: Maven TLP » maven-release » MRELEASE-1007 #8

Apache Jenkins Server-2
See https://builds.apache.org/job/maven-box/job/maven-release/job/MRELEASE-1007/8/

No changes.

All tests passed

Build log:
[...truncated 23687 lines...]
[INFO] -------------------------------------------------
[INFO]
[INFO] --- maven-invoker-plugin:2.0.0:run (integration-test-perform) @ maven-release-plugin ---
[INFO] Building: projects\perform\MRELEASE-459\pom.xml
[INFO] run script verify.groovy
[INFO] ..SUCCESS (14.3 s)
[INFO] Building: projects\perform\MRELEASE-592\pom.xml
[INFO] ..SUCCESS (13.1 s)
[INFO] Building: projects\perform\MRELEASE-736\pom.xml
[INFO] ..SUCCESS (15.0 s)
[INFO] Building: projects\perform\MRELEASE-818\pom.xml
[INFO] run script verify.groovy
[INFO] ..SUCCESS (13.7 s)
[INFO] Building: projects\perform\MRELEASE-832\pom.xml
[INFO] run script verify.groovy
[INFO] ..SUCCESS (5.8 s)
[INFO] -------------------------------------------------
[INFO] Build Summary:
[INFO]   Passed: 5, Failed: 0, Errors: 0, Skipped: 0
[INFO] -------------------------------------------------
[INFO]
[INFO] --- maven-invoker-plugin:2.0.0:run (integration-test-update-versions) @ maven-release-plugin ---
[INFO] Building: projects\update-versions\MRELEASE-555\pom.xml
[INFO] run script verify.groovy
[INFO] ..SUCCESS (6.2 s)
[INFO] Building: projects\update-versions\MRELEASE-611\pom.xml
[INFO] run script verify.groovy
[INFO] ..SUCCESS (6.4 s)
[INFO] Building: projects\update-versions\MRELEASE-783\pom.xml
[INFO] ..SUCCESS (7.1 s)
[INFO] Building: projects\update-versions\MRELEASE-976\pom.xml
[INFO] run script verify.groovy
[INFO] ..SUCCESS (6.3 s)
[INFO] -------------------------------------------------
[INFO] Build Summary:
[INFO]   Passed: 4, Failed: 0, Errors: 0, Skipped: 0
[INFO] -------------------------------------------------
[INFO]
[INFO] --- maven-checkstyle-plugin:2.15:check (checkstyle-check) @ maven-release-plugin ---
[INFO]
[INFO] -------< org.apache.maven.release:maven-release-oddeven-policy >--------
[INFO] Building Maven Release Odd-Even Policy 3.0.0-SNAPSHOT              [5/6]
[INFO] --------------------------------[ jar ]---------------------------------
[INFO]
[INFO] --- maven-clean-plugin:2.5:clean (default-clean) @ maven-release-oddeven-policy ---
[INFO]
[INFO] --- maven-enforcer-plugin:1.3.1:enforce (enforce-bytecode-version) @ maven-release-oddeven-policy ---
[INFO]
[INFO] --- maven-enforcer-plugin:1.3.1:enforce (ban-known-bad-maven-versions) @ maven-release-oddeven-policy ---
[INFO]
[INFO] --- apache-rat-plugin:0.11:check (rat-check) @ maven-release-oddeven-policy ---
[INFO] 51 implicit excludes (use -debug for more details).
[INFO] Exclude: .repository
[INFO] Exclude: Jenkinsfile
[INFO] Exclude: DEPENDENCIES
[INFO] 4 resources included (use -debug for more details)
[INFO] Rat check: Summary of files. Unapproved: 0 unknown: 0 generated: 0 approved: 4 licence.
[INFO]
[INFO] --- maven-remote-resources-plugin:1.5:process (default) @ maven-release-oddeven-policy ---
[INFO]
[INFO] --- maven-resources-plugin:2.7:resources (default-resources) @ maven-release-oddeven-policy ---
[INFO] Using 'UTF-8' encoding to copy filtered resources.
[INFO] skip non existing resourceDirectory F:\jenkins\jenkins-slave\workspace\-box_maven-release_MRELEASE-1007\m\maven-release-policies\maven-release-oddeven-policy\src\main\resources
[INFO] Copying 3 resources
[INFO]
[INFO] --- maven-compiler-plugin:3.2:compile (default-compile) @ maven-release-oddeven-policy ---
[INFO] Changes detected - recompiling the module!
[INFO] Compiling 2 source files to F:\jenkins\jenkins-slave\workspace\-box_maven-release_MRELEASE-1007\m\maven-release-policies\maven-release-oddeven-policy\target\classes
[INFO]
[INFO] --- plexus-component-metadata:1.7.1:generate-metadata (process-classes) @ maven-release-oddeven-policy ---
[INFO] Discovered 1 component descriptors(s)
[INFO]
[INFO] --- maven-resources-plugin:2.7:testResources (default-testResources) @ maven-release-oddeven-policy ---
[INFO] Using 'UTF-8' encoding to copy filtered resources.
[INFO] skip non existing resourceDirectory F:\jenkins\jenkins-slave\workspace\-box_maven-release_MRELEASE-1007\m\maven-release-policies\maven-release-oddeven-policy\src\test\resources
[INFO] Copying 3 resources
[INFO]
[INFO] --- maven-compiler-plugin:3.2:testCompile (default-testCompile) @ maven-release-oddeven-policy ---
[INFO] Changes detected - recompiling the module!
[INFO] Compiling 1 source file to F:\jenkins\jenkins-slave\workspace\-box_maven-release_MRELEASE-1007\m\maven-release-policies\maven-release-oddeven-policy\target\test-classes
[INFO]
[INFO] --- maven-surefire-plugin:2.20.1:test (default-test) @ maven-release-oddeven-policy ---
[INFO]
[INFO] -------------------------------------------------------
[INFO]  T E S T S
[INFO] -------------------------------------------------------
[INFO] Running org.apache.maven.shared.release.policy.oddeven.OddEvenVersionPolicyTestCase
[INFO] Tests run: 3, Failures: 0, Errors: 0, Skipped: 0, Time elapsed: 0.154 s - in org.apache.maven.shared.release.policy.oddeven.OddEvenVersionPolicyTestCase
[INFO]
[INFO] Results:
[INFO]
[INFO] Tests run: 3, Failures: 0, Errors: 0, Skipped: 0
[INFO]
[INFO]
[INFO] --- maven-jar-plugin:2.5:jar (default-jar) @ maven-release-oddeven-policy ---
[INFO] Building jar: F:\jenkins\jenkins-slave\workspace\-box_maven-release_MRELEASE-1007\m\maven-release-policies\maven-release-oddeven-policy\target\maven-release-oddeven-policy-3.0.0-SNAPSHOT.jar
[INFO]
[INFO] --- maven-site-plugin:3.4:attach-descriptor (attach-descriptor) @ maven-release-oddeven-policy ---
[INFO]
[INFO] --- maven-checkstyle-plugin:2.15:check (checkstyle-check) @ maven-release-oddeven-policy ---
[INFO]
[INFO] --------< org.apache.maven.release:maven-release-semver-policy >--------
[INFO] Building Maven Release SemVer Policy 3.0.0-SNAPSHOT                [6/6]
[INFO] --------------------------------[ jar ]---------------------------------
[INFO] Downloading from central: https://repo.maven.apache.org/maven2/org/semver/api/0.9.33/api-0.9.33.pom
[INFO] Downloaded from central: https://repo.maven.apache.org/maven2/org/semver/api/0.9.33/api-0.9.33.pom (2.8 kB at 98 kB/s)
[INFO] Downloading from central: https://repo.maven.apache.org/maven2/org/semver/parent/0.9.33/parent-0.9.33.pom
[INFO] Downloaded from central: https://repo.maven.apache.org/maven2/org/semver/parent/0.9.33/parent-0.9.33.pom (1.3 kB at 70 kB/s)
[INFO] Downloading from central: https://repo.maven.apache.org/maven2/com/github/jeluard/oss-parent/9/oss-parent-9.pom
[INFO] Downloaded from central: https://repo.maven.apache.org/maven2/com/github/jeluard/oss-parent/9/oss-parent-9.pom (12 kB at 542 kB/s)
[INFO] Downloading from central: https://repo.maven.apache.org/maven2/com/google/code/findbugs/jsr305/2.0.0/jsr305-2.0.0.pom
[INFO] Downloaded from central: https://repo.maven.apache.org/maven2/com/google/code/findbugs/jsr305/2.0.0/jsr305-2.0.0.pom (965 B at 39 kB/s)
[INFO] Downloading from central: https://repo.maven.apache.org/maven2/org/ow2/asm/asm/5.0.3/asm-5.0.3.pom
[INFO] Downloaded from central: https://repo.maven.apache.org/maven2/org/ow2/asm/asm/5.0.3/asm-5.0.3.pom (1.9 kB at 64 kB/s)
[INFO] Downloading from central: https://repo.maven.apache.org/maven2/org/ow2/asm/asm-parent/5.0.3/asm-parent-5.0.3.pom
[INFO] Downloaded from central: https://repo.maven.apache.org/maven2/org/ow2/asm/asm-parent/5.0.3/asm-parent-5.0.3.pom (5.5 kB at 262 kB/s)
[INFO] Downloading from central: https://repo.maven.apache.org/maven2/org/ow2/asm/asm-commons/5.0.3/asm-commons-5.0.3.pom
[INFO] Downloaded from central: https://repo.maven.apache.org/maven2/org/ow2/asm/asm-commons/5.0.3/asm-commons-5.0.3.pom (2.1 kB at 116 kB/s)
[INFO] Downloading from central: https://repo.maven.apache.org/maven2/org/ow2/asm/asm-tree/5.0.3/asm-tree-5.0.3.pom
[INFO] Downloaded from central: https://repo.maven.apache.org/maven2/org/ow2/asm/asm-tree/5.0.3/asm-tree-5.0.3.pom (2.1 kB at 116 kB/s)
[INFO] Downloading from central: https://repo.maven.apache.org/maven2/commons-lang/commons-lang/1.0/commons-lang-1.0.pom
[INFO] Downloaded from central: https://repo.maven.apache.org/maven2/commons-lang/commons-lang/1.0/commons-lang-1.0.pom (2.5 kB at 94 kB/s)
[INFO] Downloading from central: https://repo.maven.apache.org/maven2/de/tototec/de.tototec.cmdoption/0.2.0/de.tototec.cmdoption-0.2.0.pom
[INFO] Downloaded from central: https://repo.maven.apache.org/maven2/de/tototec/de.tototec.cmdoption/0.2.0/de.tototec.cmdoption-0.2.0.pom (956 B at 35 kB/s)
[INFO] Downloading from central: https://repo.maven.apache.org/maven2/org/ow2/asm/asm/5.0.3/asm-5.0.3.jar
[INFO] Downloading from central: https://repo.maven.apache.org/maven2/org/semver/api/0.9.33/api-0.9.33.jar
[INFO] Downloading from central: https://repo.maven.apache.org/maven2/org/ow2/asm/asm-commons/5.0.3/asm-commons-5.0.3.jar
[INFO] Downloading from central: https://repo.maven.apache.org/maven2/com/google/code/findbugs/jsr305/2.0.0/jsr305-2.0.0.jar
[INFO] Downloading from central: https://repo.maven.apache.org/maven2/org/ow2/asm/asm-tree/5.0.3/asm-tree-5.0.3.jar
[INFO] Downloaded from central: https://repo.maven.apache.org/maven2/org/ow2/asm/asm/5.0.3/asm-5.0.3.jar (53 kB at 2.0 MB/s)
[INFO] Downloading from central: https://repo.maven.apache.org/maven2/commons-lang/commons-lang/1.0/commons-lang-1.0.jar
[INFO] Downloaded from central: https://repo.maven.apache.org/maven2/org/ow2/asm/asm-commons/5.0.3/asm-commons-5.0.3.jar (42 kB at 1.5 MB/s)
[INFO] Downloading from central: https://repo.maven.apache.org/maven2/de/tototec/de.tototec.cmdoption/0.2.0/de.tototec.cmdoption-0.2.0.jar
[INFO] Downloaded from central: https://repo.maven.apache.org/maven2/org/ow2/asm/asm-tree/5.0.3/asm-tree-5.0.3.jar (29 kB at 569 kB/s)
[INFO] Downloaded from central: https://repo.maven.apache.org/maven2/org/semver/api/0.9.33/api-0.9.33.jar (64 kB at 321 kB/s)
[INFO] Downloaded from central: https://repo.maven.apache.org/maven2/com/google/code/findbugs/jsr305/2.0.0/jsr305-2.0.0.jar (32 kB at 144 kB/s)
[INFO] Downloaded from central: https://repo.maven.apache.org/maven2/commons-lang/commons-lang/1.0/commons-lang-1.0.jar (64 kB at 243 kB/s)
[INFO] Downloaded from central: https://repo.maven.apache.org/maven2/de/tototec/de.tototec.cmdoption/0.2.0/de.tototec.cmdoption-0.2.0.jar (42 kB at 122 kB/s)
[INFO]
[INFO] --- maven-clean-plugin:2.5:clean (default-clean) @ maven-release-semver-policy ---
[INFO]
[INFO] --- maven-enforcer-plugin:1.3.1:enforce (enforce-bytecode-version) @ maven-release-semver-policy ---
[INFO]
[INFO] --- maven-enforcer-plugin:1.3.1:enforce (ban-known-bad-maven-versions) @ maven-release-semver-policy ---
[INFO]
[INFO] --- apache-rat-plugin:0.11:check (rat-check) @ maven-release-semver-policy ---
[INFO] 51 implicit excludes (use -debug for more details).
[INFO] Exclude: .repository
[INFO] Exclude: Jenkinsfile
[INFO] Exclude: DEPENDENCIES
[INFO] 3 resources included (use -debug for more details)
[INFO] Rat check: Summary of files. Unapproved: 0 unknown: 0 generated: 0 approved: 3 licence.
[INFO]
[INFO] --- maven-remote-resources-plugin:1.5:process (default) @ maven-release-semver-policy ---
[INFO]
[INFO] --- maven-resources-plugin:2.7:resources (default-resources) @ maven-release-semver-policy ---
[INFO] Using 'UTF-8' encoding to copy filtered resources.
[INFO] skip non existing resourceDirectory F:\jenkins\jenkins-slave\workspace\-box_maven-release_MRELEASE-1007\m\maven-release-policies\maven-release-semver-policy\src\main\resources
[INFO] Copying 3 resources
[INFO]
[INFO] --- maven-compiler-plugin:3.2:compile (default-compile) @ maven-release-semver-policy ---
[INFO] Changes detected - recompiling the module!
[INFO] Compiling 1 source file to F:\jenkins\jenkins-slave\workspace\-box_maven-release_MRELEASE-1007\m\maven-release-policies\maven-release-semver-policy\target\classes
[INFO]
[INFO] --- plexus-component-metadata:1.7.1:generate-metadata (process-classes) @ maven-release-semver-policy ---
[INFO] Discovered 1 component descriptors(s)
[INFO]
[INFO] --- maven-resources-plugin:2.7:testResources (default-testResources) @ maven-release-semver-policy ---
[INFO] Using 'UTF-8' encoding to copy filtered resources.
[INFO] skip non existing resourceDirectory F:\jenkins\jenkins-slave\workspace\-box_maven-release_MRELEASE-1007\m\maven-release-policies\maven-release-semver-policy\src\test\resources
[INFO] Copying 3 resources
[INFO]
[INFO] --- maven-compiler-plugin:3.2:testCompile (default-testCompile) @ maven-release-semver-policy ---
[INFO] Changes detected - recompiling the module!
[INFO] Compiling 1 source file to F:\jenkins\jenkins-slave\workspace\-box_maven-release_MRELEASE-1007\m\maven-release-policies\maven-release-semver-policy\target\test-classes
[INFO]
[INFO] --- maven-surefire-plugin:2.20.1:test (default-test) @ maven-release-semver-policy ---
[INFO]
[INFO] -------------------------------------------------------
[INFO]  T E S T S
[INFO] -------------------------------------------------------
[INFO] Running org.apache.maven.shared.release.policy.semver.SemVerVersionPolicyTest
[INFO] Tests run: 2, Failures: 0, Errors: 0, Skipped: 0, Time elapsed: 0.154 s - in org.apache.maven.shared.release.policy.semver.SemVerVersionPolicyTest
[INFO]
[INFO] Results:
[INFO]
[INFO] Tests run: 2, Failures: 0, Errors: 0, Skipped: 0
[INFO]
[INFO]
[INFO] --- maven-jar-plugin:2.5:jar (default-jar) @ maven-release-semver-policy ---
[INFO] Building jar: F:\jenkins\jenkins-slave\workspace\-box_maven-release_MRELEASE-1007\m\maven-release-policies\maven-release-semver-policy\target\maven-release-semver-policy-3.0.0-SNAPSHOT.jar
[INFO]
[INFO] --- maven-site-plugin:3.4:attach-descriptor (attach-descriptor) @ maven-release-semver-policy ---
[INFO]
[INFO] --- maven-checkstyle-plugin:2.15:check (checkstyle-check) @ maven-release-semver-policy ---
[INFO] ------------------------------------------------------------------------
[INFO] Reactor Summary for Maven Release 3.0.0-SNAPSHOT:
[INFO]
[INFO] Maven Release ...................................... SUCCESS [ 40.995 s]
[INFO] Maven Release APIs ................................. SUCCESS [ 13.057 s]
[INFO] Maven Release Manager .............................. SUCCESS [02:37 min]
[INFO] Maven Release Plugin ............................... SUCCESS [08:04 min]
[INFO] Maven Release Odd-Even Policy ...................... SUCCESS [  2.913 s]
[INFO] Maven Release SemVer Policy ........................ SUCCESS [  4.519 s]
[INFO] ------------------------------------------------------------------------
[INFO] BUILD SUCCESS
[INFO] ------------------------------------------------------------------------
[INFO] Total time:  11:46 min
[INFO] Finished at: 2019-06-17T12:30:36-07:00
[INFO] ------------------------------------------------------------------------
[INFO] [jenkins-event-spy] Generated F:\jenkins\jenkins-slave\workspace\-box_maven-release_MRELEASE-1007@tmp\withMavencab4d0df\maven-spy-20190617-121849-5208970414195830303282.log
Picked up JAVA_TOOL_OPTIONS: -Dmaven.ext.class.path="f:\jenkins\jenkins-slave\workspace\-box_maven-release_MRELEASE-1007@tmp\withMavencab4d0df\pipeline-maven-spy.jar" -Dorg.jenkinsci.plugins.pipeline.maven.reportsFolder="f:\jenkins\jenkins-slave\workspace\-box_maven-release_MRELEASE-1007@tmp\withMavencab4d0df"
[Pipeline] }
[Pipeline] // dir
[Pipeline] }
[withMaven] invokerPublisher - Archive invoker results for Maven artifact MavenArtifact{org.apache.maven.plugins:maven-release-plugin:maven-plugin:3.0.0-SNAPSHOT(version: 3.0.0-SNAPSHOT, snapshot:false) } generated by PluginInvocation{org.apache.maven.plugins:maven-invoker-plugin:2.0.0@run  integration-test-prepare}: m\maven-release-plugin\target\invoker-reports\*.xml
[withMaven] invokerPublisher - Archive invoker results for Maven artifact MavenArtifact{org.apache.maven.plugins:maven-release-plugin:maven-plugin:3.0.0-SNAPSHOT(version: 3.0.0-SNAPSHOT, snapshot:false) } generated by PluginInvocation{org.apache.maven.plugins:maven-invoker-plugin:2.0.0@run  integration-test-prepare-with-pom}: m\maven-release-plugin\target\invoker-reports\*.xml
[withMaven] invokerPublisher - Archive invoker results for Maven artifact MavenArtifact{org.apache.maven.plugins:maven-release-plugin:maven-plugin:3.0.0-SNAPSHOT(version: 3.0.0-SNAPSHOT, snapshot:false) } generated by PluginInvocation{org.apache.maven.plugins:maven-invoker-plugin:2.0.0@run  integration-test-branch}: m\maven-release-plugin\target\invoker-reports\*.xml
[withMaven] invokerPublisher - Archive invoker results for Maven artifact MavenArtifact{org.apache.maven.plugins:maven-release-plugin:maven-plugin:3.0.0-SNAPSHOT(version: 3.0.0-SNAPSHOT, snapshot:false) } generated by PluginInvocation{org.apache.maven.plugins:maven-invoker-plugin:2.0.0@run  integration-test-perform}: m\maven-release-plugin\target\invoker-reports\*.xml
[withMaven] invokerPublisher - Archive invoker results for Maven artifact MavenArtifact{org.apache.maven.plugins:maven-release-plugin:maven-plugin:3.0.0-SNAPSHOT(version: 3.0.0-SNAPSHOT, snapshot:false) } generated by PluginInvocation{org.apache.maven.plugins:maven-invoker-plugin:2.0.0@run  integration-test-update-versions}: m\maven-release-plugin\target\invoker-reports\*.xml
[withMaven] junitPublisher - Archive test results for Maven artifact org.apache.maven.release:maven-release-api:jar:3.0.0-SNAPSHOT generated by maven-surefire-plugin:test (default-test): m\maven-release-api\target\surefire-reports\*.xml
[withMaven] junitPublisher - Archive test results for Maven artifact org.apache.maven.release:maven-release-manager:jar:3.0.0-SNAPSHOT generated by maven-surefire-plugin:test (default-test): m\maven-release-manager\target\surefire-reports\*.xml
[withMaven] junitPublisher - Archive test results for Maven artifact org.apache.maven.plugins:maven-release-plugin:maven-plugin:3.0.0-SNAPSHOT generated by maven-surefire-plugin:test (default-test): m\maven-release-plugin\target\surefire-reports\*.xml
[withMaven] junitPublisher - Archive test results for Maven artifact org.apache.maven.release:maven-release-oddeven-policy:jar:3.0.0-SNAPSHOT generated by maven-surefire-plugin:test (default-test): m\maven-release-policies\maven-release-oddeven-policy\target\surefire-reports\*.xml
[withMaven] junitPublisher - Archive test results for Maven artifact org.apache.maven.release:maven-release-semver-policy:jar:3.0.0-SNAPSHOT generated by maven-surefire-plugin:test (default-test): m\maven-release-policies\maven-release-semver-policy\target\surefire-reports\*.xml
Recording test results
[withMaven] junitPublisher - Archive test results for Maven artifact org.apache.maven.release:maven-release-manager:jar:3.0.0-SNAPSHOT generated by maven-failsafe-plugin:integration-test (default): m\maven-release-manager\target\failsafe-reports\*.xml
Recording test results
[withMaven] Publishers: Pipeline Graph Publisher: 5 ms, Invoker Publisher: 105499 ms, Junit Publisher: 3180 ms, Dependencies Fingerprint Publisher: 268 ms
[withMaven] One or multiple Maven executions have been ignored by the Jenkins Pipeline Maven Plugin because they have been interrupted before completion (1). See Pipeline Maven Plugin FAQ for more details.
[Pipeline] // withMaven
[Pipeline] cleanWs
[WS-CLEANUP] Deleting project workspace...
[WS-CLEANUP] Deferred wipeout is used...
[WS-CLEANUP] done
[Pipeline] }
[Pipeline] // stage
[Pipeline] }
[Pipeline] // node
[Pipeline] }
[Pipeline] // parallel
[Pipeline] echo
[FAILURE-003] AbortException hudson.AbortException: script returned exit code 1
[Pipeline] stage
[Pipeline] { (Notifications)
[Pipeline] echo
Build result: FAILURE
[Pipeline] jiraIssueSelector
[Pipeline] emailext
Reply | Threaded
Open this post in threaded view
|

Build failed in Jenkins: Maven TLP » maven-release » MRELEASE-1007 #9

Apache Jenkins Server-2
See https://builds.apache.org/job/maven-box/job/maven-release/job/MRELEASE-1007/9/

No changes.

All tests passed

Build log:
[...truncated 23687 lines...]
[INFO] Downloading from central: https://repo.maven.apache.org/maven2/org/apache/xbean/xbean/3.7/xbean-3.7.pom
[INFO] Downloaded from central: https://repo.maven.apache.org/maven2/org/apache/xbean/xbean/3.7/xbean-3.7.pom (15 kB at 1.7 MB/s)
[INFO] Downloading from central: https://repo.maven.apache.org/maven2/org/apache/geronimo/genesis/genesis-java5-flava/2.0/genesis-java5-flava-2.0.pom
[INFO] Downloaded from central: https://repo.maven.apache.org/maven2/org/apache/geronimo/genesis/genesis-java5-flava/2.0/genesis-java5-flava-2.0.pom (5.5 kB at 609 kB/s)
[INFO] Downloading from central: https://repo.maven.apache.org/maven2/org/apache/geronimo/genesis/genesis-default-flava/2.0/genesis-default-flava-2.0.pom
[INFO] Downloaded from central: https://repo.maven.apache.org/maven2/org/apache/geronimo/genesis/genesis-default-flava/2.0/genesis-default-flava-2.0.pom (18 kB at 1.8 MB/s)
[INFO] Downloading from central: https://repo.maven.apache.org/maven2/org/apache/geronimo/genesis/genesis/2.0/genesis-2.0.pom
[INFO] Downloaded from central: https://repo.maven.apache.org/maven2/org/apache/geronimo/genesis/genesis/2.0/genesis-2.0.pom (18 kB at 2.6 MB/s)
[INFO] Downloading from central: https://repo.maven.apache.org/maven2/org/codehaus/modello/modello-plugin-converters/1.9.1/modello-plugin-converters-1.9.1.pom
[INFO] Downloaded from central: https://repo.maven.apache.org/maven2/org/codehaus/modello/modello-plugin-converters/1.9.1/modello-plugin-converters-1.9.1.pom (1.7 kB at 207 kB/s)
[INFO] Downloading from central: https://repo.maven.apache.org/maven2/org/codehaus/modello/modello-plugins/1.9.1/modello-plugins-1.9.1.pom
[INFO] Downloaded from central: https://repo.maven.apache.org/maven2/org/codehaus/modello/modello-plugins/1.9.1/modello-plugins-1.9.1.pom (2.6 kB at 286 kB/s)
[INFO] Downloading from central: https://repo.maven.apache.org/maven2/org/codehaus/modello/modello-plugin-java/1.9.1/modello-plugin-java-1.9.1.pom
[INFO] Downloaded from central: https://repo.maven.apache.org/maven2/org/codehaus/modello/modello-plugin-java/1.9.1/modello-plugin-java-1.9.1.pom (2.7 kB at 267 kB/s)
[INFO] Downloading from central: https://repo.maven.apache.org/maven2/org/codehaus/modello/modello-plugin-dom4j/1.9.1/modello-plugin-dom4j-1.9.1.pom
[INFO] Downloaded from central: https://repo.maven.apache.org/maven2/org/codehaus/modello/modello-plugin-dom4j/1.9.1/modello-plugin-dom4j-1.9.1.pom (1.6 kB at 181 kB/s)
[INFO] Downloading from central: https://repo.maven.apache.org/maven2/org/codehaus/modello/modello-plugin-xml/1.9.1/modello-plugin-xml-1.9.1.pom
[INFO] Downloaded from central: https://repo.maven.apache.org/maven2/org/codehaus/modello/modello-plugin-xml/1.9.1/modello-plugin-xml-1.9.1.pom (1.1 kB at 83 kB/s)
[INFO] Downloading from central: https://repo.maven.apache.org/maven2/org/codehaus/modello/modello-plugin-jackson/1.9.1/modello-plugin-jackson-1.9.1.pom
[INFO] Downloaded from central: https://repo.maven.apache.org/maven2/org/codehaus/modello/modello-plugin-jackson/1.9.1/modello-plugin-jackson-1.9.1.pom (1.9 kB at 185 kB/s)
[INFO] Downloading from central: https://repo.maven.apache.org/maven2/com/fasterxml/jackson/core/jackson-core/2.1.5/jackson-core-2.1.5.pom
[INFO] Downloaded from central: https://repo.maven.apache.org/maven2/com/fasterxml/jackson/core/jackson-core/2.1.5/jackson-core-2.1.5.pom (5.6 kB at 514 kB/s)
[INFO] Downloading from central: https://repo.maven.apache.org/maven2/com/fasterxml/oss-parent/4/oss-parent-4.pom
[INFO] Downloaded from central: https://repo.maven.apache.org/maven2/com/fasterxml/oss-parent/4/oss-parent-4.pom (18 kB at 1.8 MB/s)
[INFO] Downloading from central: https://repo.maven.apache.org/maven2/com/fasterxml/jackson/core/jackson-databind/2.1.5/jackson-databind-2.1.5.pom
[INFO] Downloaded from central: https://repo.maven.apache.org/maven2/com/fasterxml/jackson/core/jackson-databind/2.1.5/jackson-databind-2.1.5.pom (5.6 kB at 560 kB/s)
[INFO] Downloading from central: https://repo.maven.apache.org/maven2/com/fasterxml/jackson/core/jackson-annotations/2.1.5/jackson-annotations-2.1.5.pom
[INFO] Downloaded from central: https://repo.maven.apache.org/maven2/com/fasterxml/jackson/core/jackson-annotations/2.1.5/jackson-annotations-2.1.5.pom (1.9 kB at 207 kB/s)
[INFO] Downloading from central: https://repo.maven.apache.org/maven2/org/codehaus/modello/modello-plugin-jdom/1.9.1/modello-plugin-jdom-1.9.1.pom
[INFO] Downloaded from central: https://repo.maven.apache.org/maven2/org/codehaus/modello/modello-plugin-jdom/1.9.1/modello-plugin-jdom-1.9.1.pom (1.9 kB at 194 kB/s)
[INFO] Downloading from central: https://repo.maven.apache.org/maven2/org/codehaus/modello/modello-plugin-jsonschema/1.9.1/modello-plugin-jsonschema-1.9.1.pom
[INFO] Downloaded from central: https://repo.maven.apache.org/maven2/org/codehaus/modello/modello-plugin-jsonschema/1.9.1/modello-plugin-jsonschema-1.9.1.pom (1.5 kB at 128 kB/s)
[INFO] Downloading from central: https://repo.maven.apache.org/maven2/org/codehaus/modello/modello-plugin-sax/1.9.1/modello-plugin-sax-1.9.1.pom
[INFO] Downloaded from central: https://repo.maven.apache.org/maven2/org/codehaus/modello/modello-plugin-sax/1.9.1/modello-plugin-sax-1.9.1.pom (1.4 kB at 138 kB/s)
[INFO] Downloading from central: https://repo.maven.apache.org/maven2/org/codehaus/modello/modello-plugin-snakeyaml/1.9.1/modello-plugin-snakeyaml-1.9.1.pom
[INFO] Downloaded from central: https://repo.maven.apache.org/maven2/org/codehaus/modello/modello-plugin-snakeyaml/1.9.1/modello-plugin-snakeyaml-1.9.1.pom (1.2 kB at 132 kB/s)
[INFO] Downloading from central: https://repo.maven.apache.org/maven2/org/yaml/snakeyaml/1.12/snakeyaml-1.12.pom
[INFO] Downloaded from central: https://repo.maven.apache.org/maven2/org/yaml/snakeyaml/1.12/snakeyaml-1.12.pom (22 kB at 2.5 MB/s)
[INFO] Downloading from central: https://repo.maven.apache.org/maven2/org/codehaus/modello/modello-plugin-stax/1.9.1/modello-plugin-stax-1.9.1.pom
[INFO] Downloaded from central: https://repo.maven.apache.org/maven2/org/codehaus/modello/modello-plugin-stax/1.9.1/modello-plugin-stax-1.9.1.pom (2.4 kB at 267 kB/s)
[INFO] Downloading from central: https://repo.maven.apache.org/maven2/org/codehaus/modello/modello-plugin-xdoc/1.9.1/modello-plugin-xdoc-1.9.1.pom
[INFO] Downloaded from central: https://repo.maven.apache.org/maven2/org/codehaus/modello/modello-plugin-xdoc/1.9.1/modello-plugin-xdoc-1.9.1.pom (1.6 kB at 145 kB/s)
[INFO] Downloading from central: https://repo.maven.apache.org/maven2/org/codehaus/modello/modello-plugin-xsd/1.9.1/modello-plugin-xsd-1.9.1.pom
[INFO] Downloaded from central: https://repo.maven.apache.org/maven2/org/codehaus/modello/modello-plugin-xsd/1.9.1/modello-plugin-xsd-1.9.1.pom (1.4 kB at 153 kB/s)
[INFO] Downloading from central: https://repo.maven.apache.org/maven2/org/jsoup/jsoup/1.10.2/jsoup-1.10.2.pom
[INFO] Downloaded from central: https://repo.maven.apache.org/maven2/org/jsoup/jsoup/1.10.2/jsoup-1.10.2.pom (7.3 kB at 663 kB/s)
[INFO] Downloading from central: https://repo.maven.apache.org/maven2/org/codehaus/modello/modello-plugin-xpp3/1.9.1/modello-plugin-xpp3-1.9.1.pom
[INFO] Downloaded from central: https://repo.maven.apache.org/maven2/org/codehaus/modello/modello-plugin-xpp3/1.9.1/modello-plugin-xpp3-1.9.1.pom (1.5 kB at 123 kB/s)
[INFO] Downloading from central: https://repo.maven.apache.org/maven2/org/codehaus/modello/modello-core/1.9.1/modello-core-1.9.1.jar
[INFO] Downloading from central: https://repo.maven.apache.org/maven2/org/apache/xbean/xbean-reflect/3.7/xbean-reflect-3.7.jar
[INFO] Downloading from central: https://repo.maven.apache.org/maven2/org/codehaus/plexus/plexus-container-default/1.7/plexus-container-default-1.7.jar
[INFO] Downloading from central: https://repo.maven.apache.org/maven2/org/codehaus/plexus/plexus-utils/3.0.24/plexus-utils-3.0.24.jar
[INFO] Downloading from central: https://repo.maven.apache.org/maven2/org/codehaus/modello/modello-plugin-converters/1.9.1/modello-plugin-converters-1.9.1.jar
[INFO] Downloaded from central: https://repo.maven.apache.org/maven2/org/codehaus/modello/modello-plugin-converters/1.9.1/modello-plugin-converters-1.9.1.jar (9.5 kB at 595 kB/s)
[INFO] Downloading from central: https://repo.maven.apache.org/maven2/org/codehaus/modello/modello-plugin-dom4j/1.9.1/modello-plugin-dom4j-1.9.1.jar
[INFO] Downloaded from central: https://repo.maven.apache.org/maven2/org/codehaus/modello/modello-core/1.9.1/modello-core-1.9.1.jar (59 kB at 2.8 MB/s)
[INFO] Downloading from central: https://repo.maven.apache.org/maven2/org/codehaus/modello/modello-plugin-xml/1.9.1/modello-plugin-xml-1.9.1.jar
[INFO] Downloaded from central: https://repo.maven.apache.org/maven2/org/codehaus/modello/modello-plugin-dom4j/1.9.1/modello-plugin-dom4j-1.9.1.jar (19 kB at 617 kB/s)
[INFO] Downloading from central: https://repo.maven.apache.org/maven2/org/codehaus/modello/modello-plugin-jackson/1.9.1/modello-plugin-jackson-1.9.1.jar
[INFO] Downloaded from central: https://repo.maven.apache.org/maven2/org/codehaus/plexus/plexus-utils/3.0.24/plexus-utils-3.0.24.jar (247 kB at 7.3 MB/s)
[INFO] Downloading from central: https://repo.maven.apache.org/maven2/com/fasterxml/jackson/core/jackson-core/2.1.5/jackson-core-2.1.5.jar
[INFO] Downloaded from central: https://repo.maven.apache.org/maven2/org/codehaus/plexus/plexus-container-default/1.7/plexus-container-default-1.7.jar (231 kB at 6.6 MB/s)
[INFO] Downloading from central: https://repo.maven.apache.org/maven2/com/fasterxml/jackson/core/jackson-databind/2.1.5/jackson-databind-2.1.5.jar
[INFO] Downloaded from central: https://repo.maven.apache.org/maven2/org/codehaus/modello/modello-plugin-xml/1.9.1/modello-plugin-xml-1.9.1.jar (15 kB at 425 kB/s)
[INFO] Downloading from central: https://repo.maven.apache.org/maven2/com/fasterxml/jackson/core/jackson-annotations/2.1.5/jackson-annotations-2.1.5.jar
[INFO] Downloaded from central: https://repo.maven.apache.org/maven2/org/apache/xbean/xbean-reflect/3.7/xbean-reflect-3.7.jar (148 kB at 3.6 MB/s)
[INFO] Downloading from central: https://repo.maven.apache.org/maven2/org/codehaus/modello/modello-plugin-java/1.9.1/modello-plugin-java-1.9.1.jar
[INFO] Downloaded from central: https://repo.maven.apache.org/maven2/com/fasterxml/jackson/core/jackson-annotations/2.1.5/jackson-annotations-2.1.5.jar (34 kB at 650 kB/s)
[INFO] Downloading from central: https://repo.maven.apache.org/maven2/org/codehaus/modello/modello-plugin-jdom/1.9.1/modello-plugin-jdom-1.9.1.jar
[INFO] Downloaded from central: https://repo.maven.apache.org/maven2/org/codehaus/modello/modello-plugin-jackson/1.9.1/modello-plugin-jackson-1.9.1.jar (19 kB at 330 kB/s)
[INFO] Downloading from central: https://repo.maven.apache.org/maven2/org/codehaus/modello/modello-plugin-jsonschema/1.9.1/modello-plugin-jsonschema-1.9.1.jar
[INFO] Downloaded from central: https://repo.maven.apache.org/maven2/com/fasterxml/jackson/core/jackson-core/2.1.5/jackson-core-2.1.5.jar (207 kB at 3.3 MB/s)
[INFO] Downloading from central: https://repo.maven.apache.org/maven2/org/codehaus/modello/modello-plugin-sax/1.9.1/modello-plugin-sax-1.9.1.jar
[INFO] Downloaded from central: https://repo.maven.apache.org/maven2/org/codehaus/modello/modello-plugin-java/1.9.1/modello-plugin-java-1.9.1.jar (90 kB at 1.4 MB/s)
[INFO] Downloading from central: https://repo.maven.apache.org/maven2/org/codehaus/modello/modello-plugin-snakeyaml/1.9.1/modello-plugin-snakeyaml-1.9.1.jar
[INFO] Downloaded from central: https://repo.maven.apache.org/maven2/org/codehaus/modello/modello-plugin-jdom/1.9.1/modello-plugin-jdom-1.9.1.jar (14 kB at 203 kB/s)
[INFO] Downloading from central: https://repo.maven.apache.org/maven2/org/yaml/snakeyaml/1.12/snakeyaml-1.12.jar
[INFO] Downloaded from central: https://repo.maven.apache.org/maven2/org/codehaus/modello/modello-plugin-jsonschema/1.9.1/modello-plugin-jsonschema-1.9.1.jar (7.0 kB at 96 kB/s)
[INFO] Downloading from central: https://repo.maven.apache.org/maven2/org/codehaus/modello/modello-plugin-stax/1.9.1/modello-plugin-stax-1.9.1.jar
[INFO] Downloaded from central: https://repo.maven.apache.org/maven2/org/codehaus/modello/modello-plugin-sax/1.9.1/modello-plugin-sax-1.9.1.jar (11 kB at 147 kB/s)
[INFO] Downloading from central: https://repo.maven.apache.org/maven2/org/codehaus/modello/modello-plugin-xdoc/1.9.1/modello-plugin-xdoc-1.9.1.jar
[INFO] Downloaded from central: https://repo.maven.apache.org/maven2/org/codehaus/modello/modello-plugin-snakeyaml/1.9.1/modello-plugin-snakeyaml-1.9.1.jar (21 kB at 278 kB/s)
[INFO] Downloading from central: https://repo.maven.apache.org/maven2/org/jsoup/jsoup/1.10.2/jsoup-1.10.2.jar
[INFO] Downloaded from central: https://repo.maven.apache.org/maven2/org/codehaus/modello/modello-plugin-xdoc/1.9.1/modello-plugin-xdoc-1.9.1.jar (15 kB at 166 kB/s)
[INFO] Downloading from central: https://repo.maven.apache.org/maven2/org/codehaus/modello/modello-plugin-xpp3/1.9.1/modello-plugin-xpp3-1.9.1.jar
[INFO] Downloaded from central: https://repo.maven.apache.org/maven2/org/codehaus/modello/modello-plugin-stax/1.9.1/modello-plugin-stax-1.9.1.jar (38 kB at 402 kB/s)
[INFO] Downloading from central: https://repo.maven.apache.org/maven2/org/codehaus/modello/modello-plugin-xsd/1.9.1/modello-plugin-xsd-1.9.1.jar
[INFO] Downloaded from central: https://repo.maven.apache.org/maven2/org/codehaus/modello/modello-plugin-xpp3/1.9.1/modello-plugin-xpp3-1.9.1.jar (26 kB at 247 kB/s)
[INFO] Downloading from central: https://repo.maven.apache.org/maven2/org/sonatype/plexus/plexus-build-api/0.0.7/plexus-build-api-0.0.7.jar
[INFO] Downloaded from central: https://repo.maven.apache.org/maven2/org/jsoup/jsoup/1.10.2/jsoup-1.10.2.jar (351 kB at 3.0 MB/s)
[INFO] Downloaded from central: https://repo.maven.apache.org/maven2/org/yaml/snakeyaml/1.12/snakeyaml-1.12.jar (271 kB at 2.3 MB/s)
[INFO] Downloaded from central: https://repo.maven.apache.org/maven2/com/fasterxml/jackson/core/jackson-databind/2.1.5/jackson-databind-2.1.5.jar (927 kB at 7.7 MB/s)
[INFO] Downloaded from central: https://repo.maven.apache.org/maven2/org/sonatype/plexus/plexus-build-api/0.0.7/plexus-build-api-0.0.7.jar (8.5 kB at 71 kB/s)
[INFO] Downloaded from central: https://repo.maven.apache.org/maven2/org/codehaus/modello/modello-plugin-xsd/1.9.1/modello-plugin-xsd-1.9.1.jar (15 kB at 118 kB/s)
[INFO] outputDirectory: F:\jenkins\jenkins-slave\workspace\-box_maven-release_MRELEASE-1007\m\maven-release-manager\target\generated-sources\modello
[INFO] Working on model: src/main/mdo/release-descriptor.mdo
[INFO] Generating current version: 3.0.0
[INFO]
[INFO] --- modello-maven-plugin:1.9.1:java (default) @ maven-release-manager ---
[INFO] outputDirectory: F:\jenkins\jenkins-slave\workspace\-box_maven-release_MRELEASE-1007\m\maven-release-manager\target\generated-sources\modello
[INFO] Working on model: src/main/mdo/release-descriptor.mdo
[INFO] Generating current version: 3.0.0
[INFO]
[INFO] --- modello-maven-plugin:1.9.1:xpp3-writer (default) @ maven-release-manager ---
[INFO] outputDirectory: F:\jenkins\jenkins-slave\workspace\-box_maven-release_MRELEASE-1007\m\maven-release-manager\target\generated-sources\modello
[INFO] Working on model: src/main/mdo/release-descriptor.mdo
[INFO] Generating current version: 3.0.0
[INFO]
[INFO] --- maven-remote-resources-plugin:1.5:process (default) @ maven-release-manager ---
[INFO] Downloading from Nexus: http://repository.apache.org/snapshots/org/apache/maven/scm/maven-scm-providers-git/1.9.6-SNAPSHOT/maven-scm-providers-git-1.9.6-20180402.205845-16.pom
[INFO] Downloaded from Nexus: http://repository.apache.org/snapshots/org/apache/maven/scm/maven-scm-providers-git/1.9.6-SNAPSHOT/maven-scm-providers-git-1.9.6-20180402.205845-16.pom (0 B at 0 B/s)
[INFO] Downloading from Nexus: http://repository.apache.org/snapshots/org/apache/maven/scm/maven-scm-providers/1.9.6-SNAPSHOT/maven-scm-providers-1.9.6-20180402.205653-16.pom
[INFO] Downloaded from Nexus: http://repository.apache.org/snapshots/org/apache/maven/scm/maven-scm-providers/1.9.6-SNAPSHOT/maven-scm-providers-1.9.6-20180402.205653-16.pom (0 B at 0 B/s)
[INFO] Downloading from Nexus: http://repository.apache.org/snapshots/org/apache/maven/scm/maven-scm/1.9.6-SNAPSHOT/maven-scm-1.9.6-20180402.205557-20.pom
[INFO] Downloaded from Nexus: http://repository.apache.org/snapshots/org/apache/maven/scm/maven-scm/1.9.6-SNAPSHOT/maven-scm-1.9.6-20180402.205557-20.pom (0 B at 0 B/s)
[INFO] Downloading from Nexus: http://repository.apache.org/snapshots/org/apache/maven/scm/maven-scm-providers-svn/1.9.6-SNAPSHOT/maven-scm-providers-svn-1.9.6-20180402.210047-16.pom
[INFO] Downloaded from Nexus: http://repository.apache.org/snapshots/org/apache/maven/scm/maven-scm-providers-svn/1.9.6-SNAPSHOT/maven-scm-providers-svn-1.9.6-20180402.210047-16.pom (0 B at 0 B/s)
[INFO] Downloading from Nexus: http://repository.apache.org/snapshots/org/apache/maven/scm/maven-scm-providers-cvs/1.9.6-SNAPSHOT/maven-scm-providers-cvs-1.9.6-20180402.205740-16.pom
[INFO] Downloaded from Nexus: http://repository.apache.org/snapshots/org/apache/maven/scm/maven-scm-providers-cvs/1.9.6-SNAPSHOT/maven-scm-providers-cvs-1.9.6-20180402.205740-16.pom (0 B at 0 B/s)
[INFO]
[INFO] --- maven-resources-plugin:2.7:resources (default-resources) @ maven-release-manager ---
[INFO] Using 'UTF-8' encoding to copy filtered resources.
[INFO] Copying 3 resources
[INFO] Copying 3 resources
[INFO]
[INFO] --- maven-compiler-plugin:3.2:compile (default-compile) @ maven-release-manager ---
[INFO] Changes detected - recompiling the module!
[INFO] Compiling 100 source files to F:\jenkins\jenkins-slave\workspace\-box_maven-release_MRELEASE-1007\m\maven-release-manager\target\classes
[INFO] /F:/jenkins/jenkins-slave/workspace/-box_maven-release_MRELEASE-1007/m/maven-release-manager/src/main/java/org/apache/maven/shared/release/phase/AbstractRewritePomsPhase.java: Some input files use or override a deprecated API.
[INFO] /F:/jenkins/jenkins-slave/workspace/-box_maven-release_MRELEASE-1007/m/maven-release-manager/src/main/java/org/apache/maven/shared/release/phase/AbstractRewritePomsPhase.java: Recompile with -Xlint:deprecation for details.
[INFO] /F:/jenkins/jenkins-slave/workspace/-box_maven-release_MRELEASE-1007/m/maven-release-manager/src/main/java/org/apache/maven/shared/release/transform/jdom/JDomModel.java: Some input files use unchecked or unsafe operations.
[INFO] /F:/jenkins/jenkins-slave/workspace/-box_maven-release_MRELEASE-1007/m/maven-release-manager/src/main/java/org/apache/maven/shared/release/transform/jdom/JDomModel.java: Recompile with -Xlint:unchecked for details.
[INFO]
[INFO] --- plexus-component-metadata:1.7.1:generate-metadata (default) @ maven-release-manager ---
[INFO] Downloading from central: https://repo.maven.apache.org/maven2/org/codehaus/plexus/plexus-container-default/1.7.1/plexus-container-default-1.7.1.pom
[INFO] Downloaded from central: https://repo.maven.apache.org/maven2/org/codehaus/plexus/plexus-container-default/1.7.1/plexus-container-default-1.7.1.pom (2.8 kB at 230 kB/s)
[INFO] Downloading from central: https://repo.maven.apache.org/maven2/org/codehaus/plexus/plexus-component-annotations/1.7.1/plexus-component-annotations-1.7.1.pom
[INFO] Downloaded from central: https://repo.maven.apache.org/maven2/org/codehaus/plexus/plexus-component-annotations/1.7.1/plexus-component-annotations-1.7.1.pom (770 B at 110 kB/s)
[INFO] Downloading from central: https://repo.maven.apache.org/maven2/com/thoughtworks/qdox/qdox/2.0-M2/qdox-2.0-M2.pom
[INFO] Downloaded from central: https://repo.maven.apache.org/maven2/com/thoughtworks/qdox/qdox/2.0-M2/qdox-2.0-M2.pom (18 kB at 599 kB/s)
[INFO] Downloading from central: https://repo.maven.apache.org/maven2/org/jdom/jdom2/2.0.6/jdom2-2.0.6.pom
[INFO] Downloaded from central: https://repo.maven.apache.org/maven2/org/jdom/jdom2/2.0.6/jdom2-2.0.6.pom (4.6 kB at 328 kB/s)
[INFO] Downloading from central: https://repo.maven.apache.org/maven2/org/codehaus/plexus/plexus-cli/1.6/plexus-cli-1.6.pom
[INFO] Downloaded from central: https://repo.maven.apache.org/maven2/org/codehaus/plexus/plexus-cli/1.6/plexus-cli-1.6.pom (1.4 kB at 101 kB/s)
[INFO] Downloading from central: https://repo.maven.apache.org/maven2/org/codehaus/plexus/plexus-components/1.1.20/plexus-components-1.1.20.pom
[INFO] Downloaded from central: https://repo.maven.apache.org/maven2/org/codehaus/plexus/plexus-components/1.1.20/plexus-components-1.1.20.pom (3.0 kB at 201 kB/s)
[INFO] Downloading from central: https://repo.maven.apache.org/maven2/org/codehaus/plexus/plexus/3.1/plexus-3.1.pom
[INFO] Downloaded from central: https://repo.maven.apache.org/maven2/org/codehaus/plexus/plexus/3.1/plexus-3.1.pom (19 kB at 1.4 MB/s)
[INFO] Downloading from central: https://repo.maven.apache.org/maven2/org/ow2/asm/asm-all/5.1/asm-all-5.1.pom
[INFO] Downloaded from central: https://repo.maven.apache.org/maven2/org/ow2/asm/asm-all/5.1/asm-all-5.1.pom (2.0 kB at 246 kB/s)
[INFO] Downloading from central: https://repo.maven.apache.org/maven2/org/ow2/asm/asm-parent/5.1/asm-parent-5.1.pom
[INFO] Downloaded from central: https://repo.maven.apache.org/maven2/org/ow2/asm/asm-parent/5.1/asm-parent-5.1.pom (5.5 kB at 610 kB/s)
[INFO] Downloading from central: https://repo.maven.apache.org/maven2/org/codehaus/plexus/plexus-container-default/1.7.1/plexus-container-default-1.7.1.jar
[INFO] Downloading from central: https://repo.maven.apache.org/maven2/org/jdom/jdom2/2.0.6/jdom2-2.0.6.jar
[INFO] Downloading from central: https://repo.maven.apache.org/maven2/org/codehaus/plexus/plexus-classworlds/2.5.1/plexus-classworlds-2.5.1.jar
[INFO] Downloading from central: https://repo.maven.apache.org/maven2/com/thoughtworks/qdox/qdox/2.0-M2/qdox-2.0-M2.jar
[INFO] Downloading from central: https://repo.maven.apache.org/maven2/org/codehaus/plexus/plexus-component-annotations/1.7.1/plexus-component-annotations-1.7.1.jar
[INFO] Downloaded from central: https://repo.maven.apache.org/maven2/org/jdom/jdom2/2.0.6/jdom2-2.0.6.jar (305 kB at 8.0 MB/s)
[INFO] Downloading from central: https://repo.maven.apache.org/maven2/org/codehaus/plexus/plexus-cli/1.6/plexus-cli-1.6.jar
[INFO] Downloaded from central: https://repo.maven.apache.org/maven2/org/codehaus/plexus/plexus-classworlds/2.5.1/plexus-classworlds-2.5.1.jar (50 kB at 1.2 MB/s)
[INFO] Downloading from central: https://repo.maven.apache.org/maven2/org/ow2/asm/asm-all/5.1/asm-all-5.1.jar
[INFO] Downloaded from central: https://repo.maven.apache.org/maven2/org/codehaus/plexus/plexus-component-annotations/1.7.1/plexus-component-annotations-1.7.1.jar (4.3 kB at 97 kB/s)
[INFO] Downloaded from central: https://repo.maven.apache.org/maven2/org/codehaus/plexus/plexus-cli/1.6/plexus-cli-1.6.jar (7.4 kB at 154 kB/s)
[INFO] Downloaded from central: https://repo.maven.apache.org/maven2/org/codehaus/plexus/plexus-container-default/1.7.1/plexus-container-default-1.7.1.jar (231 kB at 2.6 MB/s)
[INFO] Downloaded from central: https://repo.maven.apache.org/maven2/com/thoughtworks/qdox/qdox/2.0-M2/qdox-2.0-M2.jar (292 kB at 3.1 MB/s)
[INFO] Downloaded from central: https://repo.maven.apache.org/maven2/org/ow2/asm/asm-all/5.1/asm-all-5.1.jar (248 kB at 2.6 MB/s)
[INFO] Discovered 34 component descriptors(s)
[INFO]
[INFO] --- plexus-component-metadata:1.7.1:merge-metadata (merge) @ maven-release-manager ---
[INFO]
[INFO] --- maven-resources-plugin:2.7:testResources (default-testResources) @ maven-release-manager ---
[INFO] Using 'UTF-8' encoding to copy filtered resources.
[INFO] Copying 892 resources
[INFO] Copying 3 resources
[INFO]
[INFO] --- maven-compiler-plugin:3.2:testCompile (default-testCompile) @ maven-release-manager ---
[INFO] Changes detected - recompiling the module!
[INFO] Compiling 68 source files to F:\jenkins\jenkins-slave\workspace\-box_maven-release_MRELEASE-1007\m\maven-release-manager\target\test-classes
[INFO] /F:/jenkins/jenkins-slave/workspace/-box_maven-release_MRELEASE-1007/m/maven-release-manager/src/test/java/org/apache/maven/shared/release/phase/AbstractReleaseTestCase.java: Some input files use or override a deprecated API.
[INFO] /F:/jenkins/jenkins-slave/workspace/-box_maven-release_MRELEASE-1007/m/maven-release-manager/src/test/java/org/apache/maven/shared/release/phase/AbstractReleaseTestCase.java: Recompile with -Xlint:deprecation for details.
[INFO] -------------------------------------------------------------
[ERROR] COMPILATION ERROR :
[INFO] -------------------------------------------------------------
[ERROR] /F:/jenkins/jenkins-slave/workspace/-box_maven-release_MRELEASE-1007/m/maven-release-manager/src/test/java/org/apache/maven/shared/release/transform/jdom/JDomPropertiesTest.java:[108,35] reference to storeToXML is ambiguous
  both method storeToXML(java.io.OutputStream,java.lang.String,java.nio.charset.Charset) in java.util.Properties and method storeToXML(java.io.OutputStream,java.lang.String,java.lang.String) in org.apache.maven.shared.release.transform.jdom.JDomProperties match
[INFO] 1 error
[INFO] -------------------------------------------------------------
[INFO] ------------------------------------------------------------------------
[INFO] Reactor Summary for Maven Release 3.0.0-SNAPSHOT:
[INFO]
[INFO] Maven Release ...................................... SUCCESS [ 28.354 s]
[INFO] Maven Release APIs ................................. SUCCESS [ 12.385 s]
[INFO] Maven Release Manager .............................. FAILURE [ 49.344 s]
[INFO] Maven Release Plugin ............................... SKIPPED
[INFO] Maven Release Odd-Even Policy ...................... SKIPPED
[INFO] Maven Release SemVer Policy ........................ SKIPPED
[INFO] ------------------------------------------------------------------------
[INFO] BUILD FAILURE
[INFO] ------------------------------------------------------------------------
[INFO] Total time:  01:32 min
[INFO] Finished at: 2019-06-22T16:45:02Z
[INFO] ------------------------------------------------------------------------
[INFO] [jenkins-event-spy] Generated F:\jenkins\jenkins-slave\workspace\-box_maven-release_MRELEASE-1007@tmp\withMaven9f3e3cde\maven-spy-20190622-164330-451865385658568587641.log
[ERROR] Failed to execute goal org.apache.maven.plugins:maven-compiler-plugin:3.2:testCompile (default-testCompile) on project maven-release-manager: Compilation failure
[ERROR] /F:/jenkins/jenkins-slave/workspace/-box_maven-release_MRELEASE-1007/m/maven-release-manager/src/test/java/org/apache/maven/shared/release/transform/jdom/JDomPropertiesTest.java:[108,35] reference to storeToXML is ambiguous
[ERROR]   both method storeToXML(java.io.OutputStream,java.lang.String,java.nio.charset.Charset) in java.util.Properties and method storeToXML(java.io.OutputStream,java.lang.String,java.lang.String) in org.apache.maven.shared.release.transform.jdom.JDomProperties match
[ERROR] -> [Help 1]
[ERROR]
[ERROR] To see the full stack trace of the errors, re-run Maven with the -e switch.
[ERROR] Re-run Maven using the -X switch to enable full debug logging.
[ERROR]
[ERROR] For more information about the errors and possible solutions, please read the following articles:
[ERROR] [Help 1] http://cwiki.apache.org/confluence/display/MAVEN/MojoFailureException
[ERROR]
[ERROR] After correcting the problems, you can resume the build with the command
[ERROR]   mvn <goals> -rf :maven-release-manager
[Pipeline] }
[Pipeline] // dir
[Pipeline] }
[withMaven] junitPublisher - Archive test results for Maven artifact org.apache.maven.release:maven-release-api:jar:3.0.0-SNAPSHOT generated by maven-surefire-plugin:test (default-test): m\maven-release-api\target\surefire-reports\*.xml
Recording test results
None of the test reports contained any result
[withMaven] Publishers: Pipeline Graph Publisher: 3 ms, Junit Publisher: 174 ms, Dependencies Fingerprint Publisher: 95 ms
[Pipeline] // withMaven
[Pipeline] echo
[FAILURE-004] hudson.AbortException: script returned exit code 1
[Pipeline] cleanWs
[WS-CLEANUP] Deleting project workspace...
[WS-CLEANUP] Deferred wipeout is used...
[WS-CLEANUP] done
[Pipeline] cleanWs
[WS-CLEANUP] Deleting project workspace...
[WS-CLEANUP] Deferred wipeout is used...
[WS-CLEANUP] done
[Pipeline] }
[Pipeline] // stage
[Pipeline] }
[Pipeline] // node
[Pipeline] }
Failed in branch windows-jdk12
[Pipeline] // parallel
[Pipeline] echo
[FAILURE-003] AbortException hudson.AbortException: script returned exit code 1
[Pipeline] stage
[Pipeline] { (Notifications)
[Pipeline] echo
Build result: FAILURE
[Pipeline] jiraIssueSelector
[Pipeline] emailext