Build failed in Jenkins: Maven TLP » maven-release » IMPROVE_POM #1

classic Classic list List threaded Threaded
4 messages Options
Reply | Threaded
Open this post in threaded view
|

Build failed in Jenkins: Maven TLP » maven-release » IMPROVE_POM #1

Apache Jenkins Server-2
See https://builds.apache.org/job/maven-box/job/maven-release/job/IMPROVE_POM/1/

No changes.

All tests passed

Build log:
[...truncated 7.43 MB...]
[windows-jdk9-m3.5.x_build] performing MavenInvokerRecorder, reportsFilenamePattern:'**/windows-jdk9-m3.5.x_build\maven-release-plugin\target\invoker-reports/BUILD*.xml', invokerBuildDir:'**/windows-jdk9-m3.5.x_build\maven-release-plugin\target\it'
[windows-jdk9-m3.5.x_build] Found reports:[f:\jenkins\jenkins-slave\workspace\x_maven-release_IMPROVE_POM-KZP6VA3ZSGGYNTVVOCGLUBHYECJZQ34VIS6H2U5HNYVKLJFCFQKQ@2\windows-jdk9-m3.5.x_build\maven-release-plugin\target\invoker-reports\BUILD-projects_update-versions_MRELEASE-555.xml, f:\jenkins\jenkins-slave\workspace\x_maven-release_IMPROVE_POM-KZP6VA3ZSGGYNTVVOCGLUBHYECJZQ34VIS6H2U5HNYVKLJFCFQKQ@2\windows-jdk9-m3.5.x_build\maven-release-plugin\target\invoker-reports\BUILD-projects_update-versions_MRELEASE-611.xml, f:\jenkins\jenkins-slave\workspace\x_maven-release_IMPROVE_POM-KZP6VA3ZSGGYNTVVOCGLUBHYECJZQ34VIS6H2U5HNYVKLJFCFQKQ@2\windows-jdk9-m3.5.x_build\maven-release-plugin\target\invoker-reports\BUILD-projects_update-versions_MRELEASE-783.xml, f:\jenkins\jenkins-slave\workspace\x_maven-release_IMPROVE_POM-KZP6VA3ZSGGYNTVVOCGLUBHYECJZQ34VIS6H2U5HNYVKLJFCFQKQ@2\windows-jdk9-m3.5.x_build\maven-release-plugin\target\invoker-reports\BUILD-projects_update-versions_MRELEASE-976.xml]
[windows-jdk9-m3.5.x_build] Found logs:[f:\jenkins\jenkins-slave\workspace\x_maven-release_IMPROVE_POM-KZP6VA3ZSGGYNTVVOCGLUBHYECJZQ34VIS6H2U5HNYVKLJFCFQKQ@2\windows-jdk9-m3.5.x_build\maven-release-plugin\target\it\projects\update-versions\MRELEASE-555\build.log, f:\jenkins\jenkins-slave\workspace\x_maven-release_IMPROVE_POM-KZP6VA3ZSGGYNTVVOCGLUBHYECJZQ34VIS6H2U5HNYVKLJFCFQKQ@2\windows-jdk9-m3.5.x_build\maven-release-plugin\target\it\projects\update-versions\MRELEASE-611\build.log, f:\jenkins\jenkins-slave\workspace\x_maven-release_IMPROVE_POM-KZP6VA3ZSGGYNTVVOCGLUBHYECJZQ34VIS6H2U5HNYVKLJFCFQKQ@2\windows-jdk9-m3.5.x_build\maven-release-plugin\target\it\projects\update-versions\MRELEASE-783\build.log, f:\jenkins\jenkins-slave\workspace\x_maven-release_IMPROVE_POM-KZP6VA3ZSGGYNTVVOCGLUBHYECJZQ34VIS6H2U5HNYVKLJFCFQKQ@2\windows-jdk9-m3.5.x_build\maven-release-plugin\target\it\projects\update-versions\MRELEASE-976\build.log]
[windows-jdk9-m3.5.x_build] Finished parsing Maven Invoker results (found 4)
[windows-jdk9-m3.5.x_build] [withMaven] invokerPublisher - Archive invoker results for Maven artifact MavenArtifact{org.apache.maven.plugins:maven-release-plugin::3.0.0-SNAPSHOT(version: 3.0.0-SNAPSHOT, snapshot:false) } generated by PluginInvocation{org.apache.maven.plugins:maven-invoker-plugin:3.0.1@run  integration-test-perform}: windows-jdk9-m3.5.x_build\maven-release-plugin\target\invoker-reports\*.xml
[windows-jdk9-m3.5.x_build] performing MavenInvokerRecorder, reportsFilenamePattern:'**/windows-jdk9-m3.5.x_build\maven-release-plugin\target\invoker-reports/BUILD*.xml', invokerBuildDir:'**/windows-jdk9-m3.5.x_build\maven-release-plugin\target\it'
[windows-jdk9-m3.5.x_build] Found reports:[f:\jenkins\jenkins-slave\workspace\x_maven-release_IMPROVE_POM-KZP6VA3ZSGGYNTVVOCGLUBHYECJZQ34VIS6H2U5HNYVKLJFCFQKQ@2\windows-jdk9-m3.5.x_build\maven-release-plugin\target\invoker-reports\BUILD-projects_update-versions_MRELEASE-555.xml, f:\jenkins\jenkins-slave\workspace\x_maven-release_IMPROVE_POM-KZP6VA3ZSGGYNTVVOCGLUBHYECJZQ34VIS6H2U5HNYVKLJFCFQKQ@2\windows-jdk9-m3.5.x_build\maven-release-plugin\target\invoker-reports\BUILD-projects_update-versions_MRELEASE-611.xml, f:\jenkins\jenkins-slave\workspace\x_maven-release_IMPROVE_POM-KZP6VA3ZSGGYNTVVOCGLUBHYECJZQ34VIS6H2U5HNYVKLJFCFQKQ@2\windows-jdk9-m3.5.x_build\maven-release-plugin\target\invoker-reports\BUILD-projects_update-versions_MRELEASE-783.xml, f:\jenkins\jenkins-slave\workspace\x_maven-release_IMPROVE_POM-KZP6VA3ZSGGYNTVVOCGLUBHYECJZQ34VIS6H2U5HNYVKLJFCFQKQ@2\windows-jdk9-m3.5.x_build\maven-release-plugin\target\invoker-reports\BUILD-projects_update-versions_MRELEASE-976.xml]
[windows-jdk9-m3.5.x_build] Found logs:[f:\jenkins\jenkins-slave\workspace\x_maven-release_IMPROVE_POM-KZP6VA3ZSGGYNTVVOCGLUBHYECJZQ34VIS6H2U5HNYVKLJFCFQKQ@2\windows-jdk9-m3.5.x_build\maven-release-plugin\target\it\projects\update-versions\MRELEASE-555\build.log, f:\jenkins\jenkins-slave\workspace\x_maven-release_IMPROVE_POM-KZP6VA3ZSGGYNTVVOCGLUBHYECJZQ34VIS6H2U5HNYVKLJFCFQKQ@2\windows-jdk9-m3.5.x_build\maven-release-plugin\target\it\projects\update-versions\MRELEASE-611\build.log, f:\jenkins\jenkins-slave\workspace\x_maven-release_IMPROVE_POM-KZP6VA3ZSGGYNTVVOCGLUBHYECJZQ34VIS6H2U5HNYVKLJFCFQKQ@2\windows-jdk9-m3.5.x_build\maven-release-plugin\target\it\projects\update-versions\MRELEASE-783\build.log, f:\jenkins\jenkins-slave\workspace\x_maven-release_IMPROVE_POM-KZP6VA3ZSGGYNTVVOCGLUBHYECJZQ34VIS6H2U5HNYVKLJFCFQKQ@2\windows-jdk9-m3.5.x_build\maven-release-plugin\target\it\projects\update-versions\MRELEASE-976\build.log]
[windows-jdk9-m3.5.x_build] Finished parsing Maven Invoker results (found 4)
[windows-jdk9-m3.5.x_build] [withMaven] invokerPublisher - Archive invoker results for Maven artifact MavenArtifact{org.apache.maven.plugins:maven-release-plugin::3.0.0-SNAPSHOT(version: 3.0.0-SNAPSHOT, snapshot:false) } generated by PluginInvocation{org.apache.maven.plugins:maven-invoker-plugin:3.0.1@run  integration-test-update-versions}: windows-jdk9-m3.5.x_build\maven-release-plugin\target\invoker-reports\*.xml
[windows-jdk9-m3.5.x_build] performing MavenInvokerRecorder, reportsFilenamePattern:'**/windows-jdk9-m3.5.x_build\maven-release-plugin\target\invoker-reports/BUILD*.xml', invokerBuildDir:'**/windows-jdk9-m3.5.x_build\maven-release-plugin\target\it'
[windows-jdk9-m3.5.x_build] Found reports:[f:\jenkins\jenkins-slave\workspace\x_maven-release_IMPROVE_POM-KZP6VA3ZSGGYNTVVOCGLUBHYECJZQ34VIS6H2U5HNYVKLJFCFQKQ@2\windows-jdk9-m3.5.x_build\maven-release-plugin\target\invoker-reports\BUILD-projects_update-versions_MRELEASE-555.xml, f:\jenkins\jenkins-slave\workspace\x_maven-release_IMPROVE_POM-KZP6VA3ZSGGYNTVVOCGLUBHYECJZQ34VIS6H2U5HNYVKLJFCFQKQ@2\windows-jdk9-m3.5.x_build\maven-release-plugin\target\invoker-reports\BUILD-projects_update-versions_MRELEASE-611.xml, f:\jenkins\jenkins-slave\workspace\x_maven-release_IMPROVE_POM-KZP6VA3ZSGGYNTVVOCGLUBHYECJZQ34VIS6H2U5HNYVKLJFCFQKQ@2\windows-jdk9-m3.5.x_build\maven-release-plugin\target\invoker-reports\BUILD-projects_update-versions_MRELEASE-783.xml, f:\jenkins\jenkins-slave\workspace\x_maven-release_IMPROVE_POM-KZP6VA3ZSGGYNTVVOCGLUBHYECJZQ34VIS6H2U5HNYVKLJFCFQKQ@2\windows-jdk9-m3.5.x_build\maven-release-plugin\target\invoker-reports\BUILD-projects_update-versions_MRELEASE-976.xml]
[windows-jdk9-m3.5.x_build] Found logs:[f:\jenkins\jenkins-slave\workspace\x_maven-release_IMPROVE_POM-KZP6VA3ZSGGYNTVVOCGLUBHYECJZQ34VIS6H2U5HNYVKLJFCFQKQ@2\windows-jdk9-m3.5.x_build\maven-release-plugin\target\it\projects\update-versions\MRELEASE-555\build.log, f:\jenkins\jenkins-slave\workspace\x_maven-release_IMPROVE_POM-KZP6VA3ZSGGYNTVVOCGLUBHYECJZQ34VIS6H2U5HNYVKLJFCFQKQ@2\windows-jdk9-m3.5.x_build\maven-release-plugin\target\it\projects\update-versions\MRELEASE-611\build.log, f:\jenkins\jenkins-slave\workspace\x_maven-release_IMPROVE_POM-KZP6VA3ZSGGYNTVVOCGLUBHYECJZQ34VIS6H2U5HNYVKLJFCFQKQ@2\windows-jdk9-m3.5.x_build\maven-release-plugin\target\it\projects\update-versions\MRELEASE-783\build.log, f:\jenkins\jenkins-slave\workspace\x_maven-release_IMPROVE_POM-KZP6VA3ZSGGYNTVVOCGLUBHYECJZQ34VIS6H2U5HNYVKLJFCFQKQ@2\windows-jdk9-m3.5.x_build\maven-release-plugin\target\it\projects\update-versions\MRELEASE-976\build.log]
[windows-jdk9-m3.5.x_build] Finished parsing Maven Invoker results (found 4)
[windows-jdk9-m3.5.x_build] [withMaven] junitPublisher - Archive test results for Maven artifact org.apache.maven.release:maven-release-api:3.0.0-SNAPSHOT generated by maven-surefire-plugin:test (default-test): windows-jdk9-m3.5.x_build\maven-release-api\target\surefire-reports\*.xml
[windows-jdk9-m3.5.x_build] Recording test results
[windows-jdk9-m3.5.x_build] None of the test reports contained any result
[windows-jdk9-m3.5.x_build] [withMaven] junitPublisher - Archive test results for Maven artifact org.apache.maven.release:maven-release-manager:3.0.0-SNAPSHOT generated by maven-surefire-plugin:test (default-test): windows-jdk9-m3.5.x_build\maven-release-manager\target\surefire-reports\*.xml
[windows-jdk9-m3.5.x_build] Recording test results
[windows-jdk9-m3.5.x_build] [withMaven] junitPublisher - Archive test results for Maven artifact org.apache.maven.plugins:maven-release-plugin:3.0.0-SNAPSHOT generated by maven-surefire-plugin:test (default-test): windows-jdk9-m3.5.x_build\maven-release-plugin\target\surefire-reports\*.xml
[windows-jdk9-m3.5.x_build] Recording test results
[windows-jdk9-m3.5.x_build] [withMaven] junitPublisher - Archive test results for Maven artifact org.apache.maven.release:maven-release-oddeven-policy:3.0.0-SNAPSHOT generated by maven-surefire-plugin:test (default-test): windows-jdk9-m3.5.x_build\maven-release-policies\maven-release-oddeven-policy\target\surefire-reports\*.xml
[windows-jdk9-m3.5.x_build] Recording test results
[windows-jdk9-m3.5.x_build] [withMaven] junitPublisher - Archive test results for Maven artifact org.apache.maven.release:maven-release-semver-policy:3.0.0-SNAPSHOT generated by maven-surefire-plugin:test (default-test): windows-jdk9-m3.5.x_build\maven-release-policies\maven-release-semver-policy\target\surefire-reports\*.xml
[windows-jdk9-m3.5.x_build] Recording test results
[windows-jdk9-m3.5.x_build] [withMaven] junitPublisher - Archive test results for Maven artifact org.apache.maven.release:maven-release-manager:3.0.0-SNAPSHOT generated by maven-failsafe-plugin:integration-test (default): windows-jdk9-m3.5.x_build\maven-release-manager\target\failsafe-reports\*.xml
[windows-jdk9-m3.5.x_build] Recording test results
[windows-jdk9-m3.5.x_build] [withMaven] openTasksPublisher - Scan Tasks for Maven artifact org.apache.maven.release:maven-release-api:3.0.0-SNAPSHOT in source directory windows-jdk9-m3.5.x_build\maven-release-api\src\main\java
[windows-jdk9-m3.5.x_build] [withMaven] openTasksPublisher - Scan Tasks for Maven artifact org.apache.maven.release:maven-release-manager:3.0.0-SNAPSHOT in source directory windows-jdk9-m3.5.x_build\maven-release-manager\src\main\java
[windows-jdk9-m3.5.x_build] [withMaven] openTasksPublisher - Scan Tasks for Maven artifact org.apache.maven.plugins:maven-release-plugin:3.0.0-SNAPSHOT in source directory windows-jdk9-m3.5.x_build\maven-release-plugin\src\main\java
[windows-jdk9-m3.5.x_build] [withMaven] openTasksPublisher - Scan Tasks for Maven artifact org.apache.maven.release:maven-release-oddeven-policy:3.0.0-SNAPSHOT in source directory windows-jdk9-m3.5.x_build\maven-release-policies\maven-release-oddeven-policy\src\main\java
[windows-jdk9-m3.5.x_build] [withMaven] openTasksPublisher - Scan Tasks for Maven artifact org.apache.maven.release:maven-release-semver-policy:3.0.0-SNAPSHOT in source directory windows-jdk9-m3.5.x_build\maven-release-policies\maven-release-semver-policy\src\main\java
[windows-jdk9-m3.5.x_build] [TASKS] Scanning folder 'f:\jenkins\jenkins-slave\workspace\x_maven-release_IMPROVE_POM-KZP6VA3ZSGGYNTVVOCGLUBHYECJZQ34VIS6H2U5HNYVKLJFCFQKQ@2' for files matching the pattern 'windows-jdk9-m3.5.x_build\maven-release-api\src\main\java\**\*,windows-jdk9-m3.5.x_build\maven-release-manager\src\main\java\**\*,windows-jdk9-m3.5.x_build\maven-release-plugin\src\main\java\**\*,windows-jdk9-m3.5.x_build\maven-release-policies\maven-release-oddeven-policy\src\main\java\**\*,windows-jdk9-m3.5.x_build\maven-release-policies\maven-release-semver-policy\src\main\java\**\*' - excludes: null
[windows-jdk9-m3.5.x_build] [TASKS] Found 130 files to scan for tasks
[windows-jdk9-m3.5.x_build] [TASKS] Found 21 open tasks.
[windows-jdk9-m3.5.x_build] Skipping warnings blame since pipelines do not have an SCM link.%n
[Pipeline] [windows-jdk10-m3.5.x_build] // node
[Pipeline] [windows-jdk10-m3.5.x_build] }
[windows-jdk10-m3.5.x_build] Failed in branch windows-jdk10-m3.5.x_build
[Pipeline] [windows-jdk7-m3.0.x_build] }
[Pipeline] [windows-jdk7-m3.2.x_build] cleanWs
[Pipeline] [linux-jdk9-m3.5.x_build] // node
[Pipeline] [linux-jdk10-m3.5.x_build] // node
[windows-jdk7-m3.2.x_build] [WS-CLEANUP] Deleting project workspace...[WS-CLEANUP] done
[Pipeline] [linux-jdk7-m3.5.x_build] // withMaven
[Pipeline] [windows-jdk8-m3.5.x_build] // withMaven
[Pipeline] [windows-jdk9-m3.5.x_build] // withMaven
[Pipeline] [linux-jdk9-m3.5.x_build] }
[Pipeline] [linux-jdk10-m3.5.x_build] }
[Pipeline] [linux-jdk7-m3.0.x_build] }
[Pipeline] [linux-jdk7-m3.2.x_build] }
[Pipeline] [linux-jdk7-m3.3.x_build] }
[Pipeline] [linux-jdk7-m3.5.x_build] cleanWs
[Pipeline] [linux-jdk8-m3.5.x_build] }
[Pipeline] [windows-jdk8-m3.5.x_build] cleanWs
[Pipeline] [windows-jdk7-m3.3.x_build] }
[Pipeline] [windows-jdk9-m3.5.x_build] cleanWs
[Pipeline] [windows-jdk7-m3.5.x_build] }
[Pipeline] [windows-jdk7-m3.0.x_build] // stage
[Pipeline] [windows-jdk7-m3.0.x_build] }
[Pipeline] [windows-jdk7-m3.2.x_build] }
[Pipeline] [linux-jdk7-m3.0.x_build] // stage
[Pipeline] [linux-jdk7-m3.2.x_build] // stage
[windows-jdk8-m3.5.x_build] [WS-CLEANUP] Deleting project workspace...[WS-CLEANUP] done
[Pipeline] [linux-jdk7-m3.3.x_build] // stage
[windows-jdk9-m3.5.x_build] [WS-CLEANUP] Deleting project workspace...[WS-CLEANUP] done
[Pipeline] [linux-jdk8-m3.5.x_build] // stage
[Pipeline] [windows-jdk7-m3.3.x_build] // dir
[Pipeline] [windows-jdk7-m3.5.x_build] // dir
[linux-jdk7-m3.5.x_build] [WS-CLEANUP] Deleting project workspace...[WS-CLEANUP] done
[Pipeline] [linux-jdk7-m3.0.x_build] }
[Pipeline] [linux-jdk7-m3.2.x_build] }
[Pipeline] [linux-jdk7-m3.3.x_build] }
[Pipeline] [linux-jdk8-m3.5.x_build] }
[Pipeline] [windows-jdk7-m3.3.x_build] }
[windows-jdk7-m3.3.x_build] [withMaven] artifactsPublisher - Archive artifact windows-jdk7-m3.3.x_build\pom.xml under org\apache\maven\release\maven-release\3.0.0-SNAPSHOT\maven-release-3.0.0-SNAPSHOT.pom
[windows-jdk7-m3.3.x_build] [withMaven] artifactsPublisher - Archive artifact windows-jdk7-m3.3.x_build\target\maven-release-3.0.0-SNAPSHOT-site.xml under org\apache\maven\release\maven-release\3.0.0-SNAPSHOT\maven-release-3.0.0-SNAPSHOT-site.xml
[windows-jdk7-m3.3.x_build] [withMaven] artifactsPublisher - Archive artifact windows-jdk7-m3.3.x_build\maven-release-api\pom.xml under org\apache\maven\release\maven-release-api\3.0.0-SNAPSHOT\maven-release-api-3.0.0-SNAPSHOT.pom
[windows-jdk7-m3.3.x_build] [withMaven] artifactsPublisher - Archive artifact windows-jdk7-m3.3.x_build\maven-release-api\target\maven-release-api-3.0.0-SNAPSHOT.jar under org\apache\maven\release\maven-release-api\3.0.0-SNAPSHOT\maven-release-api-3.0.0-SNAPSHOT.jar
[windows-jdk7-m3.3.x_build] [withMaven] artifactsPublisher - Archive artifact windows-jdk7-m3.3.x_build\maven-release-manager\pom.xml under org\apache\maven\release\maven-release-manager\3.0.0-SNAPSHOT\maven-release-manager-3.0.0-SNAPSHOT.pom
[windows-jdk7-m3.3.x_build] [withMaven] artifactsPublisher - Archive artifact windows-jdk7-m3.3.x_build\maven-release-manager\target\maven-release-manager-3.0.0-SNAPSHOT.jar under org\apache\maven\release\maven-release-manager\3.0.0-SNAPSHOT\maven-release-manager-3.0.0-SNAPSHOT.jar
[windows-jdk7-m3.3.x_build] [withMaven] artifactsPublisher - Archive artifact windows-jdk7-m3.3.x_build\maven-release-plugin\pom.xml under org\apache\maven\plugins\maven-release-plugin\3.0.0-SNAPSHOT\maven-release-plugin-3.0.0-SNAPSHOT.pom
[windows-jdk7-m3.3.x_build] [withMaven] artifactsPublisher - Archive artifact windows-jdk7-m3.3.x_build\maven-release-plugin\target\maven-release-plugin-3.0.0-SNAPSHOT.jar under org\apache\maven\plugins\maven-release-plugin\3.0.0-SNAPSHOT\maven-release-plugin-3.0.0-SNAPSHOT.jar
[windows-jdk7-m3.3.x_build] [withMaven] artifactsPublisher - Archive artifact windows-jdk7-m3.3.x_build\maven-release-policies\maven-release-oddeven-policy\pom.xml under org\apache\maven\release\maven-release-oddeven-policy\3.0.0-SNAPSHOT\maven-release-oddeven-policy-3.0.0-SNAPSHOT.pom
[windows-jdk7-m3.3.x_build] [withMaven] artifactsPublisher - Archive artifact windows-jdk7-m3.3.x_build\maven-release-policies\maven-release-oddeven-policy\target\maven-release-oddeven-policy-3.0.0-SNAPSHOT.jar under org\apache\maven\release\maven-release-oddeven-policy\3.0.0-SNAPSHOT\maven-release-oddeven-policy-3.0.0-SNAPSHOT.jar
[windows-jdk7-m3.3.x_build] [withMaven] artifactsPublisher - Archive artifact windows-jdk7-m3.3.x_build\maven-release-policies\maven-release-semver-policy\pom.xml under org\apache\maven\release\maven-release-semver-policy\3.0.0-SNAPSHOT\maven-release-semver-policy-3.0.0-SNAPSHOT.pom
[windows-jdk7-m3.3.x_build] [withMaven] artifactsPublisher - Archive artifact windows-jdk7-m3.3.x_build\maven-release-policies\maven-release-semver-policy\target\maven-release-semver-policy-3.0.0-SNAPSHOT.jar under org\apache\maven\release\maven-release-semver-policy\3.0.0-SNAPSHOT\maven-release-semver-policy-3.0.0-SNAPSHOT.jar
[windows-jdk7-m3.3.x_build] [Fast Archiver] No prior successful build to compare, so performing full copy of artifacts
[windows-jdk7-m3.3.x_build] [withMaven] invokerPublisher - Archive invoker results for Maven artifact MavenArtifact{org.apache.maven.plugins:maven-release-plugin::3.0.0-SNAPSHOT(version: 3.0.0-SNAPSHOT, snapshot:false) } generated by PluginInvocation{org.apache.maven.plugins:maven-invoker-plugin:3.0.1@run  integration-test-prepare}: windows-jdk7-m3.3.x_build\maven-release-plugin\target\invoker-reports\*.xml
[windows-jdk7-m3.3.x_build] performing MavenInvokerRecorder, reportsFilenamePattern:'**/windows-jdk7-m3.3.x_build\maven-release-plugin\target\invoker-reports/BUILD*.xml', invokerBuildDir:'**/windows-jdk7-m3.3.x_build\maven-release-plugin\target\it'
[windows-jdk7-m3.3.x_build] Found reports:[f:\jenkins\jenkins-slave\workspace\x_maven-release_IMPROVE_POM-KZP6VA3ZSGGYNTVVOCGLUBHYECJZQ34VIS6H2U5HNYVKLJFCFQKQ\windows-jdk7-m3.3.x_build\maven-release-plugin\target\invoker-reports\BUILD-projects_update-versions_MRELEASE-555.xml, f:\jenkins\jenkins-slave\workspace\x_maven-release_IMPROVE_POM-KZP6VA3ZSGGYNTVVOCGLUBHYECJZQ34VIS6H2U5HNYVKLJFCFQKQ\windows-jdk7-m3.3.x_build\maven-release-plugin\target\invoker-reports\BUILD-projects_update-versions_MRELEASE-611.xml, f:\jenkins\jenkins-slave\workspace\x_maven-release_IMPROVE_POM-KZP6VA3ZSGGYNTVVOCGLUBHYECJZQ34VIS6H2U5HNYVKLJFCFQKQ\windows-jdk7-m3.3.x_build\maven-release-plugin\target\invoker-reports\BUILD-projects_update-versions_MRELEASE-783.xml, f:\jenkins\jenkins-slave\workspace\x_maven-release_IMPROVE_POM-KZP6VA3ZSGGYNTVVOCGLUBHYECJZQ34VIS6H2U5HNYVKLJFCFQKQ\windows-jdk7-m3.3.x_build\maven-release-plugin\target\invoker-reports\BUILD-projects_update-versions_MRELEASE-976.xml]
[windows-jdk7-m3.3.x_build] Found logs:[f:\jenkins\jenkins-slave\workspace\x_maven-release_IMPROVE_POM-KZP6VA3ZSGGYNTVVOCGLUBHYECJZQ34VIS6H2U5HNYVKLJFCFQKQ\windows-jdk7-m3.3.x_build\maven-release-plugin\target\it\projects\update-versions\MRELEASE-555\build.log, f:\jenkins\jenkins-slave\workspace\x_maven-release_IMPROVE_POM-KZP6VA3ZSGGYNTVVOCGLUBHYECJZQ34VIS6H2U5HNYVKLJFCFQKQ\windows-jdk7-m3.3.x_build\maven-release-plugin\target\it\projects\update-versions\MRELEASE-611\build.log, f:\jenkins\jenkins-slave\workspace\x_maven-release_IMPROVE_POM-KZP6VA3ZSGGYNTVVOCGLUBHYECJZQ34VIS6H2U5HNYVKLJFCFQKQ\windows-jdk7-m3.3.x_build\maven-release-plugin\target\it\projects\update-versions\MRELEASE-783\build.log, f:\jenkins\jenkins-slave\workspace\x_maven-release_IMPROVE_POM-KZP6VA3ZSGGYNTVVOCGLUBHYECJZQ34VIS6H2U5HNYVKLJFCFQKQ\windows-jdk7-m3.3.x_build\maven-release-plugin\target\it\projects\update-versions\MRELEASE-976\build.log]
[windows-jdk7-m3.3.x_build] Finished parsing Maven Invoker results (found 4)
[windows-jdk7-m3.3.x_build] [withMaven] invokerPublisher - Archive invoker results for Maven artifact MavenArtifact{org.apache.maven.plugins:maven-release-plugin::3.0.0-SNAPSHOT(version: 3.0.0-SNAPSHOT, snapshot:false) } generated by PluginInvocation{org.apache.maven.plugins:maven-invoker-plugin:3.0.1@run  integration-test-prepare-with-pom}: windows-jdk7-m3.3.x_build\maven-release-plugin\target\invoker-reports\*.xml
[windows-jdk7-m3.3.x_build] performing MavenInvokerRecorder, reportsFilenamePattern:'**/windows-jdk7-m3.3.x_build\maven-release-plugin\target\invoker-reports/BUILD*.xml', invokerBuildDir:'**/windows-jdk7-m3.3.x_build\maven-release-plugin\target\it'
[windows-jdk7-m3.3.x_build] Found reports:[f:\jenkins\jenkins-slave\workspace\x_maven-release_IMPROVE_POM-KZP6VA3ZSGGYNTVVOCGLUBHYECJZQ34VIS6H2U5HNYVKLJFCFQKQ\windows-jdk7-m3.3.x_build\maven-release-plugin\target\invoker-reports\BUILD-projects_update-versions_MRELEASE-555.xml, f:\jenkins\jenkins-slave\workspace\x_maven-release_IMPROVE_POM-KZP6VA3ZSGGYNTVVOCGLUBHYECJZQ34VIS6H2U5HNYVKLJFCFQKQ\windows-jdk7-m3.3.x_build\maven-release-plugin\target\invoker-reports\BUILD-projects_update-versions_MRELEASE-611.xml, f:\jenkins\jenkins-slave\workspace\x_maven-release_IMPROVE_POM-KZP6VA3ZSGGYNTVVOCGLUBHYECJZQ34VIS6H2U5HNYVKLJFCFQKQ\windows-jdk7-m3.3.x_build\maven-release-plugin\target\invoker-reports\BUILD-projects_update-versions_MRELEASE-783.xml, f:\jenkins\jenkins-slave\workspace\x_maven-release_IMPROVE_POM-KZP6VA3ZSGGYNTVVOCGLUBHYECJZQ34VIS6H2U5HNYVKLJFCFQKQ\windows-jdk7-m3.3.x_build\maven-release-plugin\target\invoker-reports\BUILD-projects_update-versions_MRELEASE-976.xml]
[windows-jdk7-m3.3.x_build] Found logs:[f:\jenkins\jenkins-slave\workspace\x_maven-release_IMPROVE_POM-KZP6VA3ZSGGYNTVVOCGLUBHYECJZQ34VIS6H2U5HNYVKLJFCFQKQ\windows-jdk7-m3.3.x_build\maven-release-plugin\target\it\projects\update-versions\MRELEASE-555\build.log, f:\jenkins\jenkins-slave\workspace\x_maven-release_IMPROVE_POM-KZP6VA3ZSGGYNTVVOCGLUBHYECJZQ34VIS6H2U5HNYVKLJFCFQKQ\windows-jdk7-m3.3.x_build\maven-release-plugin\target\it\projects\update-versions\MRELEASE-611\build.log, f:\jenkins\jenkins-slave\workspace\x_maven-release_IMPROVE_POM-KZP6VA3ZSGGYNTVVOCGLUBHYECJZQ34VIS6H2U5HNYVKLJFCFQKQ\windows-jdk7-m3.3.x_build\maven-release-plugin\target\it\projects\update-versions\MRELEASE-783\build.log, f:\jenkins\jenkins-slave\workspace\x_maven-release_IMPROVE_POM-KZP6VA3ZSGGYNTVVOCGLUBHYECJZQ34VIS6H2U5HNYVKLJFCFQKQ\windows-jdk7-m3.3.x_build\maven-release-plugin\target\it\projects\update-versions\MRELEASE-976\build.log]
[windows-jdk7-m3.3.x_build] Finished parsing Maven Invoker results (found 4)
[windows-jdk7-m3.3.x_build] [withMaven] invokerPublisher - Archive invoker results for Maven artifact MavenArtifact{org.apache.maven.plugins:maven-release-plugin::3.0.0-SNAPSHOT(version: 3.0.0-SNAPSHOT, snapshot:false) } generated by PluginInvocation{org.apache.maven.plugins:maven-invoker-plugin:3.0.1@run  integration-test-branch}: windows-jdk7-m3.3.x_build\maven-release-plugin\target\invoker-reports\*.xml
[windows-jdk7-m3.3.x_build] performing MavenInvokerRecorder, reportsFilenamePattern:'**/windows-jdk7-m3.3.x_build\maven-release-plugin\target\invoker-reports/BUILD*.xml', invokerBuildDir:'**/windows-jdk7-m3.3.x_build\maven-release-plugin\target\it'
[windows-jdk7-m3.3.x_build] Found reports:[f:\jenkins\jenkins-slave\workspace\x_maven-release_IMPROVE_POM-KZP6VA3ZSGGYNTVVOCGLUBHYECJZQ34VIS6H2U5HNYVKLJFCFQKQ\windows-jdk7-m3.3.x_build\maven-release-plugin\target\invoker-reports\BUILD-projects_update-versions_MRELEASE-555.xml, f:\jenkins\jenkins-slave\workspace\x_maven-release_IMPROVE_POM-KZP6VA3ZSGGYNTVVOCGLUBHYECJZQ34VIS6H2U5HNYVKLJFCFQKQ\windows-jdk7-m3.3.x_build\maven-release-plugin\target\invoker-reports\BUILD-projects_update-versions_MRELEASE-611.xml, f:\jenkins\jenkins-slave\workspace\x_maven-release_IMPROVE_POM-KZP6VA3ZSGGYNTVVOCGLUBHYECJZQ34VIS6H2U5HNYVKLJFCFQKQ\windows-jdk7-m3.3.x_build\maven-release-plugin\target\invoker-reports\BUILD-projects_update-versions_MRELEASE-783.xml, f:\jenkins\jenkins-slave\workspace\x_maven-release_IMPROVE_POM-KZP6VA3ZSGGYNTVVOCGLUBHYECJZQ34VIS6H2U5HNYVKLJFCFQKQ\windows-jdk7-m3.3.x_build\maven-release-plugin\target\invoker-reports\BUILD-projects_update-versions_MRELEASE-976.xml]
[windows-jdk7-m3.3.x_build] Found logs:[f:\jenkins\jenkins-slave\workspace\x_maven-release_IMPROVE_POM-KZP6VA3ZSGGYNTVVOCGLUBHYECJZQ34VIS6H2U5HNYVKLJFCFQKQ\windows-jdk7-m3.3.x_build\maven-release-plugin\target\it\projects\update-versions\MRELEASE-555\build.log, f:\jenkins\jenkins-slave\workspace\x_maven-release_IMPROVE_POM-KZP6VA3ZSGGYNTVVOCGLUBHYECJZQ34VIS6H2U5HNYVKLJFCFQKQ\windows-jdk7-m3.3.x_build\maven-release-plugin\target\it\projects\update-versions\MRELEASE-611\build.log, f:\jenkins\jenkins-slave\workspace\x_maven-release_IMPROVE_POM-KZP6VA3ZSGGYNTVVOCGLUBHYECJZQ34VIS6H2U5HNYVKLJFCFQKQ\windows-jdk7-m3.3.x_build\maven-release-plugin\target\it\projects\update-versions\MRELEASE-783\build.log, f:\jenkins\jenkins-slave\workspace\x_maven-release_IMPROVE_POM-KZP6VA3ZSGGYNTVVOCGLUBHYECJZQ34VIS6H2U5HNYVKLJFCFQKQ\windows-jdk7-m3.3.x_build\maven-release-plugin\target\it\projects\update-versions\MRELEASE-976\build.log]
[windows-jdk7-m3.3.x_build] Finished parsing Maven Invoker results (found 4)
[windows-jdk7-m3.3.x_build] [withMaven] invokerPublisher - Archive invoker results for Maven artifact MavenArtifact{org.apache.maven.plugins:maven-release-plugin::3.0.0-SNAPSHOT(version: 3.0.0-SNAPSHOT, snapshot:false) } generated by PluginInvocation{org.apache.maven.plugins:maven-invoker-plugin:3.0.1@run  integration-test-perform}: windows-jdk7-m3.3.x_build\maven-release-plugin\target\invoker-reports\*.xml
[windows-jdk7-m3.3.x_build] performing MavenInvokerRecorder, reportsFilenamePattern:'**/windows-jdk7-m3.3.x_build\maven-release-plugin\target\invoker-reports/BUILD*.xml', invokerBuildDir:'**/windows-jdk7-m3.3.x_build\maven-release-plugin\target\it'
[windows-jdk7-m3.3.x_build] Found reports:[f:\jenkins\jenkins-slave\workspace\x_maven-release_IMPROVE_POM-KZP6VA3ZSGGYNTVVOCGLUBHYECJZQ34VIS6H2U5HNYVKLJFCFQKQ\windows-jdk7-m3.3.x_build\maven-release-plugin\target\invoker-reports\BUILD-projects_update-versions_MRELEASE-555.xml, f:\jenkins\jenkins-slave\workspace\x_maven-release_IMPROVE_POM-KZP6VA3ZSGGYNTVVOCGLUBHYECJZQ34VIS6H2U5HNYVKLJFCFQKQ\windows-jdk7-m3.3.x_build\maven-release-plugin\target\invoker-reports\BUILD-projects_update-versions_MRELEASE-611.xml, f:\jenkins\jenkins-slave\workspace\x_maven-release_IMPROVE_POM-KZP6VA3ZSGGYNTVVOCGLUBHYECJZQ34VIS6H2U5HNYVKLJFCFQKQ\windows-jdk7-m3.3.x_build\maven-release-plugin\target\invoker-reports\BUILD-projects_update-versions_MRELEASE-783.xml, f:\jenkins\jenkins-slave\workspace\x_maven-release_IMPROVE_POM-KZP6VA3ZSGGYNTVVOCGLUBHYECJZQ34VIS6H2U5HNYVKLJFCFQKQ\windows-jdk7-m3.3.x_build\maven-release-plugin\target\invoker-reports\BUILD-projects_update-versions_MRELEASE-976.xml]
[windows-jdk7-m3.3.x_build] Found logs:[f:\jenkins\jenkins-slave\workspace\x_maven-release_IMPROVE_POM-KZP6VA3ZSGGYNTVVOCGLUBHYECJZQ34VIS6H2U5HNYVKLJFCFQKQ\windows-jdk7-m3.3.x_build\maven-release-plugin\target\it\projects\update-versions\MRELEASE-555\build.log, f:\jenkins\jenkins-slave\workspace\x_maven-release_IMPROVE_POM-KZP6VA3ZSGGYNTVVOCGLUBHYECJZQ34VIS6H2U5HNYVKLJFCFQKQ\windows-jdk7-m3.3.x_build\maven-release-plugin\target\it\projects\update-versions\MRELEASE-611\build.log, f:\jenkins\jenkins-slave\workspace\x_maven-release_IMPROVE_POM-KZP6VA3ZSGGYNTVVOCGLUBHYECJZQ34VIS6H2U5HNYVKLJFCFQKQ\windows-jdk7-m3.3.x_build\maven-release-plugin\target\it\projects\update-versions\MRELEASE-783\build.log, f:\jenkins\jenkins-slave\workspace\x_maven-release_IMPROVE_POM-KZP6VA3ZSGGYNTVVOCGLUBHYECJZQ34VIS6H2U5HNYVKLJFCFQKQ\windows-jdk7-m3.3.x_build\maven-release-plugin\target\it\projects\update-versions\MRELEASE-976\build.log]
[windows-jdk7-m3.3.x_build] Finished parsing Maven Invoker results (found 4)
[windows-jdk7-m3.3.x_build] [withMaven] invokerPublisher - Archive invoker results for Maven artifact MavenArtifact{org.apache.maven.plugins:maven-release-plugin::3.0.0-SNAPSHOT(version: 3.0.0-SNAPSHOT, snapshot:false) } generated by PluginInvocation{org.apache.maven.plugins:maven-invoker-plugin:3.0.1@run  integration-test-update-versions}: windows-jdk7-m3.3.x_build\maven-release-plugin\target\invoker-reports\*.xml
[windows-jdk7-m3.3.x_build] performing MavenInvokerRecorder, reportsFilenamePattern:'**/windows-jdk7-m3.3.x_build\maven-release-plugin\target\invoker-reports/BUILD*.xml', invokerBuildDir:'**/windows-jdk7-m3.3.x_build\maven-release-plugin\target\it'
[windows-jdk7-m3.3.x_build] Found reports:[f:\jenkins\jenkins-slave\workspace\x_maven-release_IMPROVE_POM-KZP6VA3ZSGGYNTVVOCGLUBHYECJZQ34VIS6H2U5HNYVKLJFCFQKQ\windows-jdk7-m3.3.x_build\maven-release-plugin\target\invoker-reports\BUILD-projects_update-versions_MRELEASE-555.xml, f:\jenkins\jenkins-slave\workspace\x_maven-release_IMPROVE_POM-KZP6VA3ZSGGYNTVVOCGLUBHYECJZQ34VIS6H2U5HNYVKLJFCFQKQ\windows-jdk7-m3.3.x_build\maven-release-plugin\target\invoker-reports\BUILD-projects_update-versions_MRELEASE-611.xml, f:\jenkins\jenkins-slave\workspace\x_maven-release_IMPROVE_POM-KZP6VA3ZSGGYNTVVOCGLUBHYECJZQ34VIS6H2U5HNYVKLJFCFQKQ\windows-jdk7-m3.3.x_build\maven-release-plugin\target\invoker-reports\BUILD-projects_update-versions_MRELEASE-783.xml, f:\jenkins\jenkins-slave\workspace\x_maven-release_IMPROVE_POM-KZP6VA3ZSGGYNTVVOCGLUBHYECJZQ34VIS6H2U5HNYVKLJFCFQKQ\windows-jdk7-m3.3.x_build\maven-release-plugin\target\invoker-reports\BUILD-projects_update-versions_MRELEASE-976.xml]
[windows-jdk7-m3.3.x_build] Found logs:[f:\jenkins\jenkins-slave\workspace\x_maven-release_IMPROVE_POM-KZP6VA3ZSGGYNTVVOCGLUBHYECJZQ34VIS6H2U5HNYVKLJFCFQKQ\windows-jdk7-m3.3.x_build\maven-release-plugin\target\it\projects\update-versions\MRELEASE-555\build.log, f:\jenkins\jenkins-slave\workspace\x_maven-release_IMPROVE_POM-KZP6VA3ZSGGYNTVVOCGLUBHYECJZQ34VIS6H2U5HNYVKLJFCFQKQ\windows-jdk7-m3.3.x_build\maven-release-plugin\target\it\projects\update-versions\MRELEASE-611\build.log, f:\jenkins\jenkins-slave\workspace\x_maven-release_IMPROVE_POM-KZP6VA3ZSGGYNTVVOCGLUBHYECJZQ34VIS6H2U5HNYVKLJFCFQKQ\windows-jdk7-m3.3.x_build\maven-release-plugin\target\it\projects\update-versions\MRELEASE-783\build.log, f:\jenkins\jenkins-slave\workspace\x_maven-release_IMPROVE_POM-KZP6VA3ZSGGYNTVVOCGLUBHYECJZQ34VIS6H2U5HNYVKLJFCFQKQ\windows-jdk7-m3.3.x_build\maven-release-plugin\target\it\projects\update-versions\MRELEASE-976\build.log]
[windows-jdk7-m3.3.x_build] Finished parsing Maven Invoker results (found 4)
[windows-jdk7-m3.3.x_build] [withMaven] junitPublisher - Archive test results for Maven artifact org.apache.maven.release:maven-release-api:3.0.0-SNAPSHOT generated by maven-surefire-plugin:test (default-test): windows-jdk7-m3.3.x_build\maven-release-api\target\surefire-reports\*.xml
[windows-jdk7-m3.3.x_build] Recording test results
[windows-jdk7-m3.3.x_build] None of the test reports contained any result
[windows-jdk7-m3.3.x_build] [withMaven] junitPublisher - Archive test results for Maven artifact org.apache.maven.release:maven-release-manager:3.0.0-SNAPSHOT generated by maven-surefire-plugin:test (default-test): windows-jdk7-m3.3.x_build\maven-release-manager\target\surefire-reports\*.xml
[windows-jdk7-m3.3.x_build] Recording test results
[windows-jdk7-m3.3.x_build] [withMaven] junitPublisher - Archive test results for Maven artifact org.apache.maven.plugins:maven-release-plugin:3.0.0-SNAPSHOT generated by maven-surefire-plugin:test (default-test): windows-jdk7-m3.3.x_build\maven-release-plugin\target\surefire-reports\*.xml
[windows-jdk7-m3.3.x_build] Recording test results
[windows-jdk7-m3.3.x_build] [withMaven] junitPublisher - Archive test results for Maven artifact org.apache.maven.release:maven-release-oddeven-policy:3.0.0-SNAPSHOT generated by maven-surefire-plugin:test (default-test): windows-jdk7-m3.3.x_build\maven-release-policies\maven-release-oddeven-policy\target\surefire-reports\*.xml
[windows-jdk7-m3.3.x_build] Recording test results
[windows-jdk7-m3.3.x_build] [withMaven] junitPublisher - Archive test results for Maven artifact org.apache.maven.release:maven-release-semver-policy:3.0.0-SNAPSHOT generated by maven-surefire-plugin:test (default-test): windows-jdk7-m3.3.x_build\maven-release-policies\maven-release-semver-policy\target\surefire-reports\*.xml
[windows-jdk7-m3.3.x_build] Recording test results
[windows-jdk7-m3.3.x_build] [withMaven] junitPublisher - Archive test results for Maven artifact org.apache.maven.release:maven-release-manager:3.0.0-SNAPSHOT generated by maven-failsafe-plugin:integration-test (default): windows-jdk7-m3.3.x_build\maven-release-manager\target\failsafe-reports\*.xml
[windows-jdk7-m3.3.x_build] Recording test results
[windows-jdk7-m3.3.x_build] [withMaven] openTasksPublisher - Scan Tasks for Maven artifact org.apache.maven.release:maven-release-api:3.0.0-SNAPSHOT in source directory windows-jdk7-m3.3.x_build\maven-release-api\src\main\java
[windows-jdk7-m3.3.x_build] [withMaven] openTasksPublisher - Scan Tasks for Maven artifact org.apache.maven.release:maven-release-manager:3.0.0-SNAPSHOT in source directory windows-jdk7-m3.3.x_build\maven-release-manager\src\main\java
[windows-jdk7-m3.3.x_build] [withMaven] openTasksPublisher - Scan Tasks for Maven artifact org.apache.maven.plugins:maven-release-plugin:3.0.0-SNAPSHOT in source directory windows-jdk7-m3.3.x_build\maven-release-plugin\src\main\java
[windows-jdk7-m3.3.x_build] [withMaven] openTasksPublisher - Scan Tasks for Maven artifact org.apache.maven.release:maven-release-oddeven-policy:3.0.0-SNAPSHOT in source directory windows-jdk7-m3.3.x_build\maven-release-policies\maven-release-oddeven-policy\src\main\java
[windows-jdk7-m3.3.x_build] [withMaven] openTasksPublisher - Scan Tasks for Maven artifact org.apache.maven.release:maven-release-semver-policy:3.0.0-SNAPSHOT in source directory windows-jdk7-m3.3.x_build\maven-release-policies\maven-release-semver-policy\src\main\java
[windows-jdk7-m3.3.x_build] [TASKS] Scanning folder 'f:\jenkins\jenkins-slave\workspace\x_maven-release_IMPROVE_POM-KZP6VA3ZSGGYNTVVOCGLUBHYECJZQ34VIS6H2U5HNYVKLJFCFQKQ' for files matching the pattern 'windows-jdk7-m3.3.x_build\maven-release-api\src\main\java\**\*,windows-jdk7-m3.3.x_build\maven-release-manager\src\main\java\**\*,windows-jdk7-m3.3.x_build\maven-release-plugin\src\main\java\**\*,windows-jdk7-m3.3.x_build\maven-release-policies\maven-release-oddeven-policy\src\main\java\**\*,windows-jdk7-m3.3.x_build\maven-release-policies\maven-release-semver-policy\src\main\java\**\*' - excludes: null
[windows-jdk7-m3.3.x_build] [TASKS] Found 130 files to scan for tasks
[windows-jdk7-m3.3.x_build] [TASKS] Found 21 open tasks.
[windows-jdk7-m3.3.x_build] Skipping warnings blame since pipelines do not have an SCM link.%n
[Pipeline] [windows-jdk7-m3.5.x_build] }
[windows-jdk7-m3.5.x_build] [withMaven] artifactsPublisher - Archive artifact windows-jdk7-m3.5.x_build\pom.xml under org\apache\maven\release\maven-release\3.0.0-SNAPSHOT\maven-release-3.0.0-SNAPSHOT.pom
[windows-jdk7-m3.5.x_build] [withMaven] artifactsPublisher - Archive artifact windows-jdk7-m3.5.x_build\target\maven-release-3.0.0-SNAPSHOT-site.xml under org\apache\maven\release\maven-release\3.0.0-SNAPSHOT\maven-release-3.0.0-SNAPSHOT-site.xml
[windows-jdk7-m3.5.x_build] [withMaven] artifactsPublisher - Archive artifact windows-jdk7-m3.5.x_build\maven-release-api\pom.xml under org\apache\maven\release\maven-release-api\3.0.0-SNAPSHOT\maven-release-api-3.0.0-SNAPSHOT.pom
[windows-jdk7-m3.5.x_build] [withMaven] artifactsPublisher - Archive artifact windows-jdk7-m3.5.x_build\maven-release-api\target\maven-release-api-3.0.0-SNAPSHOT.jar under org\apache\maven\release\maven-release-api\3.0.0-SNAPSHOT\maven-release-api-3.0.0-SNAPSHOT.jar
[windows-jdk7-m3.5.x_build] [withMaven] artifactsPublisher - Archive artifact windows-jdk7-m3.5.x_build\maven-release-manager\pom.xml under org\apache\maven\release\maven-release-manager\3.0.0-SNAPSHOT\maven-release-manager-3.0.0-SNAPSHOT.pom
[windows-jdk7-m3.5.x_build] [withMaven] artifactsPublisher - Archive artifact windows-jdk7-m3.5.x_build\maven-release-manager\target\maven-release-manager-3.0.0-SNAPSHOT.jar under org\apache\maven\release\maven-release-manager\3.0.0-SNAPSHOT\maven-release-manager-3.0.0-SNAPSHOT.jar
[windows-jdk7-m3.5.x_build] [withMaven] artifactsPublisher - Archive artifact windows-jdk7-m3.5.x_build\maven-release-plugin\pom.xml under org\apache\maven\plugins\maven-release-plugin\3.0.0-SNAPSHOT\maven-release-plugin-3.0.0-SNAPSHOT.pom
[windows-jdk7-m3.5.x_build] [withMaven] artifactsPublisher - Archive artifact windows-jdk7-m3.5.x_build\maven-release-plugin\target\maven-release-plugin-3.0.0-SNAPSHOT.jar under org\apache\maven\plugins\maven-release-plugin\3.0.0-SNAPSHOT\maven-release-plugin-3.0.0-SNAPSHOT.jar
[windows-jdk7-m3.5.x_build] [withMaven] artifactsPublisher - Archive artifact windows-jdk7-m3.5.x_build\maven-release-policies\maven-release-oddeven-policy\pom.xml under org\apache\maven\release\maven-release-oddeven-policy\3.0.0-SNAPSHOT\maven-release-oddeven-policy-3.0.0-SNAPSHOT.pom
[windows-jdk7-m3.5.x_build] [withMaven] artifactsPublisher - Archive artifact windows-jdk7-m3.5.x_build\maven-release-policies\maven-release-oddeven-policy\target\maven-release-oddeven-policy-3.0.0-SNAPSHOT.jar under org\apache\maven\release\maven-release-oddeven-policy\3.0.0-SNAPSHOT\maven-release-oddeven-policy-3.0.0-SNAPSHOT.jar
[windows-jdk7-m3.5.x_build] [withMaven] artifactsPublisher - Archive artifact windows-jdk7-m3.5.x_build\maven-release-policies\maven-release-semver-policy\pom.xml under org\apache\maven\release\maven-release-semver-policy\3.0.0-SNAPSHOT\maven-release-semver-policy-3.0.0-SNAPSHOT.pom
[windows-jdk7-m3.5.x_build] [withMaven] artifactsPublisher - Archive artifact windows-jdk7-m3.5.x_build\maven-release-policies\maven-release-semver-policy\target\maven-release-semver-policy-3.0.0-SNAPSHOT.jar under org\apache\maven\release\maven-release-semver-policy\3.0.0-SNAPSHOT\maven-release-semver-policy-3.0.0-SNAPSHOT.jar
[windows-jdk7-m3.5.x_build] [Fast Archiver] No prior successful build to compare, so performing full copy of artifacts
[windows-jdk7-m3.5.x_build] [withMaven] invokerPublisher - Archive invoker results for Maven artifact MavenArtifact{org.apache.maven.plugins:maven-release-plugin::3.0.0-SNAPSHOT(version: 3.0.0-SNAPSHOT, snapshot:false) } generated by PluginInvocation{org.apache.maven.plugins:maven-invoker-plugin:3.0.1@run  integration-test-prepare}: windows-jdk7-m3.5.x_build\maven-release-plugin\target\invoker-reports\*.xml
[windows-jdk7-m3.5.x_build] performing MavenInvokerRecorder, reportsFilenamePattern:'**/windows-jdk7-m3.5.x_build\maven-release-plugin\target\invoker-reports/BUILD*.xml', invokerBuildDir:'**/windows-jdk7-m3.5.x_build\maven-release-plugin\target\it'
[windows-jdk7-m3.5.x_build] Found reports:[f:\jenkins\jenkins-slave\workspace\x_maven-release_IMPROVE_POM-KZP6VA3ZSGGYNTVVOCGLUBHYECJZQ34VIS6H2U5HNYVKLJFCFQKQ@2\windows-jdk7-m3.5.x_build\maven-release-plugin\target\invoker-reports\BUILD-projects_update-versions_MRELEASE-555.xml, f:\jenkins\jenkins-slave\workspace\x_maven-release_IMPROVE_POM-KZP6VA3ZSGGYNTVVOCGLUBHYECJZQ34VIS6H2U5HNYVKLJFCFQKQ@2\windows-jdk7-m3.5.x_build\maven-release-plugin\target\invoker-reports\BUILD-projects_update-versions_MRELEASE-611.xml, f:\jenkins\jenkins-slave\workspace\x_maven-release_IMPROVE_POM-KZP6VA3ZSGGYNTVVOCGLUBHYECJZQ34VIS6H2U5HNYVKLJFCFQKQ@2\windows-jdk7-m3.5.x_build\maven-release-plugin\target\invoker-reports\BUILD-projects_update-versions_MRELEASE-783.xml, f:\jenkins\jenkins-slave\workspace\x_maven-release_IMPROVE_POM-KZP6VA3ZSGGYNTVVOCGLUBHYECJZQ34VIS6H2U5HNYVKLJFCFQKQ@2\windows-jdk7-m3.5.x_build\maven-release-plugin\target\invoker-reports\BUILD-projects_update-versions_MRELEASE-976.xml]
[windows-jdk7-m3.5.x_build] Found logs:[f:\jenkins\jenkins-slave\workspace\x_maven-release_IMPROVE_POM-KZP6VA3ZSGGYNTVVOCGLUBHYECJZQ34VIS6H2U5HNYVKLJFCFQKQ@2\windows-jdk7-m3.5.x_build\maven-release-plugin\target\it\projects\update-versions\MRELEASE-555\build.log, f:\jenkins\jenkins-slave\workspace\x_maven-release_IMPROVE_POM-KZP6VA3ZSGGYNTVVOCGLUBHYECJZQ34VIS6H2U5HNYVKLJFCFQKQ@2\windows-jdk7-m3.5.x_build\maven-release-plugin\target\it\projects\update-versions\MRELEASE-611\build.log, f:\jenkins\jenkins-slave\workspace\x_maven-release_IMPROVE_POM-KZP6VA3ZSGGYNTVVOCGLUBHYECJZQ34VIS6H2U5HNYVKLJFCFQKQ@2\windows-jdk7-m3.5.x_build\maven-release-plugin\target\it\projects\update-versions\MRELEASE-783\build.log, f:\jenkins\jenkins-slave\workspace\x_maven-release_IMPROVE_POM-KZP6VA3ZSGGYNTVVOCGLUBHYECJZQ34VIS6H2U5HNYVKLJFCFQKQ@2\windows-jdk7-m3.5.x_build\maven-release-plugin\target\it\projects\update-versions\MRELEASE-976\build.log]
[windows-jdk7-m3.5.x_build] Finished parsing Maven Invoker results (found 4)
[windows-jdk7-m3.5.x_build] [withMaven] invokerPublisher - Archive invoker results for Maven artifact MavenArtifact{org.apache.maven.plugins:maven-release-plugin::3.0.0-SNAPSHOT(version: 3.0.0-SNAPSHOT, snapshot:false) } generated by PluginInvocation{org.apache.maven.plugins:maven-invoker-plugin:3.0.1@run  integration-test-prepare-with-pom}: windows-jdk7-m3.5.x_build\maven-release-plugin\target\invoker-reports\*.xml
[windows-jdk7-m3.5.x_build] performing MavenInvokerRecorder, reportsFilenamePattern:'**/windows-jdk7-m3.5.x_build\maven-release-plugin\target\invoker-reports/BUILD*.xml', invokerBuildDir:'**/windows-jdk7-m3.5.x_build\maven-release-plugin\target\it'
[windows-jdk7-m3.5.x_build] Found reports:[f:\jenkins\jenkins-slave\workspace\x_maven-release_IMPROVE_POM-KZP6VA3ZSGGYNTVVOCGLUBHYECJZQ34VIS6H2U5HNYVKLJFCFQKQ@2\windows-jdk7-m3.5.x_build\maven-release-plugin\target\invoker-reports\BUILD-projects_update-versions_MRELEASE-555.xml, f:\jenkins\jenkins-slave\workspace\x_maven-release_IMPROVE_POM-KZP6VA3ZSGGYNTVVOCGLUBHYECJZQ34VIS6H2U5HNYVKLJFCFQKQ@2\windows-jdk7-m3.5.x_build\maven-release-plugin\target\invoker-reports\BUILD-projects_update-versions_MRELEASE-611.xml, f:\jenkins\jenkins-slave\workspace\x_maven-release_IMPROVE_POM-KZP6VA3ZSGGYNTVVOCGLUBHYECJZQ34VIS6H2U5HNYVKLJFCFQKQ@2\windows-jdk7-m3.5.x_build\maven-release-plugin\target\invoker-reports\BUILD-projects_update-versions_MRELEASE-783.xml, f:\jenkins\jenkins-slave\workspace\x_maven-release_IMPROVE_POM-KZP6VA3ZSGGYNTVVOCGLUBHYECJZQ34VIS6H2U5HNYVKLJFCFQKQ@2\windows-jdk7-m3.5.x_build\maven-release-plugin\target\invoker-reports\BUILD-projects_update-versions_MRELEASE-976.xml]
[windows-jdk7-m3.5.x_build] Found logs:[f:\jenkins\jenkins-slave\workspace\x_maven-release_IMPROVE_POM-KZP6VA3ZSGGYNTVVOCGLUBHYECJZQ34VIS6H2U5HNYVKLJFCFQKQ@2\windows-jdk7-m3.5.x_build\maven-release-plugin\target\it\projects\update-versions\MRELEASE-555\build.log, f:\jenkins\jenkins-slave\workspace\x_maven-release_IMPROVE_POM-KZP6VA3ZSGGYNTVVOCGLUBHYECJZQ34VIS6H2U5HNYVKLJFCFQKQ@2\windows-jdk7-m3.5.x_build\maven-release-plugin\target\it\projects\update-versions\MRELEASE-611\build.log, f:\jenkins\jenkins-slave\workspace\x_maven-release_IMPROVE_POM-KZP6VA3ZSGGYNTVVOCGLUBHYECJZQ34VIS6H2U5HNYVKLJFCFQKQ@2\windows-jdk7-m3.5.x_build\maven-release-plugin\target\it\projects\update-versions\MRELEASE-783\build.log, f:\jenkins\jenkins-slave\workspace\x_maven-release_IMPROVE_POM-KZP6VA3ZSGGYNTVVOCGLUBHYECJZQ34VIS6H2U5HNYVKLJFCFQKQ@2\windows-jdk7-m3.5.x_build\maven-release-plugin\target\it\projects\update-versions\MRELEASE-976\build.log]
[windows-jdk7-m3.5.x_build] Finished parsing Maven Invoker results (found 4)
[windows-jdk7-m3.5.x_build] [withMaven] invokerPublisher - Archive invoker results for Maven artifact MavenArtifact{org.apache.maven.plugins:maven-release-plugin::3.0.0-SNAPSHOT(version: 3.0.0-SNAPSHOT, snapshot:false) } generated by PluginInvocation{org.apache.maven.plugins:maven-invoker-plugin:3.0.1@run  integration-test-branch}: windows-jdk7-m3.5.x_build\maven-release-plugin\target\invoker-reports\*.xml
[windows-jdk7-m3.5.x_build] performing MavenInvokerRecorder, reportsFilenamePattern:'**/windows-jdk7-m3.5.x_build\maven-release-plugin\target\invoker-reports/BUILD*.xml', invokerBuildDir:'**/windows-jdk7-m3.5.x_build\maven-release-plugin\target\it'
[windows-jdk7-m3.5.x_build] Found reports:[f:\jenkins\jenkins-slave\workspace\x_maven-release_IMPROVE_POM-KZP6VA3ZSGGYNTVVOCGLUBHYECJZQ34VIS6H2U5HNYVKLJFCFQKQ@2\windows-jdk7-m3.5.x_build\maven-release-plugin\target\invoker-reports\BUILD-projects_update-versions_MRELEASE-555.xml, f:\jenkins\jenkins-slave\workspace\x_maven-release_IMPROVE_POM-KZP6VA3ZSGGYNTVVOCGLUBHYECJZQ34VIS6H2U5HNYVKLJFCFQKQ@2\windows-jdk7-m3.5.x_build\maven-release-plugin\target\invoker-reports\BUILD-projects_update-versions_MRELEASE-611.xml, f:\jenkins\jenkins-slave\workspace\x_maven-release_IMPROVE_POM-KZP6VA3ZSGGYNTVVOCGLUBHYECJZQ34VIS6H2U5HNYVKLJFCFQKQ@2\windows-jdk7-m3.5.x_build\maven-release-plugin\target\invoker-reports\BUILD-projects_update-versions_MRELEASE-783.xml, f:\jenkins\jenkins-slave\workspace\x_maven-release_IMPROVE_POM-KZP6VA3ZSGGYNTVVOCGLUBHYECJZQ34VIS6H2U5HNYVKLJFCFQKQ@2\windows-jdk7-m3.5.x_build\maven-release-plugin\target\invoker-reports\BUILD-projects_update-versions_MRELEASE-976.xml]
[windows-jdk7-m3.5.x_build] Found logs:[f:\jenkins\jenkins-slave\workspace\x_maven-release_IMPROVE_POM-KZP6VA3ZSGGYNTVVOCGLUBHYECJZQ34VIS6H2U5HNYVKLJFCFQKQ@2\windows-jdk7-m3.5.x_build\maven-release-plugin\target\it\projects\update-versions\MRELEASE-555\build.log, f:\jenkins\jenkins-slave\workspace\x_maven-release_IMPROVE_POM-KZP6VA3ZSGGYNTVVOCGLUBHYECJZQ34VIS6H2U5HNYVKLJFCFQKQ@2\windows-jdk7-m3.5.x_build\maven-release-plugin\target\it\projects\update-versions\MRELEASE-611\build.log, f:\jenkins\jenkins-slave\workspace\x_maven-release_IMPROVE_POM-KZP6VA3ZSGGYNTVVOCGLUBHYECJZQ34VIS6H2U5HNYVKLJFCFQKQ@2\windows-jdk7-m3.5.x_build\maven-release-plugin\target\it\projects\update-versions\MRELEASE-783\build.log, f:\jenkins\jenkins-slave\workspace\x_maven-release_IMPROVE_POM-KZP6VA3ZSGGYNTVVOCGLUBHYECJZQ34VIS6H2U5HNYVKLJFCFQKQ@2\windows-jdk7-m3.5.x_build\maven-release-plugin\target\it\projects\update-versions\MRELEASE-976\build.log]
[windows-jdk7-m3.5.x_build] Finished parsing Maven Invoker results (found 4)
[windows-jdk7-m3.5.x_build] [withMaven] invokerPublisher - Archive invoker results for Maven artifact MavenArtifact{org.apache.maven.plugins:maven-release-plugin::3.0.0-SNAPSHOT(version: 3.0.0-SNAPSHOT, snapshot:false) } generated by PluginInvocation{org.apache.maven.plugins:maven-invoker-plugin:3.0.1@run  integration-test-perform}: windows-jdk7-m3.5.x_build\maven-release-plugin\target\invoker-reports\*.xml
[windows-jdk7-m3.5.x_build] performing MavenInvokerRecorder, reportsFilenamePattern:'**/windows-jdk7-m3.5.x_build\maven-release-plugin\target\invoker-reports/BUILD*.xml', invokerBuildDir:'**/windows-jdk7-m3.5.x_build\maven-release-plugin\target\it'
[windows-jdk7-m3.5.x_build] Found reports:[f:\jenkins\jenkins-slave\workspace\x_maven-release_IMPROVE_POM-KZP6VA3ZSGGYNTVVOCGLUBHYECJZQ34VIS6H2U5HNYVKLJFCFQKQ@2\windows-jdk7-m3.5.x_build\maven-release-plugin\target\invoker-reports\BUILD-projects_update-versions_MRELEASE-555.xml, f:\jenkins\jenkins-slave\workspace\x_maven-release_IMPROVE_POM-KZP6VA3ZSGGYNTVVOCGLUBHYECJZQ34VIS6H2U5HNYVKLJFCFQKQ@2\windows-jdk7-m3.5.x_build\maven-release-plugin\target\invoker-reports\BUILD-projects_update-versions_MRELEASE-611.xml, f:\jenkins\jenkins-slave\workspace\x_maven-release_IMPROVE_POM-KZP6VA3ZSGGYNTVVOCGLUBHYECJZQ34VIS6H2U5HNYVKLJFCFQKQ@2\windows-jdk7-m3.5.x_build\maven-release-plugin\target\invoker-reports\BUILD-projects_update-versions_MRELEASE-783.xml, f:\jenkins\jenkins-slave\workspace\x_maven-release_IMPROVE_POM-KZP6VA3ZSGGYNTVVOCGLUBHYECJZQ34VIS6H2U5HNYVKLJFCFQKQ@2\windows-jdk7-m3.5.x_build\maven-release-plugin\target\invoker-reports\BUILD-projects_update-versions_MRELEASE-976.xml]
[windows-jdk7-m3.5.x_build] Found logs:[f:\jenkins\jenkins-slave\workspace\x_maven-release_IMPROVE_POM-KZP6VA3ZSGGYNTVVOCGLUBHYECJZQ34VIS6H2U5HNYVKLJFCFQKQ@2\windows-jdk7-m3.5.x_build\maven-release-plugin\target\it\projects\update-versions\MRELEASE-555\build.log, f:\jenkins\jenkins-slave\workspace\x_maven-release_IMPROVE_POM-KZP6VA3ZSGGYNTVVOCGLUBHYECJZQ34VIS6H2U5HNYVKLJFCFQKQ@2\windows-jdk7-m3.5.x_build\maven-release-plugin\target\it\projects\update-versions\MRELEASE-611\build.log, f:\jenkins\jenkins-slave\workspace\x_maven-release_IMPROVE_POM-KZP6VA3ZSGGYNTVVOCGLUBHYECJZQ34VIS6H2U5HNYVKLJFCFQKQ@2\windows-jdk7-m3.5.x_build\maven-release-plugin\target\it\projects\update-versions\MRELEASE-783\build.log, f:\jenkins\jenkins-slave\workspace\x_maven-release_IMPROVE_POM-KZP6VA3ZSGGYNTVVOCGLUBHYECJZQ34VIS6H2U5HNYVKLJFCFQKQ@2\windows-jdk7-m3.5.x_build\maven-release-plugin\target\it\projects\update-versions\MRELEASE-976\build.log]
[windows-jdk7-m3.5.x_build] Finished parsing Maven Invoker results (found 4)
[windows-jdk7-m3.5.x_build] [withMaven] invokerPublisher - Archive invoker results for Maven artifact MavenArtifact{org.apache.maven.plugins:maven-release-plugin::3.0.0-SNAPSHOT(version: 3.0.0-SNAPSHOT, snapshot:false) } generated by PluginInvocation{org.apache.maven.plugins:maven-invoker-plugin:3.0.1@run  integration-test-update-versions}: windows-jdk7-m3.5.x_build\maven-release-plugin\target\invoker-reports\*.xml
[windows-jdk7-m3.5.x_build] performing MavenInvokerRecorder, reportsFilenamePattern:'**/windows-jdk7-m3.5.x_build\maven-release-plugin\target\invoker-reports/BUILD*.xml', invokerBuildDir:'**/windows-jdk7-m3.5.x_build\maven-release-plugin\target\it'
[windows-jdk7-m3.5.x_build] Found reports:[f:\jenkins\jenkins-slave\workspace\x_maven-release_IMPROVE_POM-KZP6VA3ZSGGYNTVVOCGLUBHYECJZQ34VIS6H2U5HNYVKLJFCFQKQ@2\windows-jdk7-m3.5.x_build\maven-release-plugin\target\invoker-reports\BUILD-projects_update-versions_MRELEASE-555.xml, f:\jenkins\jenkins-slave\workspace\x_maven-release_IMPROVE_POM-KZP6VA3ZSGGYNTVVOCGLUBHYECJZQ34VIS6H2U5HNYVKLJFCFQKQ@2\windows-jdk7-m3.5.x_build\maven-release-plugin\target\invoker-reports\BUILD-projects_update-versions_MRELEASE-611.xml, f:\jenkins\jenkins-slave\workspace\x_maven-release_IMPROVE_POM-KZP6VA3ZSGGYNTVVOCGLUBHYECJZQ34VIS6H2U5HNYVKLJFCFQKQ@2\windows-jdk7-m3.5.x_build\maven-release-plugin\target\invoker-reports\BUILD-projects_update-versions_MRELEASE-783.xml, f:\jenkins\jenkins-slave\workspace\x_maven-release_IMPROVE_POM-KZP6VA3ZSGGYNTVVOCGLUBHYECJZQ34VIS6H2U5HNYVKLJFCFQKQ@2\windows-jdk7-m3.5.x_build\maven-release-plugin\target\invoker-reports\BUILD-projects_update-versions_MRELEASE-976.xml]
[windows-jdk7-m3.5.x_build] Found logs:[f:\jenkins\jenkins-slave\workspace\x_maven-release_IMPROVE_POM-KZP6VA3ZSGGYNTVVOCGLUBHYECJZQ34VIS6H2U5HNYVKLJFCFQKQ@2\windows-jdk7-m3.5.x_build\maven-release-plugin\target\it\projects\update-versions\MRELEASE-555\build.log, f:\jenkins\jenkins-slave\workspace\x_maven-release_IMPROVE_POM-KZP6VA3ZSGGYNTVVOCGLUBHYECJZQ34VIS6H2U5HNYVKLJFCFQKQ@2\windows-jdk7-m3.5.x_build\maven-release-plugin\target\it\projects\update-versions\MRELEASE-611\build.log, f:\jenkins\jenkins-slave\workspace\x_maven-release_IMPROVE_POM-KZP6VA3ZSGGYNTVVOCGLUBHYECJZQ34VIS6H2U5HNYVKLJFCFQKQ@2\windows-jdk7-m3.5.x_build\maven-release-plugin\target\it\projects\update-versions\MRELEASE-783\build.log, f:\jenkins\jenkins-slave\workspace\x_maven-release_IMPROVE_POM-KZP6VA3ZSGGYNTVVOCGLUBHYECJZQ34VIS6H2U5HNYVKLJFCFQKQ@2\windows-jdk7-m3.5.x_build\maven-release-plugin\target\it\projects\update-versions\MRELEASE-976\build.log]
[windows-jdk7-m3.5.x_build] Finished parsing Maven Invoker results (found 4)
[windows-jdk7-m3.5.x_build] [withMaven] junitPublisher - Archive test results for Maven artifact org.apache.maven.release:maven-release-api:3.0.0-SNAPSHOT generated by maven-surefire-plugin:test (default-test): windows-jdk7-m3.5.x_build\maven-release-api\target\surefire-reports\*.xml
[windows-jdk7-m3.5.x_build] Recording test results
[windows-jdk7-m3.5.x_build] None of the test reports contained any result
[windows-jdk7-m3.5.x_build] [withMaven] junitPublisher - Archive test results for Maven artifact org.apache.maven.release:maven-release-manager:3.0.0-SNAPSHOT generated by maven-surefire-plugin:test (default-test): windows-jdk7-m3.5.x_build\maven-release-manager\target\surefire-reports\*.xml
[windows-jdk7-m3.5.x_build] Recording test results
[windows-jdk7-m3.5.x_build] [withMaven] junitPublisher - Archive test results for Maven artifact org.apache.maven.plugins:maven-release-plugin:3.0.0-SNAPSHOT generated by maven-surefire-plugin:test (default-test): windows-jdk7-m3.5.x_build\maven-release-plugin\target\surefire-reports\*.xml
[windows-jdk7-m3.5.x_build] Recording test results
[windows-jdk7-m3.5.x_build] [withMaven] junitPublisher - Archive test results for Maven artifact org.apache.maven.release:maven-release-oddeven-policy:3.0.0-SNAPSHOT generated by maven-surefire-plugin:test (default-test): windows-jdk7-m3.5.x_build\maven-release-policies\maven-release-oddeven-policy\target\surefire-reports\*.xml
[windows-jdk7-m3.5.x_build] Recording test results
[windows-jdk7-m3.5.x_build] [withMaven] junitPublisher - Archive test results for Maven artifact org.apache.maven.release:maven-release-semver-policy:3.0.0-SNAPSHOT generated by maven-surefire-plugin:test (default-test): windows-jdk7-m3.5.x_build\maven-release-policies\maven-release-semver-policy\target\surefire-reports\*.xml
[windows-jdk7-m3.5.x_build] Recording test results
[windows-jdk7-m3.5.x_build] [withMaven] junitPublisher - Archive test results for Maven artifact org.apache.maven.release:maven-release-manager:3.0.0-SNAPSHOT generated by maven-failsafe-plugin:integration-test (default): windows-jdk7-m3.5.x_build\maven-release-manager\target\failsafe-reports\*.xml
[windows-jdk7-m3.5.x_build] Recording test results
[windows-jdk7-m3.5.x_build] [withMaven] openTasksPublisher - Scan Tasks for Maven artifact org.apache.maven.release:maven-release-api:3.0.0-SNAPSHOT in source directory windows-jdk7-m3.5.x_build\maven-release-api\src\main\java
[windows-jdk7-m3.5.x_build] [withMaven] openTasksPublisher - Scan Tasks for Maven artifact org.apache.maven.release:maven-release-manager:3.0.0-SNAPSHOT in source directory windows-jdk7-m3.5.x_build\maven-release-manager\src\main\java
[windows-jdk7-m3.5.x_build] [withMaven] openTasksPublisher - Scan Tasks for Maven artifact org.apache.maven.plugins:maven-release-plugin:3.0.0-SNAPSHOT in source directory windows-jdk7-m3.5.x_build\maven-release-plugin\src\main\java
[windows-jdk7-m3.5.x_build] [withMaven] openTasksPublisher - Scan Tasks for Maven artifact org.apache.maven.release:maven-release-oddeven-policy:3.0.0-SNAPSHOT in source directory windows-jdk7-m3.5.x_build\maven-release-policies\maven-release-oddeven-policy\src\main\java
[windows-jdk7-m3.5.x_build] [withMaven] openTasksPublisher - Scan Tasks for Maven artifact org.apache.maven.release:maven-release-semver-policy:3.0.0-SNAPSHOT in source directory windows-jdk7-m3.5.x_build\maven-release-policies\maven-release-semver-policy\src\main\java
[windows-jdk7-m3.5.x_build] [TASKS] Scanning folder 'f:\jenkins\jenkins-slave\workspace\x_maven-release_IMPROVE_POM-KZP6VA3ZSGGYNTVVOCGLUBHYECJZQ34VIS6H2U5HNYVKLJFCFQKQ@2' for files matching the pattern 'windows-jdk7-m3.5.x_build\maven-release-api\src\main\java\**\*,windows-jdk7-m3.5.x_build\maven-release-manager\src\main\java\**\*,windows-jdk7-m3.5.x_build\maven-release-plugin\src\main\java\**\*,windows-jdk7-m3.5.x_build\maven-release-policies\maven-release-oddeven-policy\src\main\java\**\*,windows-jdk7-m3.5.x_build\maven-release-policies\maven-release-semver-policy\src\main\java\**\*' - excludes: null
[windows-jdk7-m3.5.x_build] [TASKS] Found 130 files to scan for tasks
[windows-jdk7-m3.5.x_build] [TASKS] Found 21 open tasks.
[windows-jdk7-m3.5.x_build] Skipping warnings blame since pipelines do not have an SCM link.%n
[Pipeline] [windows-jdk7-m3.0.x_build] // node
[Pipeline] [windows-jdk7-m3.0.x_build] }
[Pipeline] [windows-jdk7-m3.2.x_build] // stage
[Pipeline] [windows-jdk7-m3.2.x_build] }
[Pipeline] [windows-jdk8-m3.5.x_build] }
[Pipeline] [windows-jdk9-m3.5.x_build] }
[Pipeline] [linux-jdk7-m3.0.x_build] // node
[Pipeline] [linux-jdk7-m3.2.x_build] // node
[Pipeline] [linux-jdk7-m3.3.x_build] // node
[Pipeline] [linux-jdk8-m3.5.x_build] // node
[Pipeline] [windows-jdk7-m3.3.x_build] // withMaven
[Pipeline] [windows-jdk7-m3.5.x_build] // withMaven
[Pipeline] [linux-jdk7-m3.0.x_build] }
[Pipeline] [linux-jdk7-m3.2.x_build] }
[Pipeline] [linux-jdk7-m3.3.x_build] }
[Pipeline] [linux-jdk8-m3.5.x_build] }
[Pipeline] [linux-jdk7-m3.5.x_build] }
[Pipeline] [windows-jdk7-m3.3.x_build] cleanWs
[Pipeline] [windows-jdk7-m3.5.x_build] cleanWs
[Pipeline] [windows-jdk7-m3.2.x_build] // node
[Pipeline] [windows-jdk7-m3.2.x_build] }
[windows-jdk7-m3.2.x_build] Failed in branch windows-jdk7-m3.2.x_build
[Pipeline] [windows-jdk8-m3.5.x_build] // stage
[Pipeline] [windows-jdk8-m3.5.x_build] }
[Pipeline] [windows-jdk9-m3.5.x_build] // stage
[Pipeline] [windows-jdk9-m3.5.x_build] }
[Pipeline] [linux-jdk7-m3.5.x_build] // stage
[Pipeline] [linux-jdk7-m3.5.x_build] }
[windows-jdk7-m3.3.x_build] [WS-CLEANUP] Deleting project workspace...[WS-CLEANUP] done
[windows-jdk7-m3.5.x_build] [WS-CLEANUP] Deleting project workspace...[WS-CLEANUP] done
[Pipeline] [windows-jdk8-m3.5.x_build] // node
[Pipeline] [windows-jdk8-m3.5.x_build] }
[Pipeline] [windows-jdk9-m3.5.x_build] // node
[Pipeline] [windows-jdk9-m3.5.x_build] }
[Pipeline] [linux-jdk7-m3.5.x_build] // node
[Pipeline] [linux-jdk7-m3.5.x_build] }
[Pipeline] [windows-jdk7-m3.3.x_build] }
[Pipeline] [windows-jdk7-m3.5.x_build] }
[Pipeline] [windows-jdk7-m3.3.x_build] // stage
[Pipeline] [windows-jdk7-m3.5.x_build] // stage
[Pipeline] [windows-jdk7-m3.3.x_build] }
[Pipeline] [windows-jdk7-m3.5.x_build] }
[Pipeline] [windows-jdk7-m3.3.x_build] // node
[Pipeline] [windows-jdk7-m3.5.x_build] // node
[Pipeline] [windows-jdk7-m3.3.x_build] }
[Pipeline] [windows-jdk7-m3.5.x_build] }
[Pipeline] // parallel
[Pipeline] stage
[Pipeline] { (Notifications)
[Pipeline] echo
Build result: FAILURE
[Pipeline] jiraIssueSelector
[Pipeline] emailext
Reply | Threaded
Open this post in threaded view
|

Build failed in Jenkins: Maven TLP » maven-release » IMPROVE_POM #2

Apache Jenkins Server-2
See https://builds.apache.org/job/maven-box/job/maven-release/job/IMPROVE_POM/2/

No changes.

All tests passed

Build log:
[...truncated 7.44 MB...]
[windows-jdk10-m3.5.x_build] [INFO] Downloading from central: https://repo.maven.apache.org/maven2/org/ow2/asm/asm-tree/5.0.3/asm-tree-5.0.3.pom
[windows-jdk10-m3.5.x_build] [INFO] Downloaded from central: https://repo.maven.apache.org/maven2/org/ow2/asm/asm-tree/5.0.3/asm-tree-5.0.3.pom (2.1 kB at 130 kB/s)
[windows-jdk10-m3.5.x_build] [INFO] Downloading from central: https://repo.maven.apache.org/maven2/commons-lang/commons-lang/1.0/commons-lang-1.0.pom
[linux-jdk10-m3.5.x_build] [withMaven] artifactsPublisher - Archive artifact linux-jdk10-m3.5.x_build/pom.xml under org/apache/maven/release/maven-release/3.0.0-SNAPSHOT/maven-release-3.0.0-SNAPSHOT.pom
[linux-jdk10-m3.5.x_build] [withMaven] artifactsPublisher - Archive artifact linux-jdk10-m3.5.x_build/target/maven-release-3.0.0-SNAPSHOT-site.xml under org/apache/maven/release/maven-release/3.0.0-SNAPSHOT/maven-release-3.0.0-SNAPSHOT-site.xml
[linux-jdk10-m3.5.x_build] [withMaven] artifactsPublisher - Archive artifact linux-jdk10-m3.5.x_build/maven-release-api/pom.xml under org/apache/maven/release/maven-release-api/3.0.0-SNAPSHOT/maven-release-api-3.0.0-SNAPSHOT.pom
[linux-jdk10-m3.5.x_build] [withMaven] artifactsPublisher - Archive artifact linux-jdk10-m3.5.x_build/maven-release-api/target/maven-release-api-3.0.0-SNAPSHOT.jar under org/apache/maven/release/maven-release-api/3.0.0-SNAPSHOT/maven-release-api-3.0.0-SNAPSHOT.jar
[linux-jdk10-m3.5.x_build] [withMaven] artifactsPublisher - Archive artifact linux-jdk10-m3.5.x_build/maven-release-manager/pom.xml under org/apache/maven/release/maven-release-manager/3.0.0-SNAPSHOT/maven-release-manager-3.0.0-SNAPSHOT.pom
[linux-jdk10-m3.5.x_build] [withMaven] artifactsPublisher - Archive artifact linux-jdk10-m3.5.x_build/maven-release-manager/target/maven-release-manager-3.0.0-SNAPSHOT.jar under org/apache/maven/release/maven-release-manager/3.0.0-SNAPSHOT/maven-release-manager-3.0.0-SNAPSHOT.jar
[linux-jdk10-m3.5.x_build] [withMaven] artifactsPublisher - Archive artifact linux-jdk10-m3.5.x_build/maven-release-plugin/pom.xml under org/apache/maven/plugins/maven-release-plugin/3.0.0-SNAPSHOT/maven-release-plugin-3.0.0-SNAPSHOT.pom
[linux-jdk10-m3.5.x_build] [withMaven] artifactsPublisher - Archive artifact linux-jdk10-m3.5.x_build/maven-release-plugin/target/maven-release-plugin-3.0.0-SNAPSHOT.jar under org/apache/maven/plugins/maven-release-plugin/3.0.0-SNAPSHOT/maven-release-plugin-3.0.0-SNAPSHOT.jar
[linux-jdk10-m3.5.x_build] [withMaven] artifactsPublisher - Archive artifact linux-jdk10-m3.5.x_build/maven-release-policies/maven-release-oddeven-policy/pom.xml under org/apache/maven/release/maven-release-oddeven-policy/3.0.0-SNAPSHOT/maven-release-oddeven-policy-3.0.0-SNAPSHOT.pom
[linux-jdk10-m3.5.x_build] [withMaven] artifactsPublisher - Archive artifact linux-jdk10-m3.5.x_build/maven-release-policies/maven-release-oddeven-policy/target/maven-release-oddeven-policy-3.0.0-SNAPSHOT.jar under org/apache/maven/release/maven-release-oddeven-policy/3.0.0-SNAPSHOT/maven-release-oddeven-policy-3.0.0-SNAPSHOT.jar
[linux-jdk10-m3.5.x_build] [withMaven] artifactsPublisher - Archive artifact linux-jdk10-m3.5.x_build/maven-release-policies/maven-release-semver-policy/pom.xml under org/apache/maven/release/maven-release-semver-policy/3.0.0-SNAPSHOT/maven-release-semver-policy-3.0.0-SNAPSHOT.pom
[linux-jdk10-m3.5.x_build] [withMaven] artifactsPublisher - Archive artifact linux-jdk10-m3.5.x_build/maven-release-policies/maven-release-semver-policy/target/maven-release-semver-policy-3.0.0-SNAPSHOT.jar under org/apache/maven/release/maven-release-semver-policy/3.0.0-SNAPSHOT/maven-release-semver-policy-3.0.0-SNAPSHOT.jar
[linux-jdk10-m3.5.x_build] [Fast Archiver] No prior successful build to compare, so performing full copy of artifacts
[linux-jdk10-m3.5.x_build] [withMaven] invokerPublisher - Archive invoker results for Maven artifact MavenArtifact{org.apache.maven.plugins:maven-release-plugin::3.0.0-SNAPSHOT(version: 3.0.0-SNAPSHOT, snapshot:false) } generated by PluginInvocation{org.apache.maven.plugins:maven-invoker-plugin:3.0.1@run  integration-test-prepare}: linux-jdk10-m3.5.x_build/maven-release-plugin/target/invoker-reports/*.xml
[linux-jdk10-m3.5.x_build] performing MavenInvokerRecorder, reportsFilenamePattern:'**/linux-jdk10-m3.5.x_build/maven-release-plugin/target/invoker-reports/BUILD*.xml', invokerBuildDir:'**/linux-jdk10-m3.5.x_build/maven-release-plugin/target/it'
[linux-jdk10-m3.5.x_build] Found reports:[/home/jenkins/jenkins-slave/workspace/x_maven-release_IMPROVE_POM-KZP6VA3ZSGGYNTVVOCGLUBHYECJZQ34VIS6H2U5HNYVKLJFCFQKQ/linux-jdk10-m3.5.x_build/maven-release-plugin/target/invoker-reports/BUILD-projects_update-versions_MRELEASE-555.xml, /home/jenkins/jenkins-slave/workspace/x_maven-release_IMPROVE_POM-KZP6VA3ZSGGYNTVVOCGLUBHYECJZQ34VIS6H2U5HNYVKLJFCFQKQ/linux-jdk10-m3.5.x_build/maven-release-plugin/target/invoker-reports/BUILD-projects_update-versions_MRELEASE-611.xml, /home/jenkins/jenkins-slave/workspace/x_maven-release_IMPROVE_POM-KZP6VA3ZSGGYNTVVOCGLUBHYECJZQ34VIS6H2U5HNYVKLJFCFQKQ/linux-jdk10-m3.5.x_build/maven-release-plugin/target/invoker-reports/BUILD-projects_update-versions_MRELEASE-783.xml, /home/jenkins/jenkins-slave/workspace/x_maven-release_IMPROVE_POM-KZP6VA3ZSGGYNTVVOCGLUBHYECJZQ34VIS6H2U5HNYVKLJFCFQKQ/linux-jdk10-m3.5.x_build/maven-release-plugin/target/invoker-reports/BUILD-projects_update-versions_MRELEASE-976.xml]
[linux-jdk10-m3.5.x_build] Found logs:[/home/jenkins/jenkins-slave/workspace/x_maven-release_IMPROVE_POM-KZP6VA3ZSGGYNTVVOCGLUBHYECJZQ34VIS6H2U5HNYVKLJFCFQKQ/linux-jdk10-m3.5.x_build/maven-release-plugin/target/it/projects/update-versions/MRELEASE-555/build.log, /home/jenkins/jenkins-slave/workspace/x_maven-release_IMPROVE_POM-KZP6VA3ZSGGYNTVVOCGLUBHYECJZQ34VIS6H2U5HNYVKLJFCFQKQ/linux-jdk10-m3.5.x_build/maven-release-plugin/target/it/projects/update-versions/MRELEASE-611/build.log, /home/jenkins/jenkins-slave/workspace/x_maven-release_IMPROVE_POM-KZP6VA3ZSGGYNTVVOCGLUBHYECJZQ34VIS6H2U5HNYVKLJFCFQKQ/linux-jdk10-m3.5.x_build/maven-release-plugin/target/it/projects/update-versions/MRELEASE-783/build.log, /home/jenkins/jenkins-slave/workspace/x_maven-release_IMPROVE_POM-KZP6VA3ZSGGYNTVVOCGLUBHYECJZQ34VIS6H2U5HNYVKLJFCFQKQ/linux-jdk10-m3.5.x_build/maven-release-plugin/target/it/projects/update-versions/MRELEASE-976/build.log]
[linux-jdk10-m3.5.x_build] Finished parsing Maven Invoker results (found 4)
[linux-jdk10-m3.5.x_build] [withMaven] invokerPublisher - Archive invoker results for Maven artifact MavenArtifact{org.apache.maven.plugins:maven-release-plugin::3.0.0-SNAPSHOT(version: 3.0.0-SNAPSHOT, snapshot:false) } generated by PluginInvocation{org.apache.maven.plugins:maven-invoker-plugin:3.0.1@run  integration-test-prepare-with-pom}: linux-jdk10-m3.5.x_build/maven-release-plugin/target/invoker-reports/*.xml
[linux-jdk10-m3.5.x_build] performing MavenInvokerRecorder, reportsFilenamePattern:'**/linux-jdk10-m3.5.x_build/maven-release-plugin/target/invoker-reports/BUILD*.xml', invokerBuildDir:'**/linux-jdk10-m3.5.x_build/maven-release-plugin/target/it'
[linux-jdk10-m3.5.x_build] Found reports:[/home/jenkins/jenkins-slave/workspace/x_maven-release_IMPROVE_POM-KZP6VA3ZSGGYNTVVOCGLUBHYECJZQ34VIS6H2U5HNYVKLJFCFQKQ/linux-jdk10-m3.5.x_build/maven-release-plugin/target/invoker-reports/BUILD-projects_update-versions_MRELEASE-555.xml, /home/jenkins/jenkins-slave/workspace/x_maven-release_IMPROVE_POM-KZP6VA3ZSGGYNTVVOCGLUBHYECJZQ34VIS6H2U5HNYVKLJFCFQKQ/linux-jdk10-m3.5.x_build/maven-release-plugin/target/invoker-reports/BUILD-projects_update-versions_MRELEASE-611.xml, /home/jenkins/jenkins-slave/workspace/x_maven-release_IMPROVE_POM-KZP6VA3ZSGGYNTVVOCGLUBHYECJZQ34VIS6H2U5HNYVKLJFCFQKQ/linux-jdk10-m3.5.x_build/maven-release-plugin/target/invoker-reports/BUILD-projects_update-versions_MRELEASE-783.xml, /home/jenkins/jenkins-slave/workspace/x_maven-release_IMPROVE_POM-KZP6VA3ZSGGYNTVVOCGLUBHYECJZQ34VIS6H2U5HNYVKLJFCFQKQ/linux-jdk10-m3.5.x_build/maven-release-plugin/target/invoker-reports/BUILD-projects_update-versions_MRELEASE-976.xml]
[linux-jdk10-m3.5.x_build] Found logs:[/home/jenkins/jenkins-slave/workspace/x_maven-release_IMPROVE_POM-KZP6VA3ZSGGYNTVVOCGLUBHYECJZQ34VIS6H2U5HNYVKLJFCFQKQ/linux-jdk10-m3.5.x_build/maven-release-plugin/target/it/projects/update-versions/MRELEASE-555/build.log, /home/jenkins/jenkins-slave/workspace/x_maven-release_IMPROVE_POM-KZP6VA3ZSGGYNTVVOCGLUBHYECJZQ34VIS6H2U5HNYVKLJFCFQKQ/linux-jdk10-m3.5.x_build/maven-release-plugin/target/it/projects/update-versions/MRELEASE-611/build.log, /home/jenkins/jenkins-slave/workspace/x_maven-release_IMPROVE_POM-KZP6VA3ZSGGYNTVVOCGLUBHYECJZQ34VIS6H2U5HNYVKLJFCFQKQ/linux-jdk10-m3.5.x_build/maven-release-plugin/target/it/projects/update-versions/MRELEASE-783/build.log, /home/jenkins/jenkins-slave/workspace/x_maven-release_IMPROVE_POM-KZP6VA3ZSGGYNTVVOCGLUBHYECJZQ34VIS6H2U5HNYVKLJFCFQKQ/linux-jdk10-m3.5.x_build/maven-release-plugin/target/it/projects/update-versions/MRELEASE-976/build.log]
[linux-jdk10-m3.5.x_build] Finished parsing Maven Invoker results (found 4)
[linux-jdk10-m3.5.x_build] [withMaven] invokerPublisher - Archive invoker results for Maven artifact MavenArtifact{org.apache.maven.plugins:maven-release-plugin::3.0.0-SNAPSHOT(version: 3.0.0-SNAPSHOT, snapshot:false) } generated by PluginInvocation{org.apache.maven.plugins:maven-invoker-plugin:3.0.1@run  integration-test-branch}: linux-jdk10-m3.5.x_build/maven-release-plugin/target/invoker-reports/*.xml
[linux-jdk10-m3.5.x_build] performing MavenInvokerRecorder, reportsFilenamePattern:'**/linux-jdk10-m3.5.x_build/maven-release-plugin/target/invoker-reports/BUILD*.xml', invokerBuildDir:'**/linux-jdk10-m3.5.x_build/maven-release-plugin/target/it'
[linux-jdk10-m3.5.x_build] Found reports:[/home/jenkins/jenkins-slave/workspace/x_maven-release_IMPROVE_POM-KZP6VA3ZSGGYNTVVOCGLUBHYECJZQ34VIS6H2U5HNYVKLJFCFQKQ/linux-jdk10-m3.5.x_build/maven-release-plugin/target/invoker-reports/BUILD-projects_update-versions_MRELEASE-555.xml, /home/jenkins/jenkins-slave/workspace/x_maven-release_IMPROVE_POM-KZP6VA3ZSGGYNTVVOCGLUBHYECJZQ34VIS6H2U5HNYVKLJFCFQKQ/linux-jdk10-m3.5.x_build/maven-release-plugin/target/invoker-reports/BUILD-projects_update-versions_MRELEASE-611.xml, /home/jenkins/jenkins-slave/workspace/x_maven-release_IMPROVE_POM-KZP6VA3ZSGGYNTVVOCGLUBHYECJZQ34VIS6H2U5HNYVKLJFCFQKQ/linux-jdk10-m3.5.x_build/maven-release-plugin/target/invoker-reports/BUILD-projects_update-versions_MRELEASE-783.xml, /home/jenkins/jenkins-slave/workspace/x_maven-release_IMPROVE_POM-KZP6VA3ZSGGYNTVVOCGLUBHYECJZQ34VIS6H2U5HNYVKLJFCFQKQ/linux-jdk10-m3.5.x_build/maven-release-plugin/target/invoker-reports/BUILD-projects_update-versions_MRELEASE-976.xml]
[linux-jdk10-m3.5.x_build] Found logs:[/home/jenkins/jenkins-slave/workspace/x_maven-release_IMPROVE_POM-KZP6VA3ZSGGYNTVVOCGLUBHYECJZQ34VIS6H2U5HNYVKLJFCFQKQ/linux-jdk10-m3.5.x_build/maven-release-plugin/target/it/projects/update-versions/MRELEASE-555/build.log, /home/jenkins/jenkins-slave/workspace/x_maven-release_IMPROVE_POM-KZP6VA3ZSGGYNTVVOCGLUBHYECJZQ34VIS6H2U5HNYVKLJFCFQKQ/linux-jdk10-m3.5.x_build/maven-release-plugin/target/it/projects/update-versions/MRELEASE-611/build.log, /home/jenkins/jenkins-slave/workspace/x_maven-release_IMPROVE_POM-KZP6VA3ZSGGYNTVVOCGLUBHYECJZQ34VIS6H2U5HNYVKLJFCFQKQ/linux-jdk10-m3.5.x_build/maven-release-plugin/target/it/projects/update-versions/MRELEASE-783/build.log, /home/jenkins/jenkins-slave/workspace/x_maven-release_IMPROVE_POM-KZP6VA3ZSGGYNTVVOCGLUBHYECJZQ34VIS6H2U5HNYVKLJFCFQKQ/linux-jdk10-m3.5.x_build/maven-release-plugin/target/it/projects/update-versions/MRELEASE-976/build.log]
[linux-jdk10-m3.5.x_build] Finished parsing Maven Invoker results (found 4)
[linux-jdk10-m3.5.x_build] [withMaven] invokerPublisher - Archive invoker results for Maven artifact MavenArtifact{org.apache.maven.plugins:maven-release-plugin::3.0.0-SNAPSHOT(version: 3.0.0-SNAPSHOT, snapshot:false) } generated by PluginInvocation{org.apache.maven.plugins:maven-invoker-plugin:3.0.1@run  integration-test-perform}: linux-jdk10-m3.5.x_build/maven-release-plugin/target/invoker-reports/*.xml
[linux-jdk10-m3.5.x_build] performing MavenInvokerRecorder, reportsFilenamePattern:'**/linux-jdk10-m3.5.x_build/maven-release-plugin/target/invoker-reports/BUILD*.xml', invokerBuildDir:'**/linux-jdk10-m3.5.x_build/maven-release-plugin/target/it'
[linux-jdk10-m3.5.x_build] Found reports:[/home/jenkins/jenkins-slave/workspace/x_maven-release_IMPROVE_POM-KZP6VA3ZSGGYNTVVOCGLUBHYECJZQ34VIS6H2U5HNYVKLJFCFQKQ/linux-jdk10-m3.5.x_build/maven-release-plugin/target/invoker-reports/BUILD-projects_update-versions_MRELEASE-555.xml, /home/jenkins/jenkins-slave/workspace/x_maven-release_IMPROVE_POM-KZP6VA3ZSGGYNTVVOCGLUBHYECJZQ34VIS6H2U5HNYVKLJFCFQKQ/linux-jdk10-m3.5.x_build/maven-release-plugin/target/invoker-reports/BUILD-projects_update-versions_MRELEASE-611.xml, /home/jenkins/jenkins-slave/workspace/x_maven-release_IMPROVE_POM-KZP6VA3ZSGGYNTVVOCGLUBHYECJZQ34VIS6H2U5HNYVKLJFCFQKQ/linux-jdk10-m3.5.x_build/maven-release-plugin/target/invoker-reports/BUILD-projects_update-versions_MRELEASE-783.xml, /home/jenkins/jenkins-slave/workspace/x_maven-release_IMPROVE_POM-KZP6VA3ZSGGYNTVVOCGLUBHYECJZQ34VIS6H2U5HNYVKLJFCFQKQ/linux-jdk10-m3.5.x_build/maven-release-plugin/target/invoker-reports/BUILD-projects_update-versions_MRELEASE-976.xml]
[linux-jdk10-m3.5.x_build] Found logs:[/home/jenkins/jenkins-slave/workspace/x_maven-release_IMPROVE_POM-KZP6VA3ZSGGYNTVVOCGLUBHYECJZQ34VIS6H2U5HNYVKLJFCFQKQ/linux-jdk10-m3.5.x_build/maven-release-plugin/target/it/projects/update-versions/MRELEASE-555/build.log, /home/jenkins/jenkins-slave/workspace/x_maven-release_IMPROVE_POM-KZP6VA3ZSGGYNTVVOCGLUBHYECJZQ34VIS6H2U5HNYVKLJFCFQKQ/linux-jdk10-m3.5.x_build/maven-release-plugin/target/it/projects/update-versions/MRELEASE-611/build.log, /home/jenkins/jenkins-slave/workspace/x_maven-release_IMPROVE_POM-KZP6VA3ZSGGYNTVVOCGLUBHYECJZQ34VIS6H2U5HNYVKLJFCFQKQ/linux-jdk10-m3.5.x_build/maven-release-plugin/target/it/projects/update-versions/MRELEASE-783/build.log, /home/jenkins/jenkins-slave/workspace/x_maven-release_IMPROVE_POM-KZP6VA3ZSGGYNTVVOCGLUBHYECJZQ34VIS6H2U5HNYVKLJFCFQKQ/linux-jdk10-m3.5.x_build/maven-release-plugin/target/it/projects/update-versions/MRELEASE-976/build.log]
[linux-jdk10-m3.5.x_build] Finished parsing Maven Invoker results (found 4)
[linux-jdk10-m3.5.x_build] [withMaven] invokerPublisher - Archive invoker results for Maven artifact MavenArtifact{org.apache.maven.plugins:maven-release-plugin::3.0.0-SNAPSHOT(version: 3.0.0-SNAPSHOT, snapshot:false) } generated by PluginInvocation{org.apache.maven.plugins:maven-invoker-plugin:3.0.1@run  integration-test-update-versions}: linux-jdk10-m3.5.x_build/maven-release-plugin/target/invoker-reports/*.xml
[linux-jdk10-m3.5.x_build] performing MavenInvokerRecorder, reportsFilenamePattern:'**/linux-jdk10-m3.5.x_build/maven-release-plugin/target/invoker-reports/BUILD*.xml', invokerBuildDir:'**/linux-jdk10-m3.5.x_build/maven-release-plugin/target/it'
[linux-jdk10-m3.5.x_build] Found reports:[/home/jenkins/jenkins-slave/workspace/x_maven-release_IMPROVE_POM-KZP6VA3ZSGGYNTVVOCGLUBHYECJZQ34VIS6H2U5HNYVKLJFCFQKQ/linux-jdk10-m3.5.x_build/maven-release-plugin/target/invoker-reports/BUILD-projects_update-versions_MRELEASE-555.xml, /home/jenkins/jenkins-slave/workspace/x_maven-release_IMPROVE_POM-KZP6VA3ZSGGYNTVVOCGLUBHYECJZQ34VIS6H2U5HNYVKLJFCFQKQ/linux-jdk10-m3.5.x_build/maven-release-plugin/target/invoker-reports/BUILD-projects_update-versions_MRELEASE-611.xml, /home/jenkins/jenkins-slave/workspace/x_maven-release_IMPROVE_POM-KZP6VA3ZSGGYNTVVOCGLUBHYECJZQ34VIS6H2U5HNYVKLJFCFQKQ/linux-jdk10-m3.5.x_build/maven-release-plugin/target/invoker-reports/BUILD-projects_update-versions_MRELEASE-783.xml, /home/jenkins/jenkins-slave/workspace/x_maven-release_IMPROVE_POM-KZP6VA3ZSGGYNTVVOCGLUBHYECJZQ34VIS6H2U5HNYVKLJFCFQKQ/linux-jdk10-m3.5.x_build/maven-release-plugin/target/invoker-reports/BUILD-projects_update-versions_MRELEASE-976.xml]
[linux-jdk10-m3.5.x_build] Found logs:[/home/jenkins/jenkins-slave/workspace/x_maven-release_IMPROVE_POM-KZP6VA3ZSGGYNTVVOCGLUBHYECJZQ34VIS6H2U5HNYVKLJFCFQKQ/linux-jdk10-m3.5.x_build/maven-release-plugin/target/it/projects/update-versions/MRELEASE-555/build.log, /home/jenkins/jenkins-slave/workspace/x_maven-release_IMPROVE_POM-KZP6VA3ZSGGYNTVVOCGLUBHYECJZQ34VIS6H2U5HNYVKLJFCFQKQ/linux-jdk10-m3.5.x_build/maven-release-plugin/target/it/projects/update-versions/MRELEASE-611/build.log, /home/jenkins/jenkins-slave/workspace/x_maven-release_IMPROVE_POM-KZP6VA3ZSGGYNTVVOCGLUBHYECJZQ34VIS6H2U5HNYVKLJFCFQKQ/linux-jdk10-m3.5.x_build/maven-release-plugin/target/it/projects/update-versions/MRELEASE-783/build.log, /home/jenkins/jenkins-slave/workspace/x_maven-release_IMPROVE_POM-KZP6VA3ZSGGYNTVVOCGLUBHYECJZQ34VIS6H2U5HNYVKLJFCFQKQ/linux-jdk10-m3.5.x_build/maven-release-plugin/target/it/projects/update-versions/MRELEASE-976/build.log]
[linux-jdk10-m3.5.x_build] Finished parsing Maven Invoker results (found 4)
[linux-jdk10-m3.5.x_build] [withMaven] junitPublisher - Archive test results for Maven artifact org.apache.maven.release:maven-release-api:3.0.0-SNAPSHOT generated by maven-surefire-plugin:test (default-test): linux-jdk10-m3.5.x_build/maven-release-api/target/surefire-reports/*.xml
[linux-jdk10-m3.5.x_build] Recording test results
[linux-jdk10-m3.5.x_build] None of the test reports contained any result
[linux-jdk10-m3.5.x_build] [withMaven] junitPublisher - Archive test results for Maven artifact org.apache.maven.release:maven-release-manager:3.0.0-SNAPSHOT generated by maven-surefire-plugin:test (default-test): linux-jdk10-m3.5.x_build/maven-release-manager/target/surefire-reports/*.xml
[linux-jdk10-m3.5.x_build] Recording test results
[linux-jdk10-m3.5.x_build] [withMaven] junitPublisher - Archive test results for Maven artifact org.apache.maven.plugins:maven-release-plugin:3.0.0-SNAPSHOT generated by maven-surefire-plugin:test (default-test): linux-jdk10-m3.5.x_build/maven-release-plugin/target/surefire-reports/*.xml
[linux-jdk10-m3.5.x_build] Recording test results
[linux-jdk10-m3.5.x_build] [withMaven] junitPublisher - Archive test results for Maven artifact org.apache.maven.release:maven-release-oddeven-policy:3.0.0-SNAPSHOT generated by maven-surefire-plugin:test (default-test): linux-jdk10-m3.5.x_build/maven-release-policies/maven-release-oddeven-policy/target/surefire-reports/*.xml
[linux-jdk10-m3.5.x_build] Recording test results
[linux-jdk10-m3.5.x_build] [withMaven] junitPublisher - Archive test results for Maven artifact org.apache.maven.release:maven-release-semver-policy:3.0.0-SNAPSHOT generated by maven-surefire-plugin:test (default-test): linux-jdk10-m3.5.x_build/maven-release-policies/maven-release-semver-policy/target/surefire-reports/*.xml
[linux-jdk10-m3.5.x_build] Recording test results
[linux-jdk10-m3.5.x_build] [withMaven] junitPublisher - Archive test results for Maven artifact org.apache.maven.release:maven-release-manager:3.0.0-SNAPSHOT generated by maven-failsafe-plugin:integration-test (default): linux-jdk10-m3.5.x_build/maven-release-manager/target/failsafe-reports/*.xml
[linux-jdk10-m3.5.x_build] Recording test results
[linux-jdk10-m3.5.x_build] [withMaven] openTasksPublisher - Scan Tasks for Maven artifact org.apache.maven.release:maven-release-api:3.0.0-SNAPSHOT in source directory linux-jdk10-m3.5.x_build/maven-release-api/src/main/java
[linux-jdk10-m3.5.x_build] [withMaven] openTasksPublisher - Scan Tasks for Maven artifact org.apache.maven.release:maven-release-manager:3.0.0-SNAPSHOT in source directory linux-jdk10-m3.5.x_build/maven-release-manager/src/main/java
[linux-jdk10-m3.5.x_build] [withMaven] openTasksPublisher - Scan Tasks for Maven artifact org.apache.maven.plugins:maven-release-plugin:3.0.0-SNAPSHOT in source directory linux-jdk10-m3.5.x_build/maven-release-plugin/src/main/java
[linux-jdk10-m3.5.x_build] [withMaven] openTasksPublisher - Scan Tasks for Maven artifact org.apache.maven.release:maven-release-oddeven-policy:3.0.0-SNAPSHOT in source directory linux-jdk10-m3.5.x_build/maven-release-policies/maven-release-oddeven-policy/src/main/java
[linux-jdk10-m3.5.x_build] [withMaven] openTasksPublisher - Scan Tasks for Maven artifact org.apache.maven.release:maven-release-semver-policy:3.0.0-SNAPSHOT in source directory linux-jdk10-m3.5.x_build/maven-release-policies/maven-release-semver-policy/src/main/java
[linux-jdk10-m3.5.x_build] [TASKS] Scanning folder '/home/jenkins/jenkins-slave/workspace/x_maven-release_IMPROVE_POM-KZP6VA3ZSGGYNTVVOCGLUBHYECJZQ34VIS6H2U5HNYVKLJFCFQKQ' for files matching the pattern 'linux-jdk10-m3.5.x_build/maven-release-api/src/main/java/**/*,linux-jdk10-m3.5.x_build/maven-release-manager/src/main/java/**/*,linux-jdk10-m3.5.x_build/maven-release-plugin/src/main/java/**/*,linux-jdk10-m3.5.x_build/maven-release-policies/maven-release-oddeven-policy/src/main/java/**/*,linux-jdk10-m3.5.x_build/maven-release-policies/maven-release-semver-policy/src/main/java/**/*' - excludes: null
[linux-jdk10-m3.5.x_build] [TASKS] Found 130 files to scan for tasks
[linux-jdk10-m3.5.x_build] [TASKS] Found 21 open tasks.
[linux-jdk10-m3.5.x_build] Skipping warnings blame since pipelines do not have an SCM link.%n
[Pipeline] [linux-jdk10-m3.5.x_build] // withMaven
[Pipeline] [linux-jdk10-m3.5.x_build] cleanWs
[linux-jdk10-m3.5.x_build] [WS-CLEANUP] Deleting project workspace...[WS-CLEANUP] done
[Pipeline] [linux-jdk10-m3.5.x_build] }
[Pipeline] [linux-jdk10-m3.5.x_build] // stage
[Pipeline] [linux-jdk10-m3.5.x_build] }
[Pipeline] [linux-jdk10-m3.5.x_build] // node
[windows-jdk10-m3.5.x_build] [INFO] Downloaded from central: https://repo.maven.apache.org/maven2/commons-lang/commons-lang/1.0/commons-lang-1.0.pom (2.5 kB at 98 kB/s)
[windows-jdk10-m3.5.x_build] [INFO] Downloading from central: https://repo.maven.apache.org/maven2/de/tototec/de.tototec.cmdoption/0.2.0/de.tototec.cmdoption-0.2.0.pom
[windows-jdk10-m3.5.x_build] [INFO] Downloaded from central: https://repo.maven.apache.org/maven2/de/tototec/de.tototec.cmdoption/0.2.0/de.tototec.cmdoption-0.2.0.pom (956 B at 50 kB/s)
[windows-jdk10-m3.5.x_build] [INFO] Downloading from central: https://repo.maven.apache.org/maven2/org/ow2/asm/asm/5.0.3/asm-5.0.3.jar
[windows-jdk10-m3.5.x_build] [INFO] Downloading from central: https://repo.maven.apache.org/maven2/org/ow2/asm/asm-commons/5.0.3/asm-commons-5.0.3.jar
[windows-jdk10-m3.5.x_build] [INFO] Downloading from central: https://repo.maven.apache.org/maven2/com/google/code/findbugs/jsr305/2.0.0/jsr305-2.0.0.jar
[windows-jdk10-m3.5.x_build] [INFO] Downloading from central: https://repo.maven.apache.org/maven2/org/ow2/asm/asm-tree/5.0.3/asm-tree-5.0.3.jar
[windows-jdk10-m3.5.x_build] [INFO] Downloading from central: https://repo.maven.apache.org/maven2/org/semver/api/0.9.33/api-0.9.33.jar
[windows-jdk10-m3.5.x_build] [INFO] Downloaded from central: https://repo.maven.apache.org/maven2/org/ow2/asm/asm/5.0.3/asm-5.0.3.jar (53 kB at 124 kB/s)
[windows-jdk10-m3.5.x_build] [INFO] Downloading from central: https://repo.maven.apache.org/maven2/commons-lang/commons-lang/1.0/commons-lang-1.0.jar
[windows-jdk10-m3.5.x_build] [INFO] Downloaded from central: https://repo.maven.apache.org/maven2/org/ow2/asm/asm-commons/5.0.3/asm-commons-5.0.3.jar (42 kB at 74 kB/s)
[windows-jdk10-m3.5.x_build] [INFO] Downloading from central: https://repo.maven.apache.org/maven2/de/tototec/de.tototec.cmdoption/0.2.0/de.tototec.cmdoption-0.2.0.jar
[windows-jdk10-m3.5.x_build] [INFO] Downloaded from central: https://repo.maven.apache.org/maven2/org/ow2/asm/asm-tree/5.0.3/asm-tree-5.0.3.jar (29 kB at 49 kB/s)
[windows-jdk10-m3.5.x_build] [INFO] Downloaded from central: https://repo.maven.apache.org/maven2/org/semver/api/0.9.33/api-0.9.33.jar (64 kB at 107 kB/s)
[windows-jdk10-m3.5.x_build] [INFO] Downloaded from central: https://repo.maven.apache.org/maven2/commons-lang/commons-lang/1.0/commons-lang-1.0.jar (64 kB at 104 kB/s)
[Pipeline] [linux-jdk10-m3.5.x_build] }
[windows-jdk10-m3.5.x_build] [INFO] Downloaded from central: https://repo.maven.apache.org/maven2/de/tototec/de.tototec.cmdoption/0.2.0/de.tototec.cmdoption-0.2.0.jar (42 kB at 56 kB/s)
[windows-jdk10-m3.5.x_build] [INFO] Downloaded from central: https://repo.maven.apache.org/maven2/com/google/code/findbugs/jsr305/2.0.0/jsr305-2.0.0.jar (32 kB at 41 kB/s)
[windows-jdk10-m3.5.x_build] [INFO]
[windows-jdk10-m3.5.x_build] [INFO] --- maven-clean-plugin:3.1.0:clean (default-clean) @ maven-release-semver-policy ---
[windows-jdk10-m3.5.x_build] [INFO]
[windows-jdk10-m3.5.x_build] [INFO] --- maven-enforcer-plugin:1.4.1:enforce (enforce-maven-version) @ maven-release-semver-policy ---
[windows-jdk10-m3.5.x_build] [INFO]
[windows-jdk10-m3.5.x_build] [INFO] --- maven-enforcer-plugin:1.4.1:enforce (enforce-bytecode-version) @ maven-release-semver-policy ---
[windows-jdk10-m3.5.x_build] [INFO]
[windows-jdk10-m3.5.x_build] [INFO] --- maven-enforcer-plugin:1.4.1:enforce (ban-known-bad-maven-versions) @ maven-release-semver-policy ---
[windows-jdk10-m3.5.x_build] [INFO]
[windows-jdk10-m3.5.x_build] [INFO] --- apache-rat-plugin:0.12:check (rat-check) @ maven-release-semver-policy ---
[windows-jdk10-m3.5.x_build] [INFO] Enabled default license matchers.
[windows-jdk10-m3.5.x_build] [INFO] Will parse SCM ignores for exclusions...
[windows-jdk10-m3.5.x_build] [INFO] Finished adding exclusions from SCM ignore files.
[windows-jdk10-m3.5.x_build] [INFO] 61 implicit excludes (use -debug for more details).
[windows-jdk10-m3.5.x_build] [INFO] Exclude: .repository
[windows-jdk10-m3.5.x_build] [INFO] Exclude: Jenkinsfile
[windows-jdk10-m3.5.x_build] [INFO] Exclude: .repository/**
[windows-jdk10-m3.5.x_build] [INFO] Exclude: .maven/spy.log
[windows-jdk10-m3.5.x_build] [INFO] Exclude: dependency-reduced-pom.xml
[windows-jdk10-m3.5.x_build] [INFO] Exclude: .java-version
[windows-jdk10-m3.5.x_build] [INFO] 3 resources included (use -debug for more details)
[windows-jdk10-m3.5.x_build] [INFO] Rat check: Summary over all files. Unapproved: 0, unknown: 0, generated: 0, approved: 3 licenses.
[windows-jdk10-m3.5.x_build] [INFO]
[windows-jdk10-m3.5.x_build] [INFO] --- maven-remote-resources-plugin:1.5:process (process-resource-bundles) @ maven-release-semver-policy ---
[windows-jdk10-m3.5.x_build] [INFO]
[windows-jdk10-m3.5.x_build] [INFO] --- maven-resources-plugin:3.1.0:resources (default-resources) @ maven-release-semver-policy ---
[windows-jdk10-m3.5.x_build] [INFO] Using 'UTF-8' encoding to copy filtered resources.
[windows-jdk10-m3.5.x_build] [INFO] skip non existing resourceDirectory F:\jenkins\jenkins-slave\workspace\x_maven-release_IMPROVE_POM-KZP6VA3ZSGGYNTVVOCGLUBHYECJZQ34VIS6H2U5HNYVKLJFCFQKQ@2\windows-jdk10-m3.5.x_build\maven-release-policies\maven-release-semver-policy\src\main\resources
[windows-jdk10-m3.5.x_build] [INFO] Copying 3 resources
[windows-jdk10-m3.5.x_build] [INFO]
[windows-jdk10-m3.5.x_build] [INFO] --- maven-compiler-plugin:3.7.0:compile (default-compile) @ maven-release-semver-policy ---
[windows-jdk10-m3.5.x_build] [INFO] Changes detected - recompiling the module!
[windows-jdk10-m3.5.x_build] [INFO] Compiling 1 source file to F:\jenkins\jenkins-slave\workspace\x_maven-release_IMPROVE_POM-KZP6VA3ZSGGYNTVVOCGLUBHYECJZQ34VIS6H2U5HNYVKLJFCFQKQ@2\windows-jdk10-m3.5.x_build\maven-release-policies\maven-release-semver-policy\target\classes
[windows-jdk10-m3.5.x_build] [INFO]
[windows-jdk10-m3.5.x_build] [INFO] --- plexus-component-metadata:1.7.1:generate-metadata (process-classes) @ maven-release-semver-policy ---
[windows-jdk10-m3.5.x_build] [INFO] Discovered 1 component descriptors(s)
[windows-jdk10-m3.5.x_build] [INFO]
[windows-jdk10-m3.5.x_build] [INFO] --- maven-resources-plugin:3.1.0:testResources (default-testResources) @ maven-release-semver-policy ---
[windows-jdk10-m3.5.x_build] [INFO] Using 'UTF-8' encoding to copy filtered resources.
[windows-jdk10-m3.5.x_build] [INFO] skip non existing resourceDirectory F:\jenkins\jenkins-slave\workspace\x_maven-release_IMPROVE_POM-KZP6VA3ZSGGYNTVVOCGLUBHYECJZQ34VIS6H2U5HNYVKLJFCFQKQ@2\windows-jdk10-m3.5.x_build\maven-release-policies\maven-release-semver-policy\src\test\resources
[windows-jdk10-m3.5.x_build] [INFO] Copying 3 resources
[windows-jdk10-m3.5.x_build] [INFO]
[windows-jdk10-m3.5.x_build] [INFO] --- maven-compiler-plugin:3.7.0:testCompile (default-testCompile) @ maven-release-semver-policy ---
[windows-jdk10-m3.5.x_build] [INFO] Changes detected - recompiling the module!
[windows-jdk10-m3.5.x_build] [INFO] Compiling 1 source file to F:\jenkins\jenkins-slave\workspace\x_maven-release_IMPROVE_POM-KZP6VA3ZSGGYNTVVOCGLUBHYECJZQ34VIS6H2U5HNYVKLJFCFQKQ@2\windows-jdk10-m3.5.x_build\maven-release-policies\maven-release-semver-policy\target\test-classes
[windows-jdk10-m3.5.x_build] [INFO]
[windows-jdk10-m3.5.x_build] [INFO] --- maven-surefire-plugin:2.22.0:test (default-test) @ maven-release-semver-policy ---
[windows-jdk10-m3.5.x_build] [INFO]
[windows-jdk10-m3.5.x_build] [INFO] -------------------------------------------------------
[windows-jdk10-m3.5.x_build] [INFO]  T E S T S
[windows-jdk10-m3.5.x_build] [INFO] -------------------------------------------------------
[windows-jdk10-m3.5.x_build] [INFO] Running org.apache.maven.shared.release.policy.semver.SemVerVersionPolicyTest
[windows-jdk10-m3.5.x_build] [INFO] Tests run: 2, Failures: 0, Errors: 0, Skipped: 0, Time elapsed: 0.06 s - in org.apache.maven.shared.release.policy.semver.SemVerVersionPolicyTest
[windows-jdk10-m3.5.x_build] [INFO]
[windows-jdk10-m3.5.x_build] [INFO] Results:
[windows-jdk10-m3.5.x_build] [INFO]
[windows-jdk10-m3.5.x_build] [INFO] Tests run: 2, Failures: 0, Errors: 0, Skipped: 0
[windows-jdk10-m3.5.x_build] [INFO]
[windows-jdk10-m3.5.x_build] [INFO]
[windows-jdk10-m3.5.x_build] [INFO] --- maven-jar-plugin:3.1.0:jar (default-jar) @ maven-release-semver-policy ---
[windows-jdk10-m3.5.x_build] [INFO] Building jar: F:\jenkins\jenkins-slave\workspace\x_maven-release_IMPROVE_POM-KZP6VA3ZSGGYNTVVOCGLUBHYECJZQ34VIS6H2U5HNYVKLJFCFQKQ@2\windows-jdk10-m3.5.x_build\maven-release-policies\maven-release-semver-policy\target\maven-release-semver-policy-3.0.0-SNAPSHOT.jar
[windows-jdk10-m3.5.x_build] [INFO]
[windows-jdk10-m3.5.x_build] [INFO] --- maven-site-plugin:3.7.1:attach-descriptor (attach-descriptor) @ maven-release-semver-policy ---
[windows-jdk10-m3.5.x_build] [INFO] Skipping because packaging 'jar' is not pom.
[windows-jdk10-m3.5.x_build] [INFO]
[windows-jdk10-m3.5.x_build] [INFO] --- maven-checkstyle-plugin:3.0.0:check (checkstyle-check) @ maven-release-semver-policy ---
[windows-jdk10-m3.5.x_build] [INFO] ------------------------------------------------------------------------
[windows-jdk10-m3.5.x_build] [INFO] Reactor Summary:
[windows-jdk10-m3.5.x_build] [INFO]
[windows-jdk10-m3.5.x_build] [INFO] Maven Release ...................................... SUCCESS [ 28.782 s]
[windows-jdk10-m3.5.x_build] [INFO] Maven Release APIs ................................. SUCCESS [  8.437 s]
[windows-jdk10-m3.5.x_build] [INFO] Maven Release Manager .............................. SUCCESS [02:07 min]
[windows-jdk10-m3.5.x_build] [INFO] Maven Release Plugin ............................... SUCCESS [04:20 min]
[windows-jdk10-m3.5.x_build] [INFO] Maven Release Odd-Even Policy ...................... SUCCESS [  2.529 s]
[windows-jdk10-m3.5.x_build] [INFO] Maven Release SemVer Policy ........................ SUCCESS [  3.243 s]
[windows-jdk10-m3.5.x_build] [INFO] ------------------------------------------------------------------------
[windows-jdk10-m3.5.x_build] [INFO] BUILD SUCCESS
[windows-jdk10-m3.5.x_build] [INFO] ------------------------------------------------------------------------
[windows-jdk10-m3.5.x_build] [INFO] Total time: 07:12 min
[windows-jdk10-m3.5.x_build] [INFO] Finished at: 2018-09-11T18:12:35Z
[windows-jdk10-m3.5.x_build] [INFO] Final Memory: 54M/184M
[windows-jdk10-m3.5.x_build] [INFO] ------------------------------------------------------------------------
[windows-jdk10-m3.5.x_build] [INFO] [jenkins-event-spy] Generated F:\jenkins\jenkins-slave\workspace\x_maven-release_IMPROVE_POM-KZP6VA3ZSGGYNTVVOCGLUBHYECJZQ34VIS6H2U5HNYVKLJFCFQKQ@2@tmp\withMaven80dd5738\maven-spy-20180911-180522-8618946237798745225827.log
[Pipeline] [windows-jdk10-m3.5.x_build] }
[Pipeline] [windows-jdk10-m3.5.x_build] // dir
[Pipeline] [windows-jdk10-m3.5.x_build] }
[windows-jdk10-m3.5.x_build] [withMaven] artifactsPublisher - Archive artifact windows-jdk10-m3.5.x_build\pom.xml under org\apache\maven\release\maven-release\3.0.0-SNAPSHOT\maven-release-3.0.0-SNAPSHOT.pom
[windows-jdk10-m3.5.x_build] [withMaven] artifactsPublisher - Archive artifact windows-jdk10-m3.5.x_build\target\maven-release-3.0.0-SNAPSHOT-site.xml under org\apache\maven\release\maven-release\3.0.0-SNAPSHOT\maven-release-3.0.0-SNAPSHOT-site.xml
[windows-jdk10-m3.5.x_build] [withMaven] artifactsPublisher - Archive artifact windows-jdk10-m3.5.x_build\maven-release-api\pom.xml under org\apache\maven\release\maven-release-api\3.0.0-SNAPSHOT\maven-release-api-3.0.0-SNAPSHOT.pom
[windows-jdk10-m3.5.x_build] [withMaven] artifactsPublisher - Archive artifact windows-jdk10-m3.5.x_build\maven-release-api\target\maven-release-api-3.0.0-SNAPSHOT.jar under org\apache\maven\release\maven-release-api\3.0.0-SNAPSHOT\maven-release-api-3.0.0-SNAPSHOT.jar
[windows-jdk10-m3.5.x_build] [withMaven] artifactsPublisher - Archive artifact windows-jdk10-m3.5.x_build\maven-release-manager\pom.xml under org\apache\maven\release\maven-release-manager\3.0.0-SNAPSHOT\maven-release-manager-3.0.0-SNAPSHOT.pom
[windows-jdk10-m3.5.x_build] [withMaven] artifactsPublisher - Archive artifact windows-jdk10-m3.5.x_build\maven-release-manager\target\maven-release-manager-3.0.0-SNAPSHOT.jar under org\apache\maven\release\maven-release-manager\3.0.0-SNAPSHOT\maven-release-manager-3.0.0-SNAPSHOT.jar
[windows-jdk10-m3.5.x_build] [withMaven] artifactsPublisher - Archive artifact windows-jdk10-m3.5.x_build\maven-release-plugin\pom.xml under org\apache\maven\plugins\maven-release-plugin\3.0.0-SNAPSHOT\maven-release-plugin-3.0.0-SNAPSHOT.pom
[windows-jdk10-m3.5.x_build] [withMaven] artifactsPublisher - Archive artifact windows-jdk10-m3.5.x_build\maven-release-plugin\target\maven-release-plugin-3.0.0-SNAPSHOT.jar under org\apache\maven\plugins\maven-release-plugin\3.0.0-SNAPSHOT\maven-release-plugin-3.0.0-SNAPSHOT.jar
[windows-jdk10-m3.5.x_build] [withMaven] artifactsPublisher - Archive artifact windows-jdk10-m3.5.x_build\maven-release-policies\maven-release-oddeven-policy\pom.xml under org\apache\maven\release\maven-release-oddeven-policy\3.0.0-SNAPSHOT\maven-release-oddeven-policy-3.0.0-SNAPSHOT.pom
[windows-jdk10-m3.5.x_build] [withMaven] artifactsPublisher - Archive artifact windows-jdk10-m3.5.x_build\maven-release-policies\maven-release-oddeven-policy\target\maven-release-oddeven-policy-3.0.0-SNAPSHOT.jar under org\apache\maven\release\maven-release-oddeven-policy\3.0.0-SNAPSHOT\maven-release-oddeven-policy-3.0.0-SNAPSHOT.jar
[windows-jdk10-m3.5.x_build] [withMaven] artifactsPublisher - Archive artifact windows-jdk10-m3.5.x_build\maven-release-policies\maven-release-semver-policy\pom.xml under org\apache\maven\release\maven-release-semver-policy\3.0.0-SNAPSHOT\maven-release-semver-policy-3.0.0-SNAPSHOT.pom
[windows-jdk10-m3.5.x_build] [withMaven] artifactsPublisher - Archive artifact windows-jdk10-m3.5.x_build\maven-release-policies\maven-release-semver-policy\target\maven-release-semver-policy-3.0.0-SNAPSHOT.jar under org\apache\maven\release\maven-release-semver-policy\3.0.0-SNAPSHOT\maven-release-semver-policy-3.0.0-SNAPSHOT.jar
[windows-jdk10-m3.5.x_build] [Fast Archiver] No prior successful build to compare, so performing full copy of artifacts
[windows-jdk10-m3.5.x_build] [withMaven] invokerPublisher - Archive invoker results for Maven artifact MavenArtifact{org.apache.maven.plugins:maven-release-plugin::3.0.0-SNAPSHOT(version: 3.0.0-SNAPSHOT, snapshot:false) } generated by PluginInvocation{org.apache.maven.plugins:maven-invoker-plugin:3.0.1@run  integration-test-prepare}: windows-jdk10-m3.5.x_build\maven-release-plugin\target\invoker-reports\*.xml
[windows-jdk10-m3.5.x_build] performing MavenInvokerRecorder, reportsFilenamePattern:'**/windows-jdk10-m3.5.x_build\maven-release-plugin\target\invoker-reports/BUILD*.xml', invokerBuildDir:'**/windows-jdk10-m3.5.x_build\maven-release-plugin\target\it'
[windows-jdk10-m3.5.x_build] Found reports:[f:\jenkins\jenkins-slave\workspace\x_maven-release_IMPROVE_POM-KZP6VA3ZSGGYNTVVOCGLUBHYECJZQ34VIS6H2U5HNYVKLJFCFQKQ@2\windows-jdk10-m3.5.x_build\maven-release-plugin\target\invoker-reports\BUILD-projects_update-versions_MRELEASE-555.xml, f:\jenkins\jenkins-slave\workspace\x_maven-release_IMPROVE_POM-KZP6VA3ZSGGYNTVVOCGLUBHYECJZQ34VIS6H2U5HNYVKLJFCFQKQ@2\windows-jdk10-m3.5.x_build\maven-release-plugin\target\invoker-reports\BUILD-projects_update-versions_MRELEASE-611.xml, f:\jenkins\jenkins-slave\workspace\x_maven-release_IMPROVE_POM-KZP6VA3ZSGGYNTVVOCGLUBHYECJZQ34VIS6H2U5HNYVKLJFCFQKQ@2\windows-jdk10-m3.5.x_build\maven-release-plugin\target\invoker-reports\BUILD-projects_update-versions_MRELEASE-783.xml, f:\jenkins\jenkins-slave\workspace\x_maven-release_IMPROVE_POM-KZP6VA3ZSGGYNTVVOCGLUBHYECJZQ34VIS6H2U5HNYVKLJFCFQKQ@2\windows-jdk10-m3.5.x_build\maven-release-plugin\target\invoker-reports\BUILD-projects_update-versions_MRELEASE-976.xml]
[windows-jdk10-m3.5.x_build] Found logs:[f:\jenkins\jenkins-slave\workspace\x_maven-release_IMPROVE_POM-KZP6VA3ZSGGYNTVVOCGLUBHYECJZQ34VIS6H2U5HNYVKLJFCFQKQ@2\windows-jdk10-m3.5.x_build\maven-release-plugin\target\it\projects\update-versions\MRELEASE-555\build.log, f:\jenkins\jenkins-slave\workspace\x_maven-release_IMPROVE_POM-KZP6VA3ZSGGYNTVVOCGLUBHYECJZQ34VIS6H2U5HNYVKLJFCFQKQ@2\windows-jdk10-m3.5.x_build\maven-release-plugin\target\it\projects\update-versions\MRELEASE-611\build.log, f:\jenkins\jenkins-slave\workspace\x_maven-release_IMPROVE_POM-KZP6VA3ZSGGYNTVVOCGLUBHYECJZQ34VIS6H2U5HNYVKLJFCFQKQ@2\windows-jdk10-m3.5.x_build\maven-release-plugin\target\it\projects\update-versions\MRELEASE-783\build.log, f:\jenkins\jenkins-slave\workspace\x_maven-release_IMPROVE_POM-KZP6VA3ZSGGYNTVVOCGLUBHYECJZQ34VIS6H2U5HNYVKLJFCFQKQ@2\windows-jdk10-m3.5.x_build\maven-release-plugin\target\it\projects\update-versions\MRELEASE-976\build.log]
[windows-jdk10-m3.5.x_build] Finished parsing Maven Invoker results (found 4)
[windows-jdk10-m3.5.x_build] [withMaven] invokerPublisher - Archive invoker results for Maven artifact MavenArtifact{org.apache.maven.plugins:maven-release-plugin::3.0.0-SNAPSHOT(version: 3.0.0-SNAPSHOT, snapshot:false) } generated by PluginInvocation{org.apache.maven.plugins:maven-invoker-plugin:3.0.1@run  integration-test-prepare-with-pom}: windows-jdk10-m3.5.x_build\maven-release-plugin\target\invoker-reports\*.xml
[windows-jdk10-m3.5.x_build] performing MavenInvokerRecorder, reportsFilenamePattern:'**/windows-jdk10-m3.5.x_build\maven-release-plugin\target\invoker-reports/BUILD*.xml', invokerBuildDir:'**/windows-jdk10-m3.5.x_build\maven-release-plugin\target\it'
[windows-jdk10-m3.5.x_build] Found reports:[f:\jenkins\jenkins-slave\workspace\x_maven-release_IMPROVE_POM-KZP6VA3ZSGGYNTVVOCGLUBHYECJZQ34VIS6H2U5HNYVKLJFCFQKQ@2\windows-jdk10-m3.5.x_build\maven-release-plugin\target\invoker-reports\BUILD-projects_update-versions_MRELEASE-555.xml, f:\jenkins\jenkins-slave\workspace\x_maven-release_IMPROVE_POM-KZP6VA3ZSGGYNTVVOCGLUBHYECJZQ34VIS6H2U5HNYVKLJFCFQKQ@2\windows-jdk10-m3.5.x_build\maven-release-plugin\target\invoker-reports\BUILD-projects_update-versions_MRELEASE-611.xml, f:\jenkins\jenkins-slave\workspace\x_maven-release_IMPROVE_POM-KZP6VA3ZSGGYNTVVOCGLUBHYECJZQ34VIS6H2U5HNYVKLJFCFQKQ@2\windows-jdk10-m3.5.x_build\maven-release-plugin\target\invoker-reports\BUILD-projects_update-versions_MRELEASE-783.xml, f:\jenkins\jenkins-slave\workspace\x_maven-release_IMPROVE_POM-KZP6VA3ZSGGYNTVVOCGLUBHYECJZQ34VIS6H2U5HNYVKLJFCFQKQ@2\windows-jdk10-m3.5.x_build\maven-release-plugin\target\invoker-reports\BUILD-projects_update-versions_MRELEASE-976.xml]
[windows-jdk10-m3.5.x_build] Found logs:[f:\jenkins\jenkins-slave\workspace\x_maven-release_IMPROVE_POM-KZP6VA3ZSGGYNTVVOCGLUBHYECJZQ34VIS6H2U5HNYVKLJFCFQKQ@2\windows-jdk10-m3.5.x_build\maven-release-plugin\target\it\projects\update-versions\MRELEASE-555\build.log, f:\jenkins\jenkins-slave\workspace\x_maven-release_IMPROVE_POM-KZP6VA3ZSGGYNTVVOCGLUBHYECJZQ34VIS6H2U5HNYVKLJFCFQKQ@2\windows-jdk10-m3.5.x_build\maven-release-plugin\target\it\projects\update-versions\MRELEASE-611\build.log, f:\jenkins\jenkins-slave\workspace\x_maven-release_IMPROVE_POM-KZP6VA3ZSGGYNTVVOCGLUBHYECJZQ34VIS6H2U5HNYVKLJFCFQKQ@2\windows-jdk10-m3.5.x_build\maven-release-plugin\target\it\projects\update-versions\MRELEASE-783\build.log, f:\jenkins\jenkins-slave\workspace\x_maven-release_IMPROVE_POM-KZP6VA3ZSGGYNTVVOCGLUBHYECJZQ34VIS6H2U5HNYVKLJFCFQKQ@2\windows-jdk10-m3.5.x_build\maven-release-plugin\target\it\projects\update-versions\MRELEASE-976\build.log]
[windows-jdk10-m3.5.x_build] Finished parsing Maven Invoker results (found 4)
[windows-jdk10-m3.5.x_build] [withMaven] invokerPublisher - Archive invoker results for Maven artifact MavenArtifact{org.apache.maven.plugins:maven-release-plugin::3.0.0-SNAPSHOT(version: 3.0.0-SNAPSHOT, snapshot:false) } generated by PluginInvocation{org.apache.maven.plugins:maven-invoker-plugin:3.0.1@run  integration-test-branch}: windows-jdk10-m3.5.x_build\maven-release-plugin\target\invoker-reports\*.xml
[windows-jdk10-m3.5.x_build] performing MavenInvokerRecorder, reportsFilenamePattern:'**/windows-jdk10-m3.5.x_build\maven-release-plugin\target\invoker-reports/BUILD*.xml', invokerBuildDir:'**/windows-jdk10-m3.5.x_build\maven-release-plugin\target\it'
[windows-jdk10-m3.5.x_build] Found reports:[f:\jenkins\jenkins-slave\workspace\x_maven-release_IMPROVE_POM-KZP6VA3ZSGGYNTVVOCGLUBHYECJZQ34VIS6H2U5HNYVKLJFCFQKQ@2\windows-jdk10-m3.5.x_build\maven-release-plugin\target\invoker-reports\BUILD-projects_update-versions_MRELEASE-555.xml, f:\jenkins\jenkins-slave\workspace\x_maven-release_IMPROVE_POM-KZP6VA3ZSGGYNTVVOCGLUBHYECJZQ34VIS6H2U5HNYVKLJFCFQKQ@2\windows-jdk10-m3.5.x_build\maven-release-plugin\target\invoker-reports\BUILD-projects_update-versions_MRELEASE-611.xml, f:\jenkins\jenkins-slave\workspace\x_maven-release_IMPROVE_POM-KZP6VA3ZSGGYNTVVOCGLUBHYECJZQ34VIS6H2U5HNYVKLJFCFQKQ@2\windows-jdk10-m3.5.x_build\maven-release-plugin\target\invoker-reports\BUILD-projects_update-versions_MRELEASE-783.xml, f:\jenkins\jenkins-slave\workspace\x_maven-release_IMPROVE_POM-KZP6VA3ZSGGYNTVVOCGLUBHYECJZQ34VIS6H2U5HNYVKLJFCFQKQ@2\windows-jdk10-m3.5.x_build\maven-release-plugin\target\invoker-reports\BUILD-projects_update-versions_MRELEASE-976.xml]
[windows-jdk10-m3.5.x_build] Found logs:[f:\jenkins\jenkins-slave\workspace\x_maven-release_IMPROVE_POM-KZP6VA3ZSGGYNTVVOCGLUBHYECJZQ34VIS6H2U5HNYVKLJFCFQKQ@2\windows-jdk10-m3.5.x_build\maven-release-plugin\target\it\projects\update-versions\MRELEASE-555\build.log, f:\jenkins\jenkins-slave\workspace\x_maven-release_IMPROVE_POM-KZP6VA3ZSGGYNTVVOCGLUBHYECJZQ34VIS6H2U5HNYVKLJFCFQKQ@2\windows-jdk10-m3.5.x_build\maven-release-plugin\target\it\projects\update-versions\MRELEASE-611\build.log, f:\jenkins\jenkins-slave\workspace\x_maven-release_IMPROVE_POM-KZP6VA3ZSGGYNTVVOCGLUBHYECJZQ34VIS6H2U5HNYVKLJFCFQKQ@2\windows-jdk10-m3.5.x_build\maven-release-plugin\target\it\projects\update-versions\MRELEASE-783\build.log, f:\jenkins\jenkins-slave\workspace\x_maven-release_IMPROVE_POM-KZP6VA3ZSGGYNTVVOCGLUBHYECJZQ34VIS6H2U5HNYVKLJFCFQKQ@2\windows-jdk10-m3.5.x_build\maven-release-plugin\target\it\projects\update-versions\MRELEASE-976\build.log]
[windows-jdk10-m3.5.x_build] Finished parsing Maven Invoker results (found 4)
[windows-jdk10-m3.5.x_build] [withMaven] invokerPublisher - Archive invoker results for Maven artifact MavenArtifact{org.apache.maven.plugins:maven-release-plugin::3.0.0-SNAPSHOT(version: 3.0.0-SNAPSHOT, snapshot:false) } generated by PluginInvocation{org.apache.maven.plugins:maven-invoker-plugin:3.0.1@run  integration-test-perform}: windows-jdk10-m3.5.x_build\maven-release-plugin\target\invoker-reports\*.xml
[windows-jdk10-m3.5.x_build] performing MavenInvokerRecorder, reportsFilenamePattern:'**/windows-jdk10-m3.5.x_build\maven-release-plugin\target\invoker-reports/BUILD*.xml', invokerBuildDir:'**/windows-jdk10-m3.5.x_build\maven-release-plugin\target\it'
[windows-jdk10-m3.5.x_build] Found reports:[f:\jenkins\jenkins-slave\workspace\x_maven-release_IMPROVE_POM-KZP6VA3ZSGGYNTVVOCGLUBHYECJZQ34VIS6H2U5HNYVKLJFCFQKQ@2\windows-jdk10-m3.5.x_build\maven-release-plugin\target\invoker-reports\BUILD-projects_update-versions_MRELEASE-555.xml, f:\jenkins\jenkins-slave\workspace\x_maven-release_IMPROVE_POM-KZP6VA3ZSGGYNTVVOCGLUBHYECJZQ34VIS6H2U5HNYVKLJFCFQKQ@2\windows-jdk10-m3.5.x_build\maven-release-plugin\target\invoker-reports\BUILD-projects_update-versions_MRELEASE-611.xml, f:\jenkins\jenkins-slave\workspace\x_maven-release_IMPROVE_POM-KZP6VA3ZSGGYNTVVOCGLUBHYECJZQ34VIS6H2U5HNYVKLJFCFQKQ@2\windows-jdk10-m3.5.x_build\maven-release-plugin\target\invoker-reports\BUILD-projects_update-versions_MRELEASE-783.xml, f:\jenkins\jenkins-slave\workspace\x_maven-release_IMPROVE_POM-KZP6VA3ZSGGYNTVVOCGLUBHYECJZQ34VIS6H2U5HNYVKLJFCFQKQ@2\windows-jdk10-m3.5.x_build\maven-release-plugin\target\invoker-reports\BUILD-projects_update-versions_MRELEASE-976.xml]
[windows-jdk10-m3.5.x_build] Found logs:[f:\jenkins\jenkins-slave\workspace\x_maven-release_IMPROVE_POM-KZP6VA3ZSGGYNTVVOCGLUBHYECJZQ34VIS6H2U5HNYVKLJFCFQKQ@2\windows-jdk10-m3.5.x_build\maven-release-plugin\target\it\projects\update-versions\MRELEASE-555\build.log, f:\jenkins\jenkins-slave\workspace\x_maven-release_IMPROVE_POM-KZP6VA3ZSGGYNTVVOCGLUBHYECJZQ34VIS6H2U5HNYVKLJFCFQKQ@2\windows-jdk10-m3.5.x_build\maven-release-plugin\target\it\projects\update-versions\MRELEASE-611\build.log, f:\jenkins\jenkins-slave\workspace\x_maven-release_IMPROVE_POM-KZP6VA3ZSGGYNTVVOCGLUBHYECJZQ34VIS6H2U5HNYVKLJFCFQKQ@2\windows-jdk10-m3.5.x_build\maven-release-plugin\target\it\projects\update-versions\MRELEASE-783\build.log, f:\jenkins\jenkins-slave\workspace\x_maven-release_IMPROVE_POM-KZP6VA3ZSGGYNTVVOCGLUBHYECJZQ34VIS6H2U5HNYVKLJFCFQKQ@2\windows-jdk10-m3.5.x_build\maven-release-plugin\target\it\projects\update-versions\MRELEASE-976\build.log]
[windows-jdk10-m3.5.x_build] Finished parsing Maven Invoker results (found 4)
[windows-jdk10-m3.5.x_build] [withMaven] invokerPublisher - Archive invoker results for Maven artifact MavenArtifact{org.apache.maven.plugins:maven-release-plugin::3.0.0-SNAPSHOT(version: 3.0.0-SNAPSHOT, snapshot:false) } generated by PluginInvocation{org.apache.maven.plugins:maven-invoker-plugin:3.0.1@run  integration-test-update-versions}: windows-jdk10-m3.5.x_build\maven-release-plugin\target\invoker-reports\*.xml
[windows-jdk10-m3.5.x_build] performing MavenInvokerRecorder, reportsFilenamePattern:'**/windows-jdk10-m3.5.x_build\maven-release-plugin\target\invoker-reports/BUILD*.xml', invokerBuildDir:'**/windows-jdk10-m3.5.x_build\maven-release-plugin\target\it'
[windows-jdk10-m3.5.x_build] Found reports:[f:\jenkins\jenkins-slave\workspace\x_maven-release_IMPROVE_POM-KZP6VA3ZSGGYNTVVOCGLUBHYECJZQ34VIS6H2U5HNYVKLJFCFQKQ@2\windows-jdk10-m3.5.x_build\maven-release-plugin\target\invoker-reports\BUILD-projects_update-versions_MRELEASE-555.xml, f:\jenkins\jenkins-slave\workspace\x_maven-release_IMPROVE_POM-KZP6VA3ZSGGYNTVVOCGLUBHYECJZQ34VIS6H2U5HNYVKLJFCFQKQ@2\windows-jdk10-m3.5.x_build\maven-release-plugin\target\invoker-reports\BUILD-projects_update-versions_MRELEASE-611.xml, f:\jenkins\jenkins-slave\workspace\x_maven-release_IMPROVE_POM-KZP6VA3ZSGGYNTVVOCGLUBHYECJZQ34VIS6H2U5HNYVKLJFCFQKQ@2\windows-jdk10-m3.5.x_build\maven-release-plugin\target\invoker-reports\BUILD-projects_update-versions_MRELEASE-783.xml, f:\jenkins\jenkins-slave\workspace\x_maven-release_IMPROVE_POM-KZP6VA3ZSGGYNTVVOCGLUBHYECJZQ34VIS6H2U5HNYVKLJFCFQKQ@2\windows-jdk10-m3.5.x_build\maven-release-plugin\target\invoker-reports\BUILD-projects_update-versions_MRELEASE-976.xml]
[windows-jdk10-m3.5.x_build] Found logs:[f:\jenkins\jenkins-slave\workspace\x_maven-release_IMPROVE_POM-KZP6VA3ZSGGYNTVVOCGLUBHYECJZQ34VIS6H2U5HNYVKLJFCFQKQ@2\windows-jdk10-m3.5.x_build\maven-release-plugin\target\it\projects\update-versions\MRELEASE-555\build.log, f:\jenkins\jenkins-slave\workspace\x_maven-release_IMPROVE_POM-KZP6VA3ZSGGYNTVVOCGLUBHYECJZQ34VIS6H2U5HNYVKLJFCFQKQ@2\windows-jdk10-m3.5.x_build\maven-release-plugin\target\it\projects\update-versions\MRELEASE-611\build.log, f:\jenkins\jenkins-slave\workspace\x_maven-release_IMPROVE_POM-KZP6VA3ZSGGYNTVVOCGLUBHYECJZQ34VIS6H2U5HNYVKLJFCFQKQ@2\windows-jdk10-m3.5.x_build\maven-release-plugin\target\it\projects\update-versions\MRELEASE-783\build.log, f:\jenkins\jenkins-slave\workspace\x_maven-release_IMPROVE_POM-KZP6VA3ZSGGYNTVVOCGLUBHYECJZQ34VIS6H2U5HNYVKLJFCFQKQ@2\windows-jdk10-m3.5.x_build\maven-release-plugin\target\it\projects\update-versions\MRELEASE-976\build.log]
[windows-jdk10-m3.5.x_build] Finished parsing Maven Invoker results (found 4)
[windows-jdk10-m3.5.x_build] [withMaven] junitPublisher - Archive test results for Maven artifact org.apache.maven.release:maven-release-api:3.0.0-SNAPSHOT generated by maven-surefire-plugin:test (default-test): windows-jdk10-m3.5.x_build\maven-release-api\target\surefire-reports\*.xml
[windows-jdk10-m3.5.x_build] Recording test results
[windows-jdk10-m3.5.x_build] None of the test reports contained any result
[windows-jdk10-m3.5.x_build] [withMaven] junitPublisher - Archive test results for Maven artifact org.apache.maven.release:maven-release-manager:3.0.0-SNAPSHOT generated by maven-surefire-plugin:test (default-test): windows-jdk10-m3.5.x_build\maven-release-manager\target\surefire-reports\*.xml
[windows-jdk10-m3.5.x_build] Recording test results
[windows-jdk10-m3.5.x_build] [withMaven] junitPublisher - Archive test results for Maven artifact org.apache.maven.plugins:maven-release-plugin:3.0.0-SNAPSHOT generated by maven-surefire-plugin:test (default-test): windows-jdk10-m3.5.x_build\maven-release-plugin\target\surefire-reports\*.xml
[windows-jdk10-m3.5.x_build] Recording test results
[windows-jdk10-m3.5.x_build] [withMaven] junitPublisher - Archive test results for Maven artifact org.apache.maven.release:maven-release-oddeven-policy:3.0.0-SNAPSHOT generated by maven-surefire-plugin:test (default-test): windows-jdk10-m3.5.x_build\maven-release-policies\maven-release-oddeven-policy\target\surefire-reports\*.xml
[windows-jdk10-m3.5.x_build] Recording test results
[windows-jdk10-m3.5.x_build] [withMaven] junitPublisher - Archive test results for Maven artifact org.apache.maven.release:maven-release-semver-policy:3.0.0-SNAPSHOT generated by maven-surefire-plugin:test (default-test): windows-jdk10-m3.5.x_build\maven-release-policies\maven-release-semver-policy\target\surefire-reports\*.xml
[windows-jdk10-m3.5.x_build] Recording test results
[windows-jdk10-m3.5.x_build] [withMaven] junitPublisher - Archive test results for Maven artifact org.apache.maven.release:maven-release-manager:3.0.0-SNAPSHOT generated by maven-failsafe-plugin:integration-test (default): windows-jdk10-m3.5.x_build\maven-release-manager\target\failsafe-reports\*.xml
[windows-jdk10-m3.5.x_build] Recording test results
[windows-jdk10-m3.5.x_build] [withMaven] openTasksPublisher - Scan Tasks for Maven artifact org.apache.maven.release:maven-release-api:3.0.0-SNAPSHOT in source directory windows-jdk10-m3.5.x_build\maven-release-api\src\main\java
[windows-jdk10-m3.5.x_build] [withMaven] openTasksPublisher - Scan Tasks for Maven artifact org.apache.maven.release:maven-release-manager:3.0.0-SNAPSHOT in source directory windows-jdk10-m3.5.x_build\maven-release-manager\src\main\java
[windows-jdk10-m3.5.x_build] [withMaven] openTasksPublisher - Scan Tasks for Maven artifact org.apache.maven.plugins:maven-release-plugin:3.0.0-SNAPSHOT in source directory windows-jdk10-m3.5.x_build\maven-release-plugin\src\main\java
[windows-jdk10-m3.5.x_build] [withMaven] openTasksPublisher - Scan Tasks for Maven artifact org.apache.maven.release:maven-release-oddeven-policy:3.0.0-SNAPSHOT in source directory windows-jdk10-m3.5.x_build\maven-release-policies\maven-release-oddeven-policy\src\main\java
[windows-jdk10-m3.5.x_build] [withMaven] openTasksPublisher - Scan Tasks for Maven artifact org.apache.maven.release:maven-release-semver-policy:3.0.0-SNAPSHOT in source directory windows-jdk10-m3.5.x_build\maven-release-policies\maven-release-semver-policy\src\main\java
[windows-jdk10-m3.5.x_build] [TASKS] Scanning folder 'f:\jenkins\jenkins-slave\workspace\x_maven-release_IMPROVE_POM-KZP6VA3ZSGGYNTVVOCGLUBHYECJZQ34VIS6H2U5HNYVKLJFCFQKQ@2' for files matching the pattern 'windows-jdk10-m3.5.x_build\maven-release-api\src\main\java\**\*,windows-jdk10-m3.5.x_build\maven-release-manager\src\main\java\**\*,windows-jdk10-m3.5.x_build\maven-release-plugin\src\main\java\**\*,windows-jdk10-m3.5.x_build\maven-release-policies\maven-release-oddeven-policy\src\main\java\**\*,windows-jdk10-m3.5.x_build\maven-release-policies\maven-release-semver-policy\src\main\java\**\*' - excludes: null
[windows-jdk10-m3.5.x_build] [TASKS] Found 130 files to scan for tasks
[windows-jdk10-m3.5.x_build] [TASKS] Found 21 open tasks.
[windows-jdk10-m3.5.x_build] Skipping warnings blame since pipelines do not have an SCM link.%n
[Pipeline] [windows-jdk10-m3.5.x_build] // withMaven
[Pipeline] [windows-jdk10-m3.5.x_build] cleanWs
[windows-jdk10-m3.5.x_build] [WS-CLEANUP] Deleting project workspace...[WS-CLEANUP] done
[Pipeline] [windows-jdk10-m3.5.x_build] }
[Pipeline] [windows-jdk10-m3.5.x_build] // stage
[Pipeline] [windows-jdk10-m3.5.x_build] }
[Pipeline] [windows-jdk10-m3.5.x_build] // node
[Pipeline] [windows-jdk10-m3.5.x_build] }
[Pipeline] // parallel
[Pipeline] stage
[Pipeline] { (Notifications)
[Pipeline] echo
Build result: FAILURE
[Pipeline] jiraIssueSelector
[Pipeline] emailext
Reply | Threaded
Open this post in threaded view
|

Build failed in Jenkins: Maven TLP » maven-release » IMPROVE_POM #3

Apache Jenkins Server-2
See https://builds.apache.org/job/maven-box/job/maven-release/job/IMPROVE_POM/3/

No changes.

All tests passed

Build log:
[...truncated 7.42 MB...]
[windows-jdk10-m3.5.x_build] [INFO] Exclude: .repository/**
[windows-jdk10-m3.5.x_build] [INFO] Exclude: .maven/spy.log
[windows-jdk10-m3.5.x_build] [INFO] Exclude: dependency-reduced-pom.xml
[windows-jdk10-m3.5.x_build] [INFO] Exclude: .java-version
[windows-jdk10-m3.5.x_build] [INFO] 4 resources included (use -debug for more details)
[windows-jdk10-m3.5.x_build] [INFO] Rat check: Summary over all files. Unapproved: 0, unknown: 0, generated: 0, approved: 4 licenses.
[windows-jdk10-m3.5.x_build] [INFO]
[windows-jdk10-m3.5.x_build] [INFO] --- maven-remote-resources-plugin:1.5:process (process-resource-bundles) @ maven-release-oddeven-policy ---
[windows-jdk10-m3.5.x_build] [INFO]
[windows-jdk10-m3.5.x_build] [INFO] --- maven-resources-plugin:3.1.0:resources (default-resources) @ maven-release-oddeven-policy ---
[windows-jdk10-m3.5.x_build] [INFO] Using 'UTF-8' encoding to copy filtered resources.
[windows-jdk10-m3.5.x_build] [INFO] skip non existing resourceDirectory F:\jenkins\jenkins-slave\workspace\x_maven-release_IMPROVE_POM-KZP6VA3ZSGGYNTVVOCGLUBHYECJZQ34VIS6H2U5HNYVKLJFCFQKQ\windows-jdk10-m3.5.x_build\maven-release-policies\maven-release-oddeven-policy\src\main\resources
[windows-jdk10-m3.5.x_build] [INFO] Copying 3 resources
[windows-jdk10-m3.5.x_build] [INFO]
[windows-jdk10-m3.5.x_build] [INFO] --- maven-compiler-plugin:3.7.0:compile (default-compile) @ maven-release-oddeven-policy ---
[windows-jdk10-m3.5.x_build] [INFO] Changes detected - recompiling the module!
[windows-jdk10-m3.5.x_build] [INFO] Compiling 2 source files to F:\jenkins\jenkins-slave\workspace\x_maven-release_IMPROVE_POM-KZP6VA3ZSGGYNTVVOCGLUBHYECJZQ34VIS6H2U5HNYVKLJFCFQKQ\windows-jdk10-m3.5.x_build\maven-release-policies\maven-release-oddeven-policy\target\classes
[windows-jdk10-m3.5.x_build] [INFO]
[windows-jdk10-m3.5.x_build] [INFO] --- plexus-component-metadata:1.7.1:generate-metadata (process-classes) @ maven-release-oddeven-policy ---
[windows-jdk10-m3.5.x_build] [INFO] Discovered 1 component descriptors(s)
[windows-jdk10-m3.5.x_build] [INFO]
[windows-jdk10-m3.5.x_build] [INFO] --- maven-resources-plugin:3.1.0:testResources (default-testResources) @ maven-release-oddeven-policy ---
[windows-jdk10-m3.5.x_build] [INFO] Using 'UTF-8' encoding to copy filtered resources.
[windows-jdk10-m3.5.x_build] [INFO] skip non existing resourceDirectory F:\jenkins\jenkins-slave\workspace\x_maven-release_IMPROVE_POM-KZP6VA3ZSGGYNTVVOCGLUBHYECJZQ34VIS6H2U5HNYVKLJFCFQKQ\windows-jdk10-m3.5.x_build\maven-release-policies\maven-release-oddeven-policy\src\test\resources
[windows-jdk10-m3.5.x_build] [INFO] Copying 3 resources
[windows-jdk10-m3.5.x_build] [INFO]
[windows-jdk10-m3.5.x_build] [INFO] --- maven-compiler-plugin:3.7.0:testCompile (default-testCompile) @ maven-release-oddeven-policy ---
[windows-jdk10-m3.5.x_build] [INFO] Changes detected - recompiling the module!
[windows-jdk10-m3.5.x_build] [INFO] Compiling 1 source file to F:\jenkins\jenkins-slave\workspace\x_maven-release_IMPROVE_POM-KZP6VA3ZSGGYNTVVOCGLUBHYECJZQ34VIS6H2U5HNYVKLJFCFQKQ\windows-jdk10-m3.5.x_build\maven-release-policies\maven-release-oddeven-policy\target\test-classes
[windows-jdk10-m3.5.x_build] [INFO]
[windows-jdk10-m3.5.x_build] [INFO] --- maven-surefire-plugin:2.22.0:test (default-test) @ maven-release-oddeven-policy ---
[windows-jdk10-m3.5.x_build] [INFO]
[windows-jdk10-m3.5.x_build] [INFO] -------------------------------------------------------
[windows-jdk10-m3.5.x_build] [INFO]  T E S T S
[windows-jdk10-m3.5.x_build] [INFO] -------------------------------------------------------
[windows-jdk10-m3.5.x_build] [INFO] Running org.apache.maven.shared.release.policy.oddeven.OddEvenVersionPolicyTestCase
[windows-jdk10-m3.5.x_build] [INFO] Tests run: 3, Failures: 0, Errors: 0, Skipped: 0, Time elapsed: 0.166 s - in org.apache.maven.shared.release.policy.oddeven.OddEvenVersionPolicyTestCase
[windows-jdk10-m3.5.x_build] [INFO]
[windows-jdk10-m3.5.x_build] [INFO] Results:
[windows-jdk10-m3.5.x_build] [INFO]
[windows-jdk10-m3.5.x_build] [INFO] Tests run: 3, Failures: 0, Errors: 0, Skipped: 0
[windows-jdk10-m3.5.x_build] [INFO]
[windows-jdk10-m3.5.x_build] [INFO]
[windows-jdk10-m3.5.x_build] [INFO] --- maven-jar-plugin:3.1.0:jar (default-jar) @ maven-release-oddeven-policy ---
[windows-jdk10-m3.5.x_build] [INFO] Building jar: F:\jenkins\jenkins-slave\workspace\x_maven-release_IMPROVE_POM-KZP6VA3ZSGGYNTVVOCGLUBHYECJZQ34VIS6H2U5HNYVKLJFCFQKQ\windows-jdk10-m3.5.x_build\maven-release-policies\maven-release-oddeven-policy\target\maven-release-oddeven-policy-3.0.0-SNAPSHOT.jar
[windows-jdk10-m3.5.x_build] [INFO]
[windows-jdk10-m3.5.x_build] [INFO] --- maven-site-plugin:3.7.1:attach-descriptor (attach-descriptor) @ maven-release-oddeven-policy ---
[windows-jdk10-m3.5.x_build] [INFO] Skipping because packaging 'jar' is not pom.
[windows-jdk10-m3.5.x_build] [INFO]
[windows-jdk10-m3.5.x_build] [INFO] --- maven-checkstyle-plugin:3.0.0:check (checkstyle-check) @ maven-release-oddeven-policy ---
[windows-jdk10-m3.5.x_build] [INFO]
[windows-jdk10-m3.5.x_build] [INFO] ------------------------------------------------------------------------
[windows-jdk10-m3.5.x_build] [INFO] Building Maven Release SemVer Policy 3.0.0-SNAPSHOT
[windows-jdk10-m3.5.x_build] [INFO] ------------------------------------------------------------------------
[windows-jdk10-m3.5.x_build] [INFO] Downloading from central: https://repo.maven.apache.org/maven2/org/semver/api/0.9.33/api-0.9.33.pom
[windows-jdk10-m3.5.x_build] [INFO] Downloaded from central: https://repo.maven.apache.org/maven2/org/semver/api/0.9.33/api-0.9.33.pom (2.8 kB at 149 kB/s)
[windows-jdk10-m3.5.x_build] [INFO] Downloading from central: https://repo.maven.apache.org/maven2/org/semver/parent/0.9.33/parent-0.9.33.pom
[windows-jdk10-m3.5.x_build] [INFO] Downloaded from central: https://repo.maven.apache.org/maven2/org/semver/parent/0.9.33/parent-0.9.33.pom (1.3 kB at 84 kB/s)
[windows-jdk10-m3.5.x_build] [INFO] Downloading from central: https://repo.maven.apache.org/maven2/com/github/jeluard/oss-parent/9/oss-parent-9.pom
[windows-jdk10-m3.5.x_build] [INFO] Downloaded from central: https://repo.maven.apache.org/maven2/com/github/jeluard/oss-parent/9/oss-parent-9.pom (12 kB at 656 kB/s)
[windows-jdk10-m3.5.x_build] [INFO] Downloading from central: https://repo.maven.apache.org/maven2/com/google/code/findbugs/jsr305/2.0.0/jsr305-2.0.0.pom
[windows-jdk10-m3.5.x_build] [INFO] Downloaded from central: https://repo.maven.apache.org/maven2/com/google/code/findbugs/jsr305/2.0.0/jsr305-2.0.0.pom (965 B at 88 kB/s)
[windows-jdk10-m3.5.x_build] [INFO] Downloading from central: https://repo.maven.apache.org/maven2/org/ow2/asm/asm/5.0.3/asm-5.0.3.pom
[windows-jdk10-m3.5.x_build] [INFO] Downloaded from central: https://repo.maven.apache.org/maven2/org/ow2/asm/asm/5.0.3/asm-5.0.3.pom (1.9 kB at 121 kB/s)
[windows-jdk10-m3.5.x_build] [INFO] Downloading from central: https://repo.maven.apache.org/maven2/org/ow2/asm/asm-parent/5.0.3/asm-parent-5.0.3.pom
[windows-jdk10-m3.5.x_build] [INFO] Downloaded from central: https://repo.maven.apache.org/maven2/org/ow2/asm/asm-parent/5.0.3/asm-parent-5.0.3.pom (5.5 kB at 250 kB/s)
[windows-jdk10-m3.5.x_build] [INFO] Downloading from central: https://repo.maven.apache.org/maven2/org/ow2/asm/asm-commons/5.0.3/asm-commons-5.0.3.pom
[windows-jdk10-m3.5.x_build] [INFO] Downloaded from central: https://repo.maven.apache.org/maven2/org/ow2/asm/asm-commons/5.0.3/asm-commons-5.0.3.pom (2.1 kB at 233 kB/s)
[windows-jdk10-m3.5.x_build] [INFO] Downloading from central: https://repo.maven.apache.org/maven2/org/ow2/asm/asm-tree/5.0.3/asm-tree-5.0.3.pom
[windows-jdk10-m3.5.x_build] [INFO] Downloaded from central: https://repo.maven.apache.org/maven2/org/ow2/asm/asm-tree/5.0.3/asm-tree-5.0.3.pom (2.1 kB at 189 kB/s)
[windows-jdk10-m3.5.x_build] [INFO] Downloading from central: https://repo.maven.apache.org/maven2/commons-lang/commons-lang/1.0/commons-lang-1.0.pom
[windows-jdk10-m3.5.x_build] [INFO] Downloaded from central: https://repo.maven.apache.org/maven2/commons-lang/commons-lang/1.0/commons-lang-1.0.pom (2.5 kB at 246 kB/s)
[windows-jdk10-m3.5.x_build] [INFO] Downloading from central: https://repo.maven.apache.org/maven2/de/tototec/de.tototec.cmdoption/0.2.0/de.tototec.cmdoption-0.2.0.pom
[windows-jdk10-m3.5.x_build] [INFO] Downloaded from central: https://repo.maven.apache.org/maven2/de/tototec/de.tototec.cmdoption/0.2.0/de.tototec.cmdoption-0.2.0.pom (956 B at 74 kB/s)
[windows-jdk10-m3.5.x_build] [INFO] Downloading from central: https://repo.maven.apache.org/maven2/com/google/code/findbugs/jsr305/2.0.0/jsr305-2.0.0.jar
[windows-jdk10-m3.5.x_build] [INFO] Downloading from central: https://repo.maven.apache.org/maven2/org/semver/api/0.9.33/api-0.9.33.jar
[windows-jdk10-m3.5.x_build] [INFO] Downloading from central: https://repo.maven.apache.org/maven2/org/ow2/asm/asm/5.0.3/asm-5.0.3.jar
[windows-jdk10-m3.5.x_build] [INFO] Downloading from central: https://repo.maven.apache.org/maven2/org/ow2/asm/asm-commons/5.0.3/asm-commons-5.0.3.jar
[windows-jdk10-m3.5.x_build] [INFO] Downloading from central: https://repo.maven.apache.org/maven2/org/ow2/asm/asm-tree/5.0.3/asm-tree-5.0.3.jar
[windows-jdk10-m3.5.x_build] [INFO] Downloaded from central: https://repo.maven.apache.org/maven2/org/semver/api/0.9.33/api-0.9.33.jar (64 kB at 1.6 MB/s)
[windows-jdk10-m3.5.x_build] [INFO] Downloading from central: https://repo.maven.apache.org/maven2/commons-lang/commons-lang/1.0/commons-lang-1.0.jar
[windows-jdk10-m3.5.x_build] [INFO] Downloaded from central: https://repo.maven.apache.org/maven2/commons-lang/commons-lang/1.0/commons-lang-1.0.jar (64 kB at 840 kB/s)
[windows-jdk10-m3.5.x_build] [INFO] Downloading from central: https://repo.maven.apache.org/maven2/de/tototec/de.tototec.cmdoption/0.2.0/de.tototec.cmdoption-0.2.0.jar
[windows-jdk10-m3.5.x_build] [INFO] Downloaded from central: https://repo.maven.apache.org/maven2/org/ow2/asm/asm/5.0.3/asm-5.0.3.jar (53 kB at 234 kB/s)
[windows-jdk10-m3.5.x_build] [INFO] Downloaded from central: https://repo.maven.apache.org/maven2/org/ow2/asm/asm-tree/5.0.3/asm-tree-5.0.3.jar (29 kB at 90 kB/s)
[windows-jdk10-m3.5.x_build] [INFO] Downloaded from central: https://repo.maven.apache.org/maven2/org/ow2/asm/asm-commons/5.0.3/asm-commons-5.0.3.jar (42 kB at 128 kB/s)
[windows-jdk10-m3.5.x_build] [INFO] Downloaded from central: https://repo.maven.apache.org/maven2/com/google/code/findbugs/jsr305/2.0.0/jsr305-2.0.0.jar (32 kB at 86 kB/s)
[windows-jdk10-m3.5.x_build] [INFO] Downloaded from central: https://repo.maven.apache.org/maven2/de/tototec/de.tototec.cmdoption/0.2.0/de.tototec.cmdoption-0.2.0.jar (42 kB at 110 kB/s)
[windows-jdk10-m3.5.x_build] [INFO]
[windows-jdk10-m3.5.x_build] [INFO] --- maven-clean-plugin:3.1.0:clean (default-clean) @ maven-release-semver-policy ---
[windows-jdk10-m3.5.x_build] [INFO]
[windows-jdk10-m3.5.x_build] [INFO] --- maven-enforcer-plugin:1.4.1:enforce (enforce-maven-version) @ maven-release-semver-policy ---
[windows-jdk10-m3.5.x_build] [INFO]
[windows-jdk10-m3.5.x_build] [INFO] --- maven-enforcer-plugin:1.4.1:enforce (enforce-bytecode-version) @ maven-release-semver-policy ---
[windows-jdk10-m3.5.x_build] [INFO]
[windows-jdk10-m3.5.x_build] [INFO] --- maven-enforcer-plugin:1.4.1:enforce (ban-known-bad-maven-versions) @ maven-release-semver-policy ---
[windows-jdk10-m3.5.x_build] [INFO]
[windows-jdk10-m3.5.x_build] [INFO] --- apache-rat-plugin:0.12:check (rat-check) @ maven-release-semver-policy ---
[windows-jdk10-m3.5.x_build] [INFO] Enabled default license matchers.
[windows-jdk10-m3.5.x_build] [INFO] Will parse SCM ignores for exclusions...
[windows-jdk10-m3.5.x_build] [INFO] Finished adding exclusions from SCM ignore files.
[windows-jdk10-m3.5.x_build] [INFO] 61 implicit excludes (use -debug for more details).
[windows-jdk10-m3.5.x_build] [INFO] Exclude: .repository
[windows-jdk10-m3.5.x_build] [INFO] Exclude: Jenkinsfile
[windows-jdk10-m3.5.x_build] [INFO] Exclude: .repository/**
[windows-jdk10-m3.5.x_build] [INFO] Exclude: .maven/spy.log
[windows-jdk10-m3.5.x_build] [INFO] Exclude: dependency-reduced-pom.xml
[windows-jdk10-m3.5.x_build] [INFO] Exclude: .java-version
[windows-jdk10-m3.5.x_build] [INFO] 3 resources included (use -debug for more details)
[windows-jdk10-m3.5.x_build] [INFO] Rat check: Summary over all files. Unapproved: 0, unknown: 0, generated: 0, approved: 3 licenses.
[windows-jdk10-m3.5.x_build] [INFO]
[windows-jdk10-m3.5.x_build] [INFO] --- maven-remote-resources-plugin:1.5:process (process-resource-bundles) @ maven-release-semver-policy ---
[windows-jdk10-m3.5.x_build] [INFO]
[windows-jdk10-m3.5.x_build] [INFO] --- maven-resources-plugin:3.1.0:resources (default-resources) @ maven-release-semver-policy ---
[windows-jdk10-m3.5.x_build] [INFO] Using 'UTF-8' encoding to copy filtered resources.
[windows-jdk10-m3.5.x_build] [INFO] skip non existing resourceDirectory F:\jenkins\jenkins-slave\workspace\x_maven-release_IMPROVE_POM-KZP6VA3ZSGGYNTVVOCGLUBHYECJZQ34VIS6H2U5HNYVKLJFCFQKQ\windows-jdk10-m3.5.x_build\maven-release-policies\maven-release-semver-policy\src\main\resources
[windows-jdk10-m3.5.x_build] [INFO] Copying 3 resources
[windows-jdk10-m3.5.x_build] [INFO]
[windows-jdk10-m3.5.x_build] [INFO] --- maven-compiler-plugin:3.7.0:compile (default-compile) @ maven-release-semver-policy ---
[windows-jdk10-m3.5.x_build] [INFO] Changes detected - recompiling the module!
[windows-jdk10-m3.5.x_build] [INFO] Compiling 1 source file to F:\jenkins\jenkins-slave\workspace\x_maven-release_IMPROVE_POM-KZP6VA3ZSGGYNTVVOCGLUBHYECJZQ34VIS6H2U5HNYVKLJFCFQKQ\windows-jdk10-m3.5.x_build\maven-release-policies\maven-release-semver-policy\target\classes
[windows-jdk10-m3.5.x_build] [INFO]
[windows-jdk10-m3.5.x_build] [INFO] --- plexus-component-metadata:1.7.1:generate-metadata (process-classes) @ maven-release-semver-policy ---
[windows-jdk10-m3.5.x_build] [INFO] Discovered 1 component descriptors(s)
[windows-jdk10-m3.5.x_build] [INFO]
[windows-jdk10-m3.5.x_build] [INFO] --- maven-resources-plugin:3.1.0:testResources (default-testResources) @ maven-release-semver-policy ---
[windows-jdk10-m3.5.x_build] [INFO] Using 'UTF-8' encoding to copy filtered resources.
[windows-jdk10-m3.5.x_build] [INFO] skip non existing resourceDirectory F:\jenkins\jenkins-slave\workspace\x_maven-release_IMPROVE_POM-KZP6VA3ZSGGYNTVVOCGLUBHYECJZQ34VIS6H2U5HNYVKLJFCFQKQ\windows-jdk10-m3.5.x_build\maven-release-policies\maven-release-semver-policy\src\test\resources
[windows-jdk10-m3.5.x_build] [INFO] Copying 3 resources
[windows-jdk10-m3.5.x_build] [INFO]
[windows-jdk10-m3.5.x_build] [INFO] --- maven-compiler-plugin:3.7.0:testCompile (default-testCompile) @ maven-release-semver-policy ---
[windows-jdk10-m3.5.x_build] [INFO] Changes detected - recompiling the module!
[windows-jdk10-m3.5.x_build] [INFO] Compiling 1 source file to F:\jenkins\jenkins-slave\workspace\x_maven-release_IMPROVE_POM-KZP6VA3ZSGGYNTVVOCGLUBHYECJZQ34VIS6H2U5HNYVKLJFCFQKQ\windows-jdk10-m3.5.x_build\maven-release-policies\maven-release-semver-policy\target\test-classes
[windows-jdk10-m3.5.x_build] [INFO]
[windows-jdk10-m3.5.x_build] [INFO] --- maven-surefire-plugin:2.22.0:test (default-test) @ maven-release-semver-policy ---
[windows-jdk10-m3.5.x_build] [INFO]
[windows-jdk10-m3.5.x_build] [INFO] -------------------------------------------------------
[windows-jdk10-m3.5.x_build] [INFO]  T E S T S
[windows-jdk10-m3.5.x_build] [INFO] -------------------------------------------------------
[windows-jdk10-m3.5.x_build] [INFO] Running org.apache.maven.shared.release.policy.semver.SemVerVersionPolicyTest
[windows-jdk10-m3.5.x_build] [INFO] Tests run: 2, Failures: 0, Errors: 0, Skipped: 0, Time elapsed: 0.121 s - in org.apache.maven.shared.release.policy.semver.SemVerVersionPolicyTest
[windows-jdk10-m3.5.x_build] [INFO]
[windows-jdk10-m3.5.x_build] [INFO] Results:
[windows-jdk10-m3.5.x_build] [INFO]
[windows-jdk10-m3.5.x_build] [INFO] Tests run: 2, Failures: 0, Errors: 0, Skipped: 0
[windows-jdk10-m3.5.x_build] [INFO]
[windows-jdk10-m3.5.x_build] [INFO]
[windows-jdk10-m3.5.x_build] [INFO] --- maven-jar-plugin:3.1.0:jar (default-jar) @ maven-release-semver-policy ---
[windows-jdk10-m3.5.x_build] [INFO] Building jar: F:\jenkins\jenkins-slave\workspace\x_maven-release_IMPROVE_POM-KZP6VA3ZSGGYNTVVOCGLUBHYECJZQ34VIS6H2U5HNYVKLJFCFQKQ\windows-jdk10-m3.5.x_build\maven-release-policies\maven-release-semver-policy\target\maven-release-semver-policy-3.0.0-SNAPSHOT.jar
[windows-jdk10-m3.5.x_build] [INFO]
[windows-jdk10-m3.5.x_build] [INFO] --- maven-site-plugin:3.7.1:attach-descriptor (attach-descriptor) @ maven-release-semver-policy ---
[windows-jdk10-m3.5.x_build] [INFO] Skipping because packaging 'jar' is not pom.
[windows-jdk10-m3.5.x_build] [INFO]
[windows-jdk10-m3.5.x_build] [INFO] --- maven-checkstyle-plugin:3.0.0:check (checkstyle-check) @ maven-release-semver-policy ---
[windows-jdk10-m3.5.x_build] [INFO] ------------------------------------------------------------------------
[windows-jdk10-m3.5.x_build] [INFO] Reactor Summary:
[windows-jdk10-m3.5.x_build] [INFO]
[windows-jdk10-m3.5.x_build] [INFO] Maven Release ...................................... SUCCESS [ 56.047 s]
[windows-jdk10-m3.5.x_build] [INFO] Maven Release APIs ................................. SUCCESS [ 11.949 s]
[windows-jdk10-m3.5.x_build] [INFO] Maven Release Manager .............................. SUCCESS [02:44 min]
[windows-jdk10-m3.5.x_build] [INFO] Maven Release Plugin ............................... SUCCESS [09:14 min]
[windows-jdk10-m3.5.x_build] [INFO] Maven Release Odd-Even Policy ...................... SUCCESS [  2.861 s]
[windows-jdk10-m3.5.x_build] [INFO] Maven Release SemVer Policy ........................ SUCCESS [  4.348 s]
[windows-jdk10-m3.5.x_build] [INFO] ------------------------------------------------------------------------
[windows-jdk10-m3.5.x_build] [INFO] BUILD SUCCESS
[windows-jdk10-m3.5.x_build] [INFO] ------------------------------------------------------------------------
[windows-jdk10-m3.5.x_build] [INFO] Total time: 13:17 min
[windows-jdk10-m3.5.x_build] [INFO] Finished at: 2018-09-13T11:40:01-07:00
[windows-jdk10-m3.5.x_build] [INFO] Final Memory: 54M/184M
[windows-jdk10-m3.5.x_build] [INFO] ------------------------------------------------------------------------
[windows-jdk10-m3.5.x_build] [INFO] [jenkins-event-spy] Generated F:\jenkins\jenkins-slave\workspace\x_maven-release_IMPROVE_POM-KZP6VA3ZSGGYNTVVOCGLUBHYECJZQ34VIS6H2U5HNYVKLJFCFQKQ@tmp\withMavend223afcf\maven-spy-20180913-112642-9797465609509467694141.log
[Pipeline] [windows-jdk10-m3.5.x_build] }
[Pipeline] [windows-jdk10-m3.5.x_build] // dir
[Pipeline] [windows-jdk10-m3.5.x_build] }
[windows-jdk10-m3.5.x_build] [withMaven] artifactsPublisher - Archive artifact windows-jdk10-m3.5.x_build\pom.xml under org\apache\maven\release\maven-release\3.0.0-SNAPSHOT\maven-release-3.0.0-SNAPSHOT.pom
[windows-jdk10-m3.5.x_build] [withMaven] artifactsPublisher - Archive artifact windows-jdk10-m3.5.x_build\target\maven-release-3.0.0-SNAPSHOT-site.xml under org\apache\maven\release\maven-release\3.0.0-SNAPSHOT\maven-release-3.0.0-SNAPSHOT-site.xml
[windows-jdk10-m3.5.x_build] [withMaven] artifactsPublisher - Archive artifact windows-jdk10-m3.5.x_build\maven-release-api\pom.xml under org\apache\maven\release\maven-release-api\3.0.0-SNAPSHOT\maven-release-api-3.0.0-SNAPSHOT.pom
[windows-jdk10-m3.5.x_build] [withMaven] artifactsPublisher - Archive artifact windows-jdk10-m3.5.x_build\maven-release-api\target\maven-release-api-3.0.0-SNAPSHOT.jar under org\apache\maven\release\maven-release-api\3.0.0-SNAPSHOT\maven-release-api-3.0.0-SNAPSHOT.jar
[windows-jdk10-m3.5.x_build] [withMaven] artifactsPublisher - Archive artifact windows-jdk10-m3.5.x_build\maven-release-manager\pom.xml under org\apache\maven\release\maven-release-manager\3.0.0-SNAPSHOT\maven-release-manager-3.0.0-SNAPSHOT.pom
[windows-jdk10-m3.5.x_build] [withMaven] artifactsPublisher - Archive artifact windows-jdk10-m3.5.x_build\maven-release-manager\target\maven-release-manager-3.0.0-SNAPSHOT.jar under org\apache\maven\release\maven-release-manager\3.0.0-SNAPSHOT\maven-release-manager-3.0.0-SNAPSHOT.jar
[windows-jdk10-m3.5.x_build] [withMaven] artifactsPublisher - Archive artifact windows-jdk10-m3.5.x_build\maven-release-plugin\pom.xml under org\apache\maven\plugins\maven-release-plugin\3.0.0-SNAPSHOT\maven-release-plugin-3.0.0-SNAPSHOT.pom
[windows-jdk10-m3.5.x_build] [withMaven] artifactsPublisher - Archive artifact windows-jdk10-m3.5.x_build\maven-release-plugin\target\maven-release-plugin-3.0.0-SNAPSHOT.jar under org\apache\maven\plugins\maven-release-plugin\3.0.0-SNAPSHOT\maven-release-plugin-3.0.0-SNAPSHOT.jar
[windows-jdk10-m3.5.x_build] [withMaven] artifactsPublisher - Archive artifact windows-jdk10-m3.5.x_build\maven-release-policies\maven-release-oddeven-policy\pom.xml under org\apache\maven\release\maven-release-oddeven-policy\3.0.0-SNAPSHOT\maven-release-oddeven-policy-3.0.0-SNAPSHOT.pom
[windows-jdk10-m3.5.x_build] [withMaven] artifactsPublisher - Archive artifact windows-jdk10-m3.5.x_build\maven-release-policies\maven-release-oddeven-policy\target\maven-release-oddeven-policy-3.0.0-SNAPSHOT.jar under org\apache\maven\release\maven-release-oddeven-policy\3.0.0-SNAPSHOT\maven-release-oddeven-policy-3.0.0-SNAPSHOT.jar
[windows-jdk10-m3.5.x_build] [withMaven] artifactsPublisher - Archive artifact windows-jdk10-m3.5.x_build\maven-release-policies\maven-release-semver-policy\pom.xml under org\apache\maven\release\maven-release-semver-policy\3.0.0-SNAPSHOT\maven-release-semver-policy-3.0.0-SNAPSHOT.pom
[windows-jdk10-m3.5.x_build] [withMaven] artifactsPublisher - Archive artifact windows-jdk10-m3.5.x_build\maven-release-policies\maven-release-semver-policy\target\maven-release-semver-policy-3.0.0-SNAPSHOT.jar under org\apache\maven\release\maven-release-semver-policy\3.0.0-SNAPSHOT\maven-release-semver-policy-3.0.0-SNAPSHOT.jar
[windows-jdk10-m3.5.x_build] [Fast Archiver] No prior successful build to compare, so performing full copy of artifacts
[windows-jdk10-m3.5.x_build] [withMaven] invokerPublisher - Archive invoker results for Maven artifact MavenArtifact{org.apache.maven.plugins:maven-release-plugin::3.0.0-SNAPSHOT(version: 3.0.0-SNAPSHOT, snapshot:false) } generated by PluginInvocation{org.apache.maven.plugins:maven-invoker-plugin:3.0.1@run  integration-test-prepare}: windows-jdk10-m3.5.x_build\maven-release-plugin\target\invoker-reports\*.xml
[windows-jdk10-m3.5.x_build] performing MavenInvokerRecorder, reportsFilenamePattern:'**/windows-jdk10-m3.5.x_build\maven-release-plugin\target\invoker-reports/BUILD*.xml', invokerBuildDir:'**/windows-jdk10-m3.5.x_build\maven-release-plugin\target\it'
[windows-jdk10-m3.5.x_build] Found reports:[f:\jenkins\jenkins-slave\workspace\x_maven-release_IMPROVE_POM-KZP6VA3ZSGGYNTVVOCGLUBHYECJZQ34VIS6H2U5HNYVKLJFCFQKQ\windows-jdk10-m3.5.x_build\maven-release-plugin\target\invoker-reports\BUILD-projects_update-versions_MRELEASE-555.xml, f:\jenkins\jenkins-slave\workspace\x_maven-release_IMPROVE_POM-KZP6VA3ZSGGYNTVVOCGLUBHYECJZQ34VIS6H2U5HNYVKLJFCFQKQ\windows-jdk10-m3.5.x_build\maven-release-plugin\target\invoker-reports\BUILD-projects_update-versions_MRELEASE-611.xml, f:\jenkins\jenkins-slave\workspace\x_maven-release_IMPROVE_POM-KZP6VA3ZSGGYNTVVOCGLUBHYECJZQ34VIS6H2U5HNYVKLJFCFQKQ\windows-jdk10-m3.5.x_build\maven-release-plugin\target\invoker-reports\BUILD-projects_update-versions_MRELEASE-783.xml, f:\jenkins\jenkins-slave\workspace\x_maven-release_IMPROVE_POM-KZP6VA3ZSGGYNTVVOCGLUBHYECJZQ34VIS6H2U5HNYVKLJFCFQKQ\windows-jdk10-m3.5.x_build\maven-release-plugin\target\invoker-reports\BUILD-projects_update-versions_MRELEASE-976.xml]
[windows-jdk10-m3.5.x_build] Found logs:[f:\jenkins\jenkins-slave\workspace\x_maven-release_IMPROVE_POM-KZP6VA3ZSGGYNTVVOCGLUBHYECJZQ34VIS6H2U5HNYVKLJFCFQKQ\windows-jdk10-m3.5.x_build\maven-release-plugin\target\it\projects\update-versions\MRELEASE-555\build.log, f:\jenkins\jenkins-slave\workspace\x_maven-release_IMPROVE_POM-KZP6VA3ZSGGYNTVVOCGLUBHYECJZQ34VIS6H2U5HNYVKLJFCFQKQ\windows-jdk10-m3.5.x_build\maven-release-plugin\target\it\projects\update-versions\MRELEASE-611\build.log, f:\jenkins\jenkins-slave\workspace\x_maven-release_IMPROVE_POM-KZP6VA3ZSGGYNTVVOCGLUBHYECJZQ34VIS6H2U5HNYVKLJFCFQKQ\windows-jdk10-m3.5.x_build\maven-release-plugin\target\it\projects\update-versions\MRELEASE-783\build.log, f:\jenkins\jenkins-slave\workspace\x_maven-release_IMPROVE_POM-KZP6VA3ZSGGYNTVVOCGLUBHYECJZQ34VIS6H2U5HNYVKLJFCFQKQ\windows-jdk10-m3.5.x_build\maven-release-plugin\target\it\projects\update-versions\MRELEASE-976\build.log]
[windows-jdk10-m3.5.x_build] Finished parsing Maven Invoker results (found 4)
[windows-jdk10-m3.5.x_build] [withMaven] invokerPublisher - Archive invoker results for Maven artifact MavenArtifact{org.apache.maven.plugins:maven-release-plugin::3.0.0-SNAPSHOT(version: 3.0.0-SNAPSHOT, snapshot:false) } generated by PluginInvocation{org.apache.maven.plugins:maven-invoker-plugin:3.0.1@run  integration-test-prepare-with-pom}: windows-jdk10-m3.5.x_build\maven-release-plugin\target\invoker-reports\*.xml
[windows-jdk10-m3.5.x_build] performing MavenInvokerRecorder, reportsFilenamePattern:'**/windows-jdk10-m3.5.x_build\maven-release-plugin\target\invoker-reports/BUILD*.xml', invokerBuildDir:'**/windows-jdk10-m3.5.x_build\maven-release-plugin\target\it'
[windows-jdk10-m3.5.x_build] Found reports:[f:\jenkins\jenkins-slave\workspace\x_maven-release_IMPROVE_POM-KZP6VA3ZSGGYNTVVOCGLUBHYECJZQ34VIS6H2U5HNYVKLJFCFQKQ\windows-jdk10-m3.5.x_build\maven-release-plugin\target\invoker-reports\BUILD-projects_update-versions_MRELEASE-555.xml, f:\jenkins\jenkins-slave\workspace\x_maven-release_IMPROVE_POM-KZP6VA3ZSGGYNTVVOCGLUBHYECJZQ34VIS6H2U5HNYVKLJFCFQKQ\windows-jdk10-m3.5.x_build\maven-release-plugin\target\invoker-reports\BUILD-projects_update-versions_MRELEASE-611.xml, f:\jenkins\jenkins-slave\workspace\x_maven-release_IMPROVE_POM-KZP6VA3ZSGGYNTVVOCGLUBHYECJZQ34VIS6H2U5HNYVKLJFCFQKQ\windows-jdk10-m3.5.x_build\maven-release-plugin\target\invoker-reports\BUILD-projects_update-versions_MRELEASE-783.xml, f:\jenkins\jenkins-slave\workspace\x_maven-release_IMPROVE_POM-KZP6VA3ZSGGYNTVVOCGLUBHYECJZQ34VIS6H2U5HNYVKLJFCFQKQ\windows-jdk10-m3.5.x_build\maven-release-plugin\target\invoker-reports\BUILD-projects_update-versions_MRELEASE-976.xml]
[windows-jdk10-m3.5.x_build] Found logs:[f:\jenkins\jenkins-slave\workspace\x_maven-release_IMPROVE_POM-KZP6VA3ZSGGYNTVVOCGLUBHYECJZQ34VIS6H2U5HNYVKLJFCFQKQ\windows-jdk10-m3.5.x_build\maven-release-plugin\target\it\projects\update-versions\MRELEASE-555\build.log, f:\jenkins\jenkins-slave\workspace\x_maven-release_IMPROVE_POM-KZP6VA3ZSGGYNTVVOCGLUBHYECJZQ34VIS6H2U5HNYVKLJFCFQKQ\windows-jdk10-m3.5.x_build\maven-release-plugin\target\it\projects\update-versions\MRELEASE-611\build.log, f:\jenkins\jenkins-slave\workspace\x_maven-release_IMPROVE_POM-KZP6VA3ZSGGYNTVVOCGLUBHYECJZQ34VIS6H2U5HNYVKLJFCFQKQ\windows-jdk10-m3.5.x_build\maven-release-plugin\target\it\projects\update-versions\MRELEASE-783\build.log, f:\jenkins\jenkins-slave\workspace\x_maven-release_IMPROVE_POM-KZP6VA3ZSGGYNTVVOCGLUBHYECJZQ34VIS6H2U5HNYVKLJFCFQKQ\windows-jdk10-m3.5.x_build\maven-release-plugin\target\it\projects\update-versions\MRELEASE-976\build.log]
[windows-jdk10-m3.5.x_build] Finished parsing Maven Invoker results (found 4)
[windows-jdk10-m3.5.x_build] [withMaven] invokerPublisher - Archive invoker results for Maven artifact MavenArtifact{org.apache.maven.plugins:maven-release-plugin::3.0.0-SNAPSHOT(version: 3.0.0-SNAPSHOT, snapshot:false) } generated by PluginInvocation{org.apache.maven.plugins:maven-invoker-plugin:3.0.1@run  integration-test-branch}: windows-jdk10-m3.5.x_build\maven-release-plugin\target\invoker-reports\*.xml
[windows-jdk10-m3.5.x_build] performing MavenInvokerRecorder, reportsFilenamePattern:'**/windows-jdk10-m3.5.x_build\maven-release-plugin\target\invoker-reports/BUILD*.xml', invokerBuildDir:'**/windows-jdk10-m3.5.x_build\maven-release-plugin\target\it'
[windows-jdk10-m3.5.x_build] Found reports:[f:\jenkins\jenkins-slave\workspace\x_maven-release_IMPROVE_POM-KZP6VA3ZSGGYNTVVOCGLUBHYECJZQ34VIS6H2U5HNYVKLJFCFQKQ\windows-jdk10-m3.5.x_build\maven-release-plugin\target\invoker-reports\BUILD-projects_update-versions_MRELEASE-555.xml, f:\jenkins\jenkins-slave\workspace\x_maven-release_IMPROVE_POM-KZP6VA3ZSGGYNTVVOCGLUBHYECJZQ34VIS6H2U5HNYVKLJFCFQKQ\windows-jdk10-m3.5.x_build\maven-release-plugin\target\invoker-reports\BUILD-projects_update-versions_MRELEASE-611.xml, f:\jenkins\jenkins-slave\workspace\x_maven-release_IMPROVE_POM-KZP6VA3ZSGGYNTVVOCGLUBHYECJZQ34VIS6H2U5HNYVKLJFCFQKQ\windows-jdk10-m3.5.x_build\maven-release-plugin\target\invoker-reports\BUILD-projects_update-versions_MRELEASE-783.xml, f:\jenkins\jenkins-slave\workspace\x_maven-release_IMPROVE_POM-KZP6VA3ZSGGYNTVVOCGLUBHYECJZQ34VIS6H2U5HNYVKLJFCFQKQ\windows-jdk10-m3.5.x_build\maven-release-plugin\target\invoker-reports\BUILD-projects_update-versions_MRELEASE-976.xml]
[windows-jdk10-m3.5.x_build] Found logs:[f:\jenkins\jenkins-slave\workspace\x_maven-release_IMPROVE_POM-KZP6VA3ZSGGYNTVVOCGLUBHYECJZQ34VIS6H2U5HNYVKLJFCFQKQ\windows-jdk10-m3.5.x_build\maven-release-plugin\target\it\projects\update-versions\MRELEASE-555\build.log, f:\jenkins\jenkins-slave\workspace\x_maven-release_IMPROVE_POM-KZP6VA3ZSGGYNTVVOCGLUBHYECJZQ34VIS6H2U5HNYVKLJFCFQKQ\windows-jdk10-m3.5.x_build\maven-release-plugin\target\it\projects\update-versions\MRELEASE-611\build.log, f:\jenkins\jenkins-slave\workspace\x_maven-release_IMPROVE_POM-KZP6VA3ZSGGYNTVVOCGLUBHYECJZQ34VIS6H2U5HNYVKLJFCFQKQ\windows-jdk10-m3.5.x_build\maven-release-plugin\target\it\projects\update-versions\MRELEASE-783\build.log, f:\jenkins\jenkins-slave\workspace\x_maven-release_IMPROVE_POM-KZP6VA3ZSGGYNTVVOCGLUBHYECJZQ34VIS6H2U5HNYVKLJFCFQKQ\windows-jdk10-m3.5.x_build\maven-release-plugin\target\it\projects\update-versions\MRELEASE-976\build.log]
[windows-jdk10-m3.5.x_build] Finished parsing Maven Invoker results (found 4)
[windows-jdk10-m3.5.x_build] [withMaven] invokerPublisher - Archive invoker results for Maven artifact MavenArtifact{org.apache.maven.plugins:maven-release-plugin::3.0.0-SNAPSHOT(version: 3.0.0-SNAPSHOT, snapshot:false) } generated by PluginInvocation{org.apache.maven.plugins:maven-invoker-plugin:3.0.1@run  integration-test-perform}: windows-jdk10-m3.5.x_build\maven-release-plugin\target\invoker-reports\*.xml
[windows-jdk10-m3.5.x_build] performing MavenInvokerRecorder, reportsFilenamePattern:'**/windows-jdk10-m3.5.x_build\maven-release-plugin\target\invoker-reports/BUILD*.xml', invokerBuildDir:'**/windows-jdk10-m3.5.x_build\maven-release-plugin\target\it'
[windows-jdk10-m3.5.x_build] Found reports:[f:\jenkins\jenkins-slave\workspace\x_maven-release_IMPROVE_POM-KZP6VA3ZSGGYNTVVOCGLUBHYECJZQ34VIS6H2U5HNYVKLJFCFQKQ\windows-jdk10-m3.5.x_build\maven-release-plugin\target\invoker-reports\BUILD-projects_update-versions_MRELEASE-555.xml, f:\jenkins\jenkins-slave\workspace\x_maven-release_IMPROVE_POM-KZP6VA3ZSGGYNTVVOCGLUBHYECJZQ34VIS6H2U5HNYVKLJFCFQKQ\windows-jdk10-m3.5.x_build\maven-release-plugin\target\invoker-reports\BUILD-projects_update-versions_MRELEASE-611.xml, f:\jenkins\jenkins-slave\workspace\x_maven-release_IMPROVE_POM-KZP6VA3ZSGGYNTVVOCGLUBHYECJZQ34VIS6H2U5HNYVKLJFCFQKQ\windows-jdk10-m3.5.x_build\maven-release-plugin\target\invoker-reports\BUILD-projects_update-versions_MRELEASE-783.xml, f:\jenkins\jenkins-slave\workspace\x_maven-release_IMPROVE_POM-KZP6VA3ZSGGYNTVVOCGLUBHYECJZQ34VIS6H2U5HNYVKLJFCFQKQ\windows-jdk10-m3.5.x_build\maven-release-plugin\target\invoker-reports\BUILD-projects_update-versions_MRELEASE-976.xml]
[windows-jdk10-m3.5.x_build] Found logs:[f:\jenkins\jenkins-slave\workspace\x_maven-release_IMPROVE_POM-KZP6VA3ZSGGYNTVVOCGLUBHYECJZQ34VIS6H2U5HNYVKLJFCFQKQ\windows-jdk10-m3.5.x_build\maven-release-plugin\target\it\projects\update-versions\MRELEASE-555\build.log, f:\jenkins\jenkins-slave\workspace\x_maven-release_IMPROVE_POM-KZP6VA3ZSGGYNTVVOCGLUBHYECJZQ34VIS6H2U5HNYVKLJFCFQKQ\windows-jdk10-m3.5.x_build\maven-release-plugin\target\it\projects\update-versions\MRELEASE-611\build.log, f:\jenkins\jenkins-slave\workspace\x_maven-release_IMPROVE_POM-KZP6VA3ZSGGYNTVVOCGLUBHYECJZQ34VIS6H2U5HNYVKLJFCFQKQ\windows-jdk10-m3.5.x_build\maven-release-plugin\target\it\projects\update-versions\MRELEASE-783\build.log, f:\jenkins\jenkins-slave\workspace\x_maven-release_IMPROVE_POM-KZP6VA3ZSGGYNTVVOCGLUBHYECJZQ34VIS6H2U5HNYVKLJFCFQKQ\windows-jdk10-m3.5.x_build\maven-release-plugin\target\it\projects\update-versions\MRELEASE-976\build.log]
[windows-jdk10-m3.5.x_build] Finished parsing Maven Invoker results (found 4)
[windows-jdk10-m3.5.x_build] [withMaven] invokerPublisher - Archive invoker results for Maven artifact MavenArtifact{org.apache.maven.plugins:maven-release-plugin::3.0.0-SNAPSHOT(version: 3.0.0-SNAPSHOT, snapshot:false) } generated by PluginInvocation{org.apache.maven.plugins:maven-invoker-plugin:3.0.1@run  integration-test-update-versions}: windows-jdk10-m3.5.x_build\maven-release-plugin\target\invoker-reports\*.xml
[windows-jdk10-m3.5.x_build] performing MavenInvokerRecorder, reportsFilenamePattern:'**/windows-jdk10-m3.5.x_build\maven-release-plugin\target\invoker-reports/BUILD*.xml', invokerBuildDir:'**/windows-jdk10-m3.5.x_build\maven-release-plugin\target\it'
[windows-jdk10-m3.5.x_build] Found reports:[f:\jenkins\jenkins-slave\workspace\x_maven-release_IMPROVE_POM-KZP6VA3ZSGGYNTVVOCGLUBHYECJZQ34VIS6H2U5HNYVKLJFCFQKQ\windows-jdk10-m3.5.x_build\maven-release-plugin\target\invoker-reports\BUILD-projects_update-versions_MRELEASE-555.xml, f:\jenkins\jenkins-slave\workspace\x_maven-release_IMPROVE_POM-KZP6VA3ZSGGYNTVVOCGLUBHYECJZQ34VIS6H2U5HNYVKLJFCFQKQ\windows-jdk10-m3.5.x_build\maven-release-plugin\target\invoker-reports\BUILD-projects_update-versions_MRELEASE-611.xml, f:\jenkins\jenkins-slave\workspace\x_maven-release_IMPROVE_POM-KZP6VA3ZSGGYNTVVOCGLUBHYECJZQ34VIS6H2U5HNYVKLJFCFQKQ\windows-jdk10-m3.5.x_build\maven-release-plugin\target\invoker-reports\BUILD-projects_update-versions_MRELEASE-783.xml, f:\jenkins\jenkins-slave\workspace\x_maven-release_IMPROVE_POM-KZP6VA3ZSGGYNTVVOCGLUBHYECJZQ34VIS6H2U5HNYVKLJFCFQKQ\windows-jdk10-m3.5.x_build\maven-release-plugin\target\invoker-reports\BUILD-projects_update-versions_MRELEASE-976.xml]
[windows-jdk10-m3.5.x_build] Found logs:[f:\jenkins\jenkins-slave\workspace\x_maven-release_IMPROVE_POM-KZP6VA3ZSGGYNTVVOCGLUBHYECJZQ34VIS6H2U5HNYVKLJFCFQKQ\windows-jdk10-m3.5.x_build\maven-release-plugin\target\it\projects\update-versions\MRELEASE-555\build.log, f:\jenkins\jenkins-slave\workspace\x_maven-release_IMPROVE_POM-KZP6VA3ZSGGYNTVVOCGLUBHYECJZQ34VIS6H2U5HNYVKLJFCFQKQ\windows-jdk10-m3.5.x_build\maven-release-plugin\target\it\projects\update-versions\MRELEASE-611\build.log, f:\jenkins\jenkins-slave\workspace\x_maven-release_IMPROVE_POM-KZP6VA3ZSGGYNTVVOCGLUBHYECJZQ34VIS6H2U5HNYVKLJFCFQKQ\windows-jdk10-m3.5.x_build\maven-release-plugin\target\it\projects\update-versions\MRELEASE-783\build.log, f:\jenkins\jenkins-slave\workspace\x_maven-release_IMPROVE_POM-KZP6VA3ZSGGYNTVVOCGLUBHYECJZQ34VIS6H2U5HNYVKLJFCFQKQ\windows-jdk10-m3.5.x_build\maven-release-plugin\target\it\projects\update-versions\MRELEASE-976\build.log]
[windows-jdk10-m3.5.x_build] Finished parsing Maven Invoker results (found 4)
[windows-jdk10-m3.5.x_build] [withMaven] junitPublisher - Archive test results for Maven artifact org.apache.maven.release:maven-release-api:3.0.0-SNAPSHOT generated by maven-surefire-plugin:test (default-test): windows-jdk10-m3.5.x_build\maven-release-api\target\surefire-reports\*.xml
[windows-jdk10-m3.5.x_build] Recording test results
[windows-jdk10-m3.5.x_build] None of the test reports contained any result
[windows-jdk10-m3.5.x_build] [withMaven] junitPublisher - Archive test results for Maven artifact org.apache.maven.release:maven-release-manager:3.0.0-SNAPSHOT generated by maven-surefire-plugin:test (default-test): windows-jdk10-m3.5.x_build\maven-release-manager\target\surefire-reports\*.xml
[windows-jdk10-m3.5.x_build] Recording test results
[windows-jdk10-m3.5.x_build] [withMaven] junitPublisher - Archive test results for Maven artifact org.apache.maven.plugins:maven-release-plugin:3.0.0-SNAPSHOT generated by maven-surefire-plugin:test (default-test): windows-jdk10-m3.5.x_build\maven-release-plugin\target\surefire-reports\*.xml
[windows-jdk10-m3.5.x_build] Recording test results
[windows-jdk10-m3.5.x_build] [withMaven] junitPublisher - Archive test results for Maven artifact org.apache.maven.release:maven-release-oddeven-policy:3.0.0-SNAPSHOT generated by maven-surefire-plugin:test (default-test): windows-jdk10-m3.5.x_build\maven-release-policies\maven-release-oddeven-policy\target\surefire-reports\*.xml
[windows-jdk10-m3.5.x_build] Recording test results
[windows-jdk10-m3.5.x_build] [withMaven] junitPublisher - Archive test results for Maven artifact org.apache.maven.release:maven-release-semver-policy:3.0.0-SNAPSHOT generated by maven-surefire-plugin:test (default-test): windows-jdk10-m3.5.x_build\maven-release-policies\maven-release-semver-policy\target\surefire-reports\*.xml
[windows-jdk10-m3.5.x_build] Recording test results
[windows-jdk10-m3.5.x_build] [withMaven] junitPublisher - Archive test results for Maven artifact org.apache.maven.release:maven-release-manager:3.0.0-SNAPSHOT generated by maven-failsafe-plugin:integration-test (default): windows-jdk10-m3.5.x_build\maven-release-manager\target\failsafe-reports\*.xml
[windows-jdk10-m3.5.x_build] Recording test results
[windows-jdk10-m3.5.x_build] [withMaven] openTasksPublisher - Scan Tasks for Maven artifact org.apache.maven.release:maven-release-api:3.0.0-SNAPSHOT in source directory windows-jdk10-m3.5.x_build\maven-release-api\src\main\java
[windows-jdk10-m3.5.x_build] [withMaven] openTasksPublisher - Scan Tasks for Maven artifact org.apache.maven.release:maven-release-manager:3.0.0-SNAPSHOT in source directory windows-jdk10-m3.5.x_build\maven-release-manager\src\main\java
[windows-jdk10-m3.5.x_build] [withMaven] openTasksPublisher - Scan Tasks for Maven artifact org.apache.maven.plugins:maven-release-plugin:3.0.0-SNAPSHOT in source directory windows-jdk10-m3.5.x_build\maven-release-plugin\src\main\java
[windows-jdk10-m3.5.x_build] [withMaven] openTasksPublisher - Scan Tasks for Maven artifact org.apache.maven.release:maven-release-oddeven-policy:3.0.0-SNAPSHOT in source directory windows-jdk10-m3.5.x_build\maven-release-policies\maven-release-oddeven-policy\src\main\java
[windows-jdk10-m3.5.x_build] [withMaven] openTasksPublisher - Scan Tasks for Maven artifact org.apache.maven.release:maven-release-semver-policy:3.0.0-SNAPSHOT in source directory windows-jdk10-m3.5.x_build\maven-release-policies\maven-release-semver-policy\src\main\java
[windows-jdk10-m3.5.x_build] [TASKS] Scanning folder 'f:\jenkins\jenkins-slave\workspace\x_maven-release_IMPROVE_POM-KZP6VA3ZSGGYNTVVOCGLUBHYECJZQ34VIS6H2U5HNYVKLJFCFQKQ' for files matching the pattern 'windows-jdk10-m3.5.x_build\maven-release-api\src\main\java\**\*,windows-jdk10-m3.5.x_build\maven-release-manager\src\main\java\**\*,windows-jdk10-m3.5.x_build\maven-release-plugin\src\main\java\**\*,windows-jdk10-m3.5.x_build\maven-release-policies\maven-release-oddeven-policy\src\main\java\**\*,windows-jdk10-m3.5.x_build\maven-release-policies\maven-release-semver-policy\src\main\java\**\*' - excludes: null
[windows-jdk10-m3.5.x_build] [TASKS] Found 130 files to scan for tasks
[windows-jdk10-m3.5.x_build] [TASKS] Found 21 open tasks.
[windows-jdk10-m3.5.x_build] Skipping warnings blame since pipelines do not have an SCM link.%n
[Pipeline] [windows-jdk10-m3.5.x_build] // withMaven
[Pipeline] [windows-jdk10-m3.5.x_build] cleanWs
[windows-jdk10-m3.5.x_build] [WS-CLEANUP] Deleting project workspace...[WS-CLEANUP] done
[Pipeline] [windows-jdk10-m3.5.x_build] }
[Pipeline] [windows-jdk10-m3.5.x_build] // stage
[Pipeline] [windows-jdk10-m3.5.x_build] }
[Pipeline] [windows-jdk10-m3.5.x_build] // node
[Pipeline] [windows-jdk10-m3.5.x_build] }
[Pipeline] // parallel
[Pipeline] stage
[Pipeline] { (Notifications)
[Pipeline] echo
Build result: FAILURE
[Pipeline] jiraIssueSelector
[Pipeline] emailext
Reply | Threaded
Open this post in threaded view
|

Build failed in Jenkins: Maven TLP » maven-release » IMPROVE_POM #4

Apache Jenkins Server-2
See https://builds.apache.org/job/maven-box/job/maven-release/job/IMPROVE_POM/4/

Changes:

* Exclude H25
* Exclude H31 cause master is failing constantly.
* no need to test anymore with '3.0.x'
* Add Java 11 to defaults
* Try to shorten path for Windows by using tempDir
* Fix arguments
* Add option for temp workspace
* disable tmpWs
* enable tmpWs
* Use def
* Try to shorten wsDir

All tests passed

Build log:
[...truncated 7.53 MB...]
[windows-jdk10-m3.5.x_build] [INFO] Exclude: dependency-reduced-pom.xml
[windows-jdk10-m3.5.x_build] [INFO] Exclude: .java-version
[windows-jdk10-m3.5.x_build] [INFO] 4 resources included (use -debug for more details)
[windows-jdk10-m3.5.x_build] [INFO] Rat check: Summary over all files. Unapproved: 0, unknown: 0, generated: 0, approved: 4 licenses.
[windows-jdk10-m3.5.x_build] [INFO]
[windows-jdk10-m3.5.x_build] [INFO] --- maven-remote-resources-plugin:1.5:process (process-resource-bundles) @ maven-release-oddeven-policy ---
[windows-jdk10-m3.5.x_build] [INFO]
[windows-jdk10-m3.5.x_build] [INFO] --- maven-resources-plugin:3.1.0:resources (default-resources) @ maven-release-oddeven-policy ---
[windows-jdk10-m3.5.x_build] [INFO] Using 'UTF-8' encoding to copy filtered resources.
[windows-jdk10-m3.5.x_build] [INFO] skip non existing resourceDirectory F:\jenkins\jenkins-slave\workspace\x_maven-release_IMPROVE_POM-KZP6VA3ZSGGYNTVVOCGLUBHYECJZQ34VIS6H2U5HNYVKLJFCFQKQ@3@2\windows-jdk10-m3.5.x_build\maven-release-policies\maven-release-oddeven-policy\src\main\resources
[windows-jdk10-m3.5.x_build] [INFO] Copying 3 resources
[windows-jdk10-m3.5.x_build] [INFO]
[windows-jdk10-m3.5.x_build] [INFO] --- maven-compiler-plugin:3.7.0:compile (default-compile) @ maven-release-oddeven-policy ---
[windows-jdk10-m3.5.x_build] [INFO] Changes detected - recompiling the module!
[windows-jdk10-m3.5.x_build] [INFO] Compiling 2 source files to F:\jenkins\jenkins-slave\workspace\x_maven-release_IMPROVE_POM-KZP6VA3ZSGGYNTVVOCGLUBHYECJZQ34VIS6H2U5HNYVKLJFCFQKQ@3@2\windows-jdk10-m3.5.x_build\maven-release-policies\maven-release-oddeven-policy\target\classes
[windows-jdk10-m3.5.x_build] [INFO]
[windows-jdk10-m3.5.x_build] [INFO] --- plexus-component-metadata:1.7.1:generate-metadata (process-classes) @ maven-release-oddeven-policy ---
[windows-jdk10-m3.5.x_build] [INFO] Discovered 1 component descriptors(s)
[windows-jdk10-m3.5.x_build] [INFO]
[windows-jdk10-m3.5.x_build] [INFO] --- maven-resources-plugin:3.1.0:testResources (default-testResources) @ maven-release-oddeven-policy ---
[windows-jdk10-m3.5.x_build] [INFO] Using 'UTF-8' encoding to copy filtered resources.
[windows-jdk10-m3.5.x_build] [INFO] skip non existing resourceDirectory F:\jenkins\jenkins-slave\workspace\x_maven-release_IMPROVE_POM-KZP6VA3ZSGGYNTVVOCGLUBHYECJZQ34VIS6H2U5HNYVKLJFCFQKQ@3@2\windows-jdk10-m3.5.x_build\maven-release-policies\maven-release-oddeven-policy\src\test\resources
[windows-jdk10-m3.5.x_build] [INFO] Copying 3 resources
[windows-jdk10-m3.5.x_build] [INFO]
[windows-jdk10-m3.5.x_build] [INFO] --- maven-compiler-plugin:3.7.0:testCompile (default-testCompile) @ maven-release-oddeven-policy ---
[windows-jdk10-m3.5.x_build] [INFO] Changes detected - recompiling the module!
[windows-jdk10-m3.5.x_build] [INFO] Compiling 1 source file to F:\jenkins\jenkins-slave\workspace\x_maven-release_IMPROVE_POM-KZP6VA3ZSGGYNTVVOCGLUBHYECJZQ34VIS6H2U5HNYVKLJFCFQKQ@3@2\windows-jdk10-m3.5.x_build\maven-release-policies\maven-release-oddeven-policy\target\test-classes
[windows-jdk10-m3.5.x_build] [INFO]
[windows-jdk10-m3.5.x_build] [INFO] --- maven-surefire-plugin:2.22.0:test (default-test) @ maven-release-oddeven-policy ---
[windows-jdk10-m3.5.x_build] [INFO]
[windows-jdk10-m3.5.x_build] [INFO] -------------------------------------------------------
[windows-jdk10-m3.5.x_build] [INFO]  T E S T S
[windows-jdk10-m3.5.x_build] [INFO] -------------------------------------------------------
[windows-jdk10-m3.5.x_build] [INFO] Running org.apache.maven.shared.release.policy.oddeven.OddEvenVersionPolicyTestCase
[windows-jdk10-m3.5.x_build] [INFO] Tests run: 3, Failures: 0, Errors: 0, Skipped: 0, Time elapsed: 0.169 s - in org.apache.maven.shared.release.policy.oddeven.OddEvenVersionPolicyTestCase
[windows-jdk10-m3.5.x_build] [INFO]
[windows-jdk10-m3.5.x_build] [INFO] Results:
[windows-jdk10-m3.5.x_build] [INFO]
[windows-jdk10-m3.5.x_build] [INFO] Tests run: 3, Failures: 0, Errors: 0, Skipped: 0
[windows-jdk10-m3.5.x_build] [INFO]
[windows-jdk10-m3.5.x_build] [INFO]
[windows-jdk10-m3.5.x_build] [INFO] --- maven-jar-plugin:3.1.0:jar (default-jar) @ maven-release-oddeven-policy ---
[windows-jdk10-m3.5.x_build] [INFO] Building jar: F:\jenkins\jenkins-slave\workspace\x_maven-release_IMPROVE_POM-KZP6VA3ZSGGYNTVVOCGLUBHYECJZQ34VIS6H2U5HNYVKLJFCFQKQ@3@2\windows-jdk10-m3.5.x_build\maven-release-policies\maven-release-oddeven-policy\target\maven-release-oddeven-policy-3.0.0-SNAPSHOT.jar
[windows-jdk10-m3.5.x_build] [INFO]
[windows-jdk10-m3.5.x_build] [INFO] --- maven-site-plugin:3.7.1:attach-descriptor (attach-descriptor) @ maven-release-oddeven-policy ---
[windows-jdk10-m3.5.x_build] [INFO] Skipping because packaging 'jar' is not pom.
[windows-jdk10-m3.5.x_build] [INFO]
[windows-jdk10-m3.5.x_build] [INFO] --- maven-checkstyle-plugin:3.0.0:check (checkstyle-check) @ maven-release-oddeven-policy ---
[windows-jdk10-m3.5.x_build] [INFO]
[windows-jdk10-m3.5.x_build] [INFO] ------------------------------------------------------------------------
[windows-jdk10-m3.5.x_build] [INFO] Building Maven Release SemVer Policy 3.0.0-SNAPSHOT
[windows-jdk10-m3.5.x_build] [INFO] ------------------------------------------------------------------------
[windows-jdk10-m3.5.x_build] [INFO] Downloading from central: https://repo.maven.apache.org/maven2/org/semver/api/0.9.33/api-0.9.33.pom
[windows-jdk10-m3.5.x_build] [INFO] Downloaded from central: https://repo.maven.apache.org/maven2/org/semver/api/0.9.33/api-0.9.33.pom (2.8 kB at 101 kB/s)
[windows-jdk10-m3.5.x_build] [INFO] Downloading from central: https://repo.maven.apache.org/maven2/org/semver/parent/0.9.33/parent-0.9.33.pom
[windows-jdk10-m3.5.x_build] [INFO] Downloaded from central: https://repo.maven.apache.org/maven2/org/semver/parent/0.9.33/parent-0.9.33.pom (1.3 kB at 66 kB/s)
[windows-jdk10-m3.5.x_build] [INFO] Downloading from central: https://repo.maven.apache.org/maven2/com/github/jeluard/oss-parent/9/oss-parent-9.pom
[windows-jdk10-m3.5.x_build] [INFO] Downloaded from central: https://repo.maven.apache.org/maven2/com/github/jeluard/oss-parent/9/oss-parent-9.pom (12 kB at 594 kB/s)
[windows-jdk10-m3.5.x_build] [INFO] Downloading from central: https://repo.maven.apache.org/maven2/com/google/code/findbugs/jsr305/2.0.0/jsr305-2.0.0.pom
[windows-jdk10-m3.5.x_build] [INFO] Downloaded from central: https://repo.maven.apache.org/maven2/com/google/code/findbugs/jsr305/2.0.0/jsr305-2.0.0.pom (965 B at 51 kB/s)
[windows-jdk10-m3.5.x_build] [INFO] Downloading from central: https://repo.maven.apache.org/maven2/org/ow2/asm/asm/5.0.3/asm-5.0.3.pom
[windows-jdk10-m3.5.x_build] [INFO] Downloaded from central: https://repo.maven.apache.org/maven2/org/ow2/asm/asm/5.0.3/asm-5.0.3.pom (1.9 kB at 81 kB/s)
[windows-jdk10-m3.5.x_build] [INFO] Downloading from central: https://repo.maven.apache.org/maven2/org/ow2/asm/asm-parent/5.0.3/asm-parent-5.0.3.pom
[windows-jdk10-m3.5.x_build] [INFO] Downloaded from central: https://repo.maven.apache.org/maven2/org/ow2/asm/asm-parent/5.0.3/asm-parent-5.0.3.pom (5.5 kB at 145 kB/s)
[windows-jdk10-m3.5.x_build] [INFO] Downloading from central: https://repo.maven.apache.org/maven2/org/ow2/asm/asm-commons/5.0.3/asm-commons-5.0.3.pom
[windows-jdk10-m3.5.x_build] [INFO] Downloaded from central: https://repo.maven.apache.org/maven2/org/ow2/asm/asm-commons/5.0.3/asm-commons-5.0.3.pom (2.1 kB at 116 kB/s)
[windows-jdk10-m3.5.x_build] [INFO] Downloading from central: https://repo.maven.apache.org/maven2/org/ow2/asm/asm-tree/5.0.3/asm-tree-5.0.3.pom
[windows-jdk10-m3.5.x_build] [INFO] Downloaded from central: https://repo.maven.apache.org/maven2/org/ow2/asm/asm-tree/5.0.3/asm-tree-5.0.3.pom (2.1 kB at 95 kB/s)
[windows-jdk10-m3.5.x_build] [INFO] Downloading from central: https://repo.maven.apache.org/maven2/commons-lang/commons-lang/1.0/commons-lang-1.0.pom
[windows-jdk10-m3.5.x_build] [INFO] Downloaded from central: https://repo.maven.apache.org/maven2/commons-lang/commons-lang/1.0/commons-lang-1.0.pom (2.5 kB at 123 kB/s)
[windows-jdk10-m3.5.x_build] [INFO] Downloading from central: https://repo.maven.apache.org/maven2/de/tototec/de.tototec.cmdoption/0.2.0/de.tototec.cmdoption-0.2.0.pom
[windows-jdk10-m3.5.x_build] [INFO] Downloaded from central: https://repo.maven.apache.org/maven2/de/tototec/de.tototec.cmdoption/0.2.0/de.tototec.cmdoption-0.2.0.pom (956 B at 37 kB/s)
[windows-jdk10-m3.5.x_build] [INFO] Downloading from central: https://repo.maven.apache.org/maven2/org/semver/api/0.9.33/api-0.9.33.jar
[windows-jdk10-m3.5.x_build] [INFO] Downloading from central: https://repo.maven.apache.org/maven2/com/google/code/findbugs/jsr305/2.0.0/jsr305-2.0.0.jar
[windows-jdk10-m3.5.x_build] [INFO] Downloading from central: https://repo.maven.apache.org/maven2/org/ow2/asm/asm-commons/5.0.3/asm-commons-5.0.3.jar
[windows-jdk10-m3.5.x_build] [INFO] Downloading from central: https://repo.maven.apache.org/maven2/org/ow2/asm/asm/5.0.3/asm-5.0.3.jar
[windows-jdk10-m3.5.x_build] [INFO] Downloading from central: https://repo.maven.apache.org/maven2/org/ow2/asm/asm-tree/5.0.3/asm-tree-5.0.3.jar
[windows-jdk10-m3.5.x_build] [INFO] Downloaded from central: https://repo.maven.apache.org/maven2/org/semver/api/0.9.33/api-0.9.33.jar (64 kB at 287 kB/s)
[windows-jdk10-m3.5.x_build] [INFO] Downloading from central: https://repo.maven.apache.org/maven2/commons-lang/commons-lang/1.0/commons-lang-1.0.jar
[windows-jdk10-m3.5.x_build] [INFO] Downloaded from central: https://repo.maven.apache.org/maven2/org/ow2/asm/asm-commons/5.0.3/asm-commons-5.0.3.jar (42 kB at 182 kB/s)
[windows-jdk10-m3.5.x_build] [INFO] Downloading from central: https://repo.maven.apache.org/maven2/de/tototec/de.tototec.cmdoption/0.2.0/de.tototec.cmdoption-0.2.0.jar
[windows-jdk10-m3.5.x_build] [INFO] Downloaded from central: https://repo.maven.apache.org/maven2/org/ow2/asm/asm/5.0.3/asm-5.0.3.jar (53 kB at 223 kB/s)
[windows-jdk10-m3.5.x_build] [INFO] Downloaded from central: https://repo.maven.apache.org/maven2/commons-lang/commons-lang/1.0/commons-lang-1.0.jar (64 kB at 173 kB/s)
[windows-jdk10-m3.5.x_build] [INFO] Downloaded from central: https://repo.maven.apache.org/maven2/com/google/code/findbugs/jsr305/2.0.0/jsr305-2.0.0.jar (32 kB at 85 kB/s)
[windows-jdk10-m3.5.x_build] [INFO] Downloaded from central: https://repo.maven.apache.org/maven2/org/ow2/asm/asm-tree/5.0.3/asm-tree-5.0.3.jar (29 kB at 70 kB/s)
[windows-jdk10-m3.5.x_build] [INFO] Downloaded from central: https://repo.maven.apache.org/maven2/de/tototec/de.tototec.cmdoption/0.2.0/de.tototec.cmdoption-0.2.0.jar (42 kB at 88 kB/s)
[windows-jdk10-m3.5.x_build] [INFO]
[windows-jdk10-m3.5.x_build] [INFO] --- maven-clean-plugin:3.1.0:clean (default-clean) @ maven-release-semver-policy ---
[windows-jdk10-m3.5.x_build] [INFO]
[windows-jdk10-m3.5.x_build] [INFO] --- maven-enforcer-plugin:1.4.1:enforce (enforce-maven-version) @ maven-release-semver-policy ---
[windows-jdk10-m3.5.x_build] [INFO]
[windows-jdk10-m3.5.x_build] [INFO] --- maven-enforcer-plugin:1.4.1:enforce (enforce-bytecode-version) @ maven-release-semver-policy ---
[windows-jdk10-m3.5.x_build] [INFO]
[windows-jdk10-m3.5.x_build] [INFO] --- maven-enforcer-plugin:1.4.1:enforce (ban-known-bad-maven-versions) @ maven-release-semver-policy ---
[windows-jdk10-m3.5.x_build] [INFO]
[windows-jdk10-m3.5.x_build] [INFO] --- apache-rat-plugin:0.12:check (rat-check) @ maven-release-semver-policy ---
[windows-jdk10-m3.5.x_build] [INFO] Enabled default license matchers.
[windows-jdk10-m3.5.x_build] [INFO] Will parse SCM ignores for exclusions...
[windows-jdk10-m3.5.x_build] [INFO] Finished adding exclusions from SCM ignore files.
[windows-jdk10-m3.5.x_build] [INFO] 61 implicit excludes (use -debug for more details).
[windows-jdk10-m3.5.x_build] [INFO] Exclude: .repository
[windows-jdk10-m3.5.x_build] [INFO] Exclude: Jenkinsfile
[windows-jdk10-m3.5.x_build] [INFO] Exclude: .repository/**
[windows-jdk10-m3.5.x_build] [INFO] Exclude: .maven/spy.log
[windows-jdk10-m3.5.x_build] [INFO] Exclude: dependency-reduced-pom.xml
[windows-jdk10-m3.5.x_build] [INFO] Exclude: .java-version
[windows-jdk10-m3.5.x_build] [INFO] 3 resources included (use -debug for more details)
[windows-jdk10-m3.5.x_build] [INFO] Rat check: Summary over all files. Unapproved: 0, unknown: 0, generated: 0, approved: 3 licenses.
[windows-jdk10-m3.5.x_build] [INFO]
[windows-jdk10-m3.5.x_build] [INFO] --- maven-remote-resources-plugin:1.5:process (process-resource-bundles) @ maven-release-semver-policy ---
[windows-jdk10-m3.5.x_build] [INFO]
[windows-jdk10-m3.5.x_build] [INFO] --- maven-resources-plugin:3.1.0:resources (default-resources) @ maven-release-semver-policy ---
[windows-jdk10-m3.5.x_build] [INFO] Using 'UTF-8' encoding to copy filtered resources.
[windows-jdk10-m3.5.x_build] [INFO] skip non existing resourceDirectory F:\jenkins\jenkins-slave\workspace\x_maven-release_IMPROVE_POM-KZP6VA3ZSGGYNTVVOCGLUBHYECJZQ34VIS6H2U5HNYVKLJFCFQKQ@3@2\windows-jdk10-m3.5.x_build\maven-release-policies\maven-release-semver-policy\src\main\resources
[windows-jdk10-m3.5.x_build] [INFO] Copying 3 resources
[windows-jdk10-m3.5.x_build] [INFO]
[windows-jdk10-m3.5.x_build] [INFO] --- maven-compiler-plugin:3.7.0:compile (default-compile) @ maven-release-semver-policy ---
[windows-jdk10-m3.5.x_build] [INFO] Changes detected - recompiling the module!
[windows-jdk10-m3.5.x_build] [INFO] Compiling 1 source file to F:\jenkins\jenkins-slave\workspace\x_maven-release_IMPROVE_POM-KZP6VA3ZSGGYNTVVOCGLUBHYECJZQ34VIS6H2U5HNYVKLJFCFQKQ@3@2\windows-jdk10-m3.5.x_build\maven-release-policies\maven-release-semver-policy\target\classes
[windows-jdk10-m3.5.x_build] [INFO]
[windows-jdk10-m3.5.x_build] [INFO] --- plexus-component-metadata:1.7.1:generate-metadata (process-classes) @ maven-release-semver-policy ---
[windows-jdk10-m3.5.x_build] [INFO] Discovered 1 component descriptors(s)
[windows-jdk10-m3.5.x_build] [INFO]
[windows-jdk10-m3.5.x_build] [INFO] --- maven-resources-plugin:3.1.0:testResources (default-testResources) @ maven-release-semver-policy ---
[windows-jdk10-m3.5.x_build] [INFO] Using 'UTF-8' encoding to copy filtered resources.
[windows-jdk10-m3.5.x_build] [INFO] skip non existing resourceDirectory F:\jenkins\jenkins-slave\workspace\x_maven-release_IMPROVE_POM-KZP6VA3ZSGGYNTVVOCGLUBHYECJZQ34VIS6H2U5HNYVKLJFCFQKQ@3@2\windows-jdk10-m3.5.x_build\maven-release-policies\maven-release-semver-policy\src\test\resources
[windows-jdk10-m3.5.x_build] [INFO] Copying 3 resources
[windows-jdk10-m3.5.x_build] [INFO]
[windows-jdk10-m3.5.x_build] [INFO] --- maven-compiler-plugin:3.7.0:testCompile (default-testCompile) @ maven-release-semver-policy ---
[windows-jdk10-m3.5.x_build] [INFO] Changes detected - recompiling the module!
[windows-jdk10-m3.5.x_build] [INFO] Compiling 1 source file to F:\jenkins\jenkins-slave\workspace\x_maven-release_IMPROVE_POM-KZP6VA3ZSGGYNTVVOCGLUBHYECJZQ34VIS6H2U5HNYVKLJFCFQKQ@3@2\windows-jdk10-m3.5.x_build\maven-release-policies\maven-release-semver-policy\target\test-classes
[windows-jdk10-m3.5.x_build] [INFO]
[windows-jdk10-m3.5.x_build] [INFO] --- maven-surefire-plugin:2.22.0:test (default-test) @ maven-release-semver-policy ---
[windows-jdk10-m3.5.x_build] [INFO]
[windows-jdk10-m3.5.x_build] [INFO] -------------------------------------------------------
[windows-jdk10-m3.5.x_build] [INFO]  T E S T S
[windows-jdk10-m3.5.x_build] [INFO] -------------------------------------------------------
[windows-jdk10-m3.5.x_build] [INFO] Running org.apache.maven.shared.release.policy.semver.SemVerVersionPolicyTest
[windows-jdk10-m3.5.x_build] [INFO] Tests run: 2, Failures: 0, Errors: 0, Skipped: 0, Time elapsed: 0.126 s - in org.apache.maven.shared.release.policy.semver.SemVerVersionPolicyTest
[windows-jdk10-m3.5.x_build] [INFO]
[windows-jdk10-m3.5.x_build] [INFO] Results:
[windows-jdk10-m3.5.x_build] [INFO]
[windows-jdk10-m3.5.x_build] [INFO] Tests run: 2, Failures: 0, Errors: 0, Skipped: 0
[windows-jdk10-m3.5.x_build] [INFO]
[windows-jdk10-m3.5.x_build] [INFO]
[windows-jdk10-m3.5.x_build] [INFO] --- maven-jar-plugin:3.1.0:jar (default-jar) @ maven-release-semver-policy ---
[windows-jdk10-m3.5.x_build] [INFO] Building jar: F:\jenkins\jenkins-slave\workspace\x_maven-release_IMPROVE_POM-KZP6VA3ZSGGYNTVVOCGLUBHYECJZQ34VIS6H2U5HNYVKLJFCFQKQ@3@2\windows-jdk10-m3.5.x_build\maven-release-policies\maven-release-semver-policy\target\maven-release-semver-policy-3.0.0-SNAPSHOT.jar
[windows-jdk10-m3.5.x_build] [INFO]
[windows-jdk10-m3.5.x_build] [INFO] --- maven-site-plugin:3.7.1:attach-descriptor (attach-descriptor) @ maven-release-semver-policy ---
[windows-jdk10-m3.5.x_build] [INFO] Skipping because packaging 'jar' is not pom.
[windows-jdk10-m3.5.x_build] [INFO]
[windows-jdk10-m3.5.x_build] [INFO] --- maven-checkstyle-plugin:3.0.0:check (checkstyle-check) @ maven-release-semver-policy ---
[windows-jdk10-m3.5.x_build] [INFO] ------------------------------------------------------------------------
[windows-jdk10-m3.5.x_build] [INFO] Reactor Summary:
[windows-jdk10-m3.5.x_build] [INFO]
[windows-jdk10-m3.5.x_build] [INFO] Maven Release ...................................... SUCCESS [ 46.356 s]
[windows-jdk10-m3.5.x_build] [INFO] Maven Release APIs ................................. SUCCESS [ 13.714 s]
[windows-jdk10-m3.5.x_build] [INFO] Maven Release Manager .............................. SUCCESS [02:58 min]
[windows-jdk10-m3.5.x_build] [INFO] Maven Release Plugin ............................... SUCCESS [08:35 min]
[windows-jdk10-m3.5.x_build] [INFO] Maven Release Odd-Even Policy ...................... SUCCESS [  3.262 s]
[windows-jdk10-m3.5.x_build] [INFO] Maven Release SemVer Policy ........................ SUCCESS [  4.474 s]
[windows-jdk10-m3.5.x_build] [INFO] ------------------------------------------------------------------------
[windows-jdk10-m3.5.x_build] [INFO] BUILD SUCCESS
[windows-jdk10-m3.5.x_build] [INFO] ------------------------------------------------------------------------
[windows-jdk10-m3.5.x_build] [INFO] Total time: 12:45 min
[windows-jdk10-m3.5.x_build] [INFO] Finished at: 2018-10-10T11:39:47-07:00
[windows-jdk10-m3.5.x_build] [INFO] Final Memory: 54M/184M
[windows-jdk10-m3.5.x_build] [INFO] ------------------------------------------------------------------------
[windows-jdk10-m3.5.x_build] [INFO] [jenkins-event-spy] Generated F:\jenkins\jenkins-slave\workspace\x_maven-release_IMPROVE_POM-KZP6VA3ZSGGYNTVVOCGLUBHYECJZQ34VIS6H2U5HNYVKLJFCFQKQ@3@2@tmp\withMaven46894db5\maven-spy-20181010-112701-6651605412152615069116.log
[Pipeline] [windows-jdk10-m3.5.x_build] }
[Pipeline] [windows-jdk10-m3.5.x_build] // dir
[Pipeline] [windows-jdk10-m3.5.x_build] }
[windows-jdk10-m3.5.x_build] [withMaven] artifactsPublisher - Archive artifact windows-jdk10-m3.5.x_build\pom.xml under org\apache\maven\release\maven-release\3.0.0-SNAPSHOT\maven-release-3.0.0-SNAPSHOT.pom
[windows-jdk10-m3.5.x_build] [withMaven] artifactsPublisher - Archive artifact windows-jdk10-m3.5.x_build\target\maven-release-3.0.0-SNAPSHOT-site.xml under org\apache\maven\release\maven-release\3.0.0-SNAPSHOT\maven-release-3.0.0-SNAPSHOT-site.xml
[windows-jdk10-m3.5.x_build] [withMaven] artifactsPublisher - Archive artifact windows-jdk10-m3.5.x_build\maven-release-api\pom.xml under org\apache\maven\release\maven-release-api\3.0.0-SNAPSHOT\maven-release-api-3.0.0-SNAPSHOT.pom
[windows-jdk10-m3.5.x_build] [withMaven] artifactsPublisher - Archive artifact windows-jdk10-m3.5.x_build\maven-release-api\target\maven-release-api-3.0.0-SNAPSHOT.jar under org\apache\maven\release\maven-release-api\3.0.0-SNAPSHOT\maven-release-api-3.0.0-SNAPSHOT.jar
[windows-jdk10-m3.5.x_build] [withMaven] artifactsPublisher - Archive artifact windows-jdk10-m3.5.x_build\maven-release-manager\pom.xml under org\apache\maven\release\maven-release-manager\3.0.0-SNAPSHOT\maven-release-manager-3.0.0-SNAPSHOT.pom
[windows-jdk10-m3.5.x_build] [withMaven] artifactsPublisher - Archive artifact windows-jdk10-m3.5.x_build\maven-release-manager\target\maven-release-manager-3.0.0-SNAPSHOT.jar under org\apache\maven\release\maven-release-manager\3.0.0-SNAPSHOT\maven-release-manager-3.0.0-SNAPSHOT.jar
[windows-jdk10-m3.5.x_build] [withMaven] artifactsPublisher - Archive artifact windows-jdk10-m3.5.x_build\maven-release-plugin\pom.xml under org\apache\maven\plugins\maven-release-plugin\3.0.0-SNAPSHOT\maven-release-plugin-3.0.0-SNAPSHOT.pom
[windows-jdk10-m3.5.x_build] [withMaven] artifactsPublisher - Archive artifact windows-jdk10-m3.5.x_build\maven-release-plugin\target\maven-release-plugin-3.0.0-SNAPSHOT.jar under org\apache\maven\plugins\maven-release-plugin\3.0.0-SNAPSHOT\maven-release-plugin-3.0.0-SNAPSHOT.jar
[windows-jdk10-m3.5.x_build] [withMaven] artifactsPublisher - Archive artifact windows-jdk10-m3.5.x_build\maven-release-policies\maven-release-oddeven-policy\pom.xml under org\apache\maven\release\maven-release-oddeven-policy\3.0.0-SNAPSHOT\maven-release-oddeven-policy-3.0.0-SNAPSHOT.pom
[windows-jdk10-m3.5.x_build] [withMaven] artifactsPublisher - Archive artifact windows-jdk10-m3.5.x_build\maven-release-policies\maven-release-oddeven-policy\target\maven-release-oddeven-policy-3.0.0-SNAPSHOT.jar under org\apache\maven\release\maven-release-oddeven-policy\3.0.0-SNAPSHOT\maven-release-oddeven-policy-3.0.0-SNAPSHOT.jar
[windows-jdk10-m3.5.x_build] [withMaven] artifactsPublisher - Archive artifact windows-jdk10-m3.5.x_build\maven-release-policies\maven-release-semver-policy\pom.xml under org\apache\maven\release\maven-release-semver-policy\3.0.0-SNAPSHOT\maven-release-semver-policy-3.0.0-SNAPSHOT.pom
[windows-jdk10-m3.5.x_build] [withMaven] artifactsPublisher - Archive artifact windows-jdk10-m3.5.x_build\maven-release-policies\maven-release-semver-policy\target\maven-release-semver-policy-3.0.0-SNAPSHOT.jar under org\apache\maven\release\maven-release-semver-policy\3.0.0-SNAPSHOT\maven-release-semver-policy-3.0.0-SNAPSHOT.jar
[windows-jdk10-m3.5.x_build] [Fast Archiver] No prior successful build to compare, so performing full copy of artifacts
[windows-jdk10-m3.5.x_build] [withMaven] invokerPublisher - Archive invoker results for Maven artifact MavenArtifact{org.apache.maven.plugins:maven-release-plugin::3.0.0-SNAPSHOT(version: 3.0.0-SNAPSHOT, snapshot:false) } generated by PluginInvocation{org.apache.maven.plugins:maven-invoker-plugin:3.0.1@run  integration-test-prepare}: windows-jdk10-m3.5.x_build\maven-release-plugin\target\invoker-reports\*.xml
[windows-jdk10-m3.5.x_build] performing MavenInvokerRecorder, reportsFilenamePattern:'**/windows-jdk10-m3.5.x_build\maven-release-plugin\target\invoker-reports/BUILD*.xml', invokerBuildDir:'**/windows-jdk10-m3.5.x_build\maven-release-plugin\target\it'
[windows-jdk10-m3.5.x_build] Found reports:[f:\jenkins\jenkins-slave\workspace\x_maven-release_IMPROVE_POM-KZP6VA3ZSGGYNTVVOCGLUBHYECJZQ34VIS6H2U5HNYVKLJFCFQKQ@3@2\windows-jdk10-m3.5.x_build\maven-release-plugin\target\invoker-reports\BUILD-projects_update-versions_MRELEASE-555.xml, f:\jenkins\jenkins-slave\workspace\x_maven-release_IMPROVE_POM-KZP6VA3ZSGGYNTVVOCGLUBHYECJZQ34VIS6H2U5HNYVKLJFCFQKQ@3@2\windows-jdk10-m3.5.x_build\maven-release-plugin\target\invoker-reports\BUILD-projects_update-versions_MRELEASE-611.xml, f:\jenkins\jenkins-slave\workspace\x_maven-release_IMPROVE_POM-KZP6VA3ZSGGYNTVVOCGLUBHYECJZQ34VIS6H2U5HNYVKLJFCFQKQ@3@2\windows-jdk10-m3.5.x_build\maven-release-plugin\target\invoker-reports\BUILD-projects_update-versions_MRELEASE-783.xml, f:\jenkins\jenkins-slave\workspace\x_maven-release_IMPROVE_POM-KZP6VA3ZSGGYNTVVOCGLUBHYECJZQ34VIS6H2U5HNYVKLJFCFQKQ@3@2\windows-jdk10-m3.5.x_build\maven-release-plugin\target\invoker-reports\BUILD-projects_update-versions_MRELEASE-976.xml]
[windows-jdk10-m3.5.x_build] Found logs:[f:\jenkins\jenkins-slave\workspace\x_maven-release_IMPROVE_POM-KZP6VA3ZSGGYNTVVOCGLUBHYECJZQ34VIS6H2U5HNYVKLJFCFQKQ@3@2\windows-jdk10-m3.5.x_build\maven-release-plugin\target\it\projects\update-versions\MRELEASE-555\build.log, f:\jenkins\jenkins-slave\workspace\x_maven-release_IMPROVE_POM-KZP6VA3ZSGGYNTVVOCGLUBHYECJZQ34VIS6H2U5HNYVKLJFCFQKQ@3@2\windows-jdk10-m3.5.x_build\maven-release-plugin\target\it\projects\update-versions\MRELEASE-611\build.log, f:\jenkins\jenkins-slave\workspace\x_maven-release_IMPROVE_POM-KZP6VA3ZSGGYNTVVOCGLUBHYECJZQ34VIS6H2U5HNYVKLJFCFQKQ@3@2\windows-jdk10-m3.5.x_build\maven-release-plugin\target\it\projects\update-versions\MRELEASE-783\build.log, f:\jenkins\jenkins-slave\workspace\x_maven-release_IMPROVE_POM-KZP6VA3ZSGGYNTVVOCGLUBHYECJZQ34VIS6H2U5HNYVKLJFCFQKQ@3@2\windows-jdk10-m3.5.x_build\maven-release-plugin\target\it\projects\update-versions\MRELEASE-976\build.log]
[windows-jdk10-m3.5.x_build] Finished parsing Maven Invoker results (found 4)
[windows-jdk10-m3.5.x_build] [withMaven] invokerPublisher - Archive invoker results for Maven artifact MavenArtifact{org.apache.maven.plugins:maven-release-plugin::3.0.0-SNAPSHOT(version: 3.0.0-SNAPSHOT, snapshot:false) } generated by PluginInvocation{org.apache.maven.plugins:maven-invoker-plugin:3.0.1@run  integration-test-prepare-with-pom}: windows-jdk10-m3.5.x_build\maven-release-plugin\target\invoker-reports\*.xml
[windows-jdk10-m3.5.x_build] performing MavenInvokerRecorder, reportsFilenamePattern:'**/windows-jdk10-m3.5.x_build\maven-release-plugin\target\invoker-reports/BUILD*.xml', invokerBuildDir:'**/windows-jdk10-m3.5.x_build\maven-release-plugin\target\it'
[windows-jdk10-m3.5.x_build] Found reports:[f:\jenkins\jenkins-slave\workspace\x_maven-release_IMPROVE_POM-KZP6VA3ZSGGYNTVVOCGLUBHYECJZQ34VIS6H2U5HNYVKLJFCFQKQ@3@2\windows-jdk10-m3.5.x_build\maven-release-plugin\target\invoker-reports\BUILD-projects_update-versions_MRELEASE-555.xml, f:\jenkins\jenkins-slave\workspace\x_maven-release_IMPROVE_POM-KZP6VA3ZSGGYNTVVOCGLUBHYECJZQ34VIS6H2U5HNYVKLJFCFQKQ@3@2\windows-jdk10-m3.5.x_build\maven-release-plugin\target\invoker-reports\BUILD-projects_update-versions_MRELEASE-611.xml, f:\jenkins\jenkins-slave\workspace\x_maven-release_IMPROVE_POM-KZP6VA3ZSGGYNTVVOCGLUBHYECJZQ34VIS6H2U5HNYVKLJFCFQKQ@3@2\windows-jdk10-m3.5.x_build\maven-release-plugin\target\invoker-reports\BUILD-projects_update-versions_MRELEASE-783.xml, f:\jenkins\jenkins-slave\workspace\x_maven-release_IMPROVE_POM-KZP6VA3ZSGGYNTVVOCGLUBHYECJZQ34VIS6H2U5HNYVKLJFCFQKQ@3@2\windows-jdk10-m3.5.x_build\maven-release-plugin\target\invoker-reports\BUILD-projects_update-versions_MRELEASE-976.xml]
[windows-jdk10-m3.5.x_build] Found logs:[f:\jenkins\jenkins-slave\workspace\x_maven-release_IMPROVE_POM-KZP6VA3ZSGGYNTVVOCGLUBHYECJZQ34VIS6H2U5HNYVKLJFCFQKQ@3@2\windows-jdk10-m3.5.x_build\maven-release-plugin\target\it\projects\update-versions\MRELEASE-555\build.log, f:\jenkins\jenkins-slave\workspace\x_maven-release_IMPROVE_POM-KZP6VA3ZSGGYNTVVOCGLUBHYECJZQ34VIS6H2U5HNYVKLJFCFQKQ@3@2\windows-jdk10-m3.5.x_build\maven-release-plugin\target\it\projects\update-versions\MRELEASE-611\build.log, f:\jenkins\jenkins-slave\workspace\x_maven-release_IMPROVE_POM-KZP6VA3ZSGGYNTVVOCGLUBHYECJZQ34VIS6H2U5HNYVKLJFCFQKQ@3@2\windows-jdk10-m3.5.x_build\maven-release-plugin\target\it\projects\update-versions\MRELEASE-783\build.log, f:\jenkins\jenkins-slave\workspace\x_maven-release_IMPROVE_POM-KZP6VA3ZSGGYNTVVOCGLUBHYECJZQ34VIS6H2U5HNYVKLJFCFQKQ@3@2\windows-jdk10-m3.5.x_build\maven-release-plugin\target\it\projects\update-versions\MRELEASE-976\build.log]
[windows-jdk10-m3.5.x_build] Finished parsing Maven Invoker results (found 4)
[windows-jdk10-m3.5.x_build] [withMaven] invokerPublisher - Archive invoker results for Maven artifact MavenArtifact{org.apache.maven.plugins:maven-release-plugin::3.0.0-SNAPSHOT(version: 3.0.0-SNAPSHOT, snapshot:false) } generated by PluginInvocation{org.apache.maven.plugins:maven-invoker-plugin:3.0.1@run  integration-test-branch}: windows-jdk10-m3.5.x_build\maven-release-plugin\target\invoker-reports\*.xml
[windows-jdk10-m3.5.x_build] performing MavenInvokerRecorder, reportsFilenamePattern:'**/windows-jdk10-m3.5.x_build\maven-release-plugin\target\invoker-reports/BUILD*.xml', invokerBuildDir:'**/windows-jdk10-m3.5.x_build\maven-release-plugin\target\it'
[windows-jdk10-m3.5.x_build] Found reports:[f:\jenkins\jenkins-slave\workspace\x_maven-release_IMPROVE_POM-KZP6VA3ZSGGYNTVVOCGLUBHYECJZQ34VIS6H2U5HNYVKLJFCFQKQ@3@2\windows-jdk10-m3.5.x_build\maven-release-plugin\target\invoker-reports\BUILD-projects_update-versions_MRELEASE-555.xml, f:\jenkins\jenkins-slave\workspace\x_maven-release_IMPROVE_POM-KZP6VA3ZSGGYNTVVOCGLUBHYECJZQ34VIS6H2U5HNYVKLJFCFQKQ@3@2\windows-jdk10-m3.5.x_build\maven-release-plugin\target\invoker-reports\BUILD-projects_update-versions_MRELEASE-611.xml, f:\jenkins\jenkins-slave\workspace\x_maven-release_IMPROVE_POM-KZP6VA3ZSGGYNTVVOCGLUBHYECJZQ34VIS6H2U5HNYVKLJFCFQKQ@3@2\windows-jdk10-m3.5.x_build\maven-release-plugin\target\invoker-reports\BUILD-projects_update-versions_MRELEASE-783.xml, f:\jenkins\jenkins-slave\workspace\x_maven-release_IMPROVE_POM-KZP6VA3ZSGGYNTVVOCGLUBHYECJZQ34VIS6H2U5HNYVKLJFCFQKQ@3@2\windows-jdk10-m3.5.x_build\maven-release-plugin\target\invoker-reports\BUILD-projects_update-versions_MRELEASE-976.xml]
[windows-jdk10-m3.5.x_build] Found logs:[f:\jenkins\jenkins-slave\workspace\x_maven-release_IMPROVE_POM-KZP6VA3ZSGGYNTVVOCGLUBHYECJZQ34VIS6H2U5HNYVKLJFCFQKQ@3@2\windows-jdk10-m3.5.x_build\maven-release-plugin\target\it\projects\update-versions\MRELEASE-555\build.log, f:\jenkins\jenkins-slave\workspace\x_maven-release_IMPROVE_POM-KZP6VA3ZSGGYNTVVOCGLUBHYECJZQ34VIS6H2U5HNYVKLJFCFQKQ@3@2\windows-jdk10-m3.5.x_build\maven-release-plugin\target\it\projects\update-versions\MRELEASE-611\build.log, f:\jenkins\jenkins-slave\workspace\x_maven-release_IMPROVE_POM-KZP6VA3ZSGGYNTVVOCGLUBHYECJZQ34VIS6H2U5HNYVKLJFCFQKQ@3@2\windows-jdk10-m3.5.x_build\maven-release-plugin\target\it\projects\update-versions\MRELEASE-783\build.log, f:\jenkins\jenkins-slave\workspace\x_maven-release_IMPROVE_POM-KZP6VA3ZSGGYNTVVOCGLUBHYECJZQ34VIS6H2U5HNYVKLJFCFQKQ@3@2\windows-jdk10-m3.5.x_build\maven-release-plugin\target\it\projects\update-versions\MRELEASE-976\build.log]
[windows-jdk10-m3.5.x_build] Finished parsing Maven Invoker results (found 4)
[windows-jdk10-m3.5.x_build] [withMaven] invokerPublisher - Archive invoker results for Maven artifact MavenArtifact{org.apache.maven.plugins:maven-release-plugin::3.0.0-SNAPSHOT(version: 3.0.0-SNAPSHOT, snapshot:false) } generated by PluginInvocation{org.apache.maven.plugins:maven-invoker-plugin:3.0.1@run  integration-test-perform}: windows-jdk10-m3.5.x_build\maven-release-plugin\target\invoker-reports\*.xml
[windows-jdk10-m3.5.x_build] performing MavenInvokerRecorder, reportsFilenamePattern:'**/windows-jdk10-m3.5.x_build\maven-release-plugin\target\invoker-reports/BUILD*.xml', invokerBuildDir:'**/windows-jdk10-m3.5.x_build\maven-release-plugin\target\it'
[windows-jdk10-m3.5.x_build] Found reports:[f:\jenkins\jenkins-slave\workspace\x_maven-release_IMPROVE_POM-KZP6VA3ZSGGYNTVVOCGLUBHYECJZQ34VIS6H2U5HNYVKLJFCFQKQ@3@2\windows-jdk10-m3.5.x_build\maven-release-plugin\target\invoker-reports\BUILD-projects_update-versions_MRELEASE-555.xml, f:\jenkins\jenkins-slave\workspace\x_maven-release_IMPROVE_POM-KZP6VA3ZSGGYNTVVOCGLUBHYECJZQ34VIS6H2U5HNYVKLJFCFQKQ@3@2\windows-jdk10-m3.5.x_build\maven-release-plugin\target\invoker-reports\BUILD-projects_update-versions_MRELEASE-611.xml, f:\jenkins\jenkins-slave\workspace\x_maven-release_IMPROVE_POM-KZP6VA3ZSGGYNTVVOCGLUBHYECJZQ34VIS6H2U5HNYVKLJFCFQKQ@3@2\windows-jdk10-m3.5.x_build\maven-release-plugin\target\invoker-reports\BUILD-projects_update-versions_MRELEASE-783.xml, f:\jenkins\jenkins-slave\workspace\x_maven-release_IMPROVE_POM-KZP6VA3ZSGGYNTVVOCGLUBHYECJZQ34VIS6H2U5HNYVKLJFCFQKQ@3@2\windows-jdk10-m3.5.x_build\maven-release-plugin\target\invoker-reports\BUILD-projects_update-versions_MRELEASE-976.xml]
[windows-jdk10-m3.5.x_build] Found logs:[f:\jenkins\jenkins-slave\workspace\x_maven-release_IMPROVE_POM-KZP6VA3ZSGGYNTVVOCGLUBHYECJZQ34VIS6H2U5HNYVKLJFCFQKQ@3@2\windows-jdk10-m3.5.x_build\maven-release-plugin\target\it\projects\update-versions\MRELEASE-555\build.log, f:\jenkins\jenkins-slave\workspace\x_maven-release_IMPROVE_POM-KZP6VA3ZSGGYNTVVOCGLUBHYECJZQ34VIS6H2U5HNYVKLJFCFQKQ@3@2\windows-jdk10-m3.5.x_build\maven-release-plugin\target\it\projects\update-versions\MRELEASE-611\build.log, f:\jenkins\jenkins-slave\workspace\x_maven-release_IMPROVE_POM-KZP6VA3ZSGGYNTVVOCGLUBHYECJZQ34VIS6H2U5HNYVKLJFCFQKQ@3@2\windows-jdk10-m3.5.x_build\maven-release-plugin\target\it\projects\update-versions\MRELEASE-783\build.log, f:\jenkins\jenkins-slave\workspace\x_maven-release_IMPROVE_POM-KZP6VA3ZSGGYNTVVOCGLUBHYECJZQ34VIS6H2U5HNYVKLJFCFQKQ@3@2\windows-jdk10-m3.5.x_build\maven-release-plugin\target\it\projects\update-versions\MRELEASE-976\build.log]
[windows-jdk10-m3.5.x_build] Finished parsing Maven Invoker results (found 4)
[windows-jdk10-m3.5.x_build] [withMaven] invokerPublisher - Archive invoker results for Maven artifact MavenArtifact{org.apache.maven.plugins:maven-release-plugin::3.0.0-SNAPSHOT(version: 3.0.0-SNAPSHOT, snapshot:false) } generated by PluginInvocation{org.apache.maven.plugins:maven-invoker-plugin:3.0.1@run  integration-test-update-versions}: windows-jdk10-m3.5.x_build\maven-release-plugin\target\invoker-reports\*.xml
[windows-jdk10-m3.5.x_build] performing MavenInvokerRecorder, reportsFilenamePattern:'**/windows-jdk10-m3.5.x_build\maven-release-plugin\target\invoker-reports/BUILD*.xml', invokerBuildDir:'**/windows-jdk10-m3.5.x_build\maven-release-plugin\target\it'
[windows-jdk10-m3.5.x_build] Found reports:[f:\jenkins\jenkins-slave\workspace\x_maven-release_IMPROVE_POM-KZP6VA3ZSGGYNTVVOCGLUBHYECJZQ34VIS6H2U5HNYVKLJFCFQKQ@3@2\windows-jdk10-m3.5.x_build\maven-release-plugin\target\invoker-reports\BUILD-projects_update-versions_MRELEASE-555.xml, f:\jenkins\jenkins-slave\workspace\x_maven-release_IMPROVE_POM-KZP6VA3ZSGGYNTVVOCGLUBHYECJZQ34VIS6H2U5HNYVKLJFCFQKQ@3@2\windows-jdk10-m3.5.x_build\maven-release-plugin\target\invoker-reports\BUILD-projects_update-versions_MRELEASE-611.xml, f:\jenkins\jenkins-slave\workspace\x_maven-release_IMPROVE_POM-KZP6VA3ZSGGYNTVVOCGLUBHYECJZQ34VIS6H2U5HNYVKLJFCFQKQ@3@2\windows-jdk10-m3.5.x_build\maven-release-plugin\target\invoker-reports\BUILD-projects_update-versions_MRELEASE-783.xml, f:\jenkins\jenkins-slave\workspace\x_maven-release_IMPROVE_POM-KZP6VA3ZSGGYNTVVOCGLUBHYECJZQ34VIS6H2U5HNYVKLJFCFQKQ@3@2\windows-jdk10-m3.5.x_build\maven-release-plugin\target\invoker-reports\BUILD-projects_update-versions_MRELEASE-976.xml]
[windows-jdk10-m3.5.x_build] Found logs:[f:\jenkins\jenkins-slave\workspace\x_maven-release_IMPROVE_POM-KZP6VA3ZSGGYNTVVOCGLUBHYECJZQ34VIS6H2U5HNYVKLJFCFQKQ@3@2\windows-jdk10-m3.5.x_build\maven-release-plugin\target\it\projects\update-versions\MRELEASE-555\build.log, f:\jenkins\jenkins-slave\workspace\x_maven-release_IMPROVE_POM-KZP6VA3ZSGGYNTVVOCGLUBHYECJZQ34VIS6H2U5HNYVKLJFCFQKQ@3@2\windows-jdk10-m3.5.x_build\maven-release-plugin\target\it\projects\update-versions\MRELEASE-611\build.log, f:\jenkins\jenkins-slave\workspace\x_maven-release_IMPROVE_POM-KZP6VA3ZSGGYNTVVOCGLUBHYECJZQ34VIS6H2U5HNYVKLJFCFQKQ@3@2\windows-jdk10-m3.5.x_build\maven-release-plugin\target\it\projects\update-versions\MRELEASE-783\build.log, f:\jenkins\jenkins-slave\workspace\x_maven-release_IMPROVE_POM-KZP6VA3ZSGGYNTVVOCGLUBHYECJZQ34VIS6H2U5HNYVKLJFCFQKQ@3@2\windows-jdk10-m3.5.x_build\maven-release-plugin\target\it\projects\update-versions\MRELEASE-976\build.log]
[windows-jdk10-m3.5.x_build] Finished parsing Maven Invoker results (found 4)
[windows-jdk10-m3.5.x_build] [withMaven] junitPublisher - Archive test results for Maven artifact org.apache.maven.release:maven-release-api:3.0.0-SNAPSHOT generated by maven-surefire-plugin:test (default-test): windows-jdk10-m3.5.x_build\maven-release-api\target\surefire-reports\*.xml
[windows-jdk10-m3.5.x_build] Recording test results
[windows-jdk10-m3.5.x_build] None of the test reports contained any result
[windows-jdk10-m3.5.x_build] [withMaven] junitPublisher - Archive test results for Maven artifact org.apache.maven.release:maven-release-manager:3.0.0-SNAPSHOT generated by maven-surefire-plugin:test (default-test): windows-jdk10-m3.5.x_build\maven-release-manager\target\surefire-reports\*.xml
[windows-jdk10-m3.5.x_build] Recording test results
[windows-jdk10-m3.5.x_build] [withMaven] junitPublisher - Archive test results for Maven artifact org.apache.maven.plugins:maven-release-plugin:3.0.0-SNAPSHOT generated by maven-surefire-plugin:test (default-test): windows-jdk10-m3.5.x_build\maven-release-plugin\target\surefire-reports\*.xml
[windows-jdk10-m3.5.x_build] Recording test results
[windows-jdk10-m3.5.x_build] [withMaven] junitPublisher - Archive test results for Maven artifact org.apache.maven.release:maven-release-oddeven-policy:3.0.0-SNAPSHOT generated by maven-surefire-plugin:test (default-test): windows-jdk10-m3.5.x_build\maven-release-policies\maven-release-oddeven-policy\target\surefire-reports\*.xml
[windows-jdk10-m3.5.x_build] Recording test results
[windows-jdk10-m3.5.x_build] [withMaven] junitPublisher - Archive test results for Maven artifact org.apache.maven.release:maven-release-semver-policy:3.0.0-SNAPSHOT generated by maven-surefire-plugin:test (default-test): windows-jdk10-m3.5.x_build\maven-release-policies\maven-release-semver-policy\target\surefire-reports\*.xml
[windows-jdk10-m3.5.x_build] Recording test results
[windows-jdk10-m3.5.x_build] [withMaven] junitPublisher - Archive test results for Maven artifact org.apache.maven.release:maven-release-manager:3.0.0-SNAPSHOT generated by maven-failsafe-plugin:integration-test (default): windows-jdk10-m3.5.x_build\maven-release-manager\target\failsafe-reports\*.xml
[windows-jdk10-m3.5.x_build] Recording test results
[windows-jdk10-m3.5.x_build] [withMaven] openTasksPublisher - Scan Tasks for Maven artifact org.apache.maven.release:maven-release-api:3.0.0-SNAPSHOT in source directory windows-jdk10-m3.5.x_build\maven-release-api\src\main\java
[windows-jdk10-m3.5.x_build] [withMaven] openTasksPublisher - Scan Tasks for Maven artifact org.apache.maven.release:maven-release-manager:3.0.0-SNAPSHOT in source directory windows-jdk10-m3.5.x_build\maven-release-manager\src\main\java
[windows-jdk10-m3.5.x_build] [withMaven] openTasksPublisher - Scan Tasks for Maven artifact org.apache.maven.plugins:maven-release-plugin:3.0.0-SNAPSHOT in source directory windows-jdk10-m3.5.x_build\maven-release-plugin\src\main\java
[windows-jdk10-m3.5.x_build] [withMaven] openTasksPublisher - Scan Tasks for Maven artifact org.apache.maven.release:maven-release-oddeven-policy:3.0.0-SNAPSHOT in source directory windows-jdk10-m3.5.x_build\maven-release-policies\maven-release-oddeven-policy\src\main\java
[windows-jdk10-m3.5.x_build] [withMaven] openTasksPublisher - Scan Tasks for Maven artifact org.apache.maven.release:maven-release-semver-policy:3.0.0-SNAPSHOT in source directory windows-jdk10-m3.5.x_build\maven-release-policies\maven-release-semver-policy\src\main\java
[windows-jdk10-m3.5.x_build] [TASKS] Scanning folder 'f:\jenkins\jenkins-slave\workspace\x_maven-release_IMPROVE_POM-KZP6VA3ZSGGYNTVVOCGLUBHYECJZQ34VIS6H2U5HNYVKLJFCFQKQ@3@2' for files matching the pattern 'windows-jdk10-m3.5.x_build\maven-release-api\src\main\java\**\*,windows-jdk10-m3.5.x_build\maven-release-manager\src\main\java\**\*,windows-jdk10-m3.5.x_build\maven-release-plugin\src\main\java\**\*,windows-jdk10-m3.5.x_build\maven-release-policies\maven-release-oddeven-policy\src\main\java\**\*,windows-jdk10-m3.5.x_build\maven-release-policies\maven-release-semver-policy\src\main\java\**\*' - excludes: null
[windows-jdk10-m3.5.x_build] [TASKS] Found 130 files to scan for tasks
[windows-jdk10-m3.5.x_build] [TASKS] Found 21 open tasks.
[windows-jdk10-m3.5.x_build] Skipping warnings blame since pipelines do not have an SCM link.%n
[Pipeline] [windows-jdk10-m3.5.x_build] // withMaven
[Pipeline] [windows-jdk10-m3.5.x_build] cleanWs
[windows-jdk10-m3.5.x_build] [WS-CLEANUP] Deleting project workspace...[WS-CLEANUP] done
[Pipeline] [windows-jdk10-m3.5.x_build] }
[Pipeline] [windows-jdk10-m3.5.x_build] // stage
[Pipeline] [windows-jdk10-m3.5.x_build] }
[Pipeline] [windows-jdk10-m3.5.x_build] // ws
[Pipeline] [windows-jdk10-m3.5.x_build] }
[Pipeline] [windows-jdk10-m3.5.x_build] // node
[Pipeline] [windows-jdk10-m3.5.x_build] }
[Pipeline] // parallel
[Pipeline] stage
[Pipeline] { (Notifications)
[Pipeline] echo
Build result: FAILURE
[Pipeline] jiraIssueSelector
[Pipeline] emailext