Build failed in Jenkins: Maven TLP » maven-project-info-reports-plugin » master #109

classic Classic list List threaded Threaded
2 messages Options
Reply | Threaded
Open this post in threaded view
|

Build failed in Jenkins: Maven TLP » maven-project-info-reports-plugin » master #109

Apache Jenkins Server-2
See https://builds.apache.org/job/maven-box/job/maven-project-info-reports-plugin/job/master/109/

Changes:

* Restore jenkins-win-he-de-1
* [maven-release-plugin] prepare release

All tests passed

Build log:
[...truncated 62318 lines...]
Caused by: org.eclipse.aether.deployment.DeploymentException: Failed to deploy artifacts: Could not transfer artifact org.apache.maven.plugins:maven-project-info-reports-plugin:jar:3.1.0 from/to apache.releases.https (https://repository.apache.org/service/local/staging/deploy/maven2): Transfer failed for https://repository.apache.org/service/local/staging/deploy/maven2/org/apache/maven/plugins/maven-project-info-reports-plugin/3.1.0/maven-project-info-reports-plugin-3.1.0.jar 401 Unauthorized
    at org.eclipse.aether.internal.impl.DefaultDeployer.deploy (DefaultDeployer.java:301)
    at org.eclipse.aether.internal.impl.DefaultDeployer.deploy (DefaultDeployer.java:213)
    at org.eclipse.aether.internal.impl.DefaultRepositorySystem.deploy (DefaultRepositorySystem.java:386)
    at org.apache.maven.artifact.deployer.DefaultArtifactDeployer.deploy (DefaultArtifactDeployer.java:142)
    at org.apache.maven.plugin.deploy.AbstractDeployMojo.deploy (AbstractDeployMojo.java:171)
    at org.apache.maven.plugin.deploy.DeployMojo.deployProject (DeployMojo.java:250)
    at org.apache.maven.plugin.deploy.DeployMojo.execute (DeployMojo.java:169)
    at org.apache.maven.plugin.DefaultBuildPluginManager.executeMojo (DefaultBuildPluginManager.java:137)
    at org.apache.maven.lifecycle.internal.MojoExecutor.execute (MojoExecutor.java:210)
    at org.apache.maven.lifecycle.internal.MojoExecutor.execute (MojoExecutor.java:156)
    at org.apache.maven.lifecycle.internal.MojoExecutor.execute (MojoExecutor.java:148)
    at org.apache.maven.lifecycle.internal.LifecycleModuleBuilder.buildProject (LifecycleModuleBuilder.java:117)
    at org.apache.maven.lifecycle.internal.LifecycleModuleBuilder.buildProject (LifecycleModuleBuilder.java:81)
    at org.apache.maven.lifecycle.internal.builder.singlethreaded.SingleThreadedBuilder.build (SingleThreadedBuilder.java:56)
    at org.apache.maven.lifecycle.internal.LifecycleStarter.execute (LifecycleStarter.java:128)
    at org.apache.maven.DefaultMaven.doExecute (DefaultMaven.java:305)
    at org.apache.maven.DefaultMaven.doExecute (DefaultMaven.java:192)
    at org.apache.maven.DefaultMaven.execute (DefaultMaven.java:105)
    at org.apache.maven.cli.MavenCli.execute (MavenCli.java:957)
    at org.apache.maven.cli.MavenCli.doMain (MavenCli.java:289)
    at org.apache.maven.cli.MavenCli.main (MavenCli.java:193)
    at sun.reflect.NativeMethodAccessorImpl.invoke0 (Native Method)
    at sun.reflect.NativeMethodAccessorImpl.invoke (NativeMethodAccessorImpl.java:62)
    at sun.reflect.DelegatingMethodAccessorImpl.invoke (DelegatingMethodAccessorImpl.java:43)
    at java.lang.reflect.Method.invoke (Method.java:498)
    at org.codehaus.plexus.classworlds.launcher.Launcher.launchEnhanced (Launcher.java:282)
    at org.codehaus.plexus.classworlds.launcher.Launcher.launch (Launcher.java:225)
    at org.codehaus.plexus.classworlds.launcher.Launcher.mainWithExitCode (Launcher.java:406)
    at org.codehaus.plexus.classworlds.launcher.Launcher.main (Launcher.java:347)
Caused by: org.eclipse.aether.transfer.ArtifactTransferException: Could not transfer artifact org.apache.maven.plugins:maven-project-info-reports-plugin:jar:3.1.0 from/to apache.releases.https (https://repository.apache.org/service/local/staging/deploy/maven2): Transfer failed for https://repository.apache.org/service/local/staging/deploy/maven2/org/apache/maven/plugins/maven-project-info-reports-plugin/3.1.0/maven-project-info-reports-plugin-3.1.0.jar 401 Unauthorized
    at org.eclipse.aether.connector.basic.ArtifactTransportListener.transferFailed (ArtifactTransportListener.java:52)
    at org.eclipse.aether.connector.basic.BasicRepositoryConnector$TaskRunner.run (BasicRepositoryConnector.java:369)
    at org.eclipse.aether.connector.basic.BasicRepositoryConnector.put (BasicRepositoryConnector.java:288)
    at org.eclipse.aether.internal.impl.DefaultDeployer.deploy (DefaultDeployer.java:295)
    at org.eclipse.aether.internal.impl.DefaultDeployer.deploy (DefaultDeployer.java:213)
    at org.eclipse.aether.internal.impl.DefaultRepositorySystem.deploy (DefaultRepositorySystem.java:386)
    at org.apache.maven.artifact.deployer.DefaultArtifactDeployer.deploy (DefaultArtifactDeployer.java:142)
    at org.apache.maven.plugin.deploy.AbstractDeployMojo.deploy (AbstractDeployMojo.java:171)
    at org.apache.maven.plugin.deploy.DeployMojo.deployProject (DeployMojo.java:250)
    at org.apache.maven.plugin.deploy.DeployMojo.execute (DeployMojo.java:169)
    at org.apache.maven.plugin.DefaultBuildPluginManager.executeMojo (DefaultBuildPluginManager.java:137)
    at org.apache.maven.lifecycle.internal.MojoExecutor.execute (MojoExecutor.java:210)
    at org.apache.maven.lifecycle.internal.MojoExecutor.execute (MojoExecutor.java:156)
    at org.apache.maven.lifecycle.internal.MojoExecutor.execute (MojoExecutor.java:148)
    at org.apache.maven.lifecycle.internal.LifecycleModuleBuilder.buildProject (LifecycleModuleBuilder.java:117)
    at org.apache.maven.lifecycle.internal.LifecycleModuleBuilder.buildProject (LifecycleModuleBuilder.java:81)
    at org.apache.maven.lifecycle.internal.builder.singlethreaded.SingleThreadedBuilder.build (SingleThreadedBuilder.java:56)
    at org.apache.maven.lifecycle.internal.LifecycleStarter.execute (LifecycleStarter.java:128)
    at org.apache.maven.DefaultMaven.doExecute (DefaultMaven.java:305)
    at org.apache.maven.DefaultMaven.doExecute (DefaultMaven.java:192)
    at org.apache.maven.DefaultMaven.execute (DefaultMaven.java:105)
    at org.apache.maven.cli.MavenCli.execute (MavenCli.java:957)
    at org.apache.maven.cli.MavenCli.doMain (MavenCli.java:289)
    at org.apache.maven.cli.MavenCli.main (MavenCli.java:193)
    at sun.reflect.NativeMethodAccessorImpl.invoke0 (Native Method)
    at sun.reflect.NativeMethodAccessorImpl.invoke (NativeMethodAccessorImpl.java:62)
    at sun.reflect.DelegatingMethodAccessorImpl.invoke (DelegatingMethodAccessorImpl.java:43)
    at java.lang.reflect.Method.invoke (Method.java:498)
    at org.codehaus.plexus.classworlds.launcher.Launcher.launchEnhanced (Launcher.java:282)
    at org.codehaus.plexus.classworlds.launcher.Launcher.launch (Launcher.java:225)
    at org.codehaus.plexus.classworlds.launcher.Launcher.mainWithExitCode (Launcher.java:406)
    at org.codehaus.plexus.classworlds.launcher.Launcher.main (Launcher.java:347)
Caused by: org.apache.maven.wagon.TransferFailedException: Transfer failed for https://repository.apache.org/service/local/staging/deploy/maven2/org/apache/maven/plugins/maven-project-info-reports-plugin/3.1.0/maven-project-info-reports-plugin-3.1.0.jar 401 Unauthorized
    at org.apache.maven.wagon.providers.http.wagon.shared.AbstractHttpClientWagon.put (AbstractHttpClientWagon.java:820)
    at org.apache.maven.wagon.providers.http.wagon.shared.AbstractHttpClientWagon.put (AbstractHttpClientWagon.java:737)
    at org.apache.maven.wagon.providers.http.wagon.shared.AbstractHttpClientWagon.put (AbstractHttpClientWagon.java:709)
    at org.apache.maven.wagon.providers.http.wagon.shared.AbstractHttpClientWagon.put (AbstractHttpClientWagon.java:703)
    at org.apache.maven.wagon.providers.http.wagon.shared.AbstractHttpClientWagon.put (AbstractHttpClientWagon.java:683)
    at org.eclipse.aether.transport.wagon.WagonTransporter$PutTaskRunner.run (WagonTransporter.java:686)
    at org.eclipse.aether.transport.wagon.WagonTransporter.execute (WagonTransporter.java:435)
    at org.eclipse.aether.transport.wagon.WagonTransporter.put (WagonTransporter.java:418)
    at org.eclipse.aether.connector.basic.BasicRepositoryConnector$PutTaskRunner.runTask (BasicRepositoryConnector.java:556)
    at org.eclipse.aether.connector.basic.BasicRepositoryConnector$TaskRunner.run (BasicRepositoryConnector.java:364)
    at org.eclipse.aether.connector.basic.BasicRepositoryConnector.put (BasicRepositoryConnector.java:288)
    at org.eclipse.aether.internal.impl.DefaultDeployer.deploy (DefaultDeployer.java:295)
    at org.eclipse.aether.internal.impl.DefaultDeployer.deploy (DefaultDeployer.java:213)
    at org.eclipse.aether.internal.impl.DefaultRepositorySystem.deploy (DefaultRepositorySystem.java:386)
    at org.apache.maven.artifact.deployer.DefaultArtifactDeployer.deploy (DefaultArtifactDeployer.java:142)
    at org.apache.maven.plugin.deploy.AbstractDeployMojo.deploy (AbstractDeployMojo.java:171)
    at org.apache.maven.plugin.deploy.DeployMojo.deployProject (DeployMojo.java:250)
    at org.apache.maven.plugin.deploy.DeployMojo.execute (DeployMojo.java:169)
    at org.apache.maven.plugin.DefaultBuildPluginManager.executeMojo (DefaultBuildPluginManager.java:137)
    at org.apache.maven.lifecycle.internal.MojoExecutor.execute (MojoExecutor.java:210)
    at org.apache.maven.lifecycle.internal.MojoExecutor.execute (MojoExecutor.java:156)
    at org.apache.maven.lifecycle.internal.MojoExecutor.execute (MojoExecutor.java:148)
    at org.apache.maven.lifecycle.internal.LifecycleModuleBuilder.buildProject (LifecycleModuleBuilder.java:117)
    at org.apache.maven.lifecycle.internal.LifecycleModuleBuilder.buildProject (LifecycleModuleBuilder.java:81)
    at org.apache.maven.lifecycle.internal.builder.singlethreaded.SingleThreadedBuilder.build (SingleThreadedBuilder.java:56)
    at org.apache.maven.lifecycle.internal.LifecycleStarter.execute (LifecycleStarter.java:128)
    at org.apache.maven.DefaultMaven.doExecute (DefaultMaven.java:305)
    at org.apache.maven.DefaultMaven.doExecute (DefaultMaven.java:192)
    at org.apache.maven.DefaultMaven.execute (DefaultMaven.java:105)
    at org.apache.maven.cli.MavenCli.execute (MavenCli.java:957)
    at org.apache.maven.cli.MavenCli.doMain (MavenCli.java:289)
    at org.apache.maven.cli.MavenCli.main (MavenCli.java:193)
    at sun.reflect.NativeMethodAccessorImpl.invoke0 (Native Method)
    at sun.reflect.NativeMethodAccessorImpl.invoke (NativeMethodAccessorImpl.java:62)
    at sun.reflect.DelegatingMethodAccessorImpl.invoke (DelegatingMethodAccessorImpl.java:43)
    at java.lang.reflect.Method.invoke (Method.java:498)
    at org.codehaus.plexus.classworlds.launcher.Launcher.launchEnhanced (Launcher.java:282)
    at org.codehaus.plexus.classworlds.launcher.Launcher.launch (Launcher.java:225)
    at org.codehaus.plexus.classworlds.launcher.Launcher.mainWithExitCode (Launcher.java:406)
    at org.codehaus.plexus.classworlds.launcher.Launcher.main (Launcher.java:347)
[ERROR]
[ERROR] Re-run Maven using the -X switch to enable full debug logging.
[ERROR]
[ERROR] For more information about the errors and possible solutions, please read the following articles:
[ERROR] [Help 1] http://cwiki.apache.org/confluence/display/MAVEN/MojoExecutionException
[Pipeline] }
[Pipeline] // dir
[Pipeline] }
[INFO] There are 11 errors reported by Checkstyle 6.18 with config/maven_checks.xml ruleset.
[INFO] Ignored 11 errors, 0 violation remaining.
[INFO]
[INFO] --- maven-invoker-plugin:3.2.1:verify (integration-test) @ maven-project-info-reports-plugin ---
[DEBUG] Configuring mojo org.apache.maven.plugins:maven-invoker-plugin:3.2.1:verify from plugin realm ClassRealm[plugin>org.apache.maven.plugins:maven-invoker-plugin:3.2.1, parent: sun.misc.Launcher$AppClassLoader@4069b25f]
[DEBUG] Configuring mojo 'org.apache.maven.plugins:maven-invoker-plugin:3.2.1:verify' with basic configurator -->
[DEBUG]   (f) ignoreFailures = false
[DEBUG]   (f) reportsDirectory = f:\jenkins\jenkins-slave\workspace\oject-info-reports-plugin_master@3\windows-jdk7-m3.6.x_build\target\invoker-reports
[DEBUG]   (f) skipInvocation = false
[DEBUG]   (f) suppressSummaries = false
[DEBUG] -- end configuration --
[INFO] -------------------------------------------------
[INFO] Build Summary:
[INFO]   Passed: 13, Failed: 0, Errors: 0, Skipped: 0
[INFO] -------------------------------------------------
[INFO] ------------------------------------------------------------------------
[INFO] BUILD SUCCESS
[INFO] ------------------------------------------------------------------------
[INFO] Total time:  04:23 min
[INFO] Finished at: 2020-05-23T14:04:10-07:00
[INFO] ------------------------------------------------------------------------
[INFO] [jenkins-event-spy] Generated F:\jenkins\jenkins-slave\workspace\oject-info-reports-plugin_master@3@tmp\withMaven1666f883\maven-spy-20200523-135946-1925368809672451260245.log
Picked up JAVA_TOOL_OPTIONS: -Dmaven.ext.class.path="f:\jenkins\jenkins-slave\workspace\oject-info-reports-plugin_master@3@tmp\withMaven1666f883\pipeline-maven-spy.jar" -Dorg.jenkinsci.plugins.pipeline.maven.reportsFolder="f:\jenkins\jenkins-slave\workspace\oject-info-reports-plugin_master@3@tmp\withMaven1666f883"
[Pipeline] }
[Pipeline] // dir
[Pipeline] }
[withMaven] artifactsPublisher - Archive artifact windows-jdk7-m3.6.x_build\pom.xml under org\apache\maven\plugins\maven-project-info-reports-plugin\3.1.0\maven-project-info-reports-plugin-3.1.0.pom
[withMaven] artifactsPublisher - Archive artifact windows-jdk7-m3.6.x_build\target\maven-project-info-reports-plugin-3.1.0.jar under org\apache\maven\plugins\maven-project-info-reports-plugin\3.1.0\maven-project-info-reports-plugin-3.1.0.jar
[withMaven] junitPublisher - Archive test results for Maven artifact org.apache.maven.plugins:maven-project-info-reports-plugin:maven-plugin:3.1.0 generated by maven-surefire-plugin:test (default-test): windows-jdk7-m3.6.x_build\target\surefire-reports\*.xml
Recording test results
[withMaven] openTasksPublisher - Scan Tasks for Maven artifact org.apache.maven.plugins:maven-project-info-reports-plugin:maven-plugin:3.1.0 in source directory windows-jdk7-m3.6.x_build\src\main\java
[TASKS] Scanning folder 'f:\jenkins\jenkins-slave\workspace\oject-info-reports-plugin_master@3' for files matching the pattern 'windows-jdk7-m3.6.x_build\src\main\java\**\*' - excludes: null
[TASKS] Found 27 files to scan for tasks
[TASKS] Found 12 open tasks.
Skipping warnings blame since pipelines do not have an SCM link.%n
[TASKS] Computing warning deltas based on reference build #108
[withMaven] invokerPublisher - Archive invoker results for Maven artifact MavenArtifact{org.apache.maven.plugins:maven-project-info-reports-plugin:maven-plugin:3.1.0(version: 3.1.0, snapshot:false) } generated by PluginInvocation{org.apache.maven.plugins:maven-invoker-plugin:3.2.1@integration-test  integration-test}: windows-jdk7-m3.6.x_build\target\invoker-reports\*.xml
[withMaven] junitPublisher - Archive test results for Maven artifact org.apache.maven.plugins:maven-project-info-reports-plugin:maven-plugin:3.1.0 generated by maven-surefire-plugin:test (default-test): linux-jdk8-m3.6.x_build/target/surefire-reports/*.xml
Recording test results
[INFO] run post-build script verify.bsh
[INFO]           minimal-pom/pom.xml .............................. SUCCESS (16.9 s)
[INFO] Building: mpir-229/pom.xml
[withMaven] Publishers: Generated Artifacts Publisher: 129 ms, Junit Publisher: 424 ms, Open Task Scanner Publisher: 159 ms, Dependencies Fingerprint Publisher: 1 ms, Invoker Publisher: 6536 ms, Pipeline Graph Publisher: 1 ms
[Pipeline] // withMaven
[Pipeline] cleanWs
[WS-CLEANUP] Deleting project workspace...
[WS-CLEANUP] Deferred wipeout is used...
[WS-CLEANUP] done
[Pipeline] }
[Pipeline] // stage
[Pipeline] }
[Pipeline] // ws
[Pipeline] }
[Pipeline] // node
[Pipeline] }
[withMaven] openTasksPublisher - Scan Tasks for Maven artifact org.apache.maven.plugins:maven-project-info-reports-plugin:maven-plugin:3.1.0 in source directory linux-jdk8-m3.6.x_build/src/main/java
[TASKS] Scanning folder '/home/jenkins/jenkins-slave/workspace/oject-info-reports-plugin_master@3' for files matching the pattern 'linux-jdk8-m3.6.x_build/src/main/java/**/*' - excludes: null
[TASKS] Found 27 files to scan for tasks
[TASKS] Found 12 open tasks.
Skipping warnings blame since pipelines do not have an SCM link.%n
[TASKS] Computing warning deltas based on reference build #108
[withMaven] invokerPublisher - Archive invoker results for Maven artifact MavenArtifact{org.apache.maven.plugins:maven-project-info-reports-plugin:maven-plugin:3.1.0(version: 3.1.0, snapshot:false) } generated by PluginInvocation{org.apache.maven.plugins:maven-invoker-plugin:3.2.1@integration-test  integration-test}: linux-jdk8-m3.6.x_build/target/invoker-reports/*.xml
[INFO] run post-build script verify.groovy
[INFO]           mpir-229/pom.xml ................................. SUCCESS (6.9 s)
[INFO]
[INFO] --- maven-checkstyle-plugin:3.0.0:check (checkstyle-check) @ maven-project-info-reports-plugin ---
[INFO] There are 11 errors reported by Checkstyle 6.18 with config/maven_checks.xml ruleset.
[INFO] Ignored 11 errors, 0 violation remaining.
[INFO]
[INFO] --- maven-invoker-plugin:3.2.1:verify (integration-test) @ maven-project-info-reports-plugin ---
[INFO] -------------------------------------------------
[INFO] Build Summary:
[INFO]   Passed: 13, Failed: 0, Errors: 0, Skipped: 0
[INFO] -------------------------------------------------
[INFO] ------------------------------------------------------------------------
[INFO] BUILD SUCCESS
[INFO] ------------------------------------------------------------------------
[INFO] Total time:  04:21 min
[INFO] Finished at: 2020-05-23T21:04:22Z
[INFO] ------------------------------------------------------------------------
[INFO] [jenkins-event-spy] Generated /home/jenkins/jenkins-slave/workspace/oject-info-reports-plugin_master@2@2@tmp/withMaven9eaf243a/maven-spy-20200523-210001-2704247239063415847535.log
[Pipeline] }
[Pipeline] // dir
[Pipeline] }
[withMaven] artifactsPublisher - Archive artifact linux-jdk11-m3.6.x_build/pom.xml under org/apache/maven/plugins/maven-project-info-reports-plugin/3.1.0/maven-project-info-reports-plugin-3.1.0.pom
[withMaven] artifactsPublisher - Archive artifact linux-jdk11-m3.6.x_build/target/maven-project-info-reports-plugin-3.1.0.jar under org/apache/maven/plugins/maven-project-info-reports-plugin/3.1.0/maven-project-info-reports-plugin-3.1.0.jar
[withMaven] junitPublisher - Archive test results for Maven artifact org.apache.maven.plugins:maven-project-info-reports-plugin:maven-plugin:3.1.0 generated by maven-surefire-plugin:test (default-test): linux-jdk11-m3.6.x_build/target/surefire-reports/*.xml
Recording test results
[withMaven] openTasksPublisher - Scan Tasks for Maven artifact org.apache.maven.plugins:maven-project-info-reports-plugin:maven-plugin:3.1.0 in source directory linux-jdk11-m3.6.x_build/src/main/java
[withMaven] Publishers: Generated Artifacts Publisher: 466 ms, Junit Publisher: 6244 ms, Open Task Scanner Publisher: 1211 ms, Dependencies Fingerprint Publisher: 1 ms, Invoker Publisher: 12991 ms, Pipeline Graph Publisher: 1 ms
[TASKS] Scanning folder '/home/jenkins/jenkins-slave/workspace/oject-info-reports-plugin_master@2@2' for files matching the pattern 'linux-jdk11-m3.6.x_build/src/main/java/**/*' - excludes: null
[TASKS] Found 27 files to scan for tasks
[TASKS] Found 12 open tasks.
Skipping warnings blame since pipelines do not have an SCM link.%n
[TASKS] Computing warning deltas based on reference build #108
[Pipeline] // withMaven
[Pipeline] cleanWs
[WS-CLEANUP] Deleting project workspace...
[WS-CLEANUP] Deferred wipeout is used...
[WS-CLEANUP] done
[Pipeline] cleanWs
[withMaven] invokerPublisher - Archive invoker results for Maven artifact MavenArtifact{org.apache.maven.plugins:maven-project-info-reports-plugin:maven-plugin:3.1.0(version: 3.1.0, snapshot:false) } generated by PluginInvocation{org.apache.maven.plugins:maven-invoker-plugin:3.2.1@integration-test  integration-test}: linux-jdk11-m3.6.x_build/target/invoker-reports/*.xml
[WS-CLEANUP] Deleting project workspace...
[WS-CLEANUP] Deferred wipeout is used...
[WS-CLEANUP] done
[Pipeline] }
[Pipeline] // stage
[Pipeline] }
[Pipeline] // ws
[Pipeline] }
[Pipeline] // node
[Pipeline] }
Failed in branch linux-jdk8-m3.6.x_build
[withMaven] Publishers: Generated Artifacts Publisher: 1301 ms, Junit Publisher: 6381 ms, Open Task Scanner Publisher: 1220 ms, Dependencies Fingerprint Publisher: 1 ms, Invoker Publisher: 12657 ms
[Pipeline] // withMaven
[Pipeline] cleanWs
[WS-CLEANUP] Deleting project workspace...
[WS-CLEANUP] Deferred wipeout is used...
[WS-CLEANUP] done
[Pipeline] }
[Pipeline] // stage
[Pipeline] }
[Pipeline] // ws
[Pipeline] }
[Pipeline] // node
[Pipeline] }
[Pipeline] // parallel
[Pipeline] stage
[Pipeline] { (Notifications)
[Pipeline] echo
Build result: FAILURE
[Pipeline] jiraIssueSelector
[Pipeline] echo
The authors of changes [rfscholte, michaelo].
[Pipeline] echo
Sending email ...
[Pipeline] emailext
Reply | Threaded
Open this post in threaded view
|

Build succeeded in Jenkins: Maven TLP » maven-project-info-reports-plugin » master #110

Apache Jenkins Server-2
See https://builds.apache.org/job/maven-box/job/maven-project-info-reports-plugin/job/master/110/

Changes:

* [maven-release-plugin] prepare for next development iteration

All tests passed