Build failed in Jenkins: Maven TLP » maven-project-info-reports-plugin » MPIR-366 #12

Previous Topic Next Topic
 
classic Classic list List threaded Threaded
9 messages Options
Reply | Threaded
Open this post in threaded view
|

Build failed in Jenkins: Maven TLP » maven-project-info-reports-plugin » MPIR-366 #12

Apache Jenkins Server-2
See https://builds.apache.org/job/maven-box/job/maven-project-info-reports-plugin/job/MPIR-366/12/

Changes:

* [MPIR-366] Drop Maven2 support Getting false positives on Jenkins,
* [MPIR-366] Drop Maven2 support Getting false positives on Jenkins,
* [MPIR-366] Drop Maven2 support Getting false positives on Jenkins,
* [MPIR-366] Drop Maven2 support Getting false positives on Jenkins,

All tests passed

Build log:
[...truncated 1.44 MB...]
[linux-jdk10] [INFO] Downloading from central: https://repo.maven.apache.org/maven2/org/abego/treelayout/org.abego.treelayout.core/1.0.1/org.abego.treelayout.core-1.0.1.jar
[linux-jdk10] [INFO] Downloaded from central: https://repo.maven.apache.org/maven2/org/antlr/antlr4-annotations/4.3/antlr4-annotations-4.3.jar (10 kB at 632 kB/s)
[linux-jdk10] [INFO] Downloading from central: https://repo.maven.apache.org/maven2/com/google/guava/guava/18.0/guava-18.0.jar
[linux-jdk10] [INFO] Downloaded from central: https://repo.maven.apache.org/maven2/org/abego/treelayout/org.abego.treelayout.core/1.0.1/org.abego.treelayout.core-1.0.1.jar (26 kB at 823 kB/s)
[linux-jdk10] [INFO] Downloaded from central: https://repo.maven.apache.org/maven2/commons-beanutils/commons-beanutils-core/1.8.3/commons-beanutils-core-1.8.3.jar (207 kB at 11 MB/s)
[linux-jdk10] [INFO] Downloaded from central: https://repo.maven.apache.org/maven2/org/antlr/antlr4-runtime/4.3/antlr4-runtime-4.3.jar (345 kB at 9.9 MB/s)
[linux-jdk10] [INFO] Downloaded from central: https://repo.maven.apache.org/maven2/com/puppycrawl/tools/checkstyle/6.1.1/checkstyle-6.1.1.jar (1.0 MB at 20 MB/s)
[linux-jdk10] [INFO] Downloaded from central: https://repo.maven.apache.org/maven2/com/google/guava/guava/18.0/guava-18.0.jar (2.3 MB at 31 MB/s)
[linux-jdk10] [INFO] There are 10 errors reported by Checkstyle 6.1.1 with config/maven_checks.xml ruleset.
[linux-jdk10] [INFO] Ignored 10 errors, 0 violation remaining.
[linux-jdk10] [INFO]
[linux-jdk10] [INFO] --- maven-jarsigner-plugin:1.3.2:verify (verify) @ maven-project-info-reports-plugin ---
[linux-jdk10] [WARNING] Picked up JAVA_TOOL_OPTIONS: -Dmaven.ext.class.path="/home/jenkins/jenkins-slave/workspace/nfo-reports-plugin_MPIR-366-S464FI4ATSVOULE3N7MCKV5FYYG6GVHDD7OLISMYBGUEPLQM2UNA@tmp/withMaven1b21c922/pipeline-maven-spy.jar" -Dorg.jenkinsci.plugins.pipeline.maven.reportsFolder="/home/jenkins/jenkins-slave/workspace/nfo-reports-plugin_MPIR-366-S464FI4ATSVOULE3N7MCKV5FYYG6GVHDD7OLISMYBGUEPLQM2UNA@tmp/withMaven1b21c922"
[linux-jdk10] [INFO] 1 archive(s) processed
[linux-jdk10] [INFO]
[linux-jdk10] [INFO] --- maven-invoker-plugin:2.0.0:verify (integration-test) @ maven-project-info-reports-plugin ---
[linux-jdk10] [INFO] -------------------------------------------------
[linux-jdk10] [INFO] Build Summary:
[linux-jdk10] [INFO]   Passed: 4, Failed: 7, Errors: 0, Skipped: 0
[linux-jdk10] [INFO] -------------------------------------------------
[linux-jdk10] [ERROR] The following builds failed:
[linux-jdk10] [ERROR] *  minimal-pom/pom.xml
[linux-jdk10] [ERROR] *  mpir-229/pom.xml
[linux-jdk10] [ERROR] *  multi-module/pom.xml
[linux-jdk10] [ERROR] *  MPIR-242/pom.xml
[linux-jdk10] [ERROR] *  full-pom/pom.xml
[linux-jdk10] [ERROR] *  git/pom.xml
[linux-jdk10] [ERROR] *  dependencies-java-1.7-and-1.8/pom.xml
[linux-jdk10] [INFO] -------------------------------------------------
[linux-jdk10] [INFO] ------------------------------------------------------------------------
[linux-jdk10] [INFO] BUILD FAILURE
[linux-jdk10] [INFO] ------------------------------------------------------------------------
[linux-jdk10] [INFO] Total time: 02:32 min
[linux-jdk10] [INFO] Finished at: 2018-04-01T13:22:11Z
[linux-jdk10] [INFO] Final Memory: 54M/308M
[linux-jdk10] [INFO] ------------------------------------------------------------------------
[linux-jdk10] [INFO] [jenkins-event-spy] Generated /home/jenkins/jenkins-slave/workspace/nfo-reports-plugin_MPIR-366-S464FI4ATSVOULE3N7MCKV5FYYG6GVHDD7OLISMYBGUEPLQM2UNA@tmp/withMaven1b21c922/maven-spy-20180401-131938-6404523363420178267684.log
[linux-jdk10] [ERROR] Failed to execute goal org.apache.maven.plugins:maven-invoker-plugin:2.0.0:verify (integration-test) on project maven-project-info-reports-plugin: 7 builds failed. See console output above for details. -> [Help 1]
[linux-jdk10] [ERROR]
[linux-jdk10] [ERROR] To see the full stack trace of the errors, re-run Maven with the -e switch.
[linux-jdk10] [ERROR] Re-run Maven using the -X switch to enable full debug logging.
[linux-jdk10] [ERROR]
[linux-jdk10] [ERROR] For more information about the errors and possible solutions, please read the following articles:
[linux-jdk10] [ERROR] [Help 1] http://cwiki.apache.org/confluence/display/MAVEN/MojoFailureException
[Pipeline] [linux-jdk10] }
[Pipeline] [linux-jdk10] // dir
[linux-jdk7] [INFO] run script verify.bsh
[linux-jdk7] [INFO] ..SUCCESS (66.8 s)
[linux-jdk7] [INFO] Building: multi-module/pom.xml
[linux-jdk8] [INFO] run script verify.bsh
[linux-jdk8] [INFO] ..SUCCESS (61.2 s)
[linux-jdk8] [INFO] Building: java-version/pom.xml
[linux-jdk8] [INFO] run script verify.groovy
[linux-jdk8] [INFO] ..SUCCESS (3.8 s)
[linux-jdk8] [INFO] Building: mpir-229/pom.xml
[linux-jdk8] [INFO] run script verify.groovy
[linux-jdk8] [INFO] ..SUCCESS (4.0 s)
[linux-jdk8] [INFO] Building: MPIR-242/pom.xml
[linux-jdk8] [INFO] run script verify.groovy
[linux-jdk8] [INFO] ..SUCCESS (4.5 s)
[linux-jdk8] [INFO] Building: MPIR-300/pom.xml
[linux-jdk9] [INFO] run script verify.bsh
[linux-jdk9] [INFO] ..SUCCESS (62.4 s)
[linux-jdk9] [INFO] Building: java-version/pom.xml
[linux-jdk9] [INFO] run script verify.groovy
[linux-jdk9] [INFO] ..SUCCESS (4.5 s)
[linux-jdk9] [INFO] Building: mpir-229/pom.xml
[Pipeline] [linux-jdk10] }
[linux-jdk10] [withMaven] junitPublisher - Archive test results for Maven artifact org.apache.maven.plugins:maven-project-info-reports-plugin:2.10-SNAPSHOT generated by maven-surefire-plugin:test (default-test): m/target/surefire-reports/*.xml
[linux-jdk10] [withMaven] junitPublisher - Jenkins JUnit Attachments Plugin not found, can't publish test attachments.Recording test results
[linux-jdk10] [withMaven] junitPublisher - Archive test results for Maven artifact org.apache.maven.plugins.project-info-reports.its:dep:1.0-SNAPSHOT generated by maven-surefire-plugin:test (default-test): m/target/it/multi-module/dep/target/surefire-reports/*.xml
[linux-jdk10] [withMaven] junitPublisher - Jenkins JUnit Attachments Plugin not found, can't publish test attachments.Recording test results
[linux-jdk10] None of the test reports contained any result
[linux-jdk10] [withMaven] junitPublisher - Archive test results for Maven artifact org.apache.maven.plugins.project-info-reports.its:main:1.0-SNAPSHOT generated by maven-surefire-plugin:test (default-test): m/target/it/multi-module/main/target/surefire-reports/*.xml
[linux-jdk10] [withMaven] junitPublisher - Jenkins JUnit Attachments Plugin not found, can't publish test attachments.Recording test results
[linux-jdk10] None of the test reports contained any result
[Pipeline] [linux-jdk10] // withMaven
[Pipeline] [linux-jdk10] echo
[linux-jdk10] [FAIL FAST] This is the first failure and likely root cause
[Pipeline] [linux-jdk10] }
[Pipeline] [linux-jdk10] // stage
[Pipeline] [linux-jdk10] }
[Pipeline] [linux-jdk10] // node
[Pipeline] [linux-jdk10] }
[linux-jdk7] Sending interrupt signal to process
[linux-jdk10] Failed in branch linux-jdk10
[linux-jdk7] [INFO] ..FAILED (13.0 s)
[linux-jdk7] [INFO]   The build exited with code 143. See /home/jenkins/jenkins-slave/workspace/nfo-reports-plugin_MPIR-366-S464FI4ATSVOULE3N7MCKV5FYYG6GVHDD7OLISMYBGUEPLQM2UNA/m/target/it/multi-module/build.log for details.
[linux-jdk7] [INFO] Building: MPIR-251/pom.xml
[linux-jdk7] Terminated
[linux-jdk8] Sending interrupt signal to process
[linux-jdk8] [INFO] run script verify.groovy
[linux-jdk8] [INFO] ..SUCCESS (4.1 s)
[linux-jdk8] [INFO]
[linux-jdk8] [INFO] --- maven-checkstyle-plugin:2.15:check (checkstyle-check) @ maven-project-info-reports-plugin ---
[linux-jdk8] [INFO] Downloading from central: https://repo.maven.apache.org/maven2/org/apache/maven/shared/maven-shared-resources/2/maven-shared-resources-2.pom
[linux-jdk8] [INFO] Downloaded from central: https://repo.maven.apache.org/maven2/org/apache/maven/shared/maven-shared-resources/2/maven-shared-resources-2.pom (3.0 kB at 197 kB/s)
[linux-jdk8] [INFO] Downloading from central: https://repo.maven.apache.org/maven2/org/codehaus/plexus/plexus-utils/3.0.10/plexus-utils-3.0.10.pom
[linux-jdk8] [INFO] Downloaded from central: https://repo.maven.apache.org/maven2/org/codehaus/plexus/plexus-utils/3.0.10/plexus-utils-3.0.10.pom (3.1 kB at 286 kB/s)
[linux-jdk8] [INFO] Downloading from central: https://repo.maven.apache.org/maven2/org/codehaus/plexus/plexus-resources/1.0.1/plexus-resources-1.0.1.pom
[linux-jdk9] Sending interrupt signal to process
[linux-jdk8] [INFO] Downloaded from central: https://repo.maven.apache.org/maven2/org/codehaus/plexus/plexus-resources/1.0.1/plexus-resources-1.0.1.pom (1.3 kB at 120 kB/s)
[linux-jdk8] [INFO] Downloading from central: https://repo.maven.apache.org/maven2/com/puppycrawl/tools/checkstyle/6.1.1/checkstyle-6.1.1.pom
[linux-jdk8] [INFO] Downloaded from central: https://repo.maven.apache.org/maven2/com/puppycrawl/tools/checkstyle/6.1.1/checkstyle-6.1.1.pom (30 kB at 2.2 MB/s)
[linux-jdk8] [INFO] Downloading from central: https://repo.maven.apache.org/maven2/org/antlr/antlr4-runtime/4.3/antlr4-runtime-4.3.pom
[linux-jdk8] [INFO] Downloaded from central: https://repo.maven.apache.org/maven2/org/antlr/antlr4-runtime/4.3/antlr4-runtime-4.3.pom (4.8 kB at 399 kB/s)
[linux-jdk8] [INFO] Downloading from central: https://repo.maven.apache.org/maven2/org/antlr/antlr4-master/4.3/antlr4-master-4.3.pom
[linux-jdk8] [INFO] Downloaded from central: https://repo.maven.apache.org/maven2/org/antlr/antlr4-master/4.3/antlr4-master-4.3.pom (7.9 kB at 721 kB/s)
[linux-jdk8] [INFO] Downloading from central: https://repo.maven.apache.org/maven2/org/abego/treelayout/org.abego.treelayout.core/1.0.1/org.abego.treelayout.core-1.0.1.pom
[linux-jdk8] [INFO] Downloaded from central: https://repo.maven.apache.org/maven2/org/abego/treelayout/org.abego.treelayout.core/1.0.1/org.abego.treelayout.core-1.0.1.pom (3.1 kB at 282 kB/s)
[linux-jdk8] [INFO] Downloading from central: https://repo.maven.apache.org/maven2/org/antlr/antlr4-annotations/4.3/antlr4-annotations-4.3.pom
[linux-jdk8] [INFO] Downloaded from central: https://repo.maven.apache.org/maven2/org/antlr/antlr4-annotations/4.3/antlr4-annotations-4.3.pom (1.3 kB at 106 kB/s)
[linux-jdk8] [INFO] Downloading from central: https://repo.maven.apache.org/maven2/commons-beanutils/commons-beanutils-core/1.8.3/commons-beanutils-core-1.8.3.pom
[linux-jdk8] [INFO] Downloaded from central: https://repo.maven.apache.org/maven2/commons-beanutils/commons-beanutils-core/1.8.3/commons-beanutils-core-1.8.3.pom (1.6 kB at 149 kB/s)
[linux-jdk8] [INFO] Downloading from central: https://repo.maven.apache.org/maven2/com/google/guava/guava/18.0/guava-18.0.pom
[linux-jdk8] [INFO] Downloaded from central: https://repo.maven.apache.org/maven2/com/google/guava/guava/18.0/guava-18.0.pom (5.7 kB at 515 kB/s)
[linux-jdk8] [INFO] Downloading from central: https://repo.maven.apache.org/maven2/com/google/guava/guava-parent/18.0/guava-parent-18.0.pom
[linux-jdk8] [INFO] Downloaded from central: https://repo.maven.apache.org/maven2/com/google/guava/guava-parent/18.0/guava-parent-18.0.pom (7.7 kB at 699 kB/s)
[linux-jdk8] [INFO] Downloading from central: https://repo.maven.apache.org/maven2/org/apache/maven/shared/maven-shared-resources/2/maven-shared-resources-2.jar
[linux-jdk8] [INFO] Downloading from central: https://repo.maven.apache.org/maven2/org/codehaus/plexus/plexus-resources/1.0.1/plexus-resources-1.0.1.jar
[linux-jdk8] [INFO] Downloading from central: https://repo.maven.apache.org/maven2/com/puppycrawl/tools/checkstyle/6.1.1/checkstyle-6.1.1.jar
[linux-jdk8] [INFO] Downloading from central: https://repo.maven.apache.org/maven2/org/antlr/antlr4-runtime/4.3/antlr4-runtime-4.3.jar
[linux-jdk8] [INFO] Downloading from central: https://repo.maven.apache.org/maven2/org/abego/treelayout/org.abego.treelayout.core/1.0.1/org.abego.treelayout.core-1.0.1.jar
[linux-jdk8] [INFO] Downloaded from central: https://repo.maven.apache.org/maven2/org/apache/maven/shared/maven-shared-resources/2/maven-shared-resources-2.jar (13 kB at 816 kB/s)
[linux-jdk8] [INFO] Downloading from central: https://repo.maven.apache.org/maven2/org/antlr/antlr4-annotations/4.3/antlr4-annotations-4.3.jar
[linux-jdk8] [INFO] Downloaded from central: https://repo.maven.apache.org/maven2/org/codehaus/plexus/plexus-resources/1.0.1/plexus-resources-1.0.1.jar (22 kB at 1.2 MB/s)
[linux-jdk8] [INFO] Downloading from central: https://repo.maven.apache.org/maven2/commons-beanutils/commons-beanutils-core/1.8.3/commons-beanutils-core-1.8.3.jar
[linux-jdk8] [INFO] Downloaded from central: https://repo.maven.apache.org/maven2/org/abego/treelayout/org.abego.treelayout.core/1.0.1/org.abego.treelayout.core-1.0.1.jar (26 kB at 1.4 MB/s)
[linux-jdk8] [INFO] Downloading from central: https://repo.maven.apache.org/maven2/com/google/guava/guava/18.0/guava-18.0.jar
[linux-jdk8] [INFO] Downloaded from central: https://repo.maven.apache.org/maven2/org/antlr/antlr4-annotations/4.3/antlr4-annotations-4.3.jar (10 kB at 361 kB/s)
[linux-jdk8] [INFO] Downloaded from central: https://repo.maven.apache.org/maven2/org/antlr/antlr4-runtime/4.3/antlr4-runtime-4.3.jar (345 kB at 9.3 MB/s)
[linux-jdk8] [INFO] Downloaded from central: https://repo.maven.apache.org/maven2/commons-beanutils/commons-beanutils-core/1.8.3/commons-beanutils-core-1.8.3.jar (207 kB at 5.0 MB/s)
[linux-jdk8] [INFO] Downloaded from central: https://repo.maven.apache.org/maven2/com/puppycrawl/tools/checkstyle/6.1.1/checkstyle-6.1.1.jar (1.0 MB at 17 MB/s)
[linux-jdk8] [INFO] Downloaded from central: https://repo.maven.apache.org/maven2/com/google/guava/guava/18.0/guava-18.0.jar (2.3 MB at 16 MB/s)
[linux-jdk8] Terminated
[linux-jdk9] [INFO] ..FAILED (4.4 s)
[linux-jdk9] [INFO]   The build exited with code 143. See /home/jenkins/jenkins-slave/workspace/nfo-reports-plugin_MPIR-366-S464FI4ATSVOULE3N7MCKV5FYYG6GVHDD7OLISMYBGUEPLQM2UNA@2/m/target/it/mpir-229/build.log for details.
[linux-jdk9] [INFO] Building: MPIR-242/pom.xml
[Pipeline] [windows-jdk7] // node
[Pipeline] [windows-jdk8] // node
[Pipeline] [windows-jdk9] // node
[Pipeline] [windows-jdk10] // node
[Pipeline] [windows-jdk7] }
[windows-jdk7] Failed in branch windows-jdk7
[Pipeline] [windows-jdk8] }
[windows-jdk8] Failed in branch windows-jdk8
[Pipeline] [windows-jdk9] }
[windows-jdk9] Failed in branch windows-jdk9
[Pipeline] [windows-jdk10] }
[windows-jdk10] Failed in branch windows-jdk10
[Pipeline] [linux-jdk7] }
[Pipeline] [linux-jdk7] // dir
[linux-jdk9] Terminated
[Pipeline] [linux-jdk7] }
[linux-jdk7] [withMaven] artifactsPublisher - Archive artifact m/target/it/MPIR-349/parent/pom.xml under org/apache/maven/plugins/project-info-reports/its/mpir-349/1.0-SNAPSHOT/mpir-349-1.0-SNAPSHOT.pom
[linux-jdk7] [withMaven] artifactsPublisher - Archive artifact m/target/it/MPIR-349/module-flat/pom.xml under org/apache/maven/plugins/project-info-reports/its/mpir-349-module-hierarchical/1.0-SNAPSHOT/mpir-349-module-hierarchical-1.0-SNAPSHOT.pom
[linux-jdk7] [withMaven] artifactsPublisher - Archive artifact m/target/it/MPIR-349/parent/module-hierarchical/pom.xml under org/apache/maven/plugins/project-info-reports/its/mpir-349-module-flat/1.0-SNAPSHOT/mpir-349-module-flat-1.0-SNAPSHOT.pom
[linux-jdk7] [withMaven] artifactsPublisher - Archive artifact m/target/it/MPIR-349/parent/pom.xml under org/apache/maven/plugins/project-info-reports/its/mpir-349/1.0-SNAPSHOT/mpir-349-1.0-SNAPSHOT.pom
[linux-jdk7] [withMaven] artifactsPublisher - Archive artifact m/target/it/MPIR-349/module-flat/pom.xml under org/apache/maven/plugins/project-info-reports/its/mpir-349-module-hierarchical/1.0-SNAPSHOT/mpir-349-module-hierarchical-1.0-SNAPSHOT.pom
[linux-jdk7] [withMaven] artifactsPublisher - Archive artifact m/target/it/MPIR-349/parent/module-hierarchical/pom.xml under org/apache/maven/plugins/project-info-reports/its/mpir-349-module-flat/1.0-SNAPSHOT/mpir-349-module-flat-1.0-SNAPSHOT.pom
[linux-jdk7] [withMaven] artifactsPublisher - Archive artifact m/target/it/MPIR-242/pom.xml under org/apache/maven/plugins/project-info-reports/its/MPIR-242/1.0-SNAPSHOT/MPIR-242-1.0-SNAPSHOT.pom
[linux-jdk7] [withMaven] artifactsPublisher - Archive artifact m/target/it/MPIR-300/pom.xml under org/apache/maven/plugins/project-info-reports/its/mpir-300/1.0-SNAPSHOT/mpir-300-1.0-SNAPSHOT.pom
[linux-jdk7] [withMaven] artifactsPublisher - Archive artifact m/target/it/git/pom.xml under org/apache/maven/plugins/project-info-reports/it/git/parent/1.0-SNAPSHOT/parent-1.0-SNAPSHOT.pom
[linux-jdk7] [withMaven] artifactsPublisher - Archive artifact m/target/it/git/inherited/pom.xml under org/apache/maven/plugins/project-info-reports/it/git/inherited/1.0-SNAPSHOT/inherited-1.0-SNAPSHOT.pom
[linux-jdk7] [withMaven] artifactsPublisher - Archive artifact m/target/it/git/push/pom.xml under org/apache/maven/plugins/project-info-reports/it/git/push/push/1.0-SNAPSHOT/push-1.0-SNAPSHOT.pom
[linux-jdk7] [withMaven] artifactsPublisher - Archive artifact m/target/it/git/push/inherited/pom.xml under org/apache/maven/plugins/project-info-reports/it/git/push/inherited/1.0-SNAPSHOT/inherited-1.0-SNAPSHOT.pom
[linux-jdk7] [withMaven] artifactsPublisher - Archive artifact m/target/it/java-version/pom.xml under org/apache/maven/plugins/project-info-reports/java-version/1.0-SNAPSHOT/java-version-1.0-SNAPSHOT.pom
[linux-jdk7] [withMaven] artifactsPublisher - Archive artifact m/target/it/java-version/plugin/pom.xml under org/apache/maven/plugins/project-info-reports/plugin/1.0-SNAPSHOT/plugin-1.0-SNAPSHOT.pom
[linux-jdk7] [withMaven] artifactsPublisher - Archive artifact m/target/it/java-version/pluginManagement/pom.xml under org/apache/maven/plugins/project-info-reports/pluginManagement/1.0-SNAPSHOT/pluginManagement-1.0-SNAPSHOT.pom
[linux-jdk7] [withMaven] artifactsPublisher - Archive artifact m/target/it/java-version/property/pom.xml under org/apache/maven/plugins/project-info-reports/property/1.0-SNAPSHOT/property-1.0-SNAPSHOT.pom
[linux-jdk7] [withMaven] artifactsPublisher - Archive artifact m/target/it/minimal-pom/pom.xml under org/apache/maven/plugins/project-info-reports/minimal-pom/1.0-SNAPSHOT/minimal-pom-1.0-SNAPSHOT.pom
[linux-jdk7] [withMaven] artifactsPublisher - Archive artifact m/target/it/full-pom/pom.xml under org/apache/maven/plugins/project-info-reports/full-pom/1.0-SNAPSHOT/full-pom-1.0-SNAPSHOT.pom
[linux-jdk7] [withMaven] artifactsPublisher - Archive artifact m/target/it/multi-module/pom.xml under org/apache/maven/plugins/project-info-reports/its/multi-module/1.0-SNAPSHOT/multi-module-1.0-SNAPSHOT.pom
[linux-jdk7] [withMaven] artifactsPublisher - Archive artifact m/target/it/multi-module/dep/pom.xml under org/apache/maven/plugins/project-info-reports/its/dep/1.0-SNAPSHOT/dep-1.0-SNAPSHOT.pom
[linux-jdk7] [withMaven] artifactsPublisher - Archive artifact m/target/it/multi-module/dep/target/dep-1.0-SNAPSHOT.jar under org/apache/maven/plugins/project-info-reports/its/dep/1.0-SNAPSHOT/dep-1.0-SNAPSHOT.jar
[linux-jdk7] [withMaven] artifactsPublisher - Archive artifact m/target/it/multi-module/main/pom.xml under org/apache/maven/plugins/project-info-reports/its/main/1.0-SNAPSHOT/main-1.0-SNAPSHOT.pom
[linux-jdk7] [withMaven] artifactsPublisher - Archive artifact m/target/it/multi-module/main/target/main-1.0-SNAPSHOT.jar under org/apache/maven/plugins/project-info-reports/its/main/1.0-SNAPSHOT/main-1.0-SNAPSHOT.jar
[linux-jdk7] [withMaven] junitPublisher - Archive test results for Maven artifact org.apache.maven.plugins.project-info-reports.its:dep:1.0-SNAPSHOT generated by maven-surefire-plugin:test (default-test): m/target/it/multi-module/dep/target/surefire-reports/*.xml
[linux-jdk7] [withMaven] junitPublisher - Jenkins JUnit Attachments Plugin not found, can't publish test attachments.Recording test results
[linux-jdk7] None of the test reports contained any result
[linux-jdk7] [withMaven] junitPublisher - Archive test results for Maven artifact org.apache.maven.plugins.project-info-reports.its:main:1.0-SNAPSHOT generated by maven-surefire-plugin:test (default-test): m/target/it/multi-module/main/target/surefire-reports/*.xml
[linux-jdk7] [withMaven] junitPublisher - Jenkins JUnit Attachments Plugin not found, can't publish test attachments.Recording test results
[linux-jdk7] None of the test reports contained any result
[linux-jdk7] [withMaven] openTasksPublisher - Scan Tasks for Maven artifact org.apache.maven.plugins.project-info-reports.its:dep:1.0-SNAPSHOT in source directory m/target/it/multi-module/dep/src/main/java
[linux-jdk7] [withMaven] openTasksPublisher - Scan Tasks for Maven artifact org.apache.maven.plugins.project-info-reports.its:main:1.0-SNAPSHOT in source directory m/target/it/multi-module/main/src/main/java
[linux-jdk7] [TASKS] Scanning folder '/home/jenkins/jenkins-slave/workspace/nfo-reports-plugin_MPIR-366-S464FI4ATSVOULE3N7MCKV5FYYG6GVHDD7OLISMYBGUEPLQM2UNA' for files matching the pattern 'm/target/it/multi-module/dep/src/main/java/**/*,m/target/it/multi-module/main/src/main/java/**/*' - excludes: null
[linux-jdk7] [TASKS] Found 2 files to scan for tasks
[linux-jdk7] [TASKS] Found 0 open tasks.
[linux-jdk7] Skipping warnings blame since pipelines do not have an SCM link.%n
[linux-jdk7] [TASKS] Computing warning deltas based on reference build #11
[linux-jdk7] [withMaven] One or multiple Maven executions have been ignored by the Jenkins Pipeline Maven Plugin because they have been interrupted before completion (2). See Pipeline Maven Plugin FAQ for more details.
[Pipeline] [linux-jdk7] // withMaven
[Pipeline] [linux-jdk7] echo
[linux-jdk7] [FAIL FAST] linux-jdk10 had first failure, ignoring script returned exit code 143
[Pipeline] [linux-jdk7] }
[Pipeline] [linux-jdk8] }
[Pipeline] [linux-jdk9] }
[Pipeline] [linux-jdk7] // stage
[Pipeline] [linux-jdk8] // dir
[Pipeline] [linux-jdk9] // dir
[Pipeline] [linux-jdk7] }
[Pipeline] [linux-jdk8] }
[linux-jdk8] [withMaven] junitPublisher - Archive test results for Maven artifact org.apache.maven.plugins.project-info-reports.its:dep:1.0-SNAPSHOT generated by maven-surefire-plugin:test (default-test): m/target/it/multi-module/dep/target/surefire-reports/*.xml
[linux-jdk8] [withMaven] junitPublisher - Jenkins JUnit Attachments Plugin not found, can't publish test attachments.Recording test results
[linux-jdk8] None of the test reports contained any result
[linux-jdk8] [withMaven] junitPublisher - Archive test results for Maven artifact org.apache.maven.plugins.project-info-reports.its:main:1.0-SNAPSHOT generated by maven-surefire-plugin:test (default-test): m/target/it/multi-module/main/target/surefire-reports/*.xml
[linux-jdk8] [withMaven] junitPublisher - Jenkins JUnit Attachments Plugin not found, can't publish test attachments.Recording test results
[linux-jdk8] None of the test reports contained any result
[linux-jdk8] [withMaven] One or multiple Maven executions have been ignored by the Jenkins Pipeline Maven Plugin because they have been interrupted before completion (1). See Pipeline Maven Plugin FAQ for more details.
[Pipeline] [linux-jdk9] }
[linux-jdk9] [withMaven] junitPublisher - Archive test results for Maven artifact org.apache.maven.plugins.project-info-reports.its:dep:1.0-SNAPSHOT generated by maven-surefire-plugin:test (default-test): m/target/it/multi-module/dep/target/surefire-reports/*.xml
[linux-jdk9] [withMaven] junitPublisher - Jenkins JUnit Attachments Plugin not found, can't publish test attachments.Recording test results
[linux-jdk9] None of the test reports contained any result
[linux-jdk9] [withMaven] junitPublisher - Archive test results for Maven artifact org.apache.maven.plugins.project-info-reports.its:main:1.0-SNAPSHOT generated by maven-surefire-plugin:test (default-test): m/target/it/multi-module/main/target/surefire-reports/*.xml
[linux-jdk9] [withMaven] junitPublisher - Jenkins JUnit Attachments Plugin not found, can't publish test attachments.Recording test results
[linux-jdk9] None of the test reports contained any result
[linux-jdk9] [withMaven] One or multiple Maven executions have been ignored by the Jenkins Pipeline Maven Plugin because they have been interrupted before completion (2). See Pipeline Maven Plugin FAQ for more details.
[Pipeline] [linux-jdk7] // node
[Pipeline] [linux-jdk8] // withMaven
[Pipeline] [linux-jdk9] // withMaven
[Pipeline] [linux-jdk7] }
[Pipeline] [linux-jdk8] echo
[linux-jdk8] [FAIL FAST] linux-jdk10 had first failure, ignoring script returned exit code 143
[Pipeline] [linux-jdk8] }
[Pipeline] [linux-jdk9] echo
[linux-jdk9] [FAIL FAST] linux-jdk10 had first failure, ignoring script returned exit code 143
[Pipeline] [linux-jdk9] }
[Pipeline] [linux-jdk8] // stage
[Pipeline] [linux-jdk9] // stage
[Pipeline] [linux-jdk8] }
[Pipeline] [linux-jdk9] }
[Pipeline] [linux-jdk8] // node
[Pipeline] [linux-jdk9] // node
[Pipeline] [linux-jdk8] }
[Pipeline] [linux-jdk9] }
[Pipeline] // parallel
[Pipeline] echo
***** FAST FAILURE *****

Fast failure triggered by linux-jdk10

***** FAST FAILURE *****
[Pipeline] stage
[Pipeline] { (Notifications)
[Pipeline] echo
Build result: FAILURE
[Pipeline] jiraIssueSelector
[Pipeline] jiraComment
[Pipeline] emailext
Reply | Threaded
Open this post in threaded view
|

Build failed in Jenkins: Maven TLP » maven-project-info-reports-plugin » MPIR-366 #13

Apache Jenkins Server-2
See https://builds.apache.org/job/maven-box/job/maven-project-info-reports-plugin/job/MPIR-366/13/

Changes:

* [MPIR-366] Drop Maven2 support don't fail fast
* [MPIR-366] Drop Maven2 support don't fail fast
* [MPIR-366] Drop Maven2 support don't fail fast
* [MPIR-366] Drop Maven2 support don't fail fast

All tests passed

Build log:
[...truncated 1.28 MB...]
[windows-jdk8] [INFO] --- maven-invoker-plugin:2.0.0:verify (integration-test) @ maven-project-info-reports-plugin ---
[windows-jdk8] [INFO] -------------------------------------------------
[windows-jdk8] [INFO] Build Summary:
[windows-jdk8] [INFO]   Passed: 11, Failed: 0, Errors: 0, Skipped: 0
[windows-jdk8] [INFO] -------------------------------------------------
[windows-jdk8] [INFO] ------------------------------------------------------------------------
[windows-jdk8] [INFO] BUILD SUCCESS
[windows-jdk8] [INFO] ------------------------------------------------------------------------
[windows-jdk8] [INFO] Total time: 04:26 min
[windows-jdk8] [INFO] Finished at: 2018-04-01T13:58:39Z
[windows-jdk8] [INFO] Final Memory: 79M/2217M
[windows-jdk8] [INFO] ------------------------------------------------------------------------
[windows-jdk8] [INFO] [jenkins-event-spy] Generated F:\jenkins\jenkins-slave\workspace\nfo-reports-plugin_MPIR-366-S464FI4ATSVOULE3N7MCKV5FYYG6GVHDD7OLISMYBGUEPLQM2UNA@tmp\withMavend5a12ca5\maven-spy-20180401-135411-6358584764113453785228.log
[windows-jdk8] Picked up JAVA_TOOL_OPTIONS: -Dmaven.ext.class.path="f:\jenkins\jenkins-slave\workspace\nfo-reports-plugin_MPIR-366-S464FI4ATSVOULE3N7MCKV5FYYG6GVHDD7OLISMYBGUEPLQM2UNA@tmp\withMavend5a12ca5\pipeline-maven-spy.jar" -Dorg.jenkinsci.plugins.pipeline.maven.reportsFolder="f:\jenkins\jenkins-slave\workspace\nfo-reports-plugin_MPIR-366-S464FI4ATSVOULE3N7MCKV5FYYG6GVHDD7OLISMYBGUEPLQM2UNA@tmp\withMavend5a12ca5"
[Pipeline] [windows-jdk8] }
[Pipeline] [windows-jdk8] // dir
[windows-jdk9] [INFO] run script verify.groovy
[windows-jdk9] [INFO] ..SUCCESS (19.6 s)
[windows-jdk9] [INFO]
[windows-jdk9] [INFO] --- maven-checkstyle-plugin:2.15:check (checkstyle-check) @ maven-project-info-reports-plugin ---
[windows-jdk9] [INFO] Downloading: https://repo.maven.apache.org/maven2/org/apache/maven/shared/maven-shared-resources/2/maven-shared-resources-2.pom
[windows-jdk9] [INFO] Downloaded: https://repo.maven.apache.org/maven2/org/apache/maven/shared/maven-shared-resources/2/maven-shared-resources-2.pom (3.0 kB at 197 kB/s)
[windows-jdk9] [INFO] Downloading: https://repo.maven.apache.org/maven2/org/codehaus/plexus/plexus-utils/3.0.10/plexus-utils-3.0.10.pom
[windows-jdk9] [INFO] Downloaded: https://repo.maven.apache.org/maven2/org/codehaus/plexus/plexus-utils/3.0.10/plexus-utils-3.0.10.pom (3.1 kB at 262 kB/s)
[windows-jdk9] [INFO] Downloading: https://repo.maven.apache.org/maven2/org/codehaus/plexus/plexus-resources/1.0.1/plexus-resources-1.0.1.pom
[windows-jdk9] [INFO] Downloaded: https://repo.maven.apache.org/maven2/org/codehaus/plexus/plexus-resources/1.0.1/plexus-resources-1.0.1.pom (1.3 kB at 101 kB/s)
[windows-jdk9] [INFO] Downloading: https://repo.maven.apache.org/maven2/com/puppycrawl/tools/checkstyle/6.1.1/checkstyle-6.1.1.pom
[windows-jdk9] [INFO] Downloaded: https://repo.maven.apache.org/maven2/com/puppycrawl/tools/checkstyle/6.1.1/checkstyle-6.1.1.pom (30 kB at 2.2 MB/s)
[windows-jdk9] [INFO] Downloading: https://repo.maven.apache.org/maven2/org/antlr/antlr4-runtime/4.3/antlr4-runtime-4.3.pom
[windows-jdk9] [INFO] Downloaded: https://repo.maven.apache.org/maven2/org/antlr/antlr4-runtime/4.3/antlr4-runtime-4.3.pom (4.8 kB at 399 kB/s)
[windows-jdk9] [INFO] Downloading: https://repo.maven.apache.org/maven2/org/antlr/antlr4-master/4.3/antlr4-master-4.3.pom
[windows-jdk9] [INFO] Downloaded: https://repo.maven.apache.org/maven2/org/antlr/antlr4-master/4.3/antlr4-master-4.3.pom (7.9 kB at 566 kB/s)
[windows-jdk9] [INFO] Downloading: https://repo.maven.apache.org/maven2/org/abego/treelayout/org.abego.treelayout.core/1.0.1/org.abego.treelayout.core-1.0.1.pom
[windows-jdk9] [INFO] Downloaded: https://repo.maven.apache.org/maven2/org/abego/treelayout/org.abego.treelayout.core/1.0.1/org.abego.treelayout.core-1.0.1.pom (3.1 kB at 259 kB/s)
[windows-jdk9] [INFO] Downloading: https://repo.maven.apache.org/maven2/org/antlr/antlr4-annotations/4.3/antlr4-annotations-4.3.pom
[windows-jdk9] [INFO] Downloaded: https://repo.maven.apache.org/maven2/org/antlr/antlr4-annotations/4.3/antlr4-annotations-4.3.pom (1.3 kB at 106 kB/s)
[windows-jdk9] [INFO] Downloading: https://repo.maven.apache.org/maven2/commons-beanutils/commons-beanutils-core/1.8.3/commons-beanutils-core-1.8.3.pom
[windows-jdk9] [INFO] Downloaded: https://repo.maven.apache.org/maven2/commons-beanutils/commons-beanutils-core/1.8.3/commons-beanutils-core-1.8.3.pom (1.6 kB at 126 kB/s)
[windows-jdk9] [INFO] Downloading: https://repo.maven.apache.org/maven2/com/google/guava/guava/18.0/guava-18.0.pom
[windows-jdk9] [INFO] Downloaded: https://repo.maven.apache.org/maven2/com/google/guava/guava/18.0/guava-18.0.pom (5.7 kB at 436 kB/s)
[windows-jdk9] [INFO] Downloading: https://repo.maven.apache.org/maven2/com/google/guava/guava-parent/18.0/guava-parent-18.0.pom
[windows-jdk9] [INFO] Downloaded: https://repo.maven.apache.org/maven2/com/google/guava/guava-parent/18.0/guava-parent-18.0.pom (7.7 kB at 699 kB/s)
[windows-jdk9] [INFO] Downloading: https://repo.maven.apache.org/maven2/com/puppycrawl/tools/checkstyle/6.1.1/checkstyle-6.1.1.jar
[windows-jdk9] [INFO] Downloading: https://repo.maven.apache.org/maven2/org/antlr/antlr4-runtime/4.3/antlr4-runtime-4.3.jar
[windows-jdk9] [INFO] Downloading: https://repo.maven.apache.org/maven2/org/codehaus/plexus/plexus-resources/1.0.1/plexus-resources-1.0.1.jar
[windows-jdk9] [INFO] Downloading: https://repo.maven.apache.org/maven2/org/abego/treelayout/org.abego.treelayout.core/1.0.1/org.abego.treelayout.core-1.0.1.jar
[windows-jdk9] [INFO] Downloading: https://repo.maven.apache.org/maven2/org/apache/maven/shared/maven-shared-resources/2/maven-shared-resources-2.jar
[windows-jdk9] [INFO] Downloaded: https://repo.maven.apache.org/maven2/com/puppycrawl/tools/checkstyle/6.1.1/checkstyle-6.1.1.jar (1.0 MB at 21 MB/s)
[windows-jdk9] [INFO] Downloading: https://repo.maven.apache.org/maven2/org/antlr/antlr4-annotations/4.3/antlr4-annotations-4.3.jar
[windows-jdk9] [INFO] Downloaded: https://repo.maven.apache.org/maven2/org/antlr/antlr4-annotations/4.3/antlr4-annotations-4.3.jar (10 kB at 116 kB/s)
[windows-jdk9] [INFO] Downloading: https://repo.maven.apache.org/maven2/commons-beanutils/commons-beanutils-core/1.8.3/commons-beanutils-core-1.8.3.jar
[windows-jdk9] [INFO] Downloaded: https://repo.maven.apache.org/maven2/commons-beanutils/commons-beanutils-core/1.8.3/commons-beanutils-core-1.8.3.jar (207 kB at 1.9 MB/s)
[windows-jdk9] [INFO] Downloading: https://repo.maven.apache.org/maven2/com/google/guava/guava/18.0/guava-18.0.jar
[windows-jdk9] [INFO] Downloaded: https://repo.maven.apache.org/maven2/org/antlr/antlr4-runtime/4.3/antlr4-runtime-4.3.jar (345 kB at 2.7 MB/s)
[windows-jdk9] [INFO] Downloaded: https://repo.maven.apache.org/maven2/org/abego/treelayout/org.abego.treelayout.core/1.0.1/org.abego.treelayout.core-1.0.1.jar (26 kB at 158 kB/s)
[windows-jdk9] [INFO] Downloaded: https://repo.maven.apache.org/maven2/com/google/guava/guava/18.0/guava-18.0.jar (2.3 MB at 13 MB/s)
[windows-jdk9] [INFO] Downloaded: https://repo.maven.apache.org/maven2/org/codehaus/plexus/plexus-resources/1.0.1/plexus-resources-1.0.1.jar (22 kB at 118 kB/s)
[windows-jdk9] [INFO] Downloaded: https://repo.maven.apache.org/maven2/org/apache/maven/shared/maven-shared-resources/2/maven-shared-resources-2.jar (13 kB at 58 kB/s)
[windows-jdk9] [INFO] There are 10 errors reported by Checkstyle 6.1.1 with config/maven_checks.xml ruleset.
[windows-jdk9] [INFO] Ignored 10 errors, 0 violation remaining.
[windows-jdk9] [INFO]
[windows-jdk9] [INFO] --- maven-jarsigner-plugin:1.3.2:verify (verify) @ maven-project-info-reports-plugin ---
[windows-jdk9] [WARNING] Picked up JAVA_TOOL_OPTIONS: -Dmaven.ext.class.path="f:\jenkins\jenkins-slave\workspace\nfo-reports-plugin_MPIR-366-S464FI4ATSVOULE3N7MCKV5FYYG6GVHDD7OLISMYBGUEPLQM2UNA@tmp\withMaven34645325\pipeline-maven-spy.jar" -Dorg.jenkinsci.plugins.pipeline.maven.reportsFolder="f:\jenkins\jenkins-slave\workspace\nfo-reports-plugin_MPIR-366-S464FI4ATSVOULE3N7MCKV5FYYG6GVHDD7OLISMYBGUEPLQM2UNA@tmp\withMaven34645325"
[windows-jdk9] [INFO] 1 archive(s) processed
[windows-jdk9] [INFO]
[windows-jdk9] [INFO] --- maven-invoker-plugin:2.0.0:verify (integration-test) @ maven-project-info-reports-plugin ---
[windows-jdk9] [INFO] -------------------------------------------------
[windows-jdk9] [INFO] Build Summary:
[windows-jdk9] [INFO]   Passed: 11, Failed: 0, Errors: 0, Skipped: 0
[windows-jdk9] [INFO] -------------------------------------------------
[windows-jdk9] [INFO] ------------------------------------------------------------------------
[windows-jdk9] [INFO] BUILD SUCCESS
[windows-jdk9] [INFO] ------------------------------------------------------------------------
[windows-jdk9] [INFO] Total time: 03:48 min
[windows-jdk9] [INFO] Finished at: 2018-04-01T13:58:41Z
[windows-jdk9] [INFO] Final Memory: 53M/177M
[windows-jdk9] [INFO] ------------------------------------------------------------------------
[windows-jdk9] [INFO] [jenkins-event-spy] Generated F:\jenkins\jenkins-slave\workspace\nfo-reports-plugin_MPIR-366-S464FI4ATSVOULE3N7MCKV5FYYG6GVHDD7OLISMYBGUEPLQM2UNA@tmp\withMaven34645325\maven-spy-20180401-135452-57511683435379337498029.log
[Pipeline] [windows-jdk8] }
[windows-jdk8] [withMaven] junitPublisher - Archive test results for Maven artifact org.apache.maven.plugins:maven-project-info-reports-plugin:2.10-SNAPSHOT generated by maven-surefire-plugin:test (default-test): m\target\surefire-reports\*.xml
[windows-jdk8] [withMaven] junitPublisher - Jenkins JUnit Attachments Plugin not found, can't publish test attachments.Recording test results
[windows-jdk8] [withMaven] junitPublisher - Archive test results for Maven artifact org.apache.maven.plugins.project-info-reports.its:dep:1.0-SNAPSHOT generated by maven-surefire-plugin:test (default-test): m\target\it\multi-module\dep\target\surefire-reports\*.xml
[windows-jdk8] [withMaven] junitPublisher - Jenkins JUnit Attachments Plugin not found, can't publish test attachments.Recording test results
[windows-jdk8] None of the test reports contained any result
[windows-jdk8] [withMaven] junitPublisher - Archive test results for Maven artifact org.apache.maven.plugins.project-info-reports.its:main:1.0-SNAPSHOT generated by maven-surefire-plugin:test (default-test): m\target\it\multi-module\main\target\surefire-reports\*.xml
[windows-jdk8] [withMaven] junitPublisher - Jenkins JUnit Attachments Plugin not found, can't publish test attachments.Recording test results
[windows-jdk8] None of the test reports contained any result
[Pipeline] [windows-jdk8] // withMaven
[Pipeline] [windows-jdk8] }
[Pipeline] [windows-jdk9] }
[Pipeline] [windows-jdk8] // stage
[Pipeline] [windows-jdk9] // dir
[windows-jdk10] [INFO] ..FAILED (25.1 s)
[windows-jdk10] [INFO]   The build exited with code 1. See f:\jenkins\jenkins-slave\workspace\nfo-reports-plugin_MPIR-366-S464FI4ATSVOULE3N7MCKV5FYYG6GVHDD7OLISMYBGUEPLQM2UNA@2\m\target\it\dependencies-java-1.7-and-1.8\build.log for details.
[windows-jdk10] [INFO] Building: full-pom\pom.xml
[windows-jdk10] [INFO] ..FAILED (6.6 s)
[windows-jdk10] [INFO]   The build exited with code 1. See f:\jenkins\jenkins-slave\workspace\nfo-reports-plugin_MPIR-366-S464FI4ATSVOULE3N7MCKV5FYYG6GVHDD7OLISMYBGUEPLQM2UNA@2\m\target\it\full-pom\build.log for details.
[windows-jdk10] [INFO] Building: git\pom.xml
[windows-jdk10] [INFO] ..FAILED (3.5 s)
[windows-jdk10] [INFO]   The build exited with code 1. See f:\jenkins\jenkins-slave\workspace\nfo-reports-plugin_MPIR-366-S464FI4ATSVOULE3N7MCKV5FYYG6GVHDD7OLISMYBGUEPLQM2UNA@2\m\target\it\git\build.log for details.
[windows-jdk10] [INFO] Building: java-version\pom.xml
[Pipeline] [windows-jdk8] }
[Pipeline] [windows-jdk9] }
[windows-jdk9] [withMaven] junitPublisher - Archive test results for Maven artifact org.apache.maven.plugins:maven-project-info-reports-plugin:2.10-SNAPSHOT generated by maven-surefire-plugin:test (default-test): m\target\surefire-reports\*.xml
[windows-jdk9] [withMaven] junitPublisher - Jenkins JUnit Attachments Plugin not found, can't publish test attachments.Recording test results
[windows-jdk9] [withMaven] junitPublisher - Archive test results for Maven artifact org.apache.maven.plugins.project-info-reports.its:dep:1.0-SNAPSHOT generated by maven-surefire-plugin:test (default-test): m\target\it\multi-module\dep\target\surefire-reports\*.xml
[windows-jdk9] [withMaven] junitPublisher - Jenkins JUnit Attachments Plugin not found, can't publish test attachments.Recording test results
[windows-jdk9] None of the test reports contained any result
[windows-jdk9] [withMaven] junitPublisher - Archive test results for Maven artifact org.apache.maven.plugins.project-info-reports.its:main:1.0-SNAPSHOT generated by maven-surefire-plugin:test (default-test): m\target\it\multi-module\main\target\surefire-reports\*.xml
[windows-jdk9] [withMaven] junitPublisher - Jenkins JUnit Attachments Plugin not found, can't publish test attachments.Recording test results
[windows-jdk9] None of the test reports contained any result
[Pipeline] [windows-jdk8] // node
[Pipeline] [windows-jdk9] // withMaven
[Pipeline] [windows-jdk8] }
[Pipeline] [windows-jdk9] }
[Pipeline] [windows-jdk9] // stage
[Pipeline] [windows-jdk9] }
[Pipeline] [windows-jdk9] // node
[Pipeline] [windows-jdk9] }
[windows-jdk10] [INFO] run script verify.groovy
[windows-jdk10] WARNING: An illegal reflective access operation has occurred
[windows-jdk10] WARNING: Illegal reflective access by org.codehaus.groovy.reflection.CachedClass$3$1 (file:/f:/jenkins/jenkins-slave/workspace/nfo-reports-plugin_MPIR-366-S464FI4ATSVOULE3N7MCKV5FYYG6GVHDD7OLISMYBGUEPLQM2UNA@2/.repository/org/codehaus/groovy/groovy/2.0.1/groovy-2.0.1.jar) to method java.lang.Object.finalize()
[windows-jdk10] WARNING: Please consider reporting this to the maintainers of org.codehaus.groovy.reflection.CachedClass$3$1
[windows-jdk10] WARNING: Use --illegal-access=warn to enable warnings of further illegal reflective access operations
[windows-jdk10] WARNING: All illegal access operations will be denied in a future release
[windows-jdk10] [INFO] ..SUCCESS (4.2 s)
[windows-jdk10] [INFO] Building: minimal-pom\pom.xml
[windows-jdk10] [INFO] ..FAILED (3.5 s)
[windows-jdk10] [INFO]   The build exited with code 1. See f:\jenkins\jenkins-slave\workspace\nfo-reports-plugin_MPIR-366-S464FI4ATSVOULE3N7MCKV5FYYG6GVHDD7OLISMYBGUEPLQM2UNA@2\m\target\it\minimal-pom\build.log for details.
[windows-jdk10] [INFO] Building: mpir-229\pom.xml
[windows-jdk10] [INFO] ..FAILED (3.4 s)
[windows-jdk10] [INFO]   The build exited with code 1. See f:\jenkins\jenkins-slave\workspace\nfo-reports-plugin_MPIR-366-S464FI4ATSVOULE3N7MCKV5FYYG6GVHDD7OLISMYBGUEPLQM2UNA@2\m\target\it\mpir-229\build.log for details.
[windows-jdk10] [INFO] Building: MPIR-242\pom.xml
[windows-jdk10] [INFO] ..FAILED (3.5 s)
[windows-jdk10] [INFO]   The build exited with code 1. See f:\jenkins\jenkins-slave\workspace\nfo-reports-plugin_MPIR-366-S464FI4ATSVOULE3N7MCKV5FYYG6GVHDD7OLISMYBGUEPLQM2UNA@2\m\target\it\MPIR-242\build.log for details.
[windows-jdk10] [INFO] Building: MPIR-251\pom.xml
[windows-jdk10] [INFO] run script verify.groovy
[windows-jdk10] [INFO] ..SUCCESS (9.1 s)
[windows-jdk10] [INFO] Building: MPIR-300\pom.xml
[windows-jdk10] [INFO] run script verify.groovy
[windows-jdk10] [INFO] ..SUCCESS (3.9 s)
[windows-jdk10] [INFO] Building: MPIR-349\parent\pom.xml
[windows-jdk10] [INFO] run script verify.groovy
[windows-jdk10] [INFO] ..SUCCESS (6.6 s)
[windows-jdk10] [INFO] Building: multi-module\pom.xml
[windows-jdk10] [INFO] ..FAILED (13.4 s)
[windows-jdk10] [INFO]   The build exited with code 1. See f:\jenkins\jenkins-slave\workspace\nfo-reports-plugin_MPIR-366-S464FI4ATSVOULE3N7MCKV5FYYG6GVHDD7OLISMYBGUEPLQM2UNA@2\m\target\it\multi-module\build.log for details.
[windows-jdk10] [INFO]
[windows-jdk10] [INFO] --- maven-checkstyle-plugin:2.15:check (checkstyle-check) @ maven-project-info-reports-plugin ---
[windows-jdk10] [INFO] Downloading: https://repo.maven.apache.org/maven2/org/apache/maven/shared/maven-shared-resources/2/maven-shared-resources-2.pom
[windows-jdk10] [INFO] Downloaded: https://repo.maven.apache.org/maven2/org/apache/maven/shared/maven-shared-resources/2/maven-shared-resources-2.pom (3.0 kB at 246 kB/s)
[windows-jdk10] [INFO] Downloading: https://repo.maven.apache.org/maven2/org/codehaus/plexus/plexus-utils/3.0.10/plexus-utils-3.0.10.pom
[windows-jdk10] [INFO] Downloaded: https://repo.maven.apache.org/maven2/org/codehaus/plexus/plexus-utils/3.0.10/plexus-utils-3.0.10.pom (3.1 kB at 262 kB/s)
[windows-jdk10] [INFO] Downloading: https://repo.maven.apache.org/maven2/org/codehaus/plexus/plexus-resources/1.0.1/plexus-resources-1.0.1.pom
[windows-jdk10] [INFO] Downloaded: https://repo.maven.apache.org/maven2/org/codehaus/plexus/plexus-resources/1.0.1/plexus-resources-1.0.1.pom (1.3 kB at 120 kB/s)
[windows-jdk10] [INFO] Downloading: https://repo.maven.apache.org/maven2/com/puppycrawl/tools/checkstyle/6.1.1/checkstyle-6.1.1.pom
[windows-jdk10] [INFO] Downloaded: https://repo.maven.apache.org/maven2/com/puppycrawl/tools/checkstyle/6.1.1/checkstyle-6.1.1.pom (30 kB at 2.0 MB/s)
[windows-jdk10] [INFO] Downloading: https://repo.maven.apache.org/maven2/org/antlr/antlr4-runtime/4.3/antlr4-runtime-4.3.pom
[windows-jdk10] [INFO] Downloaded: https://repo.maven.apache.org/maven2/org/antlr/antlr4-runtime/4.3/antlr4-runtime-4.3.pom (4.8 kB at 368 kB/s)
[windows-jdk10] [INFO] Downloading: https://repo.maven.apache.org/maven2/org/antlr/antlr4-master/4.3/antlr4-master-4.3.pom
[windows-jdk10] [INFO] Downloaded: https://repo.maven.apache.org/maven2/org/antlr/antlr4-master/4.3/antlr4-master-4.3.pom (7.9 kB at 610 kB/s)
[windows-jdk10] [INFO] Downloading: https://repo.maven.apache.org/maven2/org/abego/treelayout/org.abego.treelayout.core/1.0.1/org.abego.treelayout.core-1.0.1.pom
[windows-jdk10] [INFO] Downloaded: https://repo.maven.apache.org/maven2/org/abego/treelayout/org.abego.treelayout.core/1.0.1/org.abego.treelayout.core-1.0.1.pom (3.1 kB at 345 kB/s)
[windows-jdk10] [INFO] Downloading: https://repo.maven.apache.org/maven2/org/antlr/antlr4-annotations/4.3/antlr4-annotations-4.3.pom
[windows-jdk10] [INFO] Downloaded: https://repo.maven.apache.org/maven2/org/antlr/antlr4-annotations/4.3/antlr4-annotations-4.3.pom (1.3 kB at 106 kB/s)
[windows-jdk10] [INFO] Downloading: https://repo.maven.apache.org/maven2/commons-beanutils/commons-beanutils-core/1.8.3/commons-beanutils-core-1.8.3.pom
[windows-jdk10] [INFO] Downloaded: https://repo.maven.apache.org/maven2/commons-beanutils/commons-beanutils-core/1.8.3/commons-beanutils-core-1.8.3.pom (1.6 kB at 126 kB/s)
[windows-jdk10] [INFO] Downloading: https://repo.maven.apache.org/maven2/com/google/guava/guava/18.0/guava-18.0.pom
[windows-jdk10] [INFO] Downloaded: https://repo.maven.apache.org/maven2/com/google/guava/guava/18.0/guava-18.0.pom (5.7 kB at 472 kB/s)
[windows-jdk10] [INFO] Downloading: https://repo.maven.apache.org/maven2/com/google/guava/guava-parent/18.0/guava-parent-18.0.pom
[windows-jdk10] [INFO] Downloaded: https://repo.maven.apache.org/maven2/com/google/guava/guava-parent/18.0/guava-parent-18.0.pom (7.7 kB at 961 kB/s)
[windows-jdk10] [INFO] Downloading: https://repo.maven.apache.org/maven2/org/apache/maven/shared/maven-shared-resources/2/maven-shared-resources-2.jar
[windows-jdk10] [INFO] Downloading: https://repo.maven.apache.org/maven2/com/puppycrawl/tools/checkstyle/6.1.1/checkstyle-6.1.1.jar
[windows-jdk10] [INFO] Downloading: https://repo.maven.apache.org/maven2/org/antlr/antlr4-runtime/4.3/antlr4-runtime-4.3.jar
[windows-jdk10] [INFO] Downloading: https://repo.maven.apache.org/maven2/org/codehaus/plexus/plexus-resources/1.0.1/plexus-resources-1.0.1.jar
[windows-jdk10] [INFO] Downloading: https://repo.maven.apache.org/maven2/org/abego/treelayout/org.abego.treelayout.core/1.0.1/org.abego.treelayout.core-1.0.1.jar
[windows-jdk10] [INFO] Downloaded: https://repo.maven.apache.org/maven2/com/puppycrawl/tools/checkstyle/6.1.1/checkstyle-6.1.1.jar (1.0 MB at 12 MB/s)
[windows-jdk10] [INFO] Downloading: https://repo.maven.apache.org/maven2/org/antlr/antlr4-annotations/4.3/antlr4-annotations-4.3.jar
[windows-jdk10] [INFO] Downloaded: https://repo.maven.apache.org/maven2/org/codehaus/plexus/plexus-resources/1.0.1/plexus-resources-1.0.1.jar (22 kB at 210 kB/s)
[windows-jdk10] [INFO] Downloading: https://repo.maven.apache.org/maven2/commons-beanutils/commons-beanutils-core/1.8.3/commons-beanutils-core-1.8.3.jar
[windows-jdk10] [INFO] Downloaded: https://repo.maven.apache.org/maven2/org/antlr/antlr4-runtime/4.3/antlr4-runtime-4.3.jar (345 kB at 3.1 MB/s)
[windows-jdk10] [INFO] Downloading: https://repo.maven.apache.org/maven2/com/google/guava/guava/18.0/guava-18.0.jar
[windows-jdk10] [INFO] Downloaded: https://repo.maven.apache.org/maven2/org/antlr/antlr4-annotations/4.3/antlr4-annotations-4.3.jar (10 kB at 78 kB/s)
[windows-jdk10] [INFO] Downloaded: https://repo.maven.apache.org/maven2/commons-beanutils/commons-beanutils-core/1.8.3/commons-beanutils-core-1.8.3.jar (207 kB at 1.5 MB/s)
[windows-jdk10] [INFO] Downloaded: https://repo.maven.apache.org/maven2/org/apache/maven/shared/maven-shared-resources/2/maven-shared-resources-2.jar (13 kB at 71 kB/s)
[windows-jdk10] [INFO] Downloaded: https://repo.maven.apache.org/maven2/com/google/guava/guava/18.0/guava-18.0.jar (2.3 MB at 12 MB/s)
[windows-jdk10] [INFO] Downloaded: https://repo.maven.apache.org/maven2/org/abego/treelayout/org.abego.treelayout.core/1.0.1/org.abego.treelayout.core-1.0.1.jar (26 kB at 122 kB/s)
[windows-jdk10] [INFO] There are 10 errors reported by Checkstyle 6.1.1 with config/maven_checks.xml ruleset.
[windows-jdk10] [INFO] Ignored 10 errors, 0 violation remaining.
[windows-jdk10] [INFO]
[windows-jdk10] [INFO] --- maven-jarsigner-plugin:1.3.2:verify (verify) @ maven-project-info-reports-plugin ---
[windows-jdk10] [WARNING] Picked up JAVA_TOOL_OPTIONS: -Dmaven.ext.class.path="f:\jenkins\jenkins-slave\workspace\nfo-reports-plugin_MPIR-366-S464FI4ATSVOULE3N7MCKV5FYYG6GVHDD7OLISMYBGUEPLQM2UNA@2@tmp\withMavenfdaa4ea8\pipeline-maven-spy.jar" -Dorg.jenkinsci.plugins.pipeline.maven.reportsFolder="f:\jenkins\jenkins-slave\workspace\nfo-reports-plugin_MPIR-366-S464FI4ATSVOULE3N7MCKV5FYYG6GVHDD7OLISMYBGUEPLQM2UNA@2@tmp\withMavenfdaa4ea8"
[windows-jdk10] [INFO] 1 archive(s) processed
[windows-jdk10] [INFO]
[windows-jdk10] [INFO] --- maven-invoker-plugin:2.0.0:verify (integration-test) @ maven-project-info-reports-plugin ---
[windows-jdk10] [INFO] -------------------------------------------------
[windows-jdk10] [INFO] Build Summary:
[windows-jdk10] [INFO]   Passed: 4, Failed: 7, Errors: 0, Skipped: 0
[windows-jdk10] [INFO] -------------------------------------------------
[windows-jdk10] [ERROR] The following builds failed:
[windows-jdk10] [ERROR] *  dependencies-java-1.7-and-1.8\pom.xml
[windows-jdk10] [ERROR] *  full-pom\pom.xml
[windows-jdk10] [ERROR] *  git\pom.xml
[windows-jdk10] [ERROR] *  minimal-pom\pom.xml
[windows-jdk10] [ERROR] *  mpir-229\pom.xml
[windows-jdk10] [ERROR] *  MPIR-242\pom.xml
[windows-jdk10] [ERROR] *  multi-module\pom.xml
[windows-jdk10] [INFO] -------------------------------------------------
[windows-jdk10] [INFO] ------------------------------------------------------------------------
[windows-jdk10] [INFO] BUILD FAILURE
[windows-jdk10] [INFO] ------------------------------------------------------------------------
[windows-jdk10] [INFO] Total time: 02:55 min
[windows-jdk10] [INFO] Finished at: 2018-04-01T13:59:47Z
[windows-jdk10] [INFO] Final Memory: 49M/174M
[windows-jdk10] [INFO] ------------------------------------------------------------------------
[windows-jdk10] [INFO] [jenkins-event-spy] Generated F:\jenkins\jenkins-slave\workspace\nfo-reports-plugin_MPIR-366-S464FI4ATSVOULE3N7MCKV5FYYG6GVHDD7OLISMYBGUEPLQM2UNA@2@tmp\withMavenfdaa4ea8\maven-spy-20180401-135651-7308561720385576008747.log
[windows-jdk10] [ERROR] Failed to execute goal org.apache.maven.plugins:maven-invoker-plugin:2.0.0:verify (integration-test) on project maven-project-info-reports-plugin: 7 builds failed. See console output above for details. -> [Help 1]
[windows-jdk10] [ERROR]
[windows-jdk10] [ERROR] To see the full stack trace of the errors, re-run Maven with the -e switch.
[windows-jdk10] [ERROR] Re-run Maven using the -X switch to enable full debug logging.
[windows-jdk10] [ERROR]
[windows-jdk10] [ERROR] For more information about the errors and possible solutions, please read the following articles:
[windows-jdk10] [ERROR] [Help 1] http://cwiki.apache.org/confluence/display/MAVEN/MojoFailureException
[Pipeline] [windows-jdk10] }
[Pipeline] [windows-jdk10] // dir
[Pipeline] [windows-jdk10] }
[windows-jdk10] [withMaven] junitPublisher - Archive test results for Maven artifact org.apache.maven.plugins:maven-project-info-reports-plugin:2.10-SNAPSHOT generated by maven-surefire-plugin:test (default-test): m\target\surefire-reports\*.xml
[windows-jdk10] [withMaven] junitPublisher - Jenkins JUnit Attachments Plugin not found, can't publish test attachments.Recording test results
[windows-jdk10] [withMaven] junitPublisher - Archive test results for Maven artifact org.apache.maven.plugins.project-info-reports.its:dep:1.0-SNAPSHOT generated by maven-surefire-plugin:test (default-test): m\target\it\multi-module\dep\target\surefire-reports\*.xml
[windows-jdk10] [withMaven] junitPublisher - Jenkins JUnit Attachments Plugin not found, can't publish test attachments.Recording test results
[windows-jdk10] None of the test reports contained any result
[windows-jdk10] [withMaven] junitPublisher - Archive test results for Maven artifact org.apache.maven.plugins.project-info-reports.its:main:1.0-SNAPSHOT generated by maven-surefire-plugin:test (default-test): m\target\it\multi-module\main\target\surefire-reports\*.xml
[windows-jdk10] [withMaven] junitPublisher - Jenkins JUnit Attachments Plugin not found, can't publish test attachments.Recording test results
[windows-jdk10] None of the test reports contained any result
[Pipeline] [windows-jdk10] // withMaven
[Pipeline] [windows-jdk10] }
[Pipeline] [windows-jdk10] // stage
[Pipeline] [windows-jdk10] }
[Pipeline] [windows-jdk10] // node
[Pipeline] [windows-jdk10] }
[windows-jdk10] Failed in branch windows-jdk10
[Pipeline] // parallel
[Pipeline] stage
[Pipeline] { (Notifications)
[Pipeline] echo
Build result: FAILURE
[Pipeline] jiraIssueSelector
[Pipeline] jiraComment
[Pipeline] emailext
Reply | Threaded
Open this post in threaded view
|

Build failed in Jenkins: Maven TLP » maven-project-info-reports-plugin » MPIR-366 #14

Apache Jenkins Server-2
See https://builds.apache.org/job/maven-box/job/maven-project-info-reports-plugin/job/MPIR-366/14/

Changes:

* auto deploy if we are currently on master branch
* revert as it seems to fail on jenkins asf
* revert this one as well

No tests ran.

Build log:
[...truncated 991.37 KB...]
[windows-jdk8] [INFO] Changes detected - recompiling the module!
[windows-jdk8] [INFO] Compiling 36 source files to f:\jenkins\jenkins-slave\workspace\nfo-reports-plugin_MPIR-366-S464FI4ATSVOULE3N7MCKV5FYYG6GVHDD7OLISMYBGUEPLQM2UNA\m\target\test-classes
[windows-jdk10] [INFO] Downloaded: https://repo.maven.apache.org/maven2/org/codehaus/plexus/plexus-resources/1.0-alpha-7/plexus-resources-1.0-alpha-7.pom (1.4 kB at 194 kB/s)
[windows-jdk10] [INFO] Downloading: https://repo.maven.apache.org/maven2/org/codehaus/plexus/plexus-components/1.1.17/plexus-components-1.1.17.pom
[windows-jdk10] [INFO] Downloaded: https://repo.maven.apache.org/maven2/org/codehaus/plexus/plexus-components/1.1.17/plexus-components-1.1.17.pom (5.2 kB at 744 kB/s)
[windows-jdk10] [INFO] Downloading: https://repo.maven.apache.org/maven2/org/codehaus/plexus/plexus/2.0.5/plexus-2.0.5.pom
[windows-jdk10] [INFO] Downloaded: https://repo.maven.apache.org/maven2/org/codehaus/plexus/plexus/2.0.5/plexus-2.0.5.pom (17 kB at 913 kB/s)
[windows-jdk10] [INFO] Downloading: https://repo.maven.apache.org/maven2/org/sonatype/plexus/plexus-build-api/0.0.4/plexus-build-api-0.0.4.jar
[windows-jdk10] [INFO] Downloading: https://repo.maven.apache.org/maven2/org/apache/maven/shared/maven-artifact-resolver/1.0/maven-artifact-resolver-1.0.jar
[windows-jdk10] [INFO] Downloading: https://repo.maven.apache.org/maven2/org/apache/maven/shared/maven-filtering/1.1/maven-filtering-1.1.jar
[windows-jdk10] [INFO] Downloading: https://repo.maven.apache.org/maven2/org/codehaus/plexus/plexus-resources/1.0-alpha-7/plexus-resources-1.0-alpha-7.jar
[windows-jdk10] [INFO] Downloading: https://repo.maven.apache.org/maven2/org/codehaus/plexus/plexus-interpolation/1.12/plexus-interpolation-1.12.jar
[windows-jdk10] [INFO] Downloaded: https://repo.maven.apache.org/maven2/org/apache/maven/shared/maven-artifact-resolver/1.0/maven-artifact-resolver-1.0.jar (14 kB at 411 kB/s)
[windows-jdk10] [INFO] Downloaded: https://repo.maven.apache.org/maven2/org/codehaus/plexus/plexus-interpolation/1.12/plexus-interpolation-1.12.jar (61 kB at 1.5 MB/s)
[windows-jdk10] [INFO] Downloaded: https://repo.maven.apache.org/maven2/org/apache/maven/shared/maven-filtering/1.1/maven-filtering-1.1.jar (43 kB at 695 kB/s)
[windows-jdk10] [INFO] Downloaded: https://repo.maven.apache.org/maven2/org/sonatype/plexus/plexus-build-api/0.0.4/plexus-build-api-0.0.4.jar (6.8 kB at 83 kB/s)
[windows-jdk10] [INFO] Downloaded: https://repo.maven.apache.org/maven2/org/codehaus/plexus/plexus-resources/1.0-alpha-7/plexus-resources-1.0-alpha-7.jar (23 kB at 191 kB/s)
[windows-jdk7] Failed in branch windows-jdk7
[windows-jdk10] [INFO] Downloading: https://repo.maven.apache.org/maven2/org/apache/apache-jar-resource-bundle/1.4/apache-jar-resource-bundle-1.4.jar
[windows-jdk10] [INFO] Downloaded: https://repo.maven.apache.org/maven2/org/apache/apache-jar-resource-bundle/1.4/apache-jar-resource-bundle-1.4.jar (12 kB at 648 kB/s)
[windows-jdk9] [INFO] Mojo extractor with id: java-annotations found 0 mojo descriptors.
[windows-jdk9] [INFO]
[windows-jdk9] [INFO] --- maven-remote-resources-plugin:1.5:process (process-resource-bundles) @ maven-project-info-reports-plugin ---
[windows-jdk9] [INFO] Downloading: https://repo.maven.apache.org/maven2/org/apache/maven/shared/maven-artifact-resolver/1.0/maven-artifact-resolver-1.0.pom
[windows-jdk9] [INFO] Downloaded: https://repo.maven.apache.org/maven2/org/apache/maven/shared/maven-artifact-resolver/1.0/maven-artifact-resolver-1.0.pom (6.0 kB at 856 kB/s)
[windows-jdk9] [INFO] Downloading: https://repo.maven.apache.org/maven2/org/apache/maven/shared/maven-shared-components/12/maven-shared-components-12.pom
[windows-jdk9] [INFO] Downloaded: https://repo.maven.apache.org/maven2/org/apache/maven/shared/maven-shared-components/12/maven-shared-components-12.pom (9.3 kB at 1.2 MB/s)
[windows-jdk9] [INFO] Downloading: https://repo.maven.apache.org/maven2/org/apache/maven/maven-parent/13/maven-parent-13.pom
[windows-jdk9] [INFO] Downloaded: https://repo.maven.apache.org/maven2/org/apache/maven/maven-parent/13/maven-parent-13.pom (23 kB at 3.2 MB/s)
[windows-jdk9] [INFO] Downloading: https://repo.maven.apache.org/maven2/org/apache/maven/maven-artifact/2.0.8/maven-artifact-2.0.8.pom
[windows-jdk9] [INFO] Downloaded: https://repo.maven.apache.org/maven2/org/apache/maven/maven-artifact/2.0.8/maven-artifact-2.0.8.pom (1.6 kB at 202 kB/s)
[windows-jdk9] [INFO] Downloading: https://repo.maven.apache.org/maven2/org/codehaus/plexus/plexus-utils/1.4.6/plexus-utils-1.4.6.pom
[windows-jdk9] [INFO] Downloaded: https://repo.maven.apache.org/maven2/org/codehaus/plexus/plexus-utils/1.4.6/plexus-utils-1.4.6.pom (2.3 kB at 283 kB/s)
[windows-jdk9] [INFO] Downloading: https://repo.maven.apache.org/maven2/org/apache/maven/maven-project/2.0.8/maven-project-2.0.8.pom
[windows-jdk9] [INFO] Downloaded: https://repo.maven.apache.org/maven2/org/apache/maven/maven-project/2.0.8/maven-project-2.0.8.pom (2.7 kB at 226 kB/s)
[windows-jdk9] [INFO] Downloading: https://repo.maven.apache.org/maven2/org/apache/maven/maven-settings/2.0.8/maven-settings-2.0.8.pom
[windows-jdk9] [INFO] Downloaded: https://repo.maven.apache.org/maven2/org/apache/maven/maven-settings/2.0.8/maven-settings-2.0.8.pom (2.1 kB at 86 kB/s)
[windows-jdk9] [INFO] Downloading: https://repo.maven.apache.org/maven2/org/apache/maven/maven-profile/2.0.8/maven-profile-2.0.8.pom
[windows-jdk9] [INFO] Downloaded: https://repo.maven.apache.org/maven2/org/apache/maven/maven-profile/2.0.8/maven-profile-2.0.8.pom (2.0 kB at 97 kB/s)
[windows-jdk9] [INFO] Downloading: https://repo.maven.apache.org/maven2/org/apache/maven/maven-artifact-manager/2.0.8/maven-artifact-manager-2.0.8.pom
[windows-jdk9] [INFO] Downloaded: https://repo.maven.apache.org/maven2/org/apache/maven/maven-artifact-manager/2.0.8/maven-artifact-manager-2.0.8.pom (2.7 kB at 180 kB/s)
[windows-jdk9] [INFO] Downloading: https://repo.maven.apache.org/maven2/org/apache/maven/maven-repository-metadata/2.0.8/maven-repository-metadata-2.0.8.pom
[windows-jdk9] [INFO] Downloaded: https://repo.maven.apache.org/maven2/org/apache/maven/maven-repository-metadata/2.0.8/maven-repository-metadata-2.0.8.pom (1.9 kB at 211 kB/s)
[windows-jdk9] [INFO] Downloading: https://repo.maven.apache.org/maven2/org/apache/maven/maven-plugin-registry/2.0.8/maven-plugin-registry-2.0.8.pom
[windows-jdk9] [INFO] Downloaded: https://repo.maven.apache.org/maven2/org/apache/maven/maven-plugin-registry/2.0.8/maven-plugin-registry-2.0.8.pom (2.0 kB at 333 kB/s)
[windows-jdk9] [INFO] Downloading: https://repo.maven.apache.org/maven2/org/apache/maven/maven-plugin-api/2.0.8/maven-plugin-api-2.0.8.pom
[windows-jdk9] [INFO] Downloaded: https://repo.maven.apache.org/maven2/org/apache/maven/maven-plugin-api/2.0.8/maven-plugin-api-2.0.8.pom (1.5 kB at 213 kB/s)
[windows-jdk9] [INFO] Downloading: https://repo.maven.apache.org/maven2/org/codehaus/plexus/plexus-utils/2.1/plexus-utils-2.1.pom
[windows-jdk9] [INFO] Downloaded: https://repo.maven.apache.org/maven2/org/codehaus/plexus/plexus-utils/2.1/plexus-utils-2.1.pom (4.0 kB at 576 kB/s)
[windows-jdk9] [INFO] Downloading: https://repo.maven.apache.org/maven2/org/apache/maven/shared/maven-filtering/1.1/maven-filtering-1.1.pom
[windows-jdk9] [INFO] Downloaded: https://repo.maven.apache.org/maven2/org/apache/maven/shared/maven-filtering/1.1/maven-filtering-1.1.pom (5.8 kB at 579 kB/s)
[windows-jdk9] [INFO] Downloading: https://repo.maven.apache.org/maven2/org/apache/maven/maven-project/2.0.6/maven-project-2.0.6.pom
[windows-jdk9] [INFO] Downloaded: https://repo.maven.apache.org/maven2/org/apache/maven/maven-project/2.0.6/maven-project-2.0.6.pom (2.6 kB at 220 kB/s)
[windows-jdk9] [INFO] Downloading: https://repo.maven.apache.org/maven2/org/apache/maven/maven/2.0.6/maven-2.0.6.pom
[windows-jdk9] [INFO] Downloaded: https://repo.maven.apache.org/maven2/org/apache/maven/maven/2.0.6/maven-2.0.6.pom (9.0 kB at 1.5 MB/s)
[windows-jdk9] [INFO] Downloading: https://repo.maven.apache.org/maven2/org/apache/maven/maven-settings/2.0.6/maven-settings-2.0.6.pom
[windows-jdk9] [INFO] Downloaded: https://repo.maven.apache.org/maven2/org/apache/maven/maven-settings/2.0.6/maven-settings-2.0.6.pom (2.0 kB at 286 kB/s)
[windows-jdk9] [INFO] Downloading: https://repo.maven.apache.org/maven2/org/apache/maven/maven-model/2.0.6/maven-model-2.0.6.pom
[windows-jdk9] [INFO] Downloaded: https://repo.maven.apache.org/maven2/org/apache/maven/maven-model/2.0.6/maven-model-2.0.6.pom (3.0 kB at 339 kB/s)
[windows-jdk9] [INFO] Downloading: https://repo.maven.apache.org/maven2/org/apache/maven/maven-profile/2.0.6/maven-profile-2.0.6.pom
[windows-jdk9] [INFO] Downloaded: https://repo.maven.apache.org/maven2/org/apache/maven/maven-profile/2.0.6/maven-profile-2.0.6.pom (2.0 kB at 283 kB/s)
[windows-jdk9] [INFO] Downloading: https://repo.maven.apache.org/maven2/org/apache/maven/maven-artifact-manager/2.0.6/maven-artifact-manager-2.0.6.pom
[windows-jdk9] [INFO] Downloaded: https://repo.maven.apache.org/maven2/org/apache/maven/maven-artifact-manager/2.0.6/maven-artifact-manager-2.0.6.pom (2.6 kB at 375 kB/s)
[windows-jdk9] [INFO] Downloading: https://repo.maven.apache.org/maven2/org/apache/maven/maven-repository-metadata/2.0.6/maven-repository-metadata-2.0.6.pom
[windows-jdk9] [INFO] Downloaded: https://repo.maven.apache.org/maven2/org/apache/maven/maven-repository-metadata/2.0.6/maven-repository-metadata-2.0.6.pom (1.9 kB at 206 kB/s)
[windows-jdk9] [INFO] Downloading: https://repo.maven.apache.org/maven2/org/apache/maven/maven-artifact/2.0.6/maven-artifact-2.0.6.pom
[windows-jdk9] [INFO] Downloaded: https://repo.maven.apache.org/maven2/org/apache/maven/maven-artifact/2.0.6/maven-artifact-2.0.6.pom (1.6 kB at 175 kB/s)
[windows-jdk9] [INFO] Downloading: https://repo.maven.apache.org/maven2/org/apache/maven/maven-plugin-registry/2.0.6/maven-plugin-registry-2.0.6.pom
[windows-jdk9] [INFO] Downloaded: https://repo.maven.apache.org/maven2/org/apache/maven/maven-plugin-registry/2.0.6/maven-plugin-registry-2.0.6.pom (1.9 kB at 243 kB/s)
[windows-jdk9] [INFO] Downloading: https://repo.maven.apache.org/maven2/org/apache/maven/maven-core/2.0.6/maven-core-2.0.6.pom
[windows-jdk9] [INFO] Downloaded: https://repo.maven.apache.org/maven2/org/apache/maven/maven-core/2.0.6/maven-core-2.0.6.pom (6.7 kB at 746 kB/s)
[windows-jdk9] [INFO] Downloading: https://repo.maven.apache.org/maven2/org/apache/maven/maven-plugin-parameter-documenter/2.0.6/maven-plugin-parameter-documenter-2.0.6.pom
[windows-jdk9] [INFO] Downloaded: https://repo.maven.apache.org/maven2/org/apache/maven/maven-plugin-parameter-documenter/2.0.6/maven-plugin-parameter-documenter-2.0.6.pom (1.9 kB at 273 kB/s)
[windows-jdk9] [INFO] Downloading: https://repo.maven.apache.org/maven2/org/apache/maven/reporting/maven-reporting-api/2.0.6/maven-reporting-api-2.0.6.pom
[windows-jdk9] [INFO] Downloaded: https://repo.maven.apache.org/maven2/org/apache/maven/reporting/maven-reporting-api/2.0.6/maven-reporting-api-2.0.6.pom (1.8 kB at 219 kB/s)
[windows-jdk9] [INFO] Downloading: https://repo.maven.apache.org/maven2/org/apache/maven/reporting/maven-reporting/2.0.6/maven-reporting-2.0.6.pom
[windows-jdk9] [INFO] Downloaded: https://repo.maven.apache.org/maven2/org/apache/maven/reporting/maven-reporting/2.0.6/maven-reporting-2.0.6.pom (1.4 kB at 240 kB/s)
[windows-jdk9] [INFO] Downloading: https://repo.maven.apache.org/maven2/org/apache/maven/doxia/doxia-sink-api/1.0-alpha-7/doxia-sink-api-1.0-alpha-7.pom
[windows-jdk9] [INFO] Downloaded: https://repo.maven.apache.org/maven2/org/apache/maven/doxia/doxia-sink-api/1.0-alpha-7/doxia-sink-api-1.0-alpha-7.pom (424 B at 53 kB/s)
[windows-jdk9] [INFO] Downloading: https://repo.maven.apache.org/maven2/org/apache/maven/doxia/doxia/1.0-alpha-7/doxia-1.0-alpha-7.pom
[windows-jdk9] [INFO] Downloaded: https://repo.maven.apache.org/maven2/org/apache/maven/doxia/doxia/1.0-alpha-7/doxia-1.0-alpha-7.pom (3.9 kB at 559 kB/s)
[windows-jdk9] [INFO] Downloading: https://repo.maven.apache.org/maven2/org/apache/maven/maven-error-diagnostics/2.0.6/maven-error-diagnostics-2.0.6.pom
[windows-jdk9] [INFO] Downloaded: https://repo.maven.apache.org/maven2/org/apache/maven/maven-error-diagnostics/2.0.6/maven-error-diagnostics-2.0.6.pom (1.7 kB at 243 kB/s)
[windows-jdk9] [INFO] Downloading: https://repo.maven.apache.org/maven2/org/apache/maven/maven-plugin-api/2.0.6/maven-plugin-api-2.0.6.pom
[windows-jdk9] [INFO] Downloaded: https://repo.maven.apache.org/maven2/org/apache/maven/maven-plugin-api/2.0.6/maven-plugin-api-2.0.6.pom (1.5 kB at 242 kB/s)
[windows-jdk9] [INFO] Downloading: https://repo.maven.apache.org/maven2/org/apache/maven/maven-plugin-descriptor/2.0.6/maven-plugin-descriptor-2.0.6.pom
[windows-jdk9] [INFO] Downloaded: https://repo.maven.apache.org/maven2/org/apache/maven/maven-plugin-descriptor/2.0.6/maven-plugin-descriptor-2.0.6.pom (2.0 kB at 336 kB/s)
[windows-jdk9] [INFO] Downloading: https://repo.maven.apache.org/maven2/org/apache/maven/maven-monitor/2.0.6/maven-monitor-2.0.6.pom
[windows-jdk9] [INFO] Downloaded: https://repo.maven.apache.org/maven2/org/apache/maven/maven-monitor/2.0.6/maven-monitor-2.0.6.pom (1.3 kB at 42 kB/s)
[windows-jdk9] [INFO] Downloading: https://repo.maven.apache.org/maven2/org/codehaus/plexus/plexus-interpolation/1.12/plexus-interpolation-1.12.pom
[windows-jdk9] [INFO] Downloaded: https://repo.maven.apache.org/maven2/org/codehaus/plexus/plexus-interpolation/1.12/plexus-interpolation-1.12.pom (889 B at 148 kB/s)
[windows-jdk9] [INFO] Downloading: https://repo.maven.apache.org/maven2/org/sonatype/plexus/plexus-build-api/0.0.4/plexus-build-api-0.0.4.pom
[windows-jdk9] [INFO] Downloaded: https://repo.maven.apache.org/maven2/org/sonatype/plexus/plexus-build-api/0.0.4/plexus-build-api-0.0.4.pom (2.9 kB at 409 kB/s)
[windows-jdk9] [INFO] Downloading: https://repo.maven.apache.org/maven2/org/codehaus/plexus/plexus-utils/1.5.8/plexus-utils-1.5.8.pom
[windows-jdk9] [INFO] Downloaded: https://repo.maven.apache.org/maven2/org/codehaus/plexus/plexus-utils/1.5.8/plexus-utils-1.5.8.pom (8.1 kB at 1.3 MB/s)
[windows-jdk8] [INFO] /f:/jenkins/jenkins-slave/workspace/nfo-reports-plugin_MPIR-366-S464FI4ATSVOULE3N7MCKV5FYYG6GVHDD7OLISMYBGUEPLQM2UNA/m/src/test/java/org/apache/maven/report/projectinfo/stubs/ProjectInfoProjectStub.java: Some input files use or override a deprecated API.
[windows-jdk8] [INFO] /f:/jenkins/jenkins-slave/workspace/nfo-reports-plugin_MPIR-366-S464FI4ATSVOULE3N7MCKV5FYYG6GVHDD7OLISMYBGUEPLQM2UNA/m/src/test/java/org/apache/maven/report/projectinfo/stubs/ProjectInfoProjectStub.java: Recompile with -Xlint:deprecation for details.
[windows-jdk8] [INFO] /f:/jenkins/jenkins-slave/workspace/nfo-reports-plugin_MPIR-366-S464FI4ATSVOULE3N7MCKV5FYYG6GVHDD7OLISMYBGUEPLQM2UNA/m/src/test/java/org/apache/maven/report/projectinfo/stubs/ModulesStub.java: f:\jenkins\jenkins-slave\workspace\nfo-reports-plugin_MPIR-366-S464FI4ATSVOULE3N7MCKV5FYYG6GVHDD7OLISMYBGUEPLQM2UNA\m\src\test\java\org\apache\maven\report\projectinfo\stubs\ModulesStub.java uses unchecked or unsafe operations.
[windows-jdk8] [INFO] /f:/jenkins/jenkins-slave/workspace/nfo-reports-plugin_MPIR-366-S464FI4ATSVOULE3N7MCKV5FYYG6GVHDD7OLISMYBGUEPLQM2UNA/m/src/test/java/org/apache/maven/report/projectinfo/stubs/ModulesStub.java: Recompile with -Xlint:unchecked for details.
[windows-jdk8] [INFO] -------------------------------------------------------------
[windows-jdk8] [ERROR] COMPILATION ERROR :
[windows-jdk8] [INFO] -------------------------------------------------------------
[windows-jdk8] [ERROR] /f:/jenkins/jenkins-slave/workspace/nfo-reports-plugin_MPIR-366-S464FI4ATSVOULE3N7MCKV5FYYG6GVHDD7OLISMYBGUEPLQM2UNA/m/src/test/java/org/apache/maven/report/projectinfo/AbstractProjectInfoTestCase.java:[34,49] cannot find symbol
[windows-jdk8]   symbol:   class DependencyArtifactStubFactory
[windows-jdk8]   location: package org.apache.maven.report.projectinfo.stubs
[windows-jdk8] [ERROR] /f:/jenkins/jenkins-slave/workspace/nfo-reports-plugin_MPIR-366-S464FI4ATSVOULE3N7MCKV5FYYG6GVHDD7OLISMYBGUEPLQM2UNA/m/src/test/java/org/apache/maven/report/projectinfo/AbstractProjectInfoTestCase.java:[77,35] cannot find symbol
[windows-jdk8]   symbol:   class DependencyArtifactStubFactory
[windows-jdk8]   location: class org.apache.maven.report.projectinfo.AbstractProjectInfoTestCase
[windows-jdk8] [INFO] 2 errors
[windows-jdk8] [INFO] -------------------------------------------------------------
[windows-jdk8] [INFO] ------------------------------------------------------------------------
[windows-jdk8] [INFO] BUILD FAILURE
[windows-jdk8] [INFO] ------------------------------------------------------------------------
[windows-jdk8] [INFO] Total time: 31.282 s
[windows-jdk8] [INFO] Finished at: 2018-04-13T11:11:41Z
[windows-jdk10] [INFO]
[windows-jdk10] [INFO] --- maven-resources-plugin:2.7:resources (default-resources) @ maven-project-info-reports-plugin ---
[windows-jdk10] [INFO] Downloading: https://repo.maven.apache.org/maven2/org/apache/maven/shared/maven-filtering/1.2/maven-filtering-1.2.pom
[windows-jdk9] [INFO] Downloading: https://repo.maven.apache.org/maven2/org/codehaus/plexus/plexus-resources/1.0-alpha-7/plexus-resources-1.0-alpha-7.pom
[windows-jdk9] [INFO] Downloaded: https://repo.maven.apache.org/maven2/org/codehaus/plexus/plexus-resources/1.0-alpha-7/plexus-resources-1.0-alpha-7.pom (1.4 kB at 151 kB/s)
[windows-jdk9] [INFO] Downloading: https://repo.maven.apache.org/maven2/org/codehaus/plexus/plexus-components/1.1.17/plexus-components-1.1.17.pom
[windows-jdk9] [INFO] Downloaded: https://repo.maven.apache.org/maven2/org/codehaus/plexus/plexus-components/1.1.17/plexus-components-1.1.17.pom (5.2 kB at 744 kB/s)
[windows-jdk9] [INFO] Downloading: https://repo.maven.apache.org/maven2/org/codehaus/plexus/plexus/2.0.5/plexus-2.0.5.pom
[windows-jdk9] [INFO] Downloaded: https://repo.maven.apache.org/maven2/org/codehaus/plexus/plexus/2.0.5/plexus-2.0.5.pom (17 kB at 2.2 MB/s)
[windows-jdk9] [INFO] Downloading: https://repo.maven.apache.org/maven2/org/apache/maven/shared/maven-filtering/1.1/maven-filtering-1.1.jar
[windows-jdk9] [INFO] Downloading: https://repo.maven.apache.org/maven2/org/sonatype/plexus/plexus-build-api/0.0.4/plexus-build-api-0.0.4.jar
[windows-jdk9] [INFO] Downloading: https://repo.maven.apache.org/maven2/org/codehaus/plexus/plexus-interpolation/1.12/plexus-interpolation-1.12.jar
[windows-jdk9] [INFO] Downloading: https://repo.maven.apache.org/maven2/org/apache/maven/shared/maven-artifact-resolver/1.0/maven-artifact-resolver-1.0.jar
[windows-jdk9] [INFO] Downloading: https://repo.maven.apache.org/maven2/org/codehaus/plexus/plexus-resources/1.0-alpha-7/plexus-resources-1.0-alpha-7.jar
[windows-jdk9] [INFO] Downloaded: https://repo.maven.apache.org/maven2/org/sonatype/plexus/plexus-build-api/0.0.4/plexus-build-api-0.0.4.jar (6.8 kB at 139 kB/s)
[windows-jdk9] [INFO] Downloaded: https://repo.maven.apache.org/maven2/org/apache/maven/shared/maven-filtering/1.1/maven-filtering-1.1.jar (43 kB at 862 kB/s)
[windows-jdk9] [INFO] Downloaded: https://repo.maven.apache.org/maven2/org/apache/maven/shared/maven-artifact-resolver/1.0/maven-artifact-resolver-1.0.jar (14 kB at 230 kB/s)
[windows-jdk9] [INFO] Downloaded: https://repo.maven.apache.org/maven2/org/codehaus/plexus/plexus-resources/1.0-alpha-7/plexus-resources-1.0-alpha-7.jar (23 kB at 401 kB/s)
[windows-jdk9] [INFO] Downloaded: https://repo.maven.apache.org/maven2/org/codehaus/plexus/plexus-interpolation/1.12/plexus-interpolation-1.12.jar (61 kB at 938 kB/s)
[windows-jdk9] [INFO] Downloading: https://repo.maven.apache.org/maven2/org/apache/apache-jar-resource-bundle/1.4/apache-jar-resource-bundle-1.4.jar
[windows-jdk9] [INFO] Downloaded: https://repo.maven.apache.org/maven2/org/apache/apache-jar-resource-bundle/1.4/apache-jar-resource-bundle-1.4.jar (12 kB at 1.1 MB/s)
[windows-jdk9] Sending interrupt signal to process
[windows-jdk10] Sending interrupt signal to process
[windows-jdk10] [INFO] Downloaded: https://repo.maven.apache.org/maven2/org/apache/maven/shared/maven-filtering/1.2/maven-filtering-1.2.pom (6.5 kB at 814 kB/s)
[windows-jdk10] [INFO] Downloading: https://repo.maven.apache.org/maven2/org/apache/maven/shared/maven-shared-utils/0.3/maven-shared-utils-0.3.pom
[windows-jdk10] [INFO] Downloaded: https://repo.maven.apache.org/maven2/org/apache/maven/shared/maven-shared-utils/0.3/maven-shared-utils-0.3.pom (4.0 kB at 162 kB/s)
[windows-jdk10] [INFO] Downloading: https://repo.maven.apache.org/maven2/org/apache/maven/shared/maven-shared-components/18/maven-shared-components-18.pom
[windows-jdk10] [INFO] Downloaded: https://repo.maven.apache.org/maven2/org/apache/maven/shared/maven-shared-components/18/maven-shared-components-18.pom (4.9 kB at 380 kB/s)
[windows-jdk10] [INFO] Downloading: https://repo.maven.apache.org/maven2/org/apache/maven/maven-parent/22/maven-parent-22.pom
[windows-jdk10] [INFO] Downloaded: https://repo.maven.apache.org/maven2/org/apache/maven/maven-parent/22/maven-parent-22.pom (30 kB at 2.1 MB/s)
[windows-jdk10] [INFO] Downloading: https://repo.maven.apache.org/maven2/org/apache/apache/11/apache-11.pom
[windows-jdk10] [INFO] Downloaded: https://repo.maven.apache.org/maven2/org/apache/apache/11/apache-11.pom (15 kB at 2.1 MB/s)
[windows-jdk10] [INFO] Downloading: https://repo.maven.apache.org/maven2/org/codehaus/plexus/plexus-interpolation/1.19/plexus-interpolation-1.19.pom
[windows-jdk10] [INFO] Downloaded: https://repo.maven.apache.org/maven2/org/codehaus/plexus/plexus-interpolation/1.19/plexus-interpolation-1.19.pom (1.0 kB at 206 kB/s)
[windows-jdk10] [INFO] Downloading: https://repo.maven.apache.org/maven2/org/codehaus/plexus/plexus-components/1.3.1/plexus-components-1.3.1.pom
[windows-jdk10] [INFO] Downloaded: https://repo.maven.apache.org/maven2/org/codehaus/plexus/plexus-components/1.3.1/plexus-components-1.3.1.pom (3.1 kB at 511 kB/s)
[windows-jdk10] [INFO] Downloading: https://repo.maven.apache.org/maven2/org/apache/maven/shared/maven-filtering/1.2/maven-filtering-1.2.jar
[windows-jdk10] [INFO] Downloaded: https://repo.maven.apache.org/maven2/org/apache/maven/shared/maven-filtering/1.2/maven-filtering-1.2.jar (44 kB at 545 kB/s)
[windows-jdk10] [INFO] Downloading: https://repo.maven.apache.org/maven2/org/apache/maven/shared/maven-shared-utils/0.3/maven-shared-utils-0.3.jar
[windows-jdk10] [INFO] Downloading: https://repo.maven.apache.org/maven2/org/codehaus/plexus/plexus-interpolation/1.19/plexus-interpolation-1.19.jar
[windows-jdk10] [INFO] Downloaded: https://repo.maven.apache.org/maven2/org/apache/maven/shared/maven-shared-utils/0.3/maven-shared-utils-0.3.jar (155 kB at 835 kB/s)
[windows-jdk10] [INFO] Downloaded: https://repo.maven.apache.org/maven2/org/codehaus/plexus/plexus-interpolation/1.19/plexus-interpolation-1.19.jar (62 kB at 316 kB/s)
[windows-jdk10] [INFO] Using 'UTF-8' encoding to copy filtered resources.
[windows-jdk10] [INFO] Copying 25 resources
[windows-jdk10] [INFO] Copying 3 resources
[windows-jdk10] [INFO]
[windows-jdk10] [INFO] --- maven-compiler-plugin:3.5.1:compile (default-compile) @ maven-project-info-reports-plugin ---
[windows-jdk10] [INFO] Downloading: https://repo.maven.apache.org/maven2/org/apache/maven/maven-toolchain/2.2.1/maven-toolchain-2.2.1.pom
[windows-jdk10] [INFO] Downloaded: https://repo.maven.apache.org/maven2/org/apache/maven/maven-toolchain/2.2.1/maven-toolchain-2.2.1.pom (3.3 kB at 557 kB/s)
[windows-jdk10] [INFO] Downloading: https://repo.maven.apache.org/maven2/org/apache/maven/shared/maven-shared-incremental/1.1/maven-shared-incremental-1.1.pom
[windows-jdk10] [INFO] Downloaded: https://repo.maven.apache.org/maven2/org/apache/maven/shared/maven-shared-incremental/1.1/maven-shared-incremental-1.1.pom (4.7 kB at 62 kB/s)
[windows-jdk10] [INFO] Downloading: https://repo.maven.apache.org/maven2/org/apache/maven/shared/maven-shared-utils/0.1/maven-shared-utils-0.1.pom
[windows-jdk10] [INFO] Downloaded: https://repo.maven.apache.org/maven2/org/apache/maven/shared/maven-shared-utils/0.1/maven-shared-utils-0.1.pom (4.0 kB at 506 kB/s)
[windows-jdk10] [INFO] Downloading: https://repo.maven.apache.org/maven2/org/codehaus/plexus/plexus-compiler-api/2.7/plexus-compiler-api-2.7.pom
[windows-jdk10] [INFO] Downloaded: https://repo.maven.apache.org/maven2/org/codehaus/plexus/plexus-compiler-api/2.7/plexus-compiler-api-2.7.pom (891 B at 99 kB/s)
[windows-jdk10] [INFO] Downloading: https://repo.maven.apache.org/maven2/org/codehaus/plexus/plexus-compiler/2.7/plexus-compiler-2.7.pom
[windows-jdk10] [INFO] Downloaded: https://repo.maven.apache.org/maven2/org/codehaus/plexus/plexus-compiler/2.7/plexus-compiler-2.7.pom (4.9 kB at 705 kB/s)
[windows-jdk10] [INFO] Downloading: https://repo.maven.apache.org/maven2/org/codehaus/plexus/plexus-compiler-manager/2.7/plexus-compiler-manager-2.7.pom
[windows-jdk10] [INFO] Downloaded: https://repo.maven.apache.org/maven2/org/codehaus/plexus/plexus-compiler-manager/2.7/plexus-compiler-manager-2.7.pom (711 B at 102 kB/s)
[windows-jdk10] [INFO] Downloading: https://repo.maven.apache.org/maven2/org/codehaus/plexus/plexus-compiler-javac/2.7/plexus-compiler-javac-2.7.pom
[windows-jdk10] [INFO] Downloaded: https://repo.maven.apache.org/maven2/org/codehaus/plexus/plexus-compiler-javac/2.7/plexus-compiler-javac-2.7.pom (792 B at 132 kB/s)
[windows-jdk10] [INFO] Downloading: https://repo.maven.apache.org/maven2/org/codehaus/plexus/plexus-compilers/2.7/plexus-compilers-2.7.pom
[windows-jdk10] [INFO] Downloaded: https://repo.maven.apache.org/maven2/org/codehaus/plexus/plexus-compilers/2.7/plexus-compilers-2.7.pom (1.4 kB at 276 kB/s)
[windows-jdk10] [INFO] Downloading: https://repo.maven.apache.org/maven2/org/apache/maven/maven-toolchain/2.2.1/maven-toolchain-2.2.1.jar
[windows-jdk10] [INFO] Downloading: https://repo.maven.apache.org/maven2/org/codehaus/plexus/plexus-compiler-javac/2.7/plexus-compiler-javac-2.7.jar
[windows-jdk10] [INFO] Downloading: https://repo.maven.apache.org/maven2/org/apache/maven/shared/maven-shared-incremental/1.1/maven-shared-incremental-1.1.jar
[windows-jdk10] [INFO] Downloading: https://repo.maven.apache.org/maven2/org/codehaus/plexus/plexus-compiler-api/2.7/plexus-compiler-api-2.7.jar
[windows-jdk10] [INFO] Downloading: https://repo.maven.apache.org/maven2/org/codehaus/plexus/plexus-compiler-manager/2.7/plexus-compiler-manager-2.7.jar
[windows-jdk10] [INFO] Downloaded: https://repo.maven.apache.org/maven2/org/apache/maven/maven-toolchain/2.2.1/maven-toolchain-2.2.1.jar (38 kB at 3.8 MB/s)
[windows-jdk10] [INFO] Downloaded: https://repo.maven.apache.org/maven2/org/apache/maven/shared/maven-shared-incremental/1.1/maven-shared-incremental-1.1.jar (14 kB at 967 kB/s)
[windows-jdk10] [INFO] Downloaded: https://repo.maven.apache.org/maven2/org/codehaus/plexus/plexus-compiler-javac/2.7/plexus-compiler-javac-2.7.jar (19 kB at 1.1 MB/s)
[windows-jdk10] [INFO] Downloaded: https://repo.maven.apache.org/maven2/org/codehaus/plexus/plexus-compiler-manager/2.7/plexus-compiler-manager-2.7.jar (4.7 kB at 260 kB/s)
[windows-jdk10] [INFO] Downloaded: https://repo.maven.apache.org/maven2/org/codehaus/plexus/plexus-compiler-api/2.7/plexus-compiler-api-2.7.jar (26 kB at 1.2 MB/s)
[Pipeline] [linux-jdk7] // node
[Pipeline] [linux-jdk8] // node
[Pipeline] [linux-jdk9] // node
[Pipeline] [linux-jdk10] // node
[Pipeline] [linux-jdk7] }
[linux-jdk7] Failed in branch linux-jdk7
[Pipeline] [linux-jdk8] }
[linux-jdk8] Failed in branch linux-jdk8
[Pipeline] [linux-jdk9] }
[linux-jdk9] Failed in branch linux-jdk9
[Pipeline] [linux-jdk10] }
[linux-jdk10] Failed in branch linux-jdk10
[Pipeline] [windows-jdk8] }
[Pipeline] [windows-jdk10] }
[Pipeline] [windows-jdk8] // dir
[Pipeline] [windows-jdk8] }
[windows-jdk8] [withMaven] One or multiple Maven executions have been ignored by the Jenkins Pipeline Maven Plugin because they have been interrupted before completion (1). See Pipeline Maven Plugin FAQ for more details.
[Pipeline] [windows-jdk10] // dir
[Pipeline] [windows-jdk10] }
[windows-jdk10] [withMaven] One or multiple Maven executions have been ignored by the Jenkins Pipeline Maven Plugin because they have been interrupted before completion (1). See Pipeline Maven Plugin FAQ for more details.
[Pipeline] [windows-jdk8] // withMaven
[Pipeline] [windows-jdk8] echo
[windows-jdk8] [FAIL FAST] windows-jdk7 had first failure, ignoring script returned exit code -1
[Pipeline] [windows-jdk8] }
[Pipeline] [windows-jdk10] // withMaven
[Pipeline] [windows-jdk10] echo
[windows-jdk10] [FAIL FAST] windows-jdk7 had first failure, ignoring script returned exit code -1
[Pipeline] [windows-jdk10] }
[Pipeline] [windows-jdk8] // stage
[Pipeline] [windows-jdk8] }
[Pipeline] [windows-jdk10] // stage
[Pipeline] [windows-jdk10] }
[Pipeline] [windows-jdk8] // node
[Pipeline] [windows-jdk8] }
[Pipeline] [windows-jdk10] // node
[Pipeline] [windows-jdk10] }
[windows-jdk9] After 10s process did not stop
[Pipeline] [windows-jdk9] }
[Pipeline] [windows-jdk9] // dir
[Pipeline] [windows-jdk9] }
[windows-jdk9] [withMaven] One or multiple Maven executions have been ignored by the Jenkins Pipeline Maven Plugin because they have been interrupted before completion (1). See Pipeline Maven Plugin FAQ for more details.
[Pipeline] [windows-jdk9] // withMaven
[Pipeline] [windows-jdk9] echo
[windows-jdk9] [FAIL FAST] windows-jdk7 had first failure, ignoring null
[Pipeline] [windows-jdk9] }
[Pipeline] [windows-jdk9] // stage
[Pipeline] [windows-jdk9] }
[Pipeline] [windows-jdk9] // node
[Pipeline] [windows-jdk9] }
[Pipeline] // parallel
[Pipeline] echo
***** FAST FAILURE *****

Fast failure triggered by windows-jdk7

***** FAST FAILURE *****
[Pipeline] stage
[Pipeline] { (Notifications)
[Pipeline] echo
Build result: FAILURE
[Pipeline] jiraIssueSelector
Reply | Threaded
Open this post in threaded view
|

Build failed in Jenkins: Maven TLP » maven-project-info-reports-plugin » MPIR-366 #15

Apache Jenkins Server-2
See https://builds.apache.org/job/maven-box/job/maven-project-info-reports-plugin/job/MPIR-366/15/

Changes:

* [MPIR-366] Drop Maven 2 support
* [MPIR-366] Drop Maven 2 support
* [MPIR-366] Drop Maven 2 support
* [MPIR-366] Drop Maven 2 support

All tests passed

Build log:
[...truncated 335.74 KB...]
[windows-jdk8] [INFO] Downloading: https://repo.maven.apache.org/maven2/com/google/guava/guava-parent/18.0/guava-parent-18.0.pom
[windows-jdk8] [INFO] Downloaded: https://repo.maven.apache.org/maven2/com/google/guava/guava-parent/18.0/guava-parent-18.0.pom (7.7 kB at 640 kB/s)
[windows-jdk8] [INFO] Downloading: https://repo.maven.apache.org/maven2/org/apache/maven/shared/maven-shared-resources/2/maven-shared-resources-2.jar
[windows-jdk8] [INFO] Downloading: https://repo.maven.apache.org/maven2/org/codehaus/plexus/plexus-resources/1.0.1/plexus-resources-1.0.1.jar
[windows-jdk8] [INFO] Downloading: https://repo.maven.apache.org/maven2/com/puppycrawl/tools/checkstyle/6.1.1/checkstyle-6.1.1.jar
[windows-jdk8] [INFO] Downloading: https://repo.maven.apache.org/maven2/org/antlr/antlr4-runtime/4.3/antlr4-runtime-4.3.jar
[windows-jdk8] [INFO] Downloading: https://repo.maven.apache.org/maven2/org/abego/treelayout/org.abego.treelayout.core/1.0.1/org.abego.treelayout.core-1.0.1.jar
[windows-jdk8] [INFO] Downloaded: https://repo.maven.apache.org/maven2/com/puppycrawl/tools/checkstyle/6.1.1/checkstyle-6.1.1.jar (1.0 MB at 18 MB/s)
[windows-jdk8] [INFO] Downloading: https://repo.maven.apache.org/maven2/org/antlr/antlr4-annotations/4.3/antlr4-annotations-4.3.jar
[windows-jdk8] [INFO] Downloaded: https://repo.maven.apache.org/maven2/org/antlr/antlr4-runtime/4.3/antlr4-runtime-4.3.jar (345 kB at 5.0 MB/s)
[windows-jdk8] [INFO] Downloading: https://repo.maven.apache.org/maven2/commons-beanutils/commons-beanutils-core/1.8.3/commons-beanutils-core-1.8.3.jar
[windows-jdk8] [INFO] Downloaded: https://repo.maven.apache.org/maven2/org/apache/maven/shared/maven-shared-resources/2/maven-shared-resources-2.jar (13 kB at 147 kB/s)
[windows-jdk8] [INFO] Downloading: https://repo.maven.apache.org/maven2/com/google/guava/guava/18.0/guava-18.0.jar
[windows-jdk8] [INFO] Downloaded: https://repo.maven.apache.org/maven2/commons-beanutils/commons-beanutils-core/1.8.3/commons-beanutils-core-1.8.3.jar (207 kB at 2.3 MB/s)
[windows-jdk8] [INFO] Downloaded: https://repo.maven.apache.org/maven2/org/antlr/antlr4-annotations/4.3/antlr4-annotations-4.3.jar (10 kB at 101 kB/s)
[windows-jdk8] [INFO] Downloaded: https://repo.maven.apache.org/maven2/org/codehaus/plexus/plexus-resources/1.0.1/plexus-resources-1.0.1.jar (22 kB at 160 kB/s)
[windows-jdk8] [INFO] Downloaded: https://repo.maven.apache.org/maven2/org/abego/treelayout/org.abego.treelayout.core/1.0.1/org.abego.treelayout.core-1.0.1.jar (26 kB at 178 kB/s)
[windows-jdk8] [INFO] Downloaded: https://repo.maven.apache.org/maven2/com/google/guava/guava/18.0/guava-18.0.jar (2.3 MB at 12 MB/s)
[windows-jdk8] [INFO] There are 10 errors reported by Checkstyle 6.1.1 with config/maven_checks.xml ruleset.
[windows-jdk8] [INFO] Ignored 10 errors, 0 violation remaining.
[windows-jdk8] [INFO]
[windows-jdk8] [INFO] --- maven-jarsigner-plugin:1.3.2:verify (verify) @ maven-project-info-reports-plugin ---
[windows-jdk8] [WARNING] Picked up JAVA_TOOL_OPTIONS: -Dmaven.ext.class.path="f:\jenkins\jenkins-slave\workspace\nfo-reports-plugin_MPIR-366-S464FI4ATSVOULE3N7MCKV5FYYG6GVHDD7OLISMYBGUEPLQM2UNA@tmp\withMaven1ee3135a\pipeline-maven-spy.jar" -Dorg.jenkinsci.plugins.pipeline.maven.reportsFolder="f:\jenkins\jenkins-slave\workspace\nfo-reports-plugin_MPIR-366-S464FI4ATSVOULE3N7MCKV5FYYG6GVHDD7OLISMYBGUEPLQM2UNA@tmp\withMaven1ee3135a"
[windows-jdk8] [INFO] 1 archive(s) processed
[windows-jdk8] [INFO]
[windows-jdk8] [INFO] --- maven-invoker-plugin:2.0.0:verify (integration-test) @ maven-project-info-reports-plugin ---
[windows-jdk8] [INFO] -------------------------------------------------
[windows-jdk8] [INFO] Build Summary:
[windows-jdk8] [INFO]   Passed: 11, Failed: 0, Errors: 0, Skipped: 0
[windows-jdk8] [INFO] -------------------------------------------------
[windows-jdk8] [INFO] ------------------------------------------------------------------------
[windows-jdk8] [INFO] BUILD SUCCESS
[windows-jdk8] [INFO] ------------------------------------------------------------------------
[windows-jdk8] [INFO] Total time: 02:19 min
[windows-jdk8] [INFO] Finished at: 2018-04-13T11:14:59Z
[windows-jdk8] [INFO] Final Memory: 61M/1092M
[windows-jdk8] [INFO] ------------------------------------------------------------------------
[windows-jdk8] [INFO] [jenkins-event-spy] Generated F:\jenkins\jenkins-slave\workspace\nfo-reports-plugin_MPIR-366-S464FI4ATSVOULE3N7MCKV5FYYG6GVHDD7OLISMYBGUEPLQM2UNA@tmp\withMaven1ee3135a\maven-spy-20180413-111238-9854994914738742482771.log
[windows-jdk8] Picked up JAVA_TOOL_OPTIONS: -Dmaven.ext.class.path="f:\jenkins\jenkins-slave\workspace\nfo-reports-plugin_MPIR-366-S464FI4ATSVOULE3N7MCKV5FYYG6GVHDD7OLISMYBGUEPLQM2UNA@tmp\withMaven1ee3135a\pipeline-maven-spy.jar" -Dorg.jenkinsci.plugins.pipeline.maven.reportsFolder="f:\jenkins\jenkins-slave\workspace\nfo-reports-plugin_MPIR-366-S464FI4ATSVOULE3N7MCKV5FYYG6GVHDD7OLISMYBGUEPLQM2UNA@tmp\withMaven1ee3135a"
[Pipeline] [windows-jdk8] }
[Pipeline] [windows-jdk8] // dir
[windows-jdk7] [INFO] run script verify.groovy
[windows-jdk7] [INFO] ..SUCCESS (7.1 s)
[windows-jdk7] [INFO] Building: minimal-pom\pom.xml
[windows-jdk7] [INFO] run script verify.bsh
[windows-jdk7] [INFO] ..SUCCESS (14.6 s)
[windows-jdk7] [INFO] Building: mpir-229\pom.xml
[windows-jdk7] [INFO] run script verify.groovy
[windows-jdk7] [INFO] ..SUCCESS (7.4 s)
[windows-jdk7] [INFO] Building: MPIR-242\pom.xml
[windows-jdk7] [INFO] run script verify.groovy
[windows-jdk7] [INFO] ..SUCCESS (7.3 s)
[windows-jdk7] [INFO] Building: MPIR-251\pom.xml
[windows-jdk9] [INFO] run script verify.bsh
[windows-jdk9] [INFO] ..SUCCESS (82.3 s)
[windows-jdk9] [INFO] Building: git\pom.xml
[windows-jdk9] [INFO] ..SUCCESS (10.5 s)
[windows-jdk9] [INFO] Building: java-version\pom.xml
[windows-jdk10] [INFO] run script verify.groovy
[windows-jdk10] [INFO] ..SUCCESS (16.6 s)
[windows-jdk10] [INFO] Building: MPIR-300\pom.xml
[windows-jdk10] [INFO] run script verify.groovy
[windows-jdk10] [INFO] ..SUCCESS (8.2 s)
[windows-jdk10] [INFO] Building: MPIR-349\parent\pom.xml
[windows-jdk10] [INFO] run script verify.groovy
[windows-jdk10] [INFO] ..SUCCESS (15.0 s)
[windows-jdk10] [INFO] Building: multi-module\pom.xml
[windows-jdk9] [INFO] run script verify.groovy
[windows-jdk9] [INFO] ..SUCCESS (9.8 s)
[windows-jdk9] [INFO] Building: minimal-pom\pom.xml
[windows-jdk7] [INFO] run script verify.groovy
[windows-jdk7] [INFO] ..SUCCESS (13.5 s)
[windows-jdk7] [INFO] Building: MPIR-300\pom.xml
[windows-jdk7] [INFO] run script verify.groovy
[windows-jdk7] [INFO] ..SUCCESS (7.1 s)
[windows-jdk7] [INFO] Building: MPIR-349\parent\pom.xml
[Pipeline] [windows-jdk8] }
[windows-jdk8] [withMaven] junitPublisher - Archive test results for Maven artifact org.apache.maven.plugins:maven-project-info-reports-plugin:2.10-SNAPSHOT generated by maven-surefire-plugin:test (default-test): m\target\surefire-reports\*.xml
[windows-jdk8] [withMaven] junitPublisher - Jenkins JUnit Attachments Plugin not found, can't publish test attachments.Recording test results
[windows-jdk8] [withMaven] junitPublisher - Archive test results for Maven artifact org.apache.maven.plugins.project-info-reports.its:dep:1.0-SNAPSHOT generated by maven-surefire-plugin:test (default-test): m\target\it\multi-module\dep\target\surefire-reports\*.xml
[windows-jdk8] [withMaven] junitPublisher - Jenkins JUnit Attachments Plugin not found, can't publish test attachments.Recording test results
[windows-jdk8] None of the test reports contained any result
[windows-jdk8] [withMaven] junitPublisher - Archive test results for Maven artifact org.apache.maven.plugins.project-info-reports.its:main:1.0-SNAPSHOT generated by maven-surefire-plugin:test (default-test): m\target\it\multi-module\main\target\surefire-reports\*.xml
[windows-jdk8] [withMaven] junitPublisher - Jenkins JUnit Attachments Plugin not found, can't publish test attachments.Recording test results
[windows-jdk8] None of the test reports contained any result
[Pipeline] [windows-jdk8] // withMaven
[Pipeline] [windows-jdk8] }
[Pipeline] [windows-jdk8] // stage
[Pipeline] [windows-jdk8] }
[Pipeline] [windows-jdk8] // node
[Pipeline] [windows-jdk8] }
[windows-jdk10] [INFO] ..FAILED (23.9 s)
[windows-jdk10] [INFO]   The build exited with code 1. See f:\jenkins\jenkins-slave\workspace\nfo-reports-plugin_MPIR-366-S464FI4ATSVOULE3N7MCKV5FYYG6GVHDD7OLISMYBGUEPLQM2UNA@2\m\target\it\multi-module\build.log for details.
[windows-jdk10] [INFO]
[windows-jdk10] [INFO] --- maven-checkstyle-plugin:2.15:check (checkstyle-check) @ maven-project-info-reports-plugin ---
[windows-jdk10] [INFO] Downloading: https://repo.maven.apache.org/maven2/org/apache/maven/shared/maven-shared-resources/2/maven-shared-resources-2.pom
[windows-jdk10] [INFO] Downloaded: https://repo.maven.apache.org/maven2/org/apache/maven/shared/maven-shared-resources/2/maven-shared-resources-2.pom (3.0 kB at 227 kB/s)
[windows-jdk10] [INFO] Downloading: https://repo.maven.apache.org/maven2/org/codehaus/plexus/plexus-utils/3.0.10/plexus-utils-3.0.10.pom
[windows-jdk10] [INFO] Downloaded: https://repo.maven.apache.org/maven2/org/codehaus/plexus/plexus-utils/3.0.10/plexus-utils-3.0.10.pom (3.1 kB at 314 kB/s)
[windows-jdk10] [INFO] Downloading: https://repo.maven.apache.org/maven2/org/codehaus/plexus/plexus-resources/1.0.1/plexus-resources-1.0.1.pom
[windows-jdk10] [INFO] Downloaded: https://repo.maven.apache.org/maven2/org/codehaus/plexus/plexus-resources/1.0.1/plexus-resources-1.0.1.pom (1.3 kB at 101 kB/s)
[windows-jdk10] [INFO] Downloading: https://repo.maven.apache.org/maven2/com/puppycrawl/tools/checkstyle/6.1.1/checkstyle-6.1.1.pom
[windows-jdk10] [INFO] Downloaded: https://repo.maven.apache.org/maven2/com/puppycrawl/tools/checkstyle/6.1.1/checkstyle-6.1.1.pom (30 kB at 2.8 MB/s)
[windows-jdk10] [INFO] Downloading: https://repo.maven.apache.org/maven2/org/sonatype/oss/oss-parent/7/oss-parent-7.pom
[windows-jdk10] [INFO] Downloaded: https://repo.maven.apache.org/maven2/org/sonatype/oss/oss-parent/7/oss-parent-7.pom (4.8 kB at 322 kB/s)
[windows-jdk10] [INFO] Downloading: https://repo.maven.apache.org/maven2/org/antlr/antlr4-runtime/4.3/antlr4-runtime-4.3.pom
[windows-jdk10] [INFO] Downloaded: https://repo.maven.apache.org/maven2/org/antlr/antlr4-runtime/4.3/antlr4-runtime-4.3.pom (4.8 kB at 90 kB/s)
[windows-jdk10] [INFO] Downloading: https://repo.maven.apache.org/maven2/org/antlr/antlr4-master/4.3/antlr4-master-4.3.pom
[windows-jdk10] [INFO] Downloaded: https://repo.maven.apache.org/maven2/org/antlr/antlr4-master/4.3/antlr4-master-4.3.pom (7.9 kB at 283 kB/s)
[windows-jdk10] [INFO] Downloading: https://repo.maven.apache.org/maven2/org/abego/treelayout/org.abego.treelayout.core/1.0.1/org.abego.treelayout.core-1.0.1.pom
[windows-jdk10] [INFO] Downloaded: https://repo.maven.apache.org/maven2/org/abego/treelayout/org.abego.treelayout.core/1.0.1/org.abego.treelayout.core-1.0.1.pom (3.1 kB at 103 kB/s)
[windows-jdk10] [INFO] Downloading: https://repo.maven.apache.org/maven2/org/antlr/antlr4-annotations/4.3/antlr4-annotations-4.3.pom
[windows-jdk10] [INFO] Downloaded: https://repo.maven.apache.org/maven2/org/antlr/antlr4-annotations/4.3/antlr4-annotations-4.3.pom (1.3 kB at 141 kB/s)
[windows-jdk10] [INFO] Downloading: https://repo.maven.apache.org/maven2/commons-beanutils/commons-beanutils-core/1.8.3/commons-beanutils-core-1.8.3.pom
[windows-jdk10] [INFO] Downloaded: https://repo.maven.apache.org/maven2/commons-beanutils/commons-beanutils-core/1.8.3/commons-beanutils-core-1.8.3.pom (1.6 kB at 205 kB/s)
[windows-jdk10] [INFO] Downloading: https://repo.maven.apache.org/maven2/com/google/guava/guava/18.0/guava-18.0.pom
[windows-jdk10] [INFO] Downloaded: https://repo.maven.apache.org/maven2/com/google/guava/guava/18.0/guava-18.0.pom (5.7 kB at 708 kB/s)
[windows-jdk10] [INFO] Downloading: https://repo.maven.apache.org/maven2/com/google/guava/guava-parent/18.0/guava-parent-18.0.pom
[windows-jdk10] [INFO] Downloaded: https://repo.maven.apache.org/maven2/com/google/guava/guava-parent/18.0/guava-parent-18.0.pom (7.7 kB at 452 kB/s)
[windows-jdk10] [INFO] Downloading: https://repo.maven.apache.org/maven2/com/puppycrawl/tools/checkstyle/6.1.1/checkstyle-6.1.1.jar
[windows-jdk10] [INFO] Downloading: https://repo.maven.apache.org/maven2/org/antlr/antlr4-runtime/4.3/antlr4-runtime-4.3.jar
[windows-jdk10] [INFO] Downloading: https://repo.maven.apache.org/maven2/org/codehaus/plexus/plexus-resources/1.0.1/plexus-resources-1.0.1.jar
[windows-jdk10] [INFO] Downloading: https://repo.maven.apache.org/maven2/org/abego/treelayout/org.abego.treelayout.core/1.0.1/org.abego.treelayout.core-1.0.1.jar
[windows-jdk10] [INFO] Downloaded: https://repo.maven.apache.org/maven2/com/puppycrawl/tools/checkstyle/6.1.1/checkstyle-6.1.1.jar (1.0 MB at 9.9 MB/s)
[windows-jdk10] [INFO] Downloading: https://repo.maven.apache.org/maven2/org/antlr/antlr4-annotations/4.3/antlr4-annotations-4.3.jar
[windows-jdk10] [INFO] Downloading: https://repo.maven.apache.org/maven2/org/apache/maven/shared/maven-shared-resources/2/maven-shared-resources-2.jar
[windows-jdk10] [INFO] Downloaded: https://repo.maven.apache.org/maven2/org/antlr/antlr4-annotations/4.3/antlr4-annotations-4.3.jar (10 kB at 89 kB/s)
[windows-jdk10] [INFO] Downloading: https://repo.maven.apache.org/maven2/commons-beanutils/commons-beanutils-core/1.8.3/commons-beanutils-core-1.8.3.jar
[windows-jdk10] [INFO] Downloaded: https://repo.maven.apache.org/maven2/org/antlr/antlr4-runtime/4.3/antlr4-runtime-4.3.jar (345 kB at 2.6 MB/s)
[windows-jdk10] [INFO] Downloading: https://repo.maven.apache.org/maven2/com/google/guava/guava/18.0/guava-18.0.jar
[windows-jdk10] [INFO] Downloaded: https://repo.maven.apache.org/maven2/commons-beanutils/commons-beanutils-core/1.8.3/commons-beanutils-core-1.8.3.jar (207 kB at 763 kB/s)
[windows-jdk10] [INFO] Downloaded: https://repo.maven.apache.org/maven2/org/apache/maven/shared/maven-shared-resources/2/maven-shared-resources-2.jar (13 kB at 47 kB/s)
[windows-jdk10] [INFO] Downloaded: https://repo.maven.apache.org/maven2/org/codehaus/plexus/plexus-resources/1.0.1/plexus-resources-1.0.1.jar (22 kB at 71 kB/s)
[windows-jdk10] [INFO] Downloaded: https://repo.maven.apache.org/maven2/org/abego/treelayout/org.abego.treelayout.core/1.0.1/org.abego.treelayout.core-1.0.1.jar (26 kB at 83 kB/s)
[windows-jdk10] [INFO] Downloaded: https://repo.maven.apache.org/maven2/com/google/guava/guava/18.0/guava-18.0.jar (2.3 MB at 7.2 MB/s)
[windows-jdk10] [INFO] There are 10 errors reported by Checkstyle 6.1.1 with config/maven_checks.xml ruleset.
[windows-jdk10] [INFO] Ignored 10 errors, 0 violation remaining.
[windows-jdk10] [INFO]
[windows-jdk10] [INFO] --- maven-jarsigner-plugin:1.3.2:verify (verify) @ maven-project-info-reports-plugin ---
[windows-jdk10] [WARNING] Picked up JAVA_TOOL_OPTIONS: -Dmaven.ext.class.path="f:\jenkins\jenkins-slave\workspace\nfo-reports-plugin_MPIR-366-S464FI4ATSVOULE3N7MCKV5FYYG6GVHDD7OLISMYBGUEPLQM2UNA@2@tmp\withMavenbd1f3328\pipeline-maven-spy.jar" -Dorg.jenkinsci.plugins.pipeline.maven.reportsFolder="f:\jenkins\jenkins-slave\workspace\nfo-reports-plugin_MPIR-366-S464FI4ATSVOULE3N7MCKV5FYYG6GVHDD7OLISMYBGUEPLQM2UNA@2@tmp\withMavenbd1f3328"
[windows-jdk9] [INFO] run script verify.bsh
[windows-jdk9] [INFO] ..SUCCESS (18.3 s)
[windows-jdk9] [INFO] Building: mpir-229\pom.xml
[windows-jdk10] [INFO] 1 archive(s) processed
[windows-jdk10] [INFO]
[windows-jdk10] [INFO] --- maven-invoker-plugin:2.0.0:verify (integration-test) @ maven-project-info-reports-plugin ---
[windows-jdk10] [INFO] -------------------------------------------------
[windows-jdk10] [INFO] Build Summary:
[windows-jdk10] [INFO]   Passed: 4, Failed: 7, Errors: 0, Skipped: 0
[windows-jdk10] [INFO] -------------------------------------------------
[windows-jdk10] [ERROR] The following builds failed:
[windows-jdk10] [ERROR] *  dependencies-java-1.7-and-1.8\pom.xml
[windows-jdk10] [ERROR] *  full-pom\pom.xml
[windows-jdk10] [ERROR] *  git\pom.xml
[windows-jdk10] [ERROR] *  minimal-pom\pom.xml
[windows-jdk10] [ERROR] *  mpir-229\pom.xml
[windows-jdk10] [ERROR] *  MPIR-242\pom.xml
[windows-jdk10] [ERROR] *  multi-module\pom.xml
[windows-jdk10] [INFO] -------------------------------------------------
[windows-jdk10] [INFO] ------------------------------------------------------------------------
[windows-jdk10] [INFO] BUILD FAILURE
[windows-jdk10] [INFO] ------------------------------------------------------------------------
[windows-jdk10] [INFO] Total time: 03:19 min
[windows-jdk10] [INFO] Finished at: 2018-04-13T11:16:01Z
[windows-jdk10] [INFO] Final Memory: 46M/160M
[windows-jdk10] [INFO] ------------------------------------------------------------------------
[windows-jdk10] [INFO] [jenkins-event-spy] Generated F:\jenkins\jenkins-slave\workspace\nfo-reports-plugin_MPIR-366-S464FI4ATSVOULE3N7MCKV5FYYG6GVHDD7OLISMYBGUEPLQM2UNA@2@tmp\withMavenbd1f3328\maven-spy-20180413-111241-38213302192481786826134.log
[windows-jdk10] [ERROR] Failed to execute goal org.apache.maven.plugins:maven-invoker-plugin:2.0.0:verify (integration-test) on project maven-project-info-reports-plugin: 7 builds failed. See console output above for details. -> [Help 1]
[windows-jdk10] [ERROR]
[windows-jdk10] [ERROR] To see the full stack trace of the errors, re-run Maven with the -e switch.
[windows-jdk10] [ERROR] Re-run Maven using the -X switch to enable full debug logging.
[windows-jdk10] [ERROR]
[windows-jdk10] [ERROR] For more information about the errors and possible solutions, please read the following articles:
[windows-jdk10] [ERROR] [Help 1] http://cwiki.apache.org/confluence/display/MAVEN/MojoFailureException
[Pipeline] [windows-jdk10] }
[Pipeline] [windows-jdk10] // dir
[windows-jdk7] [INFO] run script verify.groovy
[windows-jdk7] [INFO] ..SUCCESS (13.9 s)
[windows-jdk7] [INFO] Building: multi-module\pom.xml
[Pipeline] [windows-jdk10] }
[windows-jdk10] [withMaven] junitPublisher - Archive test results for Maven artifact org.apache.maven.plugins:maven-project-info-reports-plugin:2.10-SNAPSHOT generated by maven-surefire-plugin:test (default-test): m\target\surefire-reports\*.xml
[windows-jdk10] [withMaven] junitPublisher - Jenkins JUnit Attachments Plugin not found, can't publish test attachments.Recording test results
[windows-jdk10] [withMaven] junitPublisher - Archive test results for Maven artifact org.apache.maven.plugins.project-info-reports.its:dep:1.0-SNAPSHOT generated by maven-surefire-plugin:test (default-test): m\target\it\multi-module\dep\target\surefire-reports\*.xml
[windows-jdk10] [withMaven] junitPublisher - Jenkins JUnit Attachments Plugin not found, can't publish test attachments.Recording test results
[windows-jdk10] None of the test reports contained any result
[windows-jdk10] [withMaven] junitPublisher - Archive test results for Maven artifact org.apache.maven.plugins.project-info-reports.its:main:1.0-SNAPSHOT generated by maven-surefire-plugin:test (default-test): m\target\it\multi-module\main\target\surefire-reports\*.xml
[windows-jdk10] [withMaven] junitPublisher - Jenkins JUnit Attachments Plugin not found, can't publish test attachments.Recording test results
[windows-jdk10] None of the test reports contained any result
[Pipeline] [windows-jdk10] // withMaven
[Pipeline] [windows-jdk10] echo
[windows-jdk10] [FAIL FAST] This is the first failure and likely root cause
[Pipeline] [windows-jdk10] }
[Pipeline] [windows-jdk10] // stage
[Pipeline] [windows-jdk10] }
[Pipeline] [windows-jdk10] // node
[Pipeline] [windows-jdk10] }
[windows-jdk7] Sending interrupt signal to process
[windows-jdk10] Failed in branch windows-jdk10
[windows-jdk9] Sending interrupt signal to process
[Pipeline] [linux-jdk7] // node
[Pipeline] [linux-jdk8] // node
[Pipeline] [linux-jdk9] // node
[Pipeline] [linux-jdk10] // node
[Pipeline] [linux-jdk7] }
[linux-jdk7] Failed in branch linux-jdk7
[Pipeline] [linux-jdk8] }
[linux-jdk8] Failed in branch linux-jdk8
[Pipeline] [linux-jdk9] }
[linux-jdk9] Failed in branch linux-jdk9
[Pipeline] [linux-jdk10] }
[linux-jdk10] Failed in branch linux-jdk10
[Pipeline] [windows-jdk7] }
[Pipeline] [windows-jdk7] // dir
[Pipeline] [windows-jdk7] }
[windows-jdk7] [withMaven] One or multiple Maven executions have been ignored by the Jenkins Pipeline Maven Plugin because they have been interrupted before completion (1). See Pipeline Maven Plugin FAQ for more details.
[Pipeline] [windows-jdk7] // withMaven
[Pipeline] [windows-jdk7] echo
[windows-jdk7] [FAIL FAST] windows-jdk10 had first failure, ignoring script returned exit code -1
[Pipeline] [windows-jdk7] }
[Pipeline] [windows-jdk7] // stage
[Pipeline] [windows-jdk7] }
[Pipeline] [windows-jdk7] // node
[Pipeline] [windows-jdk7] }
[windows-jdk9] After 10s process did not stop
[Pipeline] [windows-jdk9] }
[Pipeline] [windows-jdk9] // dir
[Pipeline] [windows-jdk9] }
[windows-jdk9] [withMaven] One or multiple Maven executions have been ignored by the Jenkins Pipeline Maven Plugin because they have been interrupted before completion (2). See Pipeline Maven Plugin FAQ for more details.
[Pipeline] [windows-jdk9] // withMaven
[Pipeline] [windows-jdk9] echo
[windows-jdk9] [FAIL FAST] windows-jdk10 had first failure, ignoring null
[Pipeline] [windows-jdk9] }
[Pipeline] [windows-jdk9] // stage
[Pipeline] [windows-jdk9] }
[Pipeline] [windows-jdk9] // node
[Pipeline] [windows-jdk9] }
[Pipeline] // parallel
[Pipeline] echo
***** FAST FAILURE *****

Fast failure triggered by windows-jdk10

***** FAST FAILURE *****
[Pipeline] stage
[Pipeline] { (Notifications)
[Pipeline] echo
Build result: FAILURE
[Pipeline] jiraIssueSelector
[Pipeline] jiraComment
Reply | Threaded
Open this post in threaded view
|

Build failed in Jenkins: Maven TLP » maven-project-info-reports-plugin » MPIR-366 #16

Apache Jenkins Server-2
See https://builds.apache.org/job/maven-box/job/maven-project-info-reports-plugin/job/MPIR-366/16/

Changes:

* [MPIR-366] Drop Maven 2 support
* [MPIR-366] Drop Maven 2 support
* [MPIR-366] Drop Maven 2 support
* [MPIR-366] Drop Maven 2 support

All tests passed

Build log:
[...truncated 190.70 KB...]
[windows-jdk8] [INFO] ..SUCCESS (3.2 s)
[windows-jdk8] [INFO] Building: MPIR-251\pom.xml
[windows-jdk10] [INFO] ..FAILED (9.4 s)
[windows-jdk10] [INFO]   The build exited with code 1. See f:\jenkins\jenkins-slave\workspace\nfo-reports-plugin_MPIR-366-S464FI4ATSVOULE3N7MCKV5FYYG6GVHDD7OLISMYBGUEPLQM2UNA@2\m\target\it\git\build.log for details.
[windows-jdk10] [INFO] Building: java-version\pom.xml
[windows-jdk10] [INFO] run script verify.groovy
[windows-jdk10] WARNING: An illegal reflective access operation has occurred
[windows-jdk10] WARNING: Illegal reflective access by org.codehaus.groovy.reflection.CachedClass$3$1 (file:/f:/jenkins/jenkins-slave/workspace/nfo-reports-plugin_MPIR-366-S464FI4ATSVOULE3N7MCKV5FYYG6GVHDD7OLISMYBGUEPLQM2UNA@2/.repository/org/codehaus/groovy/groovy/2.0.1/groovy-2.0.1.jar) to method java.lang.Object.finalize()
[windows-jdk10] WARNING: Please consider reporting this to the maintainers of org.codehaus.groovy.reflection.CachedClass$3$1
[windows-jdk10] WARNING: Use --illegal-access=warn to enable warnings of further illegal reflective access operations
[windows-jdk10] WARNING: All illegal access operations will be denied in a future release
[windows-jdk10] [INFO] ..SUCCESS (8.4 s)
[windows-jdk10] [INFO] Building: minimal-pom\pom.xml
[windows-jdk8] [INFO] run script verify.groovy
[windows-jdk8] [INFO] ..SUCCESS (8.9 s)
[windows-jdk8] [INFO] Building: MPIR-300\pom.xml
[windows-jdk8] [INFO] run script verify.groovy
[windows-jdk8] [INFO] ..SUCCESS (3.4 s)
[windows-jdk8] [INFO] Building: MPIR-349\parent\pom.xml
[windows-jdk10] [INFO] ..FAILED (7.4 s)
[windows-jdk10] [INFO]   The build exited with code 1. See f:\jenkins\jenkins-slave\workspace\nfo-reports-plugin_MPIR-366-S464FI4ATSVOULE3N7MCKV5FYYG6GVHDD7OLISMYBGUEPLQM2UNA@2\m\target\it\minimal-pom\build.log for details.
[windows-jdk10] [INFO] Building: mpir-229\pom.xml
[windows-jdk8] [INFO] run script verify.groovy
[windows-jdk8] [INFO] ..SUCCESS (6.1 s)
[windows-jdk8] [INFO] Building: multi-module\pom.xml
[windows-jdk7] [INFO] run script verify.bsh
[windows-jdk7] [INFO] ..SUCCESS (63.6 s)
[windows-jdk7] [INFO] Building: git\pom.xml
[windows-jdk7] [INFO] ..SUCCESS (7.9 s)
[windows-jdk7] [INFO] Building: java-version\pom.xml
[windows-jdk10] [INFO] ..FAILED (7.9 s)
[windows-jdk10] [INFO]   The build exited with code 1. See f:\jenkins\jenkins-slave\workspace\nfo-reports-plugin_MPIR-366-S464FI4ATSVOULE3N7MCKV5FYYG6GVHDD7OLISMYBGUEPLQM2UNA@2\m\target\it\mpir-229\build.log for details.
[windows-jdk10] [INFO] Building: MPIR-242\pom.xml
[windows-jdk7] [INFO] run script verify.groovy
[windows-jdk7] [INFO] ..SUCCESS (7.3 s)
[windows-jdk7] [INFO] Building: minimal-pom\pom.xml
[windows-jdk10] [INFO] ..FAILED (7.1 s)
[windows-jdk10] [INFO]   The build exited with code 1. See f:\jenkins\jenkins-slave\workspace\nfo-reports-plugin_MPIR-366-S464FI4ATSVOULE3N7MCKV5FYYG6GVHDD7OLISMYBGUEPLQM2UNA@2\m\target\it\MPIR-242\build.log for details.
[windows-jdk10] [INFO] Building: MPIR-251\pom.xml
[windows-jdk8] [INFO] run script verify.groovy
[windows-jdk8] [INFO] ..SUCCESS (14.3 s)
[windows-jdk8] [INFO]
[windows-jdk8] [INFO] --- maven-checkstyle-plugin:2.15:check (checkstyle-check) @ maven-project-info-reports-plugin ---
[windows-jdk8] [INFO] There are 10 errors reported by Checkstyle 6.1.1 with config/maven_checks.xml ruleset.
[windows-jdk8] [INFO] Ignored 10 errors, 0 violation remaining.
[windows-jdk8] [INFO]
[windows-jdk8] [INFO] --- maven-jarsigner-plugin:1.3.2:verify (verify) @ maven-project-info-reports-plugin ---
[windows-jdk8] [WARNING] Picked up JAVA_TOOL_OPTIONS: -Dmaven.ext.class.path="f:\jenkins\jenkins-slave\workspace\nfo-reports-plugin_MPIR-366-S464FI4ATSVOULE3N7MCKV5FYYG6GVHDD7OLISMYBGUEPLQM2UNA@tmp\withMaven04f0b473\pipeline-maven-spy.jar" -Dorg.jenkinsci.plugins.pipeline.maven.reportsFolder="f:\jenkins\jenkins-slave\workspace\nfo-reports-plugin_MPIR-366-S464FI4ATSVOULE3N7MCKV5FYYG6GVHDD7OLISMYBGUEPLQM2UNA@tmp\withMaven04f0b473"
[windows-jdk8] [INFO] 1 archive(s) processed
[windows-jdk8] [INFO]
[windows-jdk8] [INFO] --- maven-invoker-plugin:2.0.0:verify (integration-test) @ maven-project-info-reports-plugin ---
[windows-jdk8] [INFO] -------------------------------------------------
[windows-jdk8] [INFO] Build Summary:
[windows-jdk8] [INFO]   Passed: 11, Failed: 0, Errors: 0, Skipped: 0
[windows-jdk8] [INFO] -------------------------------------------------
[windows-jdk8] [INFO] ------------------------------------------------------------------------
[windows-jdk8] [INFO] BUILD SUCCESS
[windows-jdk8] [INFO] ------------------------------------------------------------------------
[windows-jdk8] [INFO] Total time: 02:15 min
[windows-jdk8] [INFO] Finished at: 2018-04-13T11:24:13Z
[windows-jdk8] [INFO] Final Memory: 57M/834M
[windows-jdk8] [INFO] ------------------------------------------------------------------------
[windows-jdk8] [INFO] [jenkins-event-spy] Generated F:\jenkins\jenkins-slave\workspace\nfo-reports-plugin_MPIR-366-S464FI4ATSVOULE3N7MCKV5FYYG6GVHDD7OLISMYBGUEPLQM2UNA@tmp\withMaven04f0b473\maven-spy-20180413-112158-5363034362552047268025.log
[windows-jdk8] Picked up JAVA_TOOL_OPTIONS: -Dmaven.ext.class.path="f:\jenkins\jenkins-slave\workspace\nfo-reports-plugin_MPIR-366-S464FI4ATSVOULE3N7MCKV5FYYG6GVHDD7OLISMYBGUEPLQM2UNA@tmp\withMaven04f0b473\pipeline-maven-spy.jar" -Dorg.jenkinsci.plugins.pipeline.maven.reportsFolder="f:\jenkins\jenkins-slave\workspace\nfo-reports-plugin_MPIR-366-S464FI4ATSVOULE3N7MCKV5FYYG6GVHDD7OLISMYBGUEPLQM2UNA@tmp\withMaven04f0b473"
[Pipeline] [windows-jdk8] }
[Pipeline] [windows-jdk8] // dir
[windows-jdk10] [INFO] run script verify.groovy
[windows-jdk10] [INFO] ..SUCCESS (12.7 s)
[windows-jdk10] [INFO] Building: MPIR-300\pom.xml
[windows-jdk7] [INFO] run script verify.bsh
[windows-jdk7] [INFO] ..SUCCESS (15.3 s)
[windows-jdk7] [INFO] Building: mpir-229\pom.xml
[windows-jdk10] [INFO] run script verify.groovy
[windows-jdk10] [INFO] ..SUCCESS (6.6 s)
[windows-jdk10] [INFO] Building: MPIR-349\parent\pom.xml
[windows-jdk7] [INFO] run script verify.groovy
[windows-jdk7] [INFO] ..SUCCESS (8.0 s)
[windows-jdk7] [INFO] Building: MPIR-242\pom.xml
[Pipeline] [windows-jdk8] }
[windows-jdk8] [withMaven] junitPublisher - Archive test results for Maven artifact org.apache.maven.plugins:maven-project-info-reports-plugin:2.10-SNAPSHOT generated by maven-surefire-plugin:test (default-test): m\target\surefire-reports\*.xml
[windows-jdk8] [withMaven] junitPublisher - Jenkins JUnit Attachments Plugin not found, can't publish test attachments.Recording test results
[windows-jdk8] [withMaven] junitPublisher - Archive test results for Maven artifact org.apache.maven.plugins.project-info-reports.its:dep:1.0-SNAPSHOT generated by maven-surefire-plugin:test (default-test): m\target\it\multi-module\dep\target\surefire-reports\*.xml
[windows-jdk8] [withMaven] junitPublisher - Jenkins JUnit Attachments Plugin not found, can't publish test attachments.Recording test results
[windows-jdk8] None of the test reports contained any result
[windows-jdk8] [withMaven] junitPublisher - Archive test results for Maven artifact org.apache.maven.plugins.project-info-reports.its:main:1.0-SNAPSHOT generated by maven-surefire-plugin:test (default-test): m\target\it\multi-module\main\target\surefire-reports\*.xml
[windows-jdk8] [withMaven] junitPublisher - Jenkins JUnit Attachments Plugin not found, can't publish test attachments.Recording test results
[windows-jdk8] None of the test reports contained any result
[Pipeline] [windows-jdk8] // withMaven
[Pipeline] [windows-jdk8] }
[Pipeline] [windows-jdk8] // stage
[Pipeline] [windows-jdk8] }
[Pipeline] [windows-jdk8] // node
[Pipeline] [windows-jdk8] }
[windows-jdk9] [INFO] run script verify.bsh
[windows-jdk9] [INFO] ..SUCCESS (78.0 s)
[windows-jdk9] [INFO] Building: git\pom.xml
[windows-jdk9] [INFO] ..SUCCESS (10.7 s)
[windows-jdk9] [INFO] Building: java-version\pom.xml
[windows-jdk7] [INFO] run script verify.groovy
[windows-jdk7] [INFO] ..SUCCESS (7.6 s)
[windows-jdk7] [INFO] Building: MPIR-251\pom.xml
[windows-jdk9] [INFO] run script verify.groovy
[windows-jdk9] [INFO] ..SUCCESS (8.5 s)
[windows-jdk9] [INFO] Building: minimal-pom\pom.xml
[windows-jdk10] [INFO] run script verify.groovy
[windows-jdk10] [INFO] ..SUCCESS (16.1 s)
[windows-jdk10] [INFO] Building: multi-module\pom.xml
[windows-jdk7] [INFO] run script verify.groovy
[windows-jdk7] [INFO] ..SUCCESS (13.4 s)
[windows-jdk7] [INFO] Building: MPIR-300\pom.xml
[windows-jdk7] [INFO] run script verify.groovy
[windows-jdk7] [INFO] ..SUCCESS (7.5 s)
[windows-jdk7] [INFO] Building: MPIR-349\parent\pom.xml
[windows-jdk9] [INFO] run script verify.bsh
[windows-jdk9] [INFO] ..SUCCESS (21.4 s)
[windows-jdk9] [INFO] Building: mpir-229\pom.xml
[windows-jdk10] [INFO] ..FAILED (26.7 s)
[windows-jdk10] [INFO]   The build exited with code 1. See f:\jenkins\jenkins-slave\workspace\nfo-reports-plugin_MPIR-366-S464FI4ATSVOULE3N7MCKV5FYYG6GVHDD7OLISMYBGUEPLQM2UNA@2\m\target\it\multi-module\build.log for details.
[windows-jdk10] [INFO]
[windows-jdk10] [INFO] --- maven-checkstyle-plugin:2.15:check (checkstyle-check) @ maven-project-info-reports-plugin ---
[windows-jdk10] [INFO] There are 10 errors reported by Checkstyle 6.1.1 with config/maven_checks.xml ruleset.
[windows-jdk10] [INFO] Ignored 10 errors, 0 violation remaining.
[windows-jdk10] [INFO]
[windows-jdk10] [INFO] --- maven-jarsigner-plugin:1.3.2:verify (verify) @ maven-project-info-reports-plugin ---
[windows-jdk10] [WARNING] Picked up JAVA_TOOL_OPTIONS: -Dmaven.ext.class.path="f:\jenkins\jenkins-slave\workspace\nfo-reports-plugin_MPIR-366-S464FI4ATSVOULE3N7MCKV5FYYG6GVHDD7OLISMYBGUEPLQM2UNA@2@tmp\withMavenbede9e9d\pipeline-maven-spy.jar" -Dorg.jenkinsci.plugins.pipeline.maven.reportsFolder="f:\jenkins\jenkins-slave\workspace\nfo-reports-plugin_MPIR-366-S464FI4ATSVOULE3N7MCKV5FYYG6GVHDD7OLISMYBGUEPLQM2UNA@2@tmp\withMavenbede9e9d"
[windows-jdk7] [INFO] run script verify.groovy
[windows-jdk7] [INFO] ..SUCCESS (13.7 s)
[windows-jdk7] [INFO] Building: multi-module\pom.xml
[windows-jdk10] [INFO] 1 archive(s) processed
[windows-jdk10] [INFO]
[windows-jdk10] [INFO] --- maven-invoker-plugin:2.0.0:verify (integration-test) @ maven-project-info-reports-plugin ---
[windows-jdk10] [INFO] -------------------------------------------------
[windows-jdk10] [INFO] Build Summary:
[windows-jdk10] [INFO]   Passed: 4, Failed: 7, Errors: 0, Skipped: 0
[windows-jdk10] [INFO] -------------------------------------------------
[windows-jdk10] [ERROR] The following builds failed:
[windows-jdk10] [ERROR] *  dependencies-java-1.7-and-1.8\pom.xml
[windows-jdk10] [ERROR] *  full-pom\pom.xml
[windows-jdk10] [ERROR] *  git\pom.xml
[windows-jdk10] [ERROR] *  minimal-pom\pom.xml
[windows-jdk10] [ERROR] *  mpir-229\pom.xml
[windows-jdk10] [ERROR] *  MPIR-242\pom.xml
[windows-jdk10] [ERROR] *  multi-module\pom.xml
[windows-jdk10] [INFO] -------------------------------------------------
[windows-jdk10] [INFO] ------------------------------------------------------------------------
[windows-jdk10] [INFO] BUILD FAILURE
[windows-jdk10] [INFO] ------------------------------------------------------------------------
[windows-jdk10] [INFO] Total time: 03:18 min
[windows-jdk10] [INFO] Finished at: 2018-04-13T11:25:16Z
[windows-jdk10] [INFO] Final Memory: 46M/157M
[windows-jdk10] [INFO] ------------------------------------------------------------------------
[windows-jdk10] [INFO] [jenkins-event-spy] Generated F:\jenkins\jenkins-slave\workspace\nfo-reports-plugin_MPIR-366-S464FI4ATSVOULE3N7MCKV5FYYG6GVHDD7OLISMYBGUEPLQM2UNA@2@tmp\withMavenbede9e9d\maven-spy-20180413-112158-2696568582629414114562.log
[windows-jdk10] [ERROR] Failed to execute goal org.apache.maven.plugins:maven-invoker-plugin:2.0.0:verify (integration-test) on project maven-project-info-reports-plugin: 7 builds failed. See console output above for details. -> [Help 1]
[windows-jdk10] [ERROR]
[windows-jdk10] [ERROR] To see the full stack trace of the errors, re-run Maven with the -e switch.
[windows-jdk10] [ERROR] Re-run Maven using the -X switch to enable full debug logging.
[windows-jdk10] [ERROR]
[windows-jdk10] [ERROR] For more information about the errors and possible solutions, please read the following articles:
[windows-jdk10] [ERROR] [Help 1] http://cwiki.apache.org/confluence/display/MAVEN/MojoFailureException
[Pipeline] [windows-jdk10] }
[Pipeline] [windows-jdk10] // dir
[windows-jdk9] [INFO] run script verify.groovy
[windows-jdk9] [INFO] ..SUCCESS (9.5 s)
[windows-jdk9] [INFO] Building: MPIR-242\pom.xml
[Pipeline] [windows-jdk10] }
[windows-jdk10] [withMaven] junitPublisher - Archive test results for Maven artifact org.apache.maven.plugins:maven-project-info-reports-plugin:2.10-SNAPSHOT generated by maven-surefire-plugin:test (default-test): m\target\surefire-reports\*.xml
[windows-jdk10] [withMaven] junitPublisher - Jenkins JUnit Attachments Plugin not found, can't publish test attachments.Recording test results
[windows-jdk10] [withMaven] junitPublisher - Archive test results for Maven artifact org.apache.maven.plugins.project-info-reports.its:dep:1.0-SNAPSHOT generated by maven-surefire-plugin:test (default-test): m\target\it\multi-module\dep\target\surefire-reports\*.xml
[windows-jdk10] [withMaven] junitPublisher - Jenkins JUnit Attachments Plugin not found, can't publish test attachments.Recording test results
[windows-jdk10] None of the test reports contained any result
[windows-jdk10] [withMaven] junitPublisher - Archive test results for Maven artifact org.apache.maven.plugins.project-info-reports.its:main:1.0-SNAPSHOT generated by maven-surefire-plugin:test (default-test): m\target\it\multi-module\main\target\surefire-reports\*.xml
[windows-jdk10] [withMaven] junitPublisher - Jenkins JUnit Attachments Plugin not found, can't publish test attachments.Recording test results
[windows-jdk10] None of the test reports contained any result
[Pipeline] [windows-jdk10] // withMaven
[Pipeline] [windows-jdk10] echo
[windows-jdk10] [FAIL FAST] This is the first failure and likely root cause
[Pipeline] [windows-jdk10] }
[Pipeline] [windows-jdk10] // stage
[Pipeline] [windows-jdk10] }
[Pipeline] [windows-jdk10] // node
[Pipeline] [windows-jdk10] }
[windows-jdk10] Failed in branch windows-jdk10
[windows-jdk7] Sending interrupt signal to process
[windows-jdk7] [INFO] ..FAILED (6.2 s)
[windows-jdk7] [INFO]   The build exited with code -1. See f:\jenkins\jenkins-slave\workspace\nfo-reports-plugin_MPIR-366-S464FI4ATSVOULE3N7MCKV5FYYG6GVHDD7OLISMYBGUEPLQM2UNA\m\target\it\multi-module\build.log for details.
[windows-jdk7] [INFO]
[windows-jdk7] [INFO] --- maven-checkstyle-plugin:2.15:check (checkstyle-check) @ maven-project-info-reports-plugin ---
[windows-jdk7] [INFO] Downloading: https://repo.maven.apache.org/maven2/org/apache/maven/shared/maven-shared-resources/2/maven-shared-resources-2.pom
[windows-jdk7] [INFO] Downloaded: https://repo.maven.apache.org/maven2/org/apache/maven/shared/maven-shared-resources/2/maven-shared-resources-2.pom (3.0 kB at 269 kB/s)
[windows-jdk7] [INFO] Downloading: https://repo.maven.apache.org/maven2/org/codehaus/plexus/plexus-utils/3.0.10/plexus-utils-3.0.10.pom
[windows-jdk7] [INFO] Downloaded: https://repo.maven.apache.org/maven2/org/codehaus/plexus/plexus-utils/3.0.10/plexus-utils-3.0.10.pom (3.1 kB at 393 kB/s)
[windows-jdk9] Sending interrupt signal to process
[Pipeline] [linux-jdk7] // node
[Pipeline] [linux-jdk8] // node
[Pipeline] [linux-jdk9] // node
[Pipeline] [linux-jdk10] // node
[Pipeline] [linux-jdk7] }
[linux-jdk7] Failed in branch linux-jdk7
[Pipeline] [linux-jdk8] }
[linux-jdk8] Failed in branch linux-jdk8
[Pipeline] [linux-jdk9] }
[linux-jdk9] Failed in branch linux-jdk9
[Pipeline] [linux-jdk10] }
[linux-jdk10] Failed in branch linux-jdk10
[Pipeline] [windows-jdk7] }
[Pipeline] [windows-jdk7] // dir
[windows-jdk9] [INFO] run script verify.groovy
[windows-jdk9] [INFO] ..FAILED (3.7 s)
[windows-jdk9] [INFO]   The post-build script did not succeed. assert licensePage.exists()
[windows-jdk9]        |           |
[windows-jdk9]        |           false
[windows-jdk9]        f:\jenkins\jenkins-slave\workspace\nfo-reports-plugin_MPIR-366-S464FI4ATSVOULE3N7MCKV5FYYG6GVHDD7OLISMYBGUEPLQM2UNA\m\target\it\MPIR-242\target\site\license.html
[windows-jdk9] [INFO] Building: MPIR-251\pom.xml
[Pipeline] [windows-jdk7] }
[windows-jdk7] [withMaven] One or multiple Maven executions have been ignored by the Jenkins Pipeline Maven Plugin because they have been interrupted before completion (2). See Pipeline Maven Plugin FAQ for more details.
[Pipeline] [windows-jdk7] // withMaven
[Pipeline] [windows-jdk7] echo
[windows-jdk7] [FAIL FAST] windows-jdk10 had first failure, ignoring script returned exit code -1
[Pipeline] [windows-jdk7] }
[Pipeline] [windows-jdk9] }
[Pipeline] [windows-jdk7] // stage
[Pipeline] [windows-jdk9] // dir
[Pipeline] [windows-jdk7] }
[Pipeline] [windows-jdk9] }
[windows-jdk9] [withMaven] One or multiple Maven executions have been ignored by the Jenkins Pipeline Maven Plugin because they have been interrupted before completion (2). See Pipeline Maven Plugin FAQ for more details.
[Pipeline] [windows-jdk7] // node
[Pipeline] [windows-jdk9] // withMaven
[Pipeline] [windows-jdk7] }
[Pipeline] [windows-jdk9] echo
[windows-jdk9] [FAIL FAST] windows-jdk10 had first failure, ignoring script returned exit code -1
[Pipeline] [windows-jdk9] }
[Pipeline] [windows-jdk9] // stage
[Pipeline] [windows-jdk9] }
[Pipeline] [windows-jdk9] // node
[Pipeline] [windows-jdk9] }
[Pipeline] // parallel
[Pipeline] echo
***** FAST FAILURE *****

Fast failure triggered by windows-jdk10

***** FAST FAILURE *****
[Pipeline] stage
[Pipeline] { (Notifications)
[Pipeline] echo
Build result: FAILURE
[Pipeline] jiraIssueSelector
[Pipeline] jiraComment
[Pipeline] emailext
Reply | Threaded
Open this post in threaded view
|

Build failed in Jenkins: Maven TLP » maven-project-info-reports-plugin » MPIR-366 #17

Apache Jenkins Server-2
See https://builds.apache.org/job/maven-box/job/maven-project-info-reports-plugin/job/MPIR-366/17/

Changes:

* [MPIR-366] Don't fail fast to see which OS/JDK combinations fail on
* [MPIR-366] Don't fail fast to see which OS/JDK combinations fail on
* [MPIR-366] Don't fail fast to see which OS/JDK combinations fail on
* [MPIR-366] Don't fail fast to see which OS/JDK combinations fail on

All tests passed

Build log:
[...truncated 1.53 MB...]
[linux-jdk10] [INFO] --- maven-surefire-plugin:2.21.0:test (default-test) @ maven-project-info-reports-plugin ---
[linux-jdk10] [INFO]
[linux-jdk10] [INFO] -------------------------------------------------------
[linux-jdk10] [INFO]  T E S T S
[linux-jdk10] [INFO] -------------------------------------------------------
[linux-jdk10] [INFO] Running org.apache.maven.report.projectinfo.IssueManagementReportTest
[linux-jdk10] [INFO] Tests run: 1, Failures: 0, Errors: 0, Skipped: 0, Time elapsed: 2.369 s - in org.apache.maven.report.projectinfo.IssueManagementReportTest
[linux-jdk10] [INFO] Running org.apache.maven.report.projectinfo.IndexReportTest
[linux-jdk10] [INFO] Tests run: 1, Failures: 0, Errors: 0, Skipped: 0, Time elapsed: 0.333 s - in org.apache.maven.report.projectinfo.IndexReportTest
[linux-jdk10] [INFO] Running org.apache.maven.report.projectinfo.LicensesReportTest
[linux-jdk10] [INFO] Tests run: 2, Failures: 0, Errors: 0, Skipped: 0, Time elapsed: 0.645 s - in org.apache.maven.report.projectinfo.LicensesReportTest
[linux-jdk10] [INFO] Running org.apache.maven.report.projectinfo.MailingListsReportTest
[linux-jdk10] [INFO] Tests run: 3, Failures: 0, Errors: 0, Skipped: 0, Time elapsed: 0.596 s - in org.apache.maven.report.projectinfo.MailingListsReportTest
[linux-jdk10] [INFO] Running org.apache.maven.report.projectinfo.CiManagementReportTest
[linux-jdk10] [INFO] Tests run: 1, Failures: 0, Errors: 0, Skipped: 0, Time elapsed: 0.178 s - in org.apache.maven.report.projectinfo.CiManagementReportTest
[linux-jdk10] [INFO] Running org.apache.maven.report.projectinfo.TeamReportTest
[linux-jdk10] [INFO] Tests run: 1, Failures: 0, Errors: 0, Skipped: 0, Time elapsed: 0.275 s - in org.apache.maven.report.projectinfo.TeamReportTest
[linux-jdk10] [INFO] Running org.apache.maven.report.projectinfo.ModulesReportTest
[linux-jdk10] [WARNING] Module subproject1 not found in reactor: loading locally
[linux-jdk10] [WARNING] Module subproject2 not found in reactor: loading locally
[linux-jdk10] [INFO] Tests run: 2, Failures: 0, Errors: 0, Skipped: 0, Time elapsed: 0.503 s - in org.apache.maven.report.projectinfo.ModulesReportTest
[linux-jdk10] [INFO] Running org.apache.maven.report.projectinfo.SummaryReportTest
[linux-jdk10] [INFO] Tests run: 1, Failures: 0, Errors: 0, Skipped: 0, Time elapsed: 0.301 s - in org.apache.maven.report.projectinfo.SummaryReportTest
[linux-jdk10] [INFO] Running org.apache.maven.report.projectinfo.ScmReportTest
[linux-jdk10] [INFO] Tests run: 2, Failures: 0, Errors: 0, Skipped: 0, Time elapsed: 0.544 s - in org.apache.maven.report.projectinfo.ScmReportTest
[linux-jdk10] [INFO] Running org.apache.maven.report.projectinfo.PluginManagementReportTest
[linux-jdk10] [INFO] Could not build project for: maven-compile-plugin:Error resolving project artifact: Failed to resolve version for org.apache.maven.plugins:maven-compile-plugin:pom:RELEASE: Could not find metadata org.apache.maven.plugins:maven-compile-plugin/maven-metadata.xml for project org.apache.maven.plugins:maven-compile-plugin:pom:RELEASE
[linux-jdk10] org.apache.maven.project.ProjectBuildingException: Error resolving project artifact: Failed to resolve version for org.apache.maven.plugins:maven-compile-plugin:pom:RELEASE: Could not find metadata org.apache.maven.plugins:maven-compile-plugin/maven-metadata.xml for project org.apache.maven.plugins:maven-compile-plugin:pom:RELEASE
[linux-jdk10] at org.apache.maven.project.DefaultProjectBuilder.build(DefaultProjectBuilder.java:260)
[linux-jdk10] at org.apache.maven.project.DefaultProjectBuilder.build(DefaultProjectBuilder.java:233)
[linux-jdk10] at org.apache.maven.report.projectinfo.PluginManagementReport$PluginManagementRenderer.renderSectionPluginManagement(PluginManagementReport.java:217)
[linux-jdk10] at org.apache.maven.report.projectinfo.PluginManagementReport$PluginManagementRenderer.renderBody(PluginManagementReport.java:182)
[linux-jdk10] at org.apache.maven.reporting.AbstractMavenReportRenderer.render(AbstractMavenReportRenderer.java:80)
[linux-jdk10] at org.apache.maven.report.projectinfo.PluginManagementReport.executeReport(PluginManagementReport.java:76)
[linux-jdk10] at org.apache.maven.reporting.AbstractMavenReport.generate(AbstractMavenReport.java:251)
[linux-jdk10] at org.apache.maven.report.projectinfo.AbstractProjectInfoReport.execute(AbstractProjectInfoReport.java:240)
[linux-jdk10] at org.apache.maven.report.projectinfo.AbstractProjectInfoTestCase.generateReport(AbstractProjectInfoTestCase.java:198)
[linux-jdk10] at org.apache.maven.report.projectinfo.AbstractProjectInfoTestCase.generateReport(AbstractProjectInfoTestCase.java:174)
[linux-jdk10] at org.apache.maven.report.projectinfo.PluginManagementReportTest.testReport(PluginManagementReportTest.java:52)
[linux-jdk10] at java.base/jdk.internal.reflect.NativeMethodAccessorImpl.invoke0(Native Method)
[linux-jdk10] at java.base/jdk.internal.reflect.NativeMethodAccessorImpl.invoke(NativeMethodAccessorImpl.java:62)
[linux-jdk10] at java.base/jdk.internal.reflect.DelegatingMethodAccessorImpl.invoke(DelegatingMethodAccessorImpl.java:43)
[linux-jdk10] at java.base/java.lang.reflect.Method.invoke(Method.java:564)
[linux-jdk10] at junit.framework.TestCase.runTest(TestCase.java:176)
[linux-jdk10] at junit.framework.TestCase.runBare(TestCase.java:141)
[linux-jdk10] at junit.framework.TestResult$1.protect(TestResult.java:122)
[linux-jdk10] at junit.framework.TestResult.runProtected(TestResult.java:142)
[linux-jdk10] at junit.framework.TestResult.run(TestResult.java:125)
[linux-jdk10] at junit.framework.TestCase.run(TestCase.java:129)
[linux-jdk10] at junit.framework.TestSuite.runTest(TestSuite.java:252)
[linux-jdk10] at junit.framework.TestSuite.run(TestSuite.java:247)
[linux-jdk10] at org.junit.internal.runners.JUnit38ClassRunner.run(JUnit38ClassRunner.java:86)
[linux-jdk10] at org.apache.maven.surefire.junit4.JUnit4Provider.execute(JUnit4Provider.java:365)
[linux-jdk10] at org.apache.maven.surefire.junit4.JUnit4Provider.executeWithRerun(JUnit4Provider.java:273)
[linux-jdk10] at org.apache.maven.surefire.junit4.JUnit4Provider.executeTestSet(JUnit4Provider.java:238)
[linux-jdk10] at org.apache.maven.surefire.junit4.JUnit4Provider.invoke(JUnit4Provider.java:159)
[linux-jdk10] at org.apache.maven.surefire.booter.ForkedBooter.invokeProviderInSameClassLoader(ForkedBooter.java:379)
[linux-jdk10] at org.apache.maven.surefire.booter.ForkedBooter.runSuitesInProcess(ForkedBooter.java:340)
[linux-jdk10] at org.apache.maven.surefire.booter.ForkedBooter.execute(ForkedBooter.java:125)
[linux-jdk10] at org.apache.maven.surefire.booter.ForkedBooter.main(ForkedBooter.java:413)
[linux-jdk10] Caused by: org.sonatype.aether.resolution.ArtifactResolutionException: Failed to resolve version for org.apache.maven.plugins:maven-compile-plugin:pom:RELEASE: Could not find metadata org.apache.maven.plugins:maven-compile-plugin/maven-metadata.xml
[linux-jdk10] at org.sonatype.aether.impl.internal.DefaultArtifactResolver.resolveArtifacts(DefaultArtifactResolver.java:488)
[linux-jdk10] at org.sonatype.aether.impl.internal.DefaultArtifactResolver.resolveArtifact(DefaultArtifactResolver.java:190)
[linux-jdk10] at org.apache.maven.project.DefaultProjectBuilder.build(DefaultProjectBuilder.java:251)
[linux-jdk10] ... 31 more
[linux-jdk10] Caused by: org.sonatype.aether.resolution.VersionResolutionException: Failed to resolve version for org.apache.maven.plugins:maven-compile-plugin:pom:RELEASE: Could not find metadata org.apache.maven.plugins:maven-compile-plugin/maven-metadata.xml
[linux-jdk10] at org.apache.maven.repository.internal.DefaultVersionResolver.resolveVersion(DefaultVersionResolver.java:249)
[linux-jdk10] at org.sonatype.aether.impl.internal.DefaultArtifactResolver.resolveArtifacts(DefaultArtifactResolver.java:238)
[linux-jdk10] ... 33 more
[linux-jdk10] Caused by: org.sonatype.aether.transfer.MetadataNotFoundException: Could not find metadata org.apache.maven.plugins:maven-compile-plugin/maven-metadata.xml
[linux-jdk10] at org.sonatype.aether.impl.internal.DefaultMetadataResolver.resolveMetadata(DefaultMetadataResolver.java:151)
[linux-jdk10] at org.apache.maven.repository.internal.DefaultVersionResolver.resolveVersion(DefaultVersionResolver.java:188)
[linux-jdk10] ... 34 more
[linux-jdk10] [INFO] Could not build project for: maven-project-info-reports-plugin:Error resolving project artifact: Could not find artifact org.apache.maven.plugins:maven-project-info-reports-plugin:pom:2.0.1 for project org.apache.maven.plugins:maven-project-info-reports-plugin:pom:2.0.1
[linux-jdk10] org.apache.maven.project.ProjectBuildingException: Error resolving project artifact: Could not find artifact org.apache.maven.plugins:maven-project-info-reports-plugin:pom:2.0.1 for project org.apache.maven.plugins:maven-project-info-reports-plugin:pom:2.0.1
[linux-jdk10] at org.apache.maven.project.DefaultProjectBuilder.build(DefaultProjectBuilder.java:260)
[linux-jdk10] at org.apache.maven.project.DefaultProjectBuilder.build(DefaultProjectBuilder.java:233)
[linux-jdk10] at org.apache.maven.report.projectinfo.PluginManagementReport$PluginManagementRenderer.renderSectionPluginManagement(PluginManagementReport.java:217)
[linux-jdk10] at org.apache.maven.report.projectinfo.PluginManagementReport$PluginManagementRenderer.renderBody(PluginManagementReport.java:182)
[linux-jdk10] at org.apache.maven.reporting.AbstractMavenReportRenderer.render(AbstractMavenReportRenderer.java:80)
[linux-jdk10] at org.apache.maven.report.projectinfo.PluginManagementReport.executeReport(PluginManagementReport.java:76)
[linux-jdk10] at org.apache.maven.reporting.AbstractMavenReport.generate(AbstractMavenReport.java:251)
[linux-jdk10] at org.apache.maven.report.projectinfo.AbstractProjectInfoReport.execute(AbstractProjectInfoReport.java:240)
[linux-jdk10] at org.apache.maven.report.projectinfo.AbstractProjectInfoTestCase.generateReport(AbstractProjectInfoTestCase.java:198)
[linux-jdk10] at org.apache.maven.report.projectinfo.AbstractProjectInfoTestCase.generateReport(AbstractProjectInfoTestCase.java:174)
[linux-jdk10] at org.apache.maven.report.projectinfo.PluginManagementReportTest.testReport(PluginManagementReportTest.java:52)
[linux-jdk10] at java.base/jdk.internal.reflect.NativeMethodAccessorImpl.invoke0(Native Method)
[linux-jdk10] at java.base/jdk.internal.reflect.NativeMethodAccessorImpl.invoke(NativeMethodAccessorImpl.java:62)
[linux-jdk10] at java.base/jdk.internal.reflect.DelegatingMethodAccessorImpl.invoke(DelegatingMethodAccessorImpl.java:43)
[linux-jdk10] at java.base/java.lang.reflect.Method.invoke(Method.java:564)
[linux-jdk10] at junit.framework.TestCase.runTest(TestCase.java:176)
[linux-jdk10] at junit.framework.TestCase.runBare(TestCase.java:141)
[linux-jdk10] at junit.framework.TestResult$1.protect(TestResult.java:122)
[linux-jdk10] at junit.framework.TestResult.runProtected(TestResult.java:142)
[linux-jdk10] at junit.framework.TestResult.run(TestResult.java:125)
[linux-jdk10] at junit.framework.TestCase.run(TestCase.java:129)
[linux-jdk10] at junit.framework.TestSuite.runTest(TestSuite.java:252)
[linux-jdk10] at junit.framework.TestSuite.run(TestSuite.java:247)
[linux-jdk10] at org.junit.internal.runners.JUnit38ClassRunner.run(JUnit38ClassRunner.java:86)
[linux-jdk10] at org.apache.maven.surefire.junit4.JUnit4Provider.execute(JUnit4Provider.java:365)
[linux-jdk10] at org.apache.maven.surefire.junit4.JUnit4Provider.executeWithRerun(JUnit4Provider.java:273)
[linux-jdk10] at org.apache.maven.surefire.junit4.JUnit4Provider.executeTestSet(JUnit4Provider.java:238)
[linux-jdk10] at org.apache.maven.surefire.junit4.JUnit4Provider.invoke(JUnit4Provider.java:159)
[linux-jdk10] at org.apache.maven.surefire.booter.ForkedBooter.invokeProviderInSameClassLoader(ForkedBooter.java:379)
[linux-jdk10] at org.apache.maven.surefire.booter.ForkedBooter.runSuitesInProcess(ForkedBooter.java:340)
[linux-jdk10] at org.apache.maven.surefire.booter.ForkedBooter.execute(ForkedBooter.java:125)
[linux-jdk10] at org.apache.maven.surefire.booter.ForkedBooter.main(ForkedBooter.java:413)
[linux-jdk10] Caused by: org.sonatype.aether.resolution.ArtifactResolutionException: Could not find artifact org.apache.maven.plugins:maven-project-info-reports-plugin:pom:2.0.1
[linux-jdk10] at org.sonatype.aether.impl.internal.DefaultArtifactResolver.resolveArtifacts(DefaultArtifactResolver.java:488)
[linux-jdk10] at org.sonatype.aether.impl.internal.DefaultArtifactResolver.resolveArtifact(DefaultArtifactResolver.java:190)
[linux-jdk10] at org.apache.maven.project.DefaultProjectBuilder.build(DefaultProjectBuilder.java:251)
[linux-jdk10] ... 31 more
[linux-jdk10] Caused by: org.sonatype.aether.transfer.ArtifactNotFoundException: Could not find artifact org.apache.maven.plugins:maven-project-info-reports-plugin:pom:2.0.1
[linux-jdk10] at org.sonatype.aether.impl.internal.DefaultArtifactResolver.resolveArtifacts(DefaultArtifactResolver.java:479)
[linux-jdk10] ... 33 more
[linux-jdk10] [INFO] Tests run: 1, Failures: 0, Errors: 0, Skipped: 0, Time elapsed: 0.229 s - in org.apache.maven.report.projectinfo.PluginManagementReportTest
[linux-jdk10] [INFO] Running org.apache.maven.report.projectinfo.DependencyManagementReportTest
[linux-jdk10] [INFO] Tests run: 1, Failures: 0, Errors: 0, Skipped: 0, Time elapsed: 0.275 s - in org.apache.maven.report.projectinfo.DependencyManagementReportTest
[linux-jdk10] [INFO] Running org.apache.maven.report.projectinfo.ProjectInfoReportUtilsTest
[linux-jdk10] SLF4J: Failed to load class "org.slf4j.impl.StaticLoggerBinder".
[linux-jdk10] SLF4J: Defaulting to no-operation (NOP) logger implementation
[linux-jdk10] SLF4J: See http://www.slf4j.org/codes.html#StaticLoggerBinder for further details.
[linux-jdk10] [INFO] Tests run: 1, Failures: 0, Errors: 0, Skipped: 0, Time elapsed: 1.933 s - in org.apache.maven.report.projectinfo.ProjectInfoReportUtilsTest
[linux-jdk10] [INFO] Running org.apache.maven.report.projectinfo.DependencyConvergenceReportTest
[linux-jdk10] [INFO] Tests run: 1, Failures: 0, Errors: 0, Skipped: 0, Time elapsed: 0.184 s - in org.apache.maven.report.projectinfo.DependencyConvergenceReportTest
[linux-jdk10] [INFO]
[linux-jdk10] [INFO] Results:
[linux-jdk10] [INFO]
[linux-jdk10] [INFO] Tests run: 18, Failures: 0, Errors: 0, Skipped: 0
[linux-jdk10] [INFO]
[linux-jdk10] [INFO]
[linux-jdk10] [INFO] --- maven-jar-plugin:3.0.0:jar (default-jar) @ maven-project-info-reports-plugin ---
[linux-jdk10] [INFO] Building jar: /home/jenkins/jenkins-slave/workspace/nfo-reports-plugin_MPIR-366-S464FI4ATSVOULE3N7MCKV5FYYG6GVHDD7OLISMYBGUEPLQM2UNA/m/target/maven-project-info-reports-plugin-2.10-SNAPSHOT.jar
[linux-jdk10] [INFO]
[linux-jdk10] [INFO] --- maven-plugin-plugin:3.4:addPluginArtifactMetadata (default-addPluginArtifactMetadata) @ maven-project-info-reports-plugin ---
[linux-jdk10] [INFO]
[linux-jdk10] [INFO] --- maven-site-plugin:3.5.1:attach-descriptor (attach-descriptor) @ maven-project-info-reports-plugin ---
[linux-jdk10] [INFO]
[linux-jdk10] [INFO] --- maven-jarsigner-plugin:1.3.2:sign (sign) @ maven-project-info-reports-plugin ---
[linux-jdk10] [WARNING] Picked up JAVA_TOOL_OPTIONS: -Dmaven.ext.class.path="/home/jenkins/jenkins-slave/workspace/nfo-reports-plugin_MPIR-366-S464FI4ATSVOULE3N7MCKV5FYYG6GVHDD7OLISMYBGUEPLQM2UNA@tmp/withMaven68972b16/pipeline-maven-spy.jar" -Dorg.jenkinsci.plugins.pipeline.maven.reportsFolder="/home/jenkins/jenkins-slave/workspace/nfo-reports-plugin_MPIR-366-S464FI4ATSVOULE3N7MCKV5FYYG6GVHDD7OLISMYBGUEPLQM2UNA@tmp/withMaven68972b16"
[linux-jdk10] [INFO] 1 archive(s) processed
[linux-jdk10] [INFO]
[linux-jdk10] [INFO] --- maven-invoker-plugin:2.0.0:install (integration-test) @ maven-project-info-reports-plugin ---
[linux-jdk10] [INFO] Installing /home/jenkins/jenkins-slave/workspace/nfo-reports-plugin_MPIR-366-S464FI4ATSVOULE3N7MCKV5FYYG6GVHDD7OLISMYBGUEPLQM2UNA/m/pom.xml to /home/jenkins/jenkins-slave/workspace/nfo-reports-plugin_MPIR-366-S464FI4ATSVOULE3N7MCKV5FYYG6GVHDD7OLISMYBGUEPLQM2UNA/m/target/local-repo/org/apache/maven/plugins/maven-project-info-reports-plugin/2.10-SNAPSHOT/maven-project-info-reports-plugin-2.10-SNAPSHOT.pom
[linux-jdk10] [INFO] Installing /home/jenkins/jenkins-slave/workspace/nfo-reports-plugin_MPIR-366-S464FI4ATSVOULE3N7MCKV5FYYG6GVHDD7OLISMYBGUEPLQM2UNA/m/target/maven-project-info-reports-plugin-2.10-SNAPSHOT.jar to /home/jenkins/jenkins-slave/workspace/nfo-reports-plugin_MPIR-366-S464FI4ATSVOULE3N7MCKV5FYYG6GVHDD7OLISMYBGUEPLQM2UNA/m/target/local-repo/org/apache/maven/plugins/maven-project-info-reports-plugin/2.10-SNAPSHOT/maven-project-info-reports-plugin-2.10-SNAPSHOT.jar
[linux-jdk10] [INFO]
[linux-jdk10] [INFO] --- maven-invoker-plugin:2.0.0:integration-test (integration-test) @ maven-project-info-reports-plugin ---
[linux-jdk10] [INFO] Building: git/pom.xml
[linux-jdk10] [INFO] ..FAILED (5.3 s)
[linux-jdk10] [INFO]   The build exited with code 1. See /home/jenkins/jenkins-slave/workspace/nfo-reports-plugin_MPIR-366-S464FI4ATSVOULE3N7MCKV5FYYG6GVHDD7OLISMYBGUEPLQM2UNA/m/target/it/git/build.log for details.
[linux-jdk10] [INFO] Building: full-pom/pom.xml
[linux-jdk10] [INFO] ..FAILED (11.7 s)
[linux-jdk10] [INFO]   The build exited with code 1. See /home/jenkins/jenkins-slave/workspace/nfo-reports-plugin_MPIR-366-S464FI4ATSVOULE3N7MCKV5FYYG6GVHDD7OLISMYBGUEPLQM2UNA/m/target/it/full-pom/build.log for details.
[linux-jdk10] [INFO] Building: minimal-pom/pom.xml
[linux-jdk10] [INFO] ..FAILED (4.7 s)
[linux-jdk10] [INFO]   The build exited with code 1. See /home/jenkins/jenkins-slave/workspace/nfo-reports-plugin_MPIR-366-S464FI4ATSVOULE3N7MCKV5FYYG6GVHDD7OLISMYBGUEPLQM2UNA/m/target/it/minimal-pom/build.log for details.
[linux-jdk10] [INFO] Building: MPIR-242/pom.xml
[linux-jdk10] [INFO] ..FAILED (4.4 s)
[linux-jdk10] [INFO]   The build exited with code 1. See /home/jenkins/jenkins-slave/workspace/nfo-reports-plugin_MPIR-366-S464FI4ATSVOULE3N7MCKV5FYYG6GVHDD7OLISMYBGUEPLQM2UNA/m/target/it/MPIR-242/build.log for details.
[linux-jdk10] [INFO] Building: dependencies-java-1.7-and-1.8/pom.xml
[linux-jdk10] [INFO] ..FAILED (8.8 s)
[linux-jdk10] [INFO]   The build exited with code 1. See /home/jenkins/jenkins-slave/workspace/nfo-reports-plugin_MPIR-366-S464FI4ATSVOULE3N7MCKV5FYYG6GVHDD7OLISMYBGUEPLQM2UNA/m/target/it/dependencies-java-1.7-and-1.8/build.log for details.
[linux-jdk10] [INFO] Building: MPIR-251/pom.xml
[linux-jdk10] [INFO] run script verify.groovy
[linux-jdk10] WARNING: An illegal reflective access operation has occurred
[linux-jdk10] WARNING: Illegal reflective access by org.codehaus.groovy.reflection.CachedClass$3$1 (file:/home/jenkins/jenkins-slave/workspace/nfo-reports-plugin_MPIR-366-S464FI4ATSVOULE3N7MCKV5FYYG6GVHDD7OLISMYBGUEPLQM2UNA/.repository/org/codehaus/groovy/groovy/2.0.1/groovy-2.0.1.jar) to method java.lang.Object.finalize()
[linux-jdk10] WARNING: Please consider reporting this to the maintainers of org.codehaus.groovy.reflection.CachedClass$3$1
[linux-jdk10] WARNING: Use --illegal-access=warn to enable warnings of further illegal reflective access operations
[linux-jdk10] WARNING: All illegal access operations will be denied in a future release
[linux-jdk10] [INFO] ..SUCCESS (9.1 s)
[linux-jdk10] [INFO] Building: mpir-229/pom.xml
[linux-jdk10] [INFO] ..FAILED (4.2 s)
[linux-jdk10] [INFO]   The build exited with code 1. See /home/jenkins/jenkins-slave/workspace/nfo-reports-plugin_MPIR-366-S464FI4ATSVOULE3N7MCKV5FYYG6GVHDD7OLISMYBGUEPLQM2UNA/m/target/it/mpir-229/build.log for details.
[linux-jdk10] [INFO] Building: MPIR-300/pom.xml
[linux-jdk10] [INFO] run script verify.groovy
[linux-jdk10] [INFO] ..SUCCESS (4.6 s)
[linux-jdk10] [INFO] Building: multi-module/pom.xml
[linux-jdk10] [INFO] ..FAILED (12.0 s)
[linux-jdk10] [INFO]   The build exited with code 1. See /home/jenkins/jenkins-slave/workspace/nfo-reports-plugin_MPIR-366-S464FI4ATSVOULE3N7MCKV5FYYG6GVHDD7OLISMYBGUEPLQM2UNA/m/target/it/multi-module/build.log for details.
[linux-jdk10] [INFO] Building: java-version/pom.xml
[linux-jdk10] [INFO] run script verify.groovy
[linux-jdk10] [INFO] ..SUCCESS (4.5 s)
[linux-jdk10] [INFO] Building: MPIR-349/parent/pom.xml
[linux-jdk10] [INFO] run script verify.groovy
[linux-jdk10] [INFO] ..SUCCESS (8.6 s)
[linux-jdk10] [INFO]
[linux-jdk10] [INFO] --- maven-checkstyle-plugin:2.15:check (checkstyle-check) @ maven-project-info-reports-plugin ---
[linux-jdk10] [INFO] There are 10 errors reported by Checkstyle 6.1.1 with config/maven_checks.xml ruleset.
[linux-jdk10] [INFO] Ignored 10 errors, 0 violation remaining.
[linux-jdk10] [INFO]
[linux-jdk10] [INFO] --- maven-jarsigner-plugin:1.3.2:verify (verify) @ maven-project-info-reports-plugin ---
[linux-jdk10] [WARNING] Picked up JAVA_TOOL_OPTIONS: -Dmaven.ext.class.path="/home/jenkins/jenkins-slave/workspace/nfo-reports-plugin_MPIR-366-S464FI4ATSVOULE3N7MCKV5FYYG6GVHDD7OLISMYBGUEPLQM2UNA@tmp/withMaven68972b16/pipeline-maven-spy.jar" -Dorg.jenkinsci.plugins.pipeline.maven.reportsFolder="/home/jenkins/jenkins-slave/workspace/nfo-reports-plugin_MPIR-366-S464FI4ATSVOULE3N7MCKV5FYYG6GVHDD7OLISMYBGUEPLQM2UNA@tmp/withMaven68972b16"
[linux-jdk10] [INFO] 1 archive(s) processed
[linux-jdk10] [INFO]
[linux-jdk10] [INFO] --- maven-invoker-plugin:2.0.0:verify (integration-test) @ maven-project-info-reports-plugin ---
[linux-jdk10] [INFO] -------------------------------------------------
[linux-jdk10] [INFO] Build Summary:
[linux-jdk10] [INFO]   Passed: 4, Failed: 7, Errors: 0, Skipped: 0
[linux-jdk10] [INFO] -------------------------------------------------
[linux-jdk10] [ERROR] The following builds failed:
[linux-jdk10] [ERROR] *  git/pom.xml
[linux-jdk10] [ERROR] *  dependencies-java-1.7-and-1.8/pom.xml
[linux-jdk10] [ERROR] *  minimal-pom/pom.xml
[linux-jdk10] [ERROR] *  MPIR-242/pom.xml
[linux-jdk10] [ERROR] *  full-pom/pom.xml
[linux-jdk10] [ERROR] *  multi-module/pom.xml
[linux-jdk10] [ERROR] *  mpir-229/pom.xml
[linux-jdk10] [INFO] -------------------------------------------------
[linux-jdk10] [INFO] ------------------------------------------------------------------------
[linux-jdk10] [INFO] BUILD FAILURE
[linux-jdk10] [INFO] ------------------------------------------------------------------------
[linux-jdk10] [INFO] Total time: 01:51 min
[linux-jdk10] [INFO] Finished at: 2018-04-13T15:23:53Z
[linux-jdk10] [INFO] Final Memory: 44M/240M
[linux-jdk10] [INFO] ------------------------------------------------------------------------
[linux-jdk10] [INFO] [jenkins-event-spy] Generated /home/jenkins/jenkins-slave/workspace/nfo-reports-plugin_MPIR-366-S464FI4ATSVOULE3N7MCKV5FYYG6GVHDD7OLISMYBGUEPLQM2UNA@tmp/withMaven68972b16/maven-spy-20180413-152202-42107321359715988339.log
[linux-jdk10] [ERROR] Failed to execute goal org.apache.maven.plugins:maven-invoker-plugin:2.0.0:verify (integration-test) on project maven-project-info-reports-plugin: 7 builds failed. See console output above for details. -> [Help 1]
[linux-jdk10] [ERROR]
[linux-jdk10] [ERROR] To see the full stack trace of the errors, re-run Maven with the -e switch.
[linux-jdk10] [ERROR] Re-run Maven using the -X switch to enable full debug logging.
[linux-jdk10] [ERROR]
[linux-jdk10] [ERROR] For more information about the errors and possible solutions, please read the following articles:
[linux-jdk10] [ERROR] [Help 1] http://cwiki.apache.org/confluence/display/MAVEN/MojoFailureException
[Pipeline] [linux-jdk10] }
[Pipeline] [linux-jdk10] // dir
[Pipeline] [linux-jdk10] }
[linux-jdk10] [withMaven] junitPublisher - Archive test results for Maven artifact org.apache.maven.plugins:maven-project-info-reports-plugin:2.10-SNAPSHOT generated by maven-surefire-plugin:test (default-test): m/target/surefire-reports/*.xml
[linux-jdk10] [withMaven] junitPublisher - Jenkins JUnit Attachments Plugin not found, can't publish test attachments.Recording test results
[linux-jdk10] [withMaven] junitPublisher - Archive test results for Maven artifact org.apache.maven.plugins.project-info-reports.its:dep:1.0-SNAPSHOT generated by maven-surefire-plugin:test (default-test): m/target/it/multi-module/dep/target/surefire-reports/*.xml
[linux-jdk10] [withMaven] junitPublisher - Jenkins JUnit Attachments Plugin not found, can't publish test attachments.Recording test results
[linux-jdk10] None of the test reports contained any result
[linux-jdk10] [withMaven] junitPublisher - Archive test results for Maven artifact org.apache.maven.plugins.project-info-reports.its:main:1.0-SNAPSHOT generated by maven-surefire-plugin:test (default-test): m/target/it/multi-module/main/target/surefire-reports/*.xml
[linux-jdk10] [withMaven] junitPublisher - Jenkins JUnit Attachments Plugin not found, can't publish test attachments.Recording test results
[linux-jdk10] None of the test reports contained any result
[Pipeline] [linux-jdk10] // withMaven
[Pipeline] [linux-jdk10] }
[Pipeline] [linux-jdk10] // stage
[Pipeline] [linux-jdk10] }
[Pipeline] [linux-jdk10] // node
[Pipeline] [linux-jdk10] }
[linux-jdk10] Failed in branch linux-jdk10
[Pipeline] // parallel
[Pipeline] stage
[Pipeline] { (Notifications)
[Pipeline] echo
Build result: FAILURE
[Pipeline] jiraIssueSelector
[Pipeline] jiraComment
[Pipeline] emailext
Reply | Threaded
Open this post in threaded view
|

Build failed in Jenkins: Maven TLP » maven-project-info-reports-plugin » MPIR-366 #18

Apache Jenkins Server-2
See https://builds.apache.org/job/maven-box/job/maven-project-info-reports-plugin/job/MPIR-366/18/

Changes:

* [MPIR-366] Set streamLogs to true for analysis
* [MPIR-366] Set streamLogs to true for analysis
* [MPIR-366] Set streamLogs to true for analysis
* [MPIR-366] Set streamLogs to true for analysis

All tests passed

Build log:
[...truncated 45.48 MB...]
[linux-jdk10] [INFO] urls[13] = file:/home/jenkins/jenkins-slave/workspace/nfo-reports-plugin_MPIR-366-S464FI4ATSVOULE3N7MCKV5FYYG6GVHDD7OLISMYBGUEPLQM2UNA/m/target/local-repo/org/sonatype/sisu/sisu-guice/2.1.7/sisu-guice-2.1.7-noaop.jar
[linux-jdk10] [INFO] urls[14] = file:/home/jenkins/jenkins-slave/workspace/nfo-reports-plugin_MPIR-366-S464FI4ATSVOULE3N7MCKV5FYYG6GVHDD7OLISMYBGUEPLQM2UNA/m/target/local-repo/org/codehaus/plexus/plexus-archiver/2.9/plexus-archiver-2.9.jar
[linux-jdk10] [INFO] urls[15] = file:/home/jenkins/jenkins-slave/workspace/nfo-reports-plugin_MPIR-366-S464FI4ATSVOULE3N7MCKV5FYYG6GVHDD7OLISMYBGUEPLQM2UNA/m/target/local-repo/org/codehaus/plexus/plexus-io/2.4/plexus-io-2.4.jar
[linux-jdk10] [INFO] urls[16] = file:/home/jenkins/jenkins-slave/workspace/nfo-reports-plugin_MPIR-366-S464FI4ATSVOULE3N7MCKV5FYYG6GVHDD7OLISMYBGUEPLQM2UNA/m/target/local-repo/org/apache/commons/commons-compress/1.9/commons-compress-1.9.jar
[linux-jdk10] [INFO] urls[17] = file:/home/jenkins/jenkins-slave/workspace/nfo-reports-plugin_MPIR-366-S464FI4ATSVOULE3N7MCKV5FYYG6GVHDD7OLISMYBGUEPLQM2UNA/m/target/local-repo/org/codehaus/plexus/plexus-i18n/1.0-beta-7/plexus-i18n-1.0-beta-7.jar
[linux-jdk10] [INFO] urls[18] = file:/home/jenkins/jenkins-slave/workspace/nfo-reports-plugin_MPIR-366-S464FI4ATSVOULE3N7MCKV5FYYG6GVHDD7OLISMYBGUEPLQM2UNA/m/target/local-repo/org/codehaus/plexus/plexus-utils/3.0.20/plexus-utils-3.0.20.jar
[linux-jdk10] [INFO] urls[19] = file:/home/jenkins/jenkins-slave/workspace/nfo-reports-plugin_MPIR-366-S464FI4ATSVOULE3N7MCKV5FYYG6GVHDD7OLISMYBGUEPLQM2UNA/m/target/local-repo/org/apache/maven/doxia/doxia-sink-api/1.7/doxia-sink-api-1.7.jar
[linux-jdk10] [INFO] urls[20] = file:/home/jenkins/jenkins-slave/workspace/nfo-reports-plugin_MPIR-366-S464FI4ATSVOULE3N7MCKV5FYYG6GVHDD7OLISMYBGUEPLQM2UNA/m/target/local-repo/org/apache/maven/doxia/doxia-logging-api/1.7/doxia-logging-api-1.7.jar
[linux-jdk10] [INFO] urls[21] = file:/home/jenkins/jenkins-slave/workspace/nfo-reports-plugin_MPIR-366-S464FI4ATSVOULE3N7MCKV5FYYG6GVHDD7OLISMYBGUEPLQM2UNA/m/target/local-repo/org/apache/maven/doxia/doxia-module-xhtml/1.7/doxia-module-xhtml-1.7.jar
[linux-jdk10] [INFO] urls[22] = file:/home/jenkins/jenkins-slave/workspace/nfo-reports-plugin_MPIR-366-S464FI4ATSVOULE3N7MCKV5FYYG6GVHDD7OLISMYBGUEPLQM2UNA/m/target/local-repo/org/apache/maven/doxia/doxia-core/1.7/doxia-core-1.7.jar
[linux-jdk10] [INFO] urls[23] = file:/home/jenkins/jenkins-slave/workspace/nfo-reports-plugin_MPIR-366-S464FI4ATSVOULE3N7MCKV5FYYG6GVHDD7OLISMYBGUEPLQM2UNA/m/target/local-repo/org/apache/httpcomponents/httpclient/4.0.2/httpclient-4.0.2.jar
[linux-jdk10] [INFO] urls[24] = file:/home/jenkins/jenkins-slave/workspace/nfo-reports-plugin_MPIR-366-S464FI4ATSVOULE3N7MCKV5FYYG6GVHDD7OLISMYBGUEPLQM2UNA/m/target/local-repo/commons-codec/commons-codec/1.3/commons-codec-1.3.jar
[linux-jdk10] [INFO] urls[25] = file:/home/jenkins/jenkins-slave/workspace/nfo-reports-plugin_MPIR-366-S464FI4ATSVOULE3N7MCKV5FYYG6GVHDD7OLISMYBGUEPLQM2UNA/m/target/local-repo/org/apache/httpcomponents/httpcore/4.0.1/httpcore-4.0.1.jar
[linux-jdk10] [INFO] urls[26] = file:/home/jenkins/jenkins-slave/workspace/nfo-reports-plugin_MPIR-366-S464FI4ATSVOULE3N7MCKV5FYYG6GVHDD7OLISMYBGUEPLQM2UNA/m/target/local-repo/xmlunit/xmlunit/1.5/xmlunit-1.5.jar
[linux-jdk10] [INFO] urls[27] = file:/home/jenkins/jenkins-slave/workspace/nfo-reports-plugin_MPIR-366-S464FI4ATSVOULE3N7MCKV5FYYG6GVHDD7OLISMYBGUEPLQM2UNA/m/target/local-repo/org/apache/maven/doxia/doxia-module-apt/1.7/doxia-module-apt-1.7.jar
[linux-jdk10] [INFO] urls[28] = file:/home/jenkins/jenkins-slave/workspace/nfo-reports-plugin_MPIR-366-S464FI4ATSVOULE3N7MCKV5FYYG6GVHDD7OLISMYBGUEPLQM2UNA/m/target/local-repo/org/apache/maven/doxia/doxia-module-xdoc/1.7/doxia-module-xdoc-1.7.jar
[linux-jdk10] [INFO] urls[29] = file:/home/jenkins/jenkins-slave/workspace/nfo-reports-plugin_MPIR-366-S464FI4ATSVOULE3N7MCKV5FYYG6GVHDD7OLISMYBGUEPLQM2UNA/m/target/local-repo/org/apache/maven/doxia/doxia-module-fml/1.7/doxia-module-fml-1.7.jar
[linux-jdk10] [INFO] urls[30] = file:/home/jenkins/jenkins-slave/workspace/nfo-reports-plugin_MPIR-366-S464FI4ATSVOULE3N7MCKV5FYYG6GVHDD7OLISMYBGUEPLQM2UNA/m/target/local-repo/org/apache/maven/doxia/doxia-module-markdown/1.7/doxia-module-markdown-1.7.jar
[linux-jdk10] [INFO] urls[31] = file:/home/jenkins/jenkins-slave/workspace/nfo-reports-plugin_MPIR-366-S464FI4ATSVOULE3N7MCKV5FYYG6GVHDD7OLISMYBGUEPLQM2UNA/m/target/local-repo/org/pegdown/pegdown/1.2.1/pegdown-1.2.1.jar
[linux-jdk10] [INFO] urls[32] = file:/home/jenkins/jenkins-slave/workspace/nfo-reports-plugin_MPIR-366-S464FI4ATSVOULE3N7MCKV5FYYG6GVHDD7OLISMYBGUEPLQM2UNA/m/target/local-repo/org/parboiled/parboiled-java/1.1.4/parboiled-java-1.1.4.jar
[linux-jdk10] [INFO] urls[33] = file:/home/jenkins/jenkins-slave/workspace/nfo-reports-plugin_MPIR-366-S464FI4ATSVOULE3N7MCKV5FYYG6GVHDD7OLISMYBGUEPLQM2UNA/m/target/local-repo/org/parboiled/parboiled-core/1.1.4/parboiled-core-1.1.4.jar
[linux-jdk10] [INFO] urls[34] = file:/home/jenkins/jenkins-slave/workspace/nfo-reports-plugin_MPIR-366-S464FI4ATSVOULE3N7MCKV5FYYG6GVHDD7OLISMYBGUEPLQM2UNA/m/target/local-repo/org/ow2/asm/asm/4.1/asm-4.1.jar
[linux-jdk10] [INFO] urls[35] = file:/home/jenkins/jenkins-slave/workspace/nfo-reports-plugin_MPIR-366-S464FI4ATSVOULE3N7MCKV5FYYG6GVHDD7OLISMYBGUEPLQM2UNA/m/target/local-repo/org/ow2/asm/asm-tree/4.1/asm-tree-4.1.jar
[linux-jdk10] [INFO] urls[36] = file:/home/jenkins/jenkins-slave/workspace/nfo-reports-plugin_MPIR-366-S464FI4ATSVOULE3N7MCKV5FYYG6GVHDD7OLISMYBGUEPLQM2UNA/m/target/local-repo/org/ow2/asm/asm-analysis/4.1/asm-analysis-4.1.jar
[linux-jdk10] [INFO] urls[37] = file:/home/jenkins/jenkins-slave/workspace/nfo-reports-plugin_MPIR-366-S464FI4ATSVOULE3N7MCKV5FYYG6GVHDD7OLISMYBGUEPLQM2UNA/m/target/local-repo/org/ow2/asm/asm-util/4.1/asm-util-4.1.jar
[linux-jdk10] [INFO] urls[38] = file:/home/jenkins/jenkins-slave/workspace/nfo-reports-plugin_MPIR-366-S464FI4ATSVOULE3N7MCKV5FYYG6GVHDD7OLISMYBGUEPLQM2UNA/m/target/local-repo/javax/servlet/servlet-api/2.5/servlet-api-2.5.jar
[linux-jdk10] [INFO] urls[39] = file:/home/jenkins/jenkins-slave/workspace/nfo-reports-plugin_MPIR-366-S464FI4ATSVOULE3N7MCKV5FYYG6GVHDD7OLISMYBGUEPLQM2UNA/m/target/local-repo/org/apache/maven/doxia/doxia-decoration-model/1.7.1/doxia-decoration-model-1.7.1.jar
[linux-jdk10] [INFO] urls[40] = file:/home/jenkins/jenkins-slave/workspace/nfo-reports-plugin_MPIR-366-S464FI4ATSVOULE3N7MCKV5FYYG6GVHDD7OLISMYBGUEPLQM2UNA/m/target/local-repo/org/apache/maven/doxia/doxia-site-renderer/1.7.1/doxia-site-renderer-1.7.1.jar
[linux-jdk10] [INFO] urls[41] = file:/home/jenkins/jenkins-slave/workspace/nfo-reports-plugin_MPIR-366-S464FI4ATSVOULE3N7MCKV5FYYG6GVHDD7OLISMYBGUEPLQM2UNA/m/target/local-repo/org/apache/maven/doxia/doxia-skin-model/1.7.1/doxia-skin-model-1.7.1.jar
[linux-jdk10] [INFO] urls[42] = file:/home/jenkins/jenkins-slave/workspace/nfo-reports-plugin_MPIR-366-S464FI4ATSVOULE3N7MCKV5FYYG6GVHDD7OLISMYBGUEPLQM2UNA/m/target/local-repo/junit/junit/3.8.1/junit-3.8.1.jar
[linux-jdk10] [INFO] urls[43] = file:/home/jenkins/jenkins-slave/workspace/nfo-reports-plugin_MPIR-366-S464FI4ATSVOULE3N7MCKV5FYYG6GVHDD7OLISMYBGUEPLQM2UNA/m/target/local-repo/org/codehaus/plexus/plexus-velocity/1.2/plexus-velocity-1.2.jar
[linux-jdk10] [INFO] urls[44] = file:/home/jenkins/jenkins-slave/workspace/nfo-reports-plugin_MPIR-366-S464FI4ATSVOULE3N7MCKV5FYYG6GVHDD7OLISMYBGUEPLQM2UNA/m/target/local-repo/org/apache/velocity/velocity/1.7/velocity-1.7.jar
[linux-jdk10] [INFO] urls[45] = file:/home/jenkins/jenkins-slave/workspace/nfo-reports-plugin_MPIR-366-S464FI4ATSVOULE3N7MCKV5FYYG6GVHDD7OLISMYBGUEPLQM2UNA/m/target/local-repo/org/apache/velocity/velocity-tools/2.0/velocity-tools-2.0.jar
[linux-jdk10] [INFO] urls[46] = file:/home/jenkins/jenkins-slave/workspace/nfo-reports-plugin_MPIR-366-S464FI4ATSVOULE3N7MCKV5FYYG6GVHDD7OLISMYBGUEPLQM2UNA/m/target/local-repo/commons-beanutils/commons-beanutils/1.7.0/commons-beanutils-1.7.0.jar
[linux-jdk10] [INFO] urls[47] = file:/home/jenkins/jenkins-slave/workspace/nfo-reports-plugin_MPIR-366-S464FI4ATSVOULE3N7MCKV5FYYG6GVHDD7OLISMYBGUEPLQM2UNA/m/target/local-repo/commons-digester/commons-digester/1.8/commons-digester-1.8.jar
[linux-jdk10] [INFO] urls[48] = file:/home/jenkins/jenkins-slave/workspace/nfo-reports-plugin_MPIR-366-S464FI4ATSVOULE3N7MCKV5FYYG6GVHDD7OLISMYBGUEPLQM2UNA/m/target/local-repo/commons-chain/commons-chain/1.1/commons-chain-1.1.jar
[linux-jdk10] [INFO] urls[49] = file:/home/jenkins/jenkins-slave/workspace/nfo-reports-plugin_MPIR-366-S464FI4ATSVOULE3N7MCKV5FYYG6GVHDD7OLISMYBGUEPLQM2UNA/m/target/local-repo/commons-logging/commons-logging/1.1/commons-logging-1.1.jar
[linux-jdk10] [INFO] urls[50] = file:/home/jenkins/jenkins-slave/workspace/nfo-reports-plugin_MPIR-366-S464FI4ATSVOULE3N7MCKV5FYYG6GVHDD7OLISMYBGUEPLQM2UNA/m/target/local-repo/commons-validator/commons-validator/1.3.1/commons-validator-1.3.1.jar
[linux-jdk10] [INFO] urls[51] = file:/home/jenkins/jenkins-slave/workspace/nfo-reports-plugin_MPIR-366-S464FI4ATSVOULE3N7MCKV5FYYG6GVHDD7OLISMYBGUEPLQM2UNA/m/target/local-repo/dom4j/dom4j/1.1/dom4j-1.1.jar
[linux-jdk10] [INFO] urls[52] = file:/home/jenkins/jenkins-slave/workspace/nfo-reports-plugin_MPIR-366-S464FI4ATSVOULE3N7MCKV5FYYG6GVHDD7OLISMYBGUEPLQM2UNA/m/target/local-repo/oro/oro/2.0.8/oro-2.0.8.jar
[linux-jdk10] [INFO] urls[53] = file:/home/jenkins/jenkins-slave/workspace/nfo-reports-plugin_MPIR-366-S464FI4ATSVOULE3N7MCKV5FYYG6GVHDD7OLISMYBGUEPLQM2UNA/m/target/local-repo/sslext/sslext/1.2-0/sslext-1.2-0.jar
[linux-jdk10] [INFO] urls[54] = file:/home/jenkins/jenkins-slave/workspace/nfo-reports-plugin_MPIR-366-S464FI4ATSVOULE3N7MCKV5FYYG6GVHDD7OLISMYBGUEPLQM2UNA/m/target/local-repo/org/apache/struts/struts-core/1.3.8/struts-core-1.3.8.jar
[linux-jdk10] [INFO] urls[55] = file:/home/jenkins/jenkins-slave/workspace/nfo-reports-plugin_MPIR-366-S464FI4ATSVOULE3N7MCKV5FYYG6GVHDD7OLISMYBGUEPLQM2UNA/m/target/local-repo/antlr/antlr/2.7.2/antlr-2.7.2.jar
[linux-jdk10] [INFO] urls[56] = file:/home/jenkins/jenkins-slave/workspace/nfo-reports-plugin_MPIR-366-S464FI4ATSVOULE3N7MCKV5FYYG6GVHDD7OLISMYBGUEPLQM2UNA/m/target/local-repo/org/apache/struts/struts-taglib/1.3.8/struts-taglib-1.3.8.jar
[linux-jdk10] [INFO] urls[57] = file:/home/jenkins/jenkins-slave/workspace/nfo-reports-plugin_MPIR-366-S464FI4ATSVOULE3N7MCKV5FYYG6GVHDD7OLISMYBGUEPLQM2UNA/m/target/local-repo/org/apache/struts/struts-tiles/1.3.8/struts-tiles-1.3.8.jar
[linux-jdk10] [INFO] urls[58] = file:/home/jenkins/jenkins-slave/workspace/nfo-reports-plugin_MPIR-366-S464FI4ATSVOULE3N7MCKV5FYYG6GVHDD7OLISMYBGUEPLQM2UNA/m/target/local-repo/commons-collections/commons-collections/3.2.1/commons-collections-3.2.1.jar
[linux-jdk10] [INFO] urls[59] = file:/home/jenkins/jenkins-slave/workspace/nfo-reports-plugin_MPIR-366-S464FI4ATSVOULE3N7MCKV5FYYG6GVHDD7OLISMYBGUEPLQM2UNA/m/target/local-repo/commons-lang/commons-lang/2.4/commons-lang-2.4.jar
[linux-jdk10] [INFO] urls[60] = file:/home/jenkins/jenkins-slave/workspace/nfo-reports-plugin_MPIR-366-S464FI4ATSVOULE3N7MCKV5FYYG6GVHDD7OLISMYBGUEPLQM2UNA/m/target/local-repo/org/apache/maven/doxia/doxia-integration-tools/1.7.1/doxia-integration-tools-1.7.1.jar
[linux-jdk10] [INFO] urls[61] = file:/home/jenkins/jenkins-slave/workspace/nfo-reports-plugin_MPIR-366-S464FI4ATSVOULE3N7MCKV5FYYG6GVHDD7OLISMYBGUEPLQM2UNA/m/target/local-repo/org/mortbay/jetty/jetty/6.1.25/jetty-6.1.25.jar
[linux-jdk10] [INFO] urls[62] = file:/home/jenkins/jenkins-slave/workspace/nfo-reports-plugin_MPIR-366-S464FI4ATSVOULE3N7MCKV5FYYG6GVHDD7OLISMYBGUEPLQM2UNA/m/target/local-repo/org/mortbay/jetty/servlet-api/2.5-20081211/servlet-api-2.5-20081211.jar
[linux-jdk10] [INFO] urls[63] = file:/home/jenkins/jenkins-slave/workspace/nfo-reports-plugin_MPIR-366-S464FI4ATSVOULE3N7MCKV5FYYG6GVHDD7OLISMYBGUEPLQM2UNA/m/target/local-repo/org/mortbay/jetty/jetty-util/6.1.25/jetty-util-6.1.25.jar
[linux-jdk10] [INFO] urls[64] = file:/home/jenkins/jenkins-slave/workspace/nfo-reports-plugin_MPIR-366-S464FI4ATSVOULE3N7MCKV5FYYG6GVHDD7OLISMYBGUEPLQM2UNA/m/target/local-repo/org/apache/commons/commons-lang3/3.4/commons-lang3-3.4.jar
[linux-jdk10] [INFO] urls[65] = file:/home/jenkins/jenkins-slave/workspace/nfo-reports-plugin_MPIR-366-S464FI4ATSVOULE3N7MCKV5FYYG6GVHDD7OLISMYBGUEPLQM2UNA/m/target/local-repo/commons-io/commons-io/1.4/commons-io-1.4.jar
[linux-jdk10] [INFO] Number of foreign imports: 1
[linux-jdk10] [INFO] import: Entry[import  from realm ClassRealm[maven.api, parent: null]]
[linux-jdk10] [INFO]
[linux-jdk10] [INFO] -----------------------------------------------------
[linux-jdk10] [INFO]
[linux-jdk10] [INFO]     at org.apache.maven.plugin.DefaultBuildPluginManager.executeMojo (DefaultBuildPluginManager.java:181)
[linux-jdk10] [INFO]     at org.apache.maven.lifecycle.internal.MojoExecutor.execute (MojoExecutor.java:208)
[linux-jdk10] [INFO]     at org.apache.maven.lifecycle.internal.MojoExecutor.execute (MojoExecutor.java:154)
[linux-jdk10] [INFO]     at org.apache.maven.lifecycle.internal.MojoExecutor.execute (MojoExecutor.java:146)
[linux-jdk10] [INFO]     at org.apache.maven.lifecycle.internal.LifecycleModuleBuilder.buildProject (LifecycleModuleBuilder.java:117)
[linux-jdk10] [INFO]     at org.apache.maven.lifecycle.internal.LifecycleModuleBuilder.buildProject (LifecycleModuleBuilder.java:81)
[linux-jdk10] [INFO]     at org.apache.maven.lifecycle.internal.builder.singlethreaded.SingleThreadedBuilder.build (SingleThreadedBuilder.java:51)
[linux-jdk10] [INFO]     at org.apache.maven.lifecycle.internal.LifecycleStarter.execute (LifecycleStarter.java:128)
[linux-jdk10] [INFO]     at org.apache.maven.DefaultMaven.doExecute (DefaultMaven.java:309)
[linux-jdk10] [INFO]     at org.apache.maven.DefaultMaven.doExecute (DefaultMaven.java:194)
[linux-jdk10] [INFO]     at org.apache.maven.DefaultMaven.execute (DefaultMaven.java:107)
[linux-jdk10] [INFO]     at org.apache.maven.cli.MavenCli.execute (MavenCli.java:955)
[linux-jdk10] [INFO]     at org.apache.maven.cli.MavenCli.doMain (MavenCli.java:290)
[linux-jdk10] [INFO]     at org.apache.maven.cli.MavenCli.main (MavenCli.java:194)
[linux-jdk10] [INFO]     at jdk.internal.reflect.NativeMethodAccessorImpl.invoke0 (Native Method)
[linux-jdk10] [INFO]     at jdk.internal.reflect.NativeMethodAccessorImpl.invoke (NativeMethodAccessorImpl.java:62)
[linux-jdk10] [INFO]     at jdk.internal.reflect.DelegatingMethodAccessorImpl.invoke (DelegatingMethodAccessorImpl.java:43)
[linux-jdk10] [INFO]     at java.lang.reflect.Method.invoke (Method.java:564)
[linux-jdk10] [INFO]     at org.codehaus.plexus.classworlds.launcher.Launcher.launchEnhanced (Launcher.java:289)
[linux-jdk10] [INFO]     at org.codehaus.plexus.classworlds.launcher.Launcher.launch (Launcher.java:229)
[linux-jdk10] [INFO]     at org.codehaus.plexus.classworlds.launcher.Launcher.mainWithExitCode (Launcher.java:415)
[linux-jdk10] [INFO]     at org.codehaus.plexus.classworlds.launcher.Launcher.main (Launcher.java:356)
[linux-jdk10] [INFO] Caused by: java.lang.ExceptionInInitializerError
[linux-jdk10] [INFO]     at org.apache.maven.doxia.siterenderer.DefaultSiteRenderer.generateDocument (DefaultSiteRenderer.java:708)
[linux-jdk10] [INFO]     at org.apache.maven.plugins.site.render.ReportDocumentRenderer.renderDocument (ReportDocumentRenderer.java:266)
[linux-jdk10] [INFO]     at org.apache.maven.doxia.siterenderer.DefaultSiteRenderer.render (DefaultSiteRenderer.java:329)
[linux-jdk10] [INFO]     at org.apache.maven.plugins.site.render.SiteMojo.renderLocale (SiteMojo.java:181)
[linux-jdk10] [INFO]     at org.apache.maven.plugins.site.render.SiteMojo.execute (SiteMojo.java:135)
[linux-jdk10] [INFO]     at org.apache.maven.plugin.DefaultBuildPluginManager.executeMojo (DefaultBuildPluginManager.java:134)
[linux-jdk10] [INFO]     at org.apache.maven.lifecycle.internal.MojoExecutor.execute (MojoExecutor.java:208)
[linux-jdk10] [INFO]     at org.apache.maven.lifecycle.internal.MojoExecutor.execute (MojoExecutor.java:154)
[linux-jdk10] [INFO]     at org.apache.maven.lifecycle.internal.MojoExecutor.execute (MojoExecutor.java:146)
[linux-jdk10] [INFO]     at org.apache.maven.lifecycle.internal.LifecycleModuleBuilder.buildProject (LifecycleModuleBuilder.java:117)
[linux-jdk10] [INFO]     at org.apache.maven.lifecycle.internal.LifecycleModuleBuilder.buildProject (LifecycleModuleBuilder.java:81)
[linux-jdk10] [INFO]     at org.apache.maven.lifecycle.internal.builder.singlethreaded.SingleThreadedBuilder.build (SingleThreadedBuilder.java:51)
[linux-jdk10] [INFO]     at org.apache.maven.lifecycle.internal.LifecycleStarter.execute (LifecycleStarter.java:128)
[linux-jdk10] [INFO]     at org.apache.maven.DefaultMaven.doExecute (DefaultMaven.java:309)
[linux-jdk10] [INFO]     at org.apache.maven.DefaultMaven.doExecute (DefaultMaven.java:194)
[linux-jdk10] [INFO]     at org.apache.maven.DefaultMaven.execute (DefaultMaven.java:107)
[linux-jdk10] [INFO]     at org.apache.maven.cli.MavenCli.execute (MavenCli.java:955)
[linux-jdk10] [INFO]     at org.apache.maven.cli.MavenCli.doMain (MavenCli.java:290)
[linux-jdk10] [INFO]     at org.apache.maven.cli.MavenCli.main (MavenCli.java:194)
[linux-jdk10] [INFO]     at jdk.internal.reflect.NativeMethodAccessorImpl.invoke0 (Native Method)
[linux-jdk10] [INFO]     at jdk.internal.reflect.NativeMethodAccessorImpl.invoke (NativeMethodAccessorImpl.java:62)
[linux-jdk10] [INFO]     at jdk.internal.reflect.DelegatingMethodAccessorImpl.invoke (DelegatingMethodAccessorImpl.java:43)
[linux-jdk10] [INFO]     at java.lang.reflect.Method.invoke (Method.java:564)
[linux-jdk10] [INFO]     at org.codehaus.plexus.classworlds.launcher.Launcher.launchEnhanced (Launcher.java:289)
[linux-jdk10] [INFO]     at org.codehaus.plexus.classworlds.launcher.Launcher.launch (Launcher.java:229)
[linux-jdk10] [INFO]     at org.codehaus.plexus.classworlds.launcher.Launcher.mainWithExitCode (Launcher.java:415)
[linux-jdk10] [INFO]     at org.codehaus.plexus.classworlds.launcher.Launcher.main (Launcher.java:356)
[linux-jdk10] [INFO] Caused by: java.lang.StringIndexOutOfBoundsException: begin 0, end 3, length 2
[linux-jdk10] [INFO]     at java.lang.String.checkBoundsBeginEnd (String.java:3107)
[linux-jdk10] [INFO]     at java.lang.String.substring (String.java:1873)
[linux-jdk10] [INFO]     at org.apache.commons.lang.SystemUtils.getJavaVersionAsFloat (SystemUtils.java:1133)
[linux-jdk10] [INFO]     at org.apache.commons.lang.SystemUtils.<clinit> (SystemUtils.java:818)
[linux-jdk10] [INFO]     at org.apache.maven.doxia.siterenderer.DefaultSiteRenderer.generateDocument (DefaultSiteRenderer.java:708)
[linux-jdk10] [INFO]     at org.apache.maven.plugins.site.render.ReportDocumentRenderer.renderDocument (ReportDocumentRenderer.java:266)
[linux-jdk10] [INFO]     at org.apache.maven.doxia.siterenderer.DefaultSiteRenderer.render (DefaultSiteRenderer.java:329)
[linux-jdk10] [INFO]     at org.apache.maven.plugins.site.render.SiteMojo.renderLocale (SiteMojo.java:181)
[linux-jdk10] [INFO]     at org.apache.maven.plugins.site.render.SiteMojo.execute (SiteMojo.java:135)
[linux-jdk10] [INFO]     at org.apache.maven.plugin.DefaultBuildPluginManager.executeMojo (DefaultBuildPluginManager.java:134)
[linux-jdk10] [INFO]     at org.apache.maven.lifecycle.internal.MojoExecutor.execute (MojoExecutor.java:208)
[linux-jdk10] [INFO]     at org.apache.maven.lifecycle.internal.MojoExecutor.execute (MojoExecutor.java:154)
[linux-jdk10] [INFO]     at org.apache.maven.lifecycle.internal.MojoExecutor.execute (MojoExecutor.java:146)
[linux-jdk10] [INFO]     at org.apache.maven.lifecycle.internal.LifecycleModuleBuilder.buildProject (LifecycleModuleBuilder.java:117)
[linux-jdk10] [INFO]     at org.apache.maven.lifecycle.internal.LifecycleModuleBuilder.buildProject (LifecycleModuleBuilder.java:81)
[linux-jdk10] [INFO]     at org.apache.maven.lifecycle.internal.builder.singlethreaded.SingleThreadedBuilder.build (SingleThreadedBuilder.java:51)
[linux-jdk10] [INFO]     at org.apache.maven.lifecycle.internal.LifecycleStarter.execute (LifecycleStarter.java:128)
[linux-jdk10] [INFO]     at org.apache.maven.DefaultMaven.doExecute (DefaultMaven.java:309)
[linux-jdk10] [INFO]     at org.apache.maven.DefaultMaven.doExecute (DefaultMaven.java:194)
[linux-jdk10] [INFO]     at org.apache.maven.DefaultMaven.execute (DefaultMaven.java:107)
[linux-jdk10] [INFO]     at org.apache.maven.cli.MavenCli.execute (MavenCli.java:955)
[linux-jdk10] [INFO]     at org.apache.maven.cli.MavenCli.doMain (MavenCli.java:290)
[linux-jdk10] [INFO]     at org.apache.maven.cli.MavenCli.main (MavenCli.java:194)
[linux-jdk10] [INFO]     at jdk.internal.reflect.NativeMethodAccessorImpl.invoke0 (Native Method)
[linux-jdk10] [INFO]     at jdk.internal.reflect.NativeMethodAccessorImpl.invoke (NativeMethodAccessorImpl.java:62)
[linux-jdk10] [INFO]     at jdk.internal.reflect.DelegatingMethodAccessorImpl.invoke (DelegatingMethodAccessorImpl.java:43)
[linux-jdk10] [INFO]     at java.lang.reflect.Method.invoke (Method.java:564)
[linux-jdk10] [INFO]     at org.codehaus.plexus.classworlds.launcher.Launcher.launchEnhanced (Launcher.java:289)
[linux-jdk10] [INFO]     at org.codehaus.plexus.classworlds.launcher.Launcher.launch (Launcher.java:229)
[linux-jdk10] [INFO]     at org.codehaus.plexus.classworlds.launcher.Launcher.mainWithExitCode (Launcher.java:415)
[linux-jdk10] [INFO]     at org.codehaus.plexus.classworlds.launcher.Launcher.main (Launcher.java:356)
[linux-jdk10] [INFO] [ERROR]
[linux-jdk10] [INFO] [ERROR]
[linux-jdk10] [INFO] [ERROR] For more information about the errors and possible solutions, please read the following articles:
[linux-jdk10] [INFO] [ERROR] [Help 1] http://cwiki.apache.org/confluence/display/MAVEN/PluginContainerException
[linux-jdk10] [INFO] ..FAILED (4.1 s)
[linux-jdk10] [INFO]   The build exited with code 1. See /home/jenkins/jenkins-slave/workspace/nfo-reports-plugin_MPIR-366-S464FI4ATSVOULE3N7MCKV5FYYG6GVHDD7OLISMYBGUEPLQM2UNA/m/target/it/minimal-pom/build.log for details.
[linux-jdk10] [INFO]
[linux-jdk10] [INFO] --- maven-checkstyle-plugin:2.15:check (checkstyle-check) @ maven-project-info-reports-plugin ---
[linux-jdk10] [INFO] Downloading from central: https://repo.maven.apache.org/maven2/org/apache/maven/shared/maven-shared-resources/2/maven-shared-resources-2.pom
[linux-jdk10] [INFO] Downloaded from central: https://repo.maven.apache.org/maven2/org/apache/maven/shared/maven-shared-resources/2/maven-shared-resources-2.pom (3.0 kB at 211 kB/s)
[linux-jdk10] [INFO] Downloading from central: https://repo.maven.apache.org/maven2/org/codehaus/plexus/plexus-utils/3.0.10/plexus-utils-3.0.10.pom
[linux-jdk10] [INFO] Downloaded from central: https://repo.maven.apache.org/maven2/org/codehaus/plexus/plexus-utils/3.0.10/plexus-utils-3.0.10.pom (3.1 kB at 286 kB/s)
[linux-jdk10] [INFO] Downloading from central: https://repo.maven.apache.org/maven2/org/codehaus/plexus/plexus-resources/1.0.1/plexus-resources-1.0.1.pom
[linux-jdk10] [INFO] Downloaded from central: https://repo.maven.apache.org/maven2/org/codehaus/plexus/plexus-resources/1.0.1/plexus-resources-1.0.1.pom (1.3 kB at 120 kB/s)
[linux-jdk10] [INFO] Downloading from central: https://repo.maven.apache.org/maven2/com/puppycrawl/tools/checkstyle/6.1.1/checkstyle-6.1.1.pom
[linux-jdk10] [INFO] Downloaded from central: https://repo.maven.apache.org/maven2/com/puppycrawl/tools/checkstyle/6.1.1/checkstyle-6.1.1.pom (30 kB at 2.8 MB/s)
[linux-jdk10] [INFO] Downloading from central: https://repo.maven.apache.org/maven2/org/sonatype/oss/oss-parent/7/oss-parent-7.pom
[linux-jdk10] [INFO] Downloaded from central: https://repo.maven.apache.org/maven2/org/sonatype/oss/oss-parent/7/oss-parent-7.pom (4.8 kB at 482 kB/s)
[linux-jdk10] [INFO] Downloading from central: https://repo.maven.apache.org/maven2/org/antlr/antlr4-runtime/4.3/antlr4-runtime-4.3.pom
[linux-jdk10] [INFO] Downloaded from central: https://repo.maven.apache.org/maven2/org/antlr/antlr4-runtime/4.3/antlr4-runtime-4.3.pom (4.8 kB at 479 kB/s)
[linux-jdk10] [INFO] Downloading from central: https://repo.maven.apache.org/maven2/org/antlr/antlr4-master/4.3/antlr4-master-4.3.pom
[linux-jdk10] [INFO] Downloaded from central: https://repo.maven.apache.org/maven2/org/antlr/antlr4-master/4.3/antlr4-master-4.3.pom (7.9 kB at 793 kB/s)
[linux-jdk10] [INFO] Downloading from central: https://repo.maven.apache.org/maven2/org/abego/treelayout/org.abego.treelayout.core/1.0.1/org.abego.treelayout.core-1.0.1.pom
[linux-jdk10] [INFO] Downloaded from central: https://repo.maven.apache.org/maven2/org/abego/treelayout/org.abego.treelayout.core/1.0.1/org.abego.treelayout.core-1.0.1.pom (3.1 kB at 310 kB/s)
[linux-jdk10] [INFO] Downloading from central: https://repo.maven.apache.org/maven2/org/antlr/antlr4-annotations/4.3/antlr4-annotations-4.3.pom
[linux-jdk10] [INFO] Downloaded from central: https://repo.maven.apache.org/maven2/org/antlr/antlr4-annotations/4.3/antlr4-annotations-4.3.pom (1.3 kB at 116 kB/s)
[linux-jdk10] [INFO] Downloading from central: https://repo.maven.apache.org/maven2/commons-beanutils/commons-beanutils-core/1.8.3/commons-beanutils-core-1.8.3.pom
[linux-jdk10] [INFO] Downloaded from central: https://repo.maven.apache.org/maven2/commons-beanutils/commons-beanutils-core/1.8.3/commons-beanutils-core-1.8.3.pom (1.6 kB at 149 kB/s)
[linux-jdk10] [INFO] Downloading from central: https://repo.maven.apache.org/maven2/com/google/guava/guava/18.0/guava-18.0.pom
[linux-jdk10] [INFO] Downloaded from central: https://repo.maven.apache.org/maven2/com/google/guava/guava/18.0/guava-18.0.pom (5.7 kB at 515 kB/s)
[linux-jdk10] [INFO] Downloading from central: https://repo.maven.apache.org/maven2/com/google/guava/guava-parent/18.0/guava-parent-18.0.pom
[linux-jdk10] [INFO] Downloaded from central: https://repo.maven.apache.org/maven2/com/google/guava/guava-parent/18.0/guava-parent-18.0.pom (7.7 kB at 699 kB/s)
[linux-jdk10] [INFO] Downloading from central: https://repo.maven.apache.org/maven2/org/apache/maven/shared/maven-shared-resources/2/maven-shared-resources-2.jar
[linux-jdk10] [INFO] Downloading from central: https://repo.maven.apache.org/maven2/org/codehaus/plexus/plexus-resources/1.0.1/plexus-resources-1.0.1.jar
[linux-jdk10] [INFO] Downloading from central: https://repo.maven.apache.org/maven2/com/puppycrawl/tools/checkstyle/6.1.1/checkstyle-6.1.1.jar
[linux-jdk10] [INFO] Downloading from central: https://repo.maven.apache.org/maven2/org/antlr/antlr4-runtime/4.3/antlr4-runtime-4.3.jar
[linux-jdk10] [INFO] Downloading from central: https://repo.maven.apache.org/maven2/org/abego/treelayout/org.abego.treelayout.core/1.0.1/org.abego.treelayout.core-1.0.1.jar
[linux-jdk10] [INFO] Downloaded from central: https://repo.maven.apache.org/maven2/org/codehaus/plexus/plexus-resources/1.0.1/plexus-resources-1.0.1.jar (22 kB at 1.7 MB/s)
[linux-jdk10] [INFO] Downloading from central: https://repo.maven.apache.org/maven2/org/antlr/antlr4-annotations/4.3/antlr4-annotations-4.3.jar
[linux-jdk10] [INFO] Downloaded from central: https://repo.maven.apache.org/maven2/org/apache/maven/shared/maven-shared-resources/2/maven-shared-resources-2.jar (13 kB at 768 kB/s)
[linux-jdk10] [INFO] Downloading from central: https://repo.maven.apache.org/maven2/commons-beanutils/commons-beanutils-core/1.8.3/commons-beanutils-core-1.8.3.jar
[linux-jdk10] [INFO] Downloaded from central: https://repo.maven.apache.org/maven2/org/abego/treelayout/org.abego.treelayout.core/1.0.1/org.abego.treelayout.core-1.0.1.jar (26 kB at 1.3 MB/s)
[linux-jdk10] [INFO] Downloading from central: https://repo.maven.apache.org/maven2/com/google/guava/guava/18.0/guava-18.0.jar
[linux-jdk10] [INFO] Downloaded from central: https://repo.maven.apache.org/maven2/org/antlr/antlr4-annotations/4.3/antlr4-annotations-4.3.jar (10 kB at 421 kB/s)
[linux-jdk10] [INFO] Downloaded from central: https://repo.maven.apache.org/maven2/org/antlr/antlr4-runtime/4.3/antlr4-runtime-4.3.jar (345 kB at 12 MB/s)
[linux-jdk10] [INFO] Downloaded from central: https://repo.maven.apache.org/maven2/commons-beanutils/commons-beanutils-core/1.8.3/commons-beanutils-core-1.8.3.jar (207 kB at 6.5 MB/s)
[linux-jdk10] [INFO] Downloaded from central: https://repo.maven.apache.org/maven2/com/puppycrawl/tools/checkstyle/6.1.1/checkstyle-6.1.1.jar (1.0 MB at 21 MB/s)
[linux-jdk10] [INFO] Downloaded from central: https://repo.maven.apache.org/maven2/com/google/guava/guava/18.0/guava-18.0.jar (2.3 MB at 30 MB/s)
[linux-jdk10] [INFO] There are 10 errors reported by Checkstyle 6.1.1 with config/maven_checks.xml ruleset.
[linux-jdk10] [INFO] Ignored 10 errors, 0 violation remaining.
[linux-jdk10] [INFO]
[linux-jdk10] [INFO] --- maven-jarsigner-plugin:1.3.2:verify (verify) @ maven-project-info-reports-plugin ---
[linux-jdk10] [WARNING] Picked up JAVA_TOOL_OPTIONS: -Dmaven.ext.class.path="/home/jenkins/jenkins-slave/workspace/nfo-reports-plugin_MPIR-366-S464FI4ATSVOULE3N7MCKV5FYYG6GVHDD7OLISMYBGUEPLQM2UNA@tmp/withMaven66c67071/pipeline-maven-spy.jar" -Dorg.jenkinsci.plugins.pipeline.maven.reportsFolder="/home/jenkins/jenkins-slave/workspace/nfo-reports-plugin_MPIR-366-S464FI4ATSVOULE3N7MCKV5FYYG6GVHDD7OLISMYBGUEPLQM2UNA@tmp/withMaven66c67071"
[linux-jdk10] [INFO] 1 archive(s) processed
[linux-jdk10] [INFO]
[linux-jdk10] [INFO] --- maven-invoker-plugin:2.0.0:verify (integration-test) @ maven-project-info-reports-plugin ---
[linux-jdk10] [INFO] -------------------------------------------------
[linux-jdk10] [INFO] Build Summary:
[linux-jdk10] [INFO]   Passed: 4, Failed: 7, Errors: 0, Skipped: 0
[linux-jdk10] [INFO] -------------------------------------------------
[linux-jdk10] [ERROR] The following builds failed:
[linux-jdk10] [ERROR] *  multi-module/pom.xml
[linux-jdk10] [ERROR] *  full-pom/pom.xml
[linux-jdk10] [ERROR] *  dependencies-java-1.7-and-1.8/pom.xml
[linux-jdk10] [ERROR] *  git/pom.xml
[linux-jdk10] [ERROR] *  MPIR-242/pom.xml
[linux-jdk10] [ERROR] *  minimal-pom/pom.xml
[linux-jdk10] [ERROR] *  mpir-229/pom.xml
[linux-jdk10] [INFO] -------------------------------------------------
[linux-jdk10] [INFO] ------------------------------------------------------------------------
[linux-jdk10] [INFO] BUILD FAILURE
[linux-jdk10] [INFO] ------------------------------------------------------------------------
[linux-jdk10] [INFO] Total time: 01:59 min
[linux-jdk10] [INFO] Finished at: 2018-04-13T15:38:04Z
[linux-jdk10] [INFO] Final Memory: 47M/240M
[linux-jdk10] [INFO] ------------------------------------------------------------------------
[linux-jdk10] [INFO] [jenkins-event-spy] Generated /home/jenkins/jenkins-slave/workspace/nfo-reports-plugin_MPIR-366-S464FI4ATSVOULE3N7MCKV5FYYG6GVHDD7OLISMYBGUEPLQM2UNA@tmp/withMaven66c67071/maven-spy-20180413-153605-16518320992190430602764.log
[linux-jdk10] [ERROR] Failed to execute goal org.apache.maven.plugins:maven-invoker-plugin:2.0.0:verify (integration-test) on project maven-project-info-reports-plugin: 7 builds failed. See console output above for details. -> [Help 1]
[linux-jdk10] [ERROR]
[linux-jdk10] [ERROR] To see the full stack trace of the errors, re-run Maven with the -e switch.
[linux-jdk10] [ERROR] Re-run Maven using the -X switch to enable full debug logging.
[linux-jdk10] [ERROR]
[linux-jdk10] [ERROR] For more information about the errors and possible solutions, please read the following articles:
[linux-jdk10] [ERROR] [Help 1] http://cwiki.apache.org/confluence/display/MAVEN/MojoFailureException
[Pipeline] [linux-jdk10] }
[Pipeline] [linux-jdk10] // dir
[Pipeline] [linux-jdk10] }
[linux-jdk10] [withMaven] junitPublisher - Archive test results for Maven artifact org.apache.maven.plugins:maven-project-info-reports-plugin:2.10-SNAPSHOT generated by maven-surefire-plugin:test (default-test): m/target/surefire-reports/*.xml
[linux-jdk10] [withMaven] junitPublisher - Jenkins JUnit Attachments Plugin not found, can't publish test attachments.Recording test results
[linux-jdk10] [withMaven] junitPublisher - Archive test results for Maven artifact org.apache.maven.plugins.project-info-reports.its:dep:1.0-SNAPSHOT generated by maven-surefire-plugin:test (default-test): m/target/it/multi-module/dep/target/surefire-reports/*.xml
[linux-jdk10] [withMaven] junitPublisher - Jenkins JUnit Attachments Plugin not found, can't publish test attachments.Recording test results
[linux-jdk10] None of the test reports contained any result
[linux-jdk10] [withMaven] junitPublisher - Archive test results for Maven artifact org.apache.maven.plugins.project-info-reports.its:main:1.0-SNAPSHOT generated by maven-surefire-plugin:test (default-test): m/target/it/multi-module/main/target/surefire-reports/*.xml
[linux-jdk10] [withMaven] junitPublisher - Jenkins JUnit Attachments Plugin not found, can't publish test attachments.Recording test results
[linux-jdk10] None of the test reports contained any result
[Pipeline] [linux-jdk10] // withMaven
[Pipeline] [linux-jdk10] }
[Pipeline] [linux-jdk10] // stage
[Pipeline] [linux-jdk10] }
[Pipeline] [linux-jdk10] // node
[Pipeline] [linux-jdk10] }
[linux-jdk10] Failed in branch linux-jdk10
[Pipeline] // parallel
[Pipeline] stage
[Pipeline] { (Notifications)
[Pipeline] echo
Build result: FAILURE
[Pipeline] jiraIssueSelector
[Pipeline] jiraComment
Reply | Threaded
Open this post in threaded view
|

Build failed in Jenkins: Maven TLP » maven-project-info-reports-plugin » MPIR-366 #19

Apache Jenkins Server-2
See https://builds.apache.org/job/maven-box/job/maven-project-info-reports-plugin/job/MPIR-366/19/

Changes:

* [MPIR-366] Drop Maven2 support Upgrade to maven-site-plugin 3.7, on
* [MPIR-366] Drop Maven2 support Upgrade to maven-site-plugin 3.7, on
* [MPIR-366] Drop Maven2 support Upgrade to maven-site-plugin 3.7, on
* [MPIR-366] Drop Maven2 support Upgrade to maven-site-plugin 3.7, on
* [MPIR-366] Drop Maven2 support Upgrade to maven-site-plugin 3.7, on

All tests passed

Build log:
[...truncated 48.62 MB...]
[windows-jdk8] [INFO] [DEBUG] Skin doxia-sitetools prerequisite: 1.7, current: 1.8, matched = true
[windows-jdk8] [INFO] [DEBUG] The file 'F:\jenkins\jenkins-slave\workspace\nfo-reports-plugin_MPIR-366-S464FI4ATSVOULE3N7MCKV5FYYG6GVHDD7OLISMYBGUEPLQM2UNA@2\m\target\it\multi-module\main\target\site\css\site.css' does not exist. Creating an empty file.
[windows-jdk8] [INFO] [DEBUG] Generating F:\jenkins\jenkins-slave\workspace\nfo-reports-plugin_MPIR-366-S464FI4ATSVOULE3N7MCKV5FYYG6GVHDD7OLISMYBGUEPLQM2UNA@2\m\target\it\multi-module\main\target\site\index.html
[windows-jdk8] [INFO] [INFO] Generating "About" report                --- maven-project-info-reports-plugin:2.10-SNAPSHOT:index
[windows-jdk8] [INFO] [DEBUG] Processing Velocity for template org/apache/maven/doxia/siterenderer/resources/default-site.vm on index.html
[windows-jdk8] [INFO] [DEBUG] Velocimacro : added VM link: source=org/apache/maven/doxia/siterenderer/resources/default-site-macros.vm
[windows-jdk8] [INFO] [DEBUG] Velocimacro : added VM image: source=org/apache/maven/doxia/siterenderer/resources/default-site-macros.vm
[windows-jdk8] [INFO] [DEBUG] Velocimacro : added VM banner: source=org/apache/maven/doxia/siterenderer/resources/default-site-macros.vm
[windows-jdk8] [INFO] [DEBUG] Velocimacro : added VM links: source=org/apache/maven/doxia/siterenderer/resources/default-site-macros.vm
[windows-jdk8] [INFO] [DEBUG] Velocimacro : added VM breadcrumbs: source=org/apache/maven/doxia/siterenderer/resources/default-site-macros.vm
[windows-jdk8] [INFO] [DEBUG] Velocimacro : added VM displayTree: source=org/apache/maven/doxia/siterenderer/resources/default-site-macros.vm
[windows-jdk8] [INFO] [DEBUG] Velocimacro : added VM menuItem: source=org/apache/maven/doxia/siterenderer/resources/default-site-macros.vm
[windows-jdk8] [INFO] [DEBUG] Velocimacro : added VM mainMenu: source=org/apache/maven/doxia/siterenderer/resources/default-site-macros.vm
[windows-jdk8] [INFO] [DEBUG] Velocimacro : added VM copyright: source=org/apache/maven/doxia/siterenderer/resources/default-site-macros.vm
[windows-jdk8] [INFO] [DEBUG] Velocimacro : added VM publishDate: source=org/apache/maven/doxia/siterenderer/resources/default-site-macros.vm
[windows-jdk8] [INFO] [DEBUG] Velocimacro : added VM poweredByLogo: source=org/apache/maven/doxia/siterenderer/resources/default-site-macros.vm
[windows-jdk8] [INFO] [DEBUG] Velocimacro : added VM googleAnalytics: source=org/apache/maven/doxia/siterenderer/resources/default-site-macros.vm
[windows-jdk8] [INFO] [DEBUG] Multipage report: 0 subreports
[windows-jdk8] [INFO] [DEBUG] Generating F:\jenkins\jenkins-slave\workspace\nfo-reports-plugin_MPIR-366-S464FI4ATSVOULE3N7MCKV5FYYG6GVHDD7OLISMYBGUEPLQM2UNA@2\m\target\it\multi-module\main\target\site\project-summary.html
[windows-jdk8] [INFO] [INFO] Generating "Summary" report              --- maven-project-info-reports-plugin:2.10-SNAPSHOT:summary
[windows-jdk8] [INFO] [DEBUG] Processing Velocity for template org/apache/maven/doxia/siterenderer/resources/default-site.vm on project-summary.html
[windows-jdk8] [INFO] [DEBUG] Velocimacro : added VM link: source=org/apache/maven/doxia/siterenderer/resources/default-site-macros.vm
[windows-jdk8] [INFO] [DEBUG] Velocimacro : added VM image: source=org/apache/maven/doxia/siterenderer/resources/default-site-macros.vm
[windows-jdk8] [INFO] [DEBUG] Velocimacro : added VM banner: source=org/apache/maven/doxia/siterenderer/resources/default-site-macros.vm
[windows-jdk8] [INFO] [DEBUG] Velocimacro : added VM links: source=org/apache/maven/doxia/siterenderer/resources/default-site-macros.vm
[windows-jdk8] [INFO] [DEBUG] Velocimacro : added VM breadcrumbs: source=org/apache/maven/doxia/siterenderer/resources/default-site-macros.vm
[windows-jdk8] [INFO] [DEBUG] Velocimacro : added VM displayTree: source=org/apache/maven/doxia/siterenderer/resources/default-site-macros.vm
[windows-jdk8] [INFO] [DEBUG] Velocimacro : added VM menuItem: source=org/apache/maven/doxia/siterenderer/resources/default-site-macros.vm
[windows-jdk8] [INFO] [DEBUG] Velocimacro : added VM mainMenu: source=org/apache/maven/doxia/siterenderer/resources/default-site-macros.vm
[windows-jdk8] [INFO] [DEBUG] Velocimacro : added VM copyright: source=org/apache/maven/doxia/siterenderer/resources/default-site-macros.vm
[windows-jdk8] [INFO] [DEBUG] Velocimacro : added VM publishDate: source=org/apache/maven/doxia/siterenderer/resources/default-site-macros.vm
[windows-jdk8] [INFO] [DEBUG] Velocimacro : added VM poweredByLogo: source=org/apache/maven/doxia/siterenderer/resources/default-site-macros.vm
[windows-jdk8] [INFO] [DEBUG] Velocimacro : added VM googleAnalytics: source=org/apache/maven/doxia/siterenderer/resources/default-site-macros.vm
[windows-jdk8] [INFO] [DEBUG] Multipage report: 0 subreports
[windows-jdk8] [INFO] [DEBUG] Generating F:\jenkins\jenkins-slave\workspace\nfo-reports-plugin_MPIR-366-S464FI4ATSVOULE3N7MCKV5FYYG6GVHDD7OLISMYBGUEPLQM2UNA@2\m\target\it\multi-module\main\target\site\dependencies.html
[windows-jdk8] [INFO] [INFO] Generating "Dependencies" report         --- maven-project-info-reports-plugin:2.10-SNAPSHOT:dependencies
[windows-jdk8] [INFO] [DEBUG] building maven31 dependency graph for org.apache.maven.plugins.project-info-reports.its:main:jar:1.0-SNAPSHOT with Maven31DependencyGraphBuilder
[windows-jdk8] [INFO] [DEBUG] Dependency collection stats: {ConflictMarker.analyzeTime=0, ConflictMarker.markTime=0, ConflictMarker.nodeCount=2, ConflictIdSorter.graphTime=0, ConflictIdSorter.topsortTime=1, ConflictIdSorter.conflictIdCount=1, ConflictIdSorter.conflictIdCycleCount=0, ConflictResolver.totalTime=0, ConflictResolver.conflictItemCount=1, DefaultDependencyCollector.collectTime=0, DefaultDependencyCollector.transformTime=1}
[windows-jdk8] [INFO] [DEBUG] org.apache.maven.plugins.project-info-reports.its:main:jar:1.0-SNAPSHOT
[windows-jdk8] [INFO] [DEBUG]    org.apache.maven.plugins.project-info-reports.its:dep:jar:1.0-SNAPSHOT:compile
[windows-jdk8] [INFO] [DEBUG] Skipped remote request for org.apache.maven.plugins.project-info-reports.its:dep:1.0-SNAPSHOT/maven-metadata.xml, locally installed metadata up-to-date.
[windows-jdk8] [INFO] [DEBUG] Skipped remote request for org.apache.maven.plugins.project-info-reports.its:dep:1.0-SNAPSHOT/maven-metadata.xml, locally installed metadata up-to-date.
[windows-jdk8] [INFO] [DEBUG] building maven31 dependency graph for org.apache.maven.plugins.project-info-reports.its:main:jar:1.0-SNAPSHOT with Maven31DependencyGraphBuilder
[windows-jdk8] [INFO] [DEBUG] Dependency collection stats: {ConflictMarker.analyzeTime=0, ConflictMarker.markTime=0, ConflictMarker.nodeCount=2, ConflictIdSorter.graphTime=0, ConflictIdSorter.topsortTime=0, ConflictIdSorter.conflictIdCount=1, ConflictIdSorter.conflictIdCycleCount=0, ConflictResolver.totalTime=0, ConflictResolver.conflictItemCount=1, DefaultDependencyCollector.collectTime=0, DefaultDependencyCollector.transformTime=0}
[windows-jdk8] [INFO] [DEBUG] org.apache.maven.plugins.project-info-reports.its:main:jar:1.0-SNAPSHOT
[windows-jdk8] [INFO] [DEBUG]    org.apache.maven.plugins.project-info-reports.its:dep:jar:1.0-SNAPSHOT:compile
[windows-jdk8] [INFO] [DEBUG] Skipped remote request for org.apache.maven.plugins.project-info-reports.its:dep:1.0-SNAPSHOT/maven-metadata.xml, locally installed metadata up-to-date.
[windows-jdk8] [INFO] [DEBUG] Skipped remote request for org.apache.maven.plugins.project-info-reports.its:dep:1.0-SNAPSHOT/maven-metadata.xml, locally installed metadata up-to-date.
[windows-jdk8] [INFO] [DEBUG] Extension realms for project org.apache.maven.plugins.project-info-reports.its:dep:jar:1.0-SNAPSHOT: (none)
[windows-jdk8] [INFO] [DEBUG] Looking up lifecycle mappings for packaging jar from ClassRealm[maven.ext, parent: ClassRealm[plexus.core, parent: null]]
[windows-jdk8] [INFO] [DEBUG] Extension realms for project org.apache.maven.plugins.project-info-reports.its:multi-module:pom:1.0-SNAPSHOT: (none)
[windows-jdk8] [INFO] [DEBUG] Looking up lifecycle mappings for packaging pom from ClassRealm[maven.ext, parent: ClassRealm[plexus.core, parent: null]]
[windows-jdk8] [INFO] [DEBUG] Extension realms for project org.apache:apache:pom:16: (none)
[windows-jdk8] [INFO] [DEBUG] Looking up lifecycle mappings for packaging pom from ClassRealm[maven.ext, parent: ClassRealm[plexus.core, parent: null]]
[windows-jdk8] [INFO] [DEBUG] Extension realms for project org.apache.maven.plugins.project-info-reports.its:dep:jar:1.0-SNAPSHOT: (none)
[windows-jdk8] [INFO] [DEBUG] Looking up lifecycle mappings for packaging jar from ClassRealm[maven.ext, parent: ClassRealm[plexus.core, parent: null]]
[windows-jdk8] [INFO] [DEBUG] Extension realms for project org.apache.maven.plugins.project-info-reports.its:multi-module:pom:1.0-SNAPSHOT: (none)
[windows-jdk8] [INFO] [DEBUG] Looking up lifecycle mappings for packaging pom from ClassRealm[maven.ext, parent: ClassRealm[plexus.core, parent: null]]
[windows-jdk8] [INFO] [DEBUG] Extension realms for project org.apache:apache:pom:16: (none)
[windows-jdk8] [INFO] [DEBUG] Looking up lifecycle mappings for packaging pom from ClassRealm[maven.ext, parent: ClassRealm[plexus.core, parent: null]]
[windows-jdk8] [INFO] [DEBUG] Extension realms for project org.apache.maven.plugins.project-info-reports.its:main:jar:1.0-SNAPSHOT: (none)
[windows-jdk8] [INFO] [DEBUG] Looking up lifecycle mappings for packaging jar from ClassRealm[maven.ext, parent: ClassRealm[plexus.core, parent: null]]
[windows-jdk8] [INFO] [DEBUG] Extension realms for project org.apache.maven.plugins.project-info-reports.its:multi-module:pom:1.0-SNAPSHOT: (none)
[windows-jdk8] [INFO] [DEBUG] Looking up lifecycle mappings for packaging pom from ClassRealm[maven.ext, parent: ClassRealm[plexus.core, parent: null]]
[windows-jdk8] [INFO] [DEBUG] Extension realms for project org.apache:apache:pom:16: (none)
[windows-jdk8] [INFO] [DEBUG] Looking up lifecycle mappings for packaging pom from ClassRealm[maven.ext, parent: ClassRealm[plexus.core, parent: null]]
[windows-jdk8] [INFO] [DEBUG] Extension realms for project org.apache.maven.plugins.project-info-reports.its:dep:jar:1.0-SNAPSHOT: (none)
[windows-jdk8] [INFO] [DEBUG] Looking up lifecycle mappings for packaging jar from ClassRealm[maven.ext, parent: ClassRealm[plexus.core, parent: null]]
[windows-jdk8] [INFO] [DEBUG] Extension realms for project org.apache.maven.plugins.project-info-reports.its:multi-module:pom:1.0-SNAPSHOT: (none)
[windows-jdk8] [INFO] [DEBUG] Looking up lifecycle mappings for packaging pom from ClassRealm[maven.ext, parent: ClassRealm[plexus.core, parent: null]]
[windows-jdk8] [INFO] [DEBUG] Extension realms for project org.apache:apache:pom:16: (none)
[windows-jdk8] [INFO] [DEBUG] Looking up lifecycle mappings for packaging pom from ClassRealm[maven.ext, parent: ClassRealm[plexus.core, parent: null]]
[windows-jdk8] [INFO] [DEBUG] Skipped remote request for org.apache.maven.plugins.project-info-reports.its:dep:1.0-SNAPSHOT/maven-metadata.xml, locally installed metadata up-to-date.
[windows-jdk8] [INFO] [DEBUG] Skipped remote request for org.apache.maven.plugins.project-info-reports.its:dep:1.0-SNAPSHOT/maven-metadata.xml, locally installed metadata up-to-date.
[windows-jdk8] [INFO] [DEBUG] Skipped remote request for org.apache.maven.plugins.project-info-reports.its:dep:1.0-SNAPSHOT/maven-metadata.xml, locally installed metadata up-to-date.
[windows-jdk8] [INFO] [DEBUG] Skipped remote request for org.apache.maven.plugins.project-info-reports.its:dep:1.0-SNAPSHOT/maven-metadata.xml, locally installed metadata up-to-date.
[windows-jdk8] [INFO] [DEBUG] Skipped remote request for org.apache.maven.plugins.project-info-reports.its:dep:1.0-SNAPSHOT/maven-metadata.xml, locally installed metadata up-to-date.
[windows-jdk8] [INFO] [DEBUG] Skipped remote request for org.apache.maven.plugins.project-info-reports.its:dep:1.0-SNAPSHOT/maven-metadata.xml, locally installed metadata up-to-date.
[windows-jdk8] [INFO] [DEBUG] Processing Velocity for template org/apache/maven/doxia/siterenderer/resources/default-site.vm on dependencies.html
[windows-jdk8] [INFO] [DEBUG] Velocimacro : added VM link: source=org/apache/maven/doxia/siterenderer/resources/default-site-macros.vm
[windows-jdk8] [INFO] [DEBUG] Velocimacro : added VM image: source=org/apache/maven/doxia/siterenderer/resources/default-site-macros.vm
[windows-jdk8] [INFO] [DEBUG] Velocimacro : added VM banner: source=org/apache/maven/doxia/siterenderer/resources/default-site-macros.vm
[windows-jdk8] [INFO] [DEBUG] Velocimacro : added VM links: source=org/apache/maven/doxia/siterenderer/resources/default-site-macros.vm
[windows-jdk8] [INFO] [DEBUG] Velocimacro : added VM breadcrumbs: source=org/apache/maven/doxia/siterenderer/resources/default-site-macros.vm
[windows-jdk8] [INFO] [DEBUG] Velocimacro : added VM displayTree: source=org/apache/maven/doxia/siterenderer/resources/default-site-macros.vm
[windows-jdk8] [INFO] [DEBUG] Velocimacro : added VM menuItem: source=org/apache/maven/doxia/siterenderer/resources/default-site-macros.vm
[windows-jdk8] [INFO] [DEBUG] Velocimacro : added VM mainMenu: source=org/apache/maven/doxia/siterenderer/resources/default-site-macros.vm
[windows-jdk8] [INFO] [DEBUG] Velocimacro : added VM copyright: source=org/apache/maven/doxia/siterenderer/resources/default-site-macros.vm
[windows-jdk8] [INFO] [DEBUG] Velocimacro : added VM publishDate: source=org/apache/maven/doxia/siterenderer/resources/default-site-macros.vm
[windows-jdk8] [INFO] [DEBUG] Velocimacro : added VM poweredByLogo: source=org/apache/maven/doxia/siterenderer/resources/default-site-macros.vm
[windows-jdk8] [INFO] [DEBUG] Velocimacro : added VM googleAnalytics: source=org/apache/maven/doxia/siterenderer/resources/default-site-macros.vm
[windows-jdk8] [INFO] [DEBUG] Multipage report: 0 subreports
[windows-jdk8] [INFO] [DEBUG] Generating F:\jenkins\jenkins-slave\workspace\nfo-reports-plugin_MPIR-366-S464FI4ATSVOULE3N7MCKV5FYYG6GVHDD7OLISMYBGUEPLQM2UNA@2\m\target\it\multi-module\main\target\site\dependency-convergence.html
[windows-jdk8] [INFO] [INFO] Generating "Dependency Convergence" report --- maven-project-info-reports-plugin:2.10-SNAPSHOT:dependency-convergence
[windows-jdk8] [INFO] [DEBUG] Dependency tree resolution listener events:
[windows-jdk8] [INFO] [DEBUG] testArtifact: artifact=org.apache.maven.plugins.project-info-reports.its:multi-module:pom:1.0-SNAPSHOT
[windows-jdk8] [INFO] [DEBUG] includeArtifact: artifact=org.apache.maven.plugins.project-info-reports.its:multi-module:pom:1.0-SNAPSHOT
[windows-jdk8] [INFO] [DEBUG] startProcessChildren: artifact=org.apache.maven.plugins.project-info-reports.its:multi-module:pom:1.0-SNAPSHOT
[windows-jdk8] [INFO] [DEBUG] endProcessChildren: artifact=org.apache.maven.plugins.project-info-reports.its:multi-module:pom:1.0-SNAPSHOT
[windows-jdk8] [INFO] [DEBUG] Dependency tree resolution listener events:
[windows-jdk8] [INFO] [DEBUG] testArtifact: artifact=org.apache.maven.plugins.project-info-reports.its:dep:jar:1.0-SNAPSHOT
[windows-jdk8] [INFO] [DEBUG] includeArtifact: artifact=org.apache.maven.plugins.project-info-reports.its:dep:jar:1.0-SNAPSHOT
[windows-jdk8] [INFO] [DEBUG] startProcessChildren: artifact=org.apache.maven.plugins.project-info-reports.its:dep:jar:1.0-SNAPSHOT
[windows-jdk8] [INFO] [DEBUG] endProcessChildren: artifact=org.apache.maven.plugins.project-info-reports.its:dep:jar:1.0-SNAPSHOT
[windows-jdk8] [INFO] [DEBUG] Dependency tree resolution listener events:
[windows-jdk8] [INFO] [DEBUG] testArtifact: artifact=org.apache.maven.plugins.project-info-reports.its:main:jar:1.0-SNAPSHOT
[windows-jdk8] [INFO] [DEBUG] includeArtifact: artifact=org.apache.maven.plugins.project-info-reports.its:main:jar:1.0-SNAPSHOT
[windows-jdk8] [INFO] [DEBUG] startProcessChildren: artifact=org.apache.maven.plugins.project-info-reports.its:main:jar:1.0-SNAPSHOT
[windows-jdk8] [INFO] [DEBUG]   testArtifact: artifact=org.apache.maven.plugins.project-info-reports.its:dep:jar:1.0-SNAPSHOT:compile
[windows-jdk8] [INFO] [DEBUG]   includeArtifact: artifact=org.apache.maven.plugins.project-info-reports.its:dep:jar:1.0-SNAPSHOT:compile
[windows-jdk8] [INFO] [DEBUG]   startProcessChildren: artifact=org.apache.maven.plugins.project-info-reports.its:dep:jar:1.0-SNAPSHOT:compile
[windows-jdk8] [INFO] [DEBUG]   endProcessChildren: artifact=org.apache.maven.plugins.project-info-reports.its:dep:jar:1.0-SNAPSHOT:compile
[windows-jdk8] [INFO] [DEBUG] endProcessChildren: artifact=org.apache.maven.plugins.project-info-reports.its:main:jar:1.0-SNAPSHOT
[windows-jdk8] [INFO] [DEBUG] Dependency {groupId=org.apache.maven.plugins.project-info-reports.its, artifactId=dep, version=1.0-SNAPSHOT, type=jar} is a reactor project
[windows-jdk8] [INFO] [DEBUG] Processing Velocity for template org/apache/maven/doxia/siterenderer/resources/default-site.vm on dependency-convergence.html
[windows-jdk8] [INFO] [DEBUG] Velocimacro : added VM link: source=org/apache/maven/doxia/siterenderer/resources/default-site-macros.vm
[windows-jdk8] [INFO] [DEBUG] Velocimacro : added VM image: source=org/apache/maven/doxia/siterenderer/resources/default-site-macros.vm
[windows-jdk8] [INFO] [DEBUG] Velocimacro : added VM banner: source=org/apache/maven/doxia/siterenderer/resources/default-site-macros.vm
[windows-jdk8] [INFO] [DEBUG] Velocimacro : added VM links: source=org/apache/maven/doxia/siterenderer/resources/default-site-macros.vm
[windows-jdk8] [INFO] [DEBUG] Velocimacro : added VM breadcrumbs: source=org/apache/maven/doxia/siterenderer/resources/default-site-macros.vm
[windows-jdk8] [INFO] [DEBUG] Velocimacro : added VM displayTree: source=org/apache/maven/doxia/siterenderer/resources/default-site-macros.vm
[windows-jdk8] [INFO] [DEBUG] Velocimacro : added VM menuItem: source=org/apache/maven/doxia/siterenderer/resources/default-site-macros.vm
[windows-jdk8] [INFO] [DEBUG] Velocimacro : added VM mainMenu: source=org/apache/maven/doxia/siterenderer/resources/default-site-macros.vm
[windows-jdk8] [INFO] [DEBUG] Velocimacro : added VM copyright: source=org/apache/maven/doxia/siterenderer/resources/default-site-macros.vm
[windows-jdk8] [INFO] [DEBUG] Velocimacro : added VM publishDate: source=org/apache/maven/doxia/siterenderer/resources/default-site-macros.vm
[windows-jdk8] [INFO] [DEBUG] Velocimacro : added VM poweredByLogo: source=org/apache/maven/doxia/siterenderer/resources/default-site-macros.vm
[windows-jdk8] [INFO] [DEBUG] Velocimacro : added VM googleAnalytics: source=org/apache/maven/doxia/siterenderer/resources/default-site-macros.vm
[windows-jdk8] [INFO] [DEBUG] Multipage report: 0 subreports
[windows-jdk8] [INFO] [DEBUG] Generating F:\jenkins\jenkins-slave\workspace\nfo-reports-plugin_MPIR-366-S464FI4ATSVOULE3N7MCKV5FYYG6GVHDD7OLISMYBGUEPLQM2UNA@2\m\target\it\multi-module\main\target\site\project-info.html
[windows-jdk8] [INFO] [DEBUG] Processing Velocity for template org/apache/maven/doxia/siterenderer/resources/default-site.vm on project-info.html
[windows-jdk8] [INFO] [DEBUG] Velocimacro : added VM link: source=org/apache/maven/doxia/siterenderer/resources/default-site-macros.vm
[windows-jdk8] [INFO] [DEBUG] Velocimacro : added VM image: source=org/apache/maven/doxia/siterenderer/resources/default-site-macros.vm
[windows-jdk8] [INFO] [DEBUG] Velocimacro : added VM banner: source=org/apache/maven/doxia/siterenderer/resources/default-site-macros.vm
[windows-jdk8] [INFO] [DEBUG] Velocimacro : added VM links: source=org/apache/maven/doxia/siterenderer/resources/default-site-macros.vm
[windows-jdk8] [INFO] [DEBUG] Velocimacro : added VM breadcrumbs: source=org/apache/maven/doxia/siterenderer/resources/default-site-macros.vm
[windows-jdk8] [INFO] [DEBUG] Velocimacro : added VM displayTree: source=org/apache/maven/doxia/siterenderer/resources/default-site-macros.vm
[windows-jdk8] [INFO] [DEBUG] Velocimacro : added VM menuItem: source=org/apache/maven/doxia/siterenderer/resources/default-site-macros.vm
[windows-jdk8] [INFO] [DEBUG] Velocimacro : added VM mainMenu: source=org/apache/maven/doxia/siterenderer/resources/default-site-macros.vm
[windows-jdk8] [INFO] [DEBUG] Velocimacro : added VM copyright: source=org/apache/maven/doxia/siterenderer/resources/default-site-macros.vm
[windows-jdk8] [INFO] [DEBUG] Velocimacro : added VM publishDate: source=org/apache/maven/doxia/siterenderer/resources/default-site-macros.vm
[windows-jdk8] [INFO] [DEBUG] Velocimacro : added VM poweredByLogo: source=org/apache/maven/doxia/siterenderer/resources/default-site-macros.vm
[windows-jdk8] [INFO] [DEBUG] Velocimacro : added VM googleAnalytics: source=org/apache/maven/doxia/siterenderer/resources/default-site-macros.vm
[windows-jdk8] [INFO] [INFO] ------------------------------------------------------------------------
[windows-jdk8] [INFO] [INFO] Reactor Summary:
[windows-jdk8] [INFO] [INFO]
[windows-jdk8] [INFO] [INFO] MPIR IT test for multi-module reports .............. SUCCESS [  2.293 s]
[windows-jdk8] [INFO] [INFO] dep ................................................ SUCCESS [  0.130 s]
[windows-jdk8] [INFO] [INFO] main ............................................... SUCCESS [  0.255 s]
[windows-jdk8] [INFO] [INFO] ------------------------------------------------------------------------
[windows-jdk8] [INFO] [INFO] BUILD SUCCESS
[windows-jdk8] [INFO] [INFO] ------------------------------------------------------------------------
[windows-jdk8] [INFO] [INFO] Total time: 2.805 s
[windows-jdk8] [INFO] [INFO] Finished at: 2018-04-14T09:50:57Z
[windows-jdk8] [INFO] [INFO] Final Memory: 28M/327M
[windows-jdk8] [INFO] [INFO] ------------------------------------------------------------------------
[windows-jdk8] [INFO] [INFO] [jenkins-event-spy] Generated F:\jenkins\jenkins-slave\workspace\nfo-reports-plugin_MPIR-366-S464FI4ATSVOULE3N7MCKV5FYYG6GVHDD7OLISMYBGUEPLQM2UNA@2@tmp\withMaven7f97a9a5\maven-spy-20180414-095054-4386337623426007431896.log
[windows-jdk8] [INFO] Picked up JAVA_TOOL_OPTIONS: -Dmaven.ext.class.path="f:\jenkins\jenkins-slave\workspace\nfo-reports-plugin_MPIR-366-S464FI4ATSVOULE3N7MCKV5FYYG6GVHDD7OLISMYBGUEPLQM2UNA@2@tmp\withMaven7f97a9a5\pipeline-maven-spy.jar" -Dorg.jenkinsci.plugins.pipeline.maven.reportsFolder="f:\jenkins\jenkins-slave\workspace\nfo-reports-plugin_MPIR-366-S464FI4ATSVOULE3N7MCKV5FYYG6GVHDD7OLISMYBGUEPLQM2UNA@2@tmp\withMaven7f97a9a5"
[windows-jdk8] [INFO] run script verify.groovy
[windows-jdk8] [INFO] Running post-build script: f:\jenkins\jenkins-slave\workspace\nfo-reports-plugin_MPIR-366-S464FI4ATSVOULE3N7MCKV5FYYG6GVHDD7OLISMYBGUEPLQM2UNA@2\m\target\it\multi-module\verify.groovy
[windows-jdk8] [INFO] Finished post-build script: f:\jenkins\jenkins-slave\workspace\nfo-reports-plugin_MPIR-366-S464FI4ATSVOULE3N7MCKV5FYYG6GVHDD7OLISMYBGUEPLQM2UNA@2\m\target\it\multi-module\verify.groovy
[windows-jdk8] [INFO] ..SUCCESS (14.1 s)
[windows-jdk8] [INFO]
[windows-jdk8] [INFO] --- maven-checkstyle-plugin:2.15:check (checkstyle-check) @ maven-project-info-reports-plugin ---
[windows-jdk8] [INFO] Downloading: https://repo.maven.apache.org/maven2/org/apache/maven/shared/maven-shared-resources/2/maven-shared-resources-2.pom
[windows-jdk8] [INFO] Downloaded: https://repo.maven.apache.org/maven2/org/apache/maven/shared/maven-shared-resources/2/maven-shared-resources-2.pom (3.0 kB at 185 kB/s)
[windows-jdk8] [INFO] Downloading: https://repo.maven.apache.org/maven2/org/codehaus/plexus/plexus-utils/3.0.10/plexus-utils-3.0.10.pom
[windows-jdk8] [INFO] Downloaded: https://repo.maven.apache.org/maven2/org/codehaus/plexus/plexus-utils/3.0.10/plexus-utils-3.0.10.pom (3.1 kB at 262 kB/s)
[windows-jdk8] [INFO] Downloading: https://repo.maven.apache.org/maven2/org/codehaus/plexus/plexus-resources/1.0.1/plexus-resources-1.0.1.pom
[windows-jdk8] [INFO] Downloaded: https://repo.maven.apache.org/maven2/org/codehaus/plexus/plexus-resources/1.0.1/plexus-resources-1.0.1.pom (1.3 kB at 88 kB/s)
[windows-jdk8] [INFO] Downloading: https://repo.maven.apache.org/maven2/com/puppycrawl/tools/checkstyle/6.1.1/checkstyle-6.1.1.pom
[windows-jdk8] [INFO] Downloaded: https://repo.maven.apache.org/maven2/com/puppycrawl/tools/checkstyle/6.1.1/checkstyle-6.1.1.pom (30 kB at 2.2 MB/s)
[windows-jdk8] [INFO] Downloading: https://repo.maven.apache.org/maven2/org/sonatype/oss/oss-parent/7/oss-parent-7.pom
[windows-jdk8] [INFO] Downloaded: https://repo.maven.apache.org/maven2/org/sonatype/oss/oss-parent/7/oss-parent-7.pom (4.8 kB at 603 kB/s)
[windows-jdk8] [INFO] Downloading: https://repo.maven.apache.org/maven2/org/antlr/antlr4-runtime/4.3/antlr4-runtime-4.3.pom
[windows-jdk8] [INFO] Downloaded: https://repo.maven.apache.org/maven2/org/antlr/antlr4-runtime/4.3/antlr4-runtime-4.3.pom (4.8 kB at 399 kB/s)
[windows-jdk8] [INFO] Downloading: https://repo.maven.apache.org/maven2/org/antlr/antlr4-master/4.3/antlr4-master-4.3.pom
[windows-jdk8] [INFO] Downloaded: https://repo.maven.apache.org/maven2/org/antlr/antlr4-master/4.3/antlr4-master-4.3.pom (7.9 kB at 610 kB/s)
[windows-jdk8] [INFO] Downloading: https://repo.maven.apache.org/maven2/org/abego/treelayout/org.abego.treelayout.core/1.0.1/org.abego.treelayout.core-1.0.1.pom
[windows-jdk8] [INFO] Downloaded: https://repo.maven.apache.org/maven2/org/abego/treelayout/org.abego.treelayout.core/1.0.1/org.abego.treelayout.core-1.0.1.pom (3.1 kB at 222 kB/s)
[windows-jdk8] [INFO] Downloading: https://repo.maven.apache.org/maven2/org/antlr/antlr4-annotations/4.3/antlr4-annotations-4.3.pom
[windows-jdk8] [INFO] Downloaded: https://repo.maven.apache.org/maven2/org/antlr/antlr4-annotations/4.3/antlr4-annotations-4.3.pom (1.3 kB at 106 kB/s)
[windows-jdk8] [INFO] Downloading: https://repo.maven.apache.org/maven2/commons-beanutils/commons-beanutils-core/1.8.3/commons-beanutils-core-1.8.3.pom
[windows-jdk8] [INFO] Downloaded: https://repo.maven.apache.org/maven2/commons-beanutils/commons-beanutils-core/1.8.3/commons-beanutils-core-1.8.3.pom (1.6 kB at 149 kB/s)
[windows-jdk8] [INFO] Downloading: https://repo.maven.apache.org/maven2/com/google/guava/guava/18.0/guava-18.0.pom
[windows-jdk8] [INFO] Downloaded: https://repo.maven.apache.org/maven2/com/google/guava/guava/18.0/guava-18.0.pom (5.7 kB at 472 kB/s)
[windows-jdk8] [INFO] Downloading: https://repo.maven.apache.org/maven2/com/google/guava/guava-parent/18.0/guava-parent-18.0.pom
[windows-jdk8] [INFO] Downloaded: https://repo.maven.apache.org/maven2/com/google/guava/guava-parent/18.0/guava-parent-18.0.pom (7.7 kB at 640 kB/s)
[windows-jdk8] [INFO] Downloading: https://repo.maven.apache.org/maven2/org/apache/maven/shared/maven-shared-resources/2/maven-shared-resources-2.jar
[windows-jdk8] [INFO] Downloading: https://repo.maven.apache.org/maven2/org/abego/treelayout/org.abego.treelayout.core/1.0.1/org.abego.treelayout.core-1.0.1.jar
[windows-jdk8] [INFO] Downloading: https://repo.maven.apache.org/maven2/org/antlr/antlr4-runtime/4.3/antlr4-runtime-4.3.jar
[windows-jdk8] [INFO] Downloading: https://repo.maven.apache.org/maven2/com/puppycrawl/tools/checkstyle/6.1.1/checkstyle-6.1.1.jar
[windows-jdk8] [INFO] Downloading: https://repo.maven.apache.org/maven2/org/codehaus/plexus/plexus-resources/1.0.1/plexus-resources-1.0.1.jar
[windows-jdk8] [INFO] Downloaded: https://repo.maven.apache.org/maven2/org/apache/maven/shared/maven-shared-resources/2/maven-shared-resources-2.jar (13 kB at 154 kB/s)
[windows-jdk8] [INFO] Downloading: https://repo.maven.apache.org/maven2/org/antlr/antlr4-annotations/4.3/antlr4-annotations-4.3.jar
[windows-jdk8] [INFO] Downloaded: https://repo.maven.apache.org/maven2/com/puppycrawl/tools/checkstyle/6.1.1/checkstyle-6.1.1.jar (1.0 MB at 9.1 MB/s)
[windows-jdk8] [INFO] Downloading: https://repo.maven.apache.org/maven2/commons-beanutils/commons-beanutils-core/1.8.3/commons-beanutils-core-1.8.3.jar
[windows-jdk8] [INFO] Downloaded: https://repo.maven.apache.org/maven2/org/antlr/antlr4-runtime/4.3/antlr4-runtime-4.3.jar (345 kB at 3.0 MB/s)
[windows-jdk8] [INFO] Downloading: https://repo.maven.apache.org/maven2/com/google/guava/guava/18.0/guava-18.0.jar
[windows-jdk8] [INFO] Downloaded: https://repo.maven.apache.org/maven2/org/abego/treelayout/org.abego.treelayout.core/1.0.1/org.abego.treelayout.core-1.0.1.jar (26 kB at 216 kB/s)
[windows-jdk8] [INFO] Downloaded: https://repo.maven.apache.org/maven2/org/codehaus/plexus/plexus-resources/1.0.1/plexus-resources-1.0.1.jar (22 kB at 150 kB/s)
[windows-jdk8] [INFO] Downloaded: https://repo.maven.apache.org/maven2/org/antlr/antlr4-annotations/4.3/antlr4-annotations-4.3.jar (10 kB at 68 kB/s)
[windows-jdk8] [INFO] Downloaded: https://repo.maven.apache.org/maven2/commons-beanutils/commons-beanutils-core/1.8.3/commons-beanutils-core-1.8.3.jar (207 kB at 1.4 MB/s)
[windows-jdk8] [INFO] Downloaded: https://repo.maven.apache.org/maven2/com/google/guava/guava/18.0/guava-18.0.jar (2.3 MB at 11 MB/s)
[windows-jdk8] [INFO] There are 10 errors reported by Checkstyle 6.1.1 with config/maven_checks.xml ruleset.
[windows-jdk8] [INFO] Ignored 10 errors, 0 violation remaining.
[windows-jdk8] [INFO]
[windows-jdk8] [INFO] --- maven-jarsigner-plugin:1.3.2:verify (verify) @ maven-project-info-reports-plugin ---
[windows-jdk8] [WARNING] Picked up JAVA_TOOL_OPTIONS: -Dmaven.ext.class.path="f:\jenkins\jenkins-slave\workspace\nfo-reports-plugin_MPIR-366-S464FI4ATSVOULE3N7MCKV5FYYG6GVHDD7OLISMYBGUEPLQM2UNA@2@tmp\withMaven7f97a9a5\pipeline-maven-spy.jar" -Dorg.jenkinsci.plugins.pipeline.maven.reportsFolder="f:\jenkins\jenkins-slave\workspace\nfo-reports-plugin_MPIR-366-S464FI4ATSVOULE3N7MCKV5FYYG6GVHDD7OLISMYBGUEPLQM2UNA@2@tmp\withMaven7f97a9a5"
[windows-jdk8] [INFO] 1 archive(s) processed
[windows-jdk8] [INFO]
[windows-jdk8] [INFO] --- maven-invoker-plugin:2.0.0:verify (integration-test) @ maven-project-info-reports-plugin ---
[windows-jdk8] [INFO] -------------------------------------------------
[windows-jdk8] [INFO] Build Summary:
[windows-jdk8] [INFO]   Passed: 11, Failed: 0, Errors: 0, Skipped: 0
[windows-jdk8] [INFO] -------------------------------------------------
[windows-jdk8] [INFO] ------------------------------------------------------------------------
[windows-jdk8] [INFO] BUILD SUCCESS
[windows-jdk8] [INFO] ------------------------------------------------------------------------
[windows-jdk8] [INFO] Total time: 04:09 min
[windows-jdk8] [INFO] Finished at: 2018-04-14T09:50:59Z
[windows-jdk8] [INFO] Final Memory: 63M/887M
[windows-jdk8] [INFO] ------------------------------------------------------------------------
[windows-jdk8] [INFO] [jenkins-event-spy] Generated F:\jenkins\jenkins-slave\workspace\nfo-reports-plugin_MPIR-366-S464FI4ATSVOULE3N7MCKV5FYYG6GVHDD7OLISMYBGUEPLQM2UNA@2@tmp\withMaven7f97a9a5\maven-spy-20180414-094649-7434548878377129968733.log
[windows-jdk8] Picked up JAVA_TOOL_OPTIONS: -Dmaven.ext.class.path="f:\jenkins\jenkins-slave\workspace\nfo-reports-plugin_MPIR-366-S464FI4ATSVOULE3N7MCKV5FYYG6GVHDD7OLISMYBGUEPLQM2UNA@2@tmp\withMaven7f97a9a5\pipeline-maven-spy.jar" -Dorg.jenkinsci.plugins.pipeline.maven.reportsFolder="f:\jenkins\jenkins-slave\workspace\nfo-reports-plugin_MPIR-366-S464FI4ATSVOULE3N7MCKV5FYYG6GVHDD7OLISMYBGUEPLQM2UNA@2@tmp\withMaven7f97a9a5"
[Pipeline] [windows-jdk8] }
[Pipeline] [windows-jdk8] // dir
[Pipeline] [windows-jdk8] }
[windows-jdk8] [withMaven] junitPublisher - Archive test results for Maven artifact org.apache.maven.plugins:maven-project-info-reports-plugin:2.10-SNAPSHOT generated by maven-surefire-plugin:test (default-test): m\target\surefire-reports\*.xml
[windows-jdk8] [withMaven] junitPublisher - Jenkins JUnit Attachments Plugin not found, can't publish test attachments.Recording test results
[windows-jdk8] [withMaven] junitPublisher - Archive test results for Maven artifact org.apache.maven.plugins.project-info-reports.its:dep:1.0-SNAPSHOT generated by maven-surefire-plugin:test (default-test): m\target\it\multi-module\dep\target\surefire-reports\*.xml
[windows-jdk8] [withMaven] junitPublisher - Jenkins JUnit Attachments Plugin not found, can't publish test attachments.Recording test results
[windows-jdk8] None of the test reports contained any result
[windows-jdk8] [withMaven] junitPublisher - Archive test results for Maven artifact org.apache.maven.plugins.project-info-reports.its:main:1.0-SNAPSHOT generated by maven-surefire-plugin:test (default-test): m\target\it\multi-module\main\target\surefire-reports\*.xml
[windows-jdk8] [withMaven] junitPublisher - Jenkins JUnit Attachments Plugin not found, can't publish test attachments.Recording test results
[windows-jdk8] None of the test reports contained any result
[Pipeline] [windows-jdk8] // withMaven
[Pipeline] [windows-jdk8] }
[Pipeline] [windows-jdk8] // stage
[Pipeline] [windows-jdk8] }
[Pipeline] [windows-jdk8] // node
[Pipeline] [windows-jdk8] }
[Pipeline] // parallel
[Pipeline] stage
[Pipeline] { (Notifications)
[Pipeline] echo
Build result: FAILURE
[Pipeline] jiraIssueSelector
[Pipeline] jiraComment
[Pipeline] emailext
Reply | Threaded
Open this post in threaded view
|

Build aborted in Jenkins: Maven TLP » maven-project-info-reports-plugin » MPIR-366 #20

Apache Jenkins Server-2
See https://builds.apache.org/job/maven-box/job/maven-project-info-reports-plugin/job/MPIR-366/20/

No changes.

All tests passed

Build log:
[...truncated 984.06 MB...]
[windows-jdk9] [INFO] at org.apache.maven.report.projectinfo.DependenciesReport.executeReport(DependenciesReport.java:185)
[windows-jdk9] [INFO] at org.apache.maven.reporting.AbstractMavenReport.generate(AbstractMavenReport.java:251)
[windows-jdk9] [INFO] at org.apache.maven.plugins.site.render.ReportDocumentRenderer.renderDocument(ReportDocumentRenderer.java:230)
[windows-jdk9] [INFO] at org.apache.maven.doxia.siterenderer.DefaultSiteRenderer.render(DefaultSiteRenderer.java:349)
[windows-jdk9] [INFO] at org.apache.maven.plugins.site.render.SiteMojo.renderLocale(SiteMojo.java:184)
[windows-jdk9] [INFO] at org.apache.maven.plugins.site.render.SiteMojo.execute(SiteMojo.java:133)
[windows-jdk9] [INFO] at org.apache.maven.plugin.DefaultBuildPluginManager.executeMojo(DefaultBuildPluginManager.java:134)
[windows-jdk9] [INFO] at org.apache.maven.lifecycle.internal.MojoExecutor.execute(MojoExecutor.java:208)
[windows-jdk9] [INFO] at org.apache.maven.lifecycle.internal.MojoExecutor.execute(MojoExecutor.java:154)
[windows-jdk9] [INFO] at org.apache.maven.lifecycle.internal.MojoExecutor.execute(MojoExecutor.java:146)
[windows-jdk9] [INFO] at org.apache.maven.lifecycle.internal.LifecycleModuleBuilder.buildProject(LifecycleModuleBuilder.java:117)
[windows-jdk9] [INFO] at org.apache.maven.lifecycle.internal.LifecycleModuleBuilder.buildProject(LifecycleModuleBuilder.java:81)
[windows-jdk9] [INFO] at org.apache.maven.lifecycle.internal.builder.singlethreaded.SingleThreadedBuilder.build(SingleThreadedBuilder.java:51)
[windows-jdk9] [INFO] at org.apache.maven.lifecycle.internal.LifecycleStarter.execute(LifecycleStarter.java:128)
[windows-jdk9] [INFO] at org.apache.maven.DefaultMaven.doExecute(DefaultMaven.java:309)
[windows-jdk9] [INFO] at org.apache.maven.DefaultMaven.doExecute(DefaultMaven.java:194)
[windows-jdk9] [INFO] at org.apache.maven.DefaultMaven.execute(DefaultMaven.java:107)
[windows-jdk9] [INFO] at org.apache.maven.cli.MavenCli.execute(MavenCli.java:993)
[windows-jdk9] [INFO] at org.apache.maven.cli.MavenCli.doMain(MavenCli.java:345)
[windows-jdk9] [INFO] at org.apache.maven.cli.MavenCli.main(MavenCli.java:191)
[windows-jdk9] [INFO] at java.base/jdk.internal.reflect.NativeMethodAccessorImpl.invoke0(Native Method)
[windows-jdk9] [INFO] at java.base/jdk.internal.reflect.NativeMethodAccessorImpl.invoke(NativeMethodAccessorImpl.java:62)
[windows-jdk9] [INFO] at java.base/jdk.internal.reflect.DelegatingMethodAccessorImpl.invoke(DelegatingMethodAccessorImpl.java:43)
[windows-jdk9] [INFO] at java.base/java.lang.reflect.Method.invoke(Method.java:564)
[windows-jdk9] [INFO] at org.codehaus.plexus.classworlds.launcher.Launcher.launchEnhanced(Launcher.java:289)
[windows-jdk9] [INFO] at org.codehaus.plexus.classworlds.launcher.Launcher.launch(Launcher.java:229)
[windows-jdk9] [INFO] at org.codehaus.plexus.classworlds.launcher.Launcher.mainWithExitCode(Launcher.java:415)
[windows-jdk9] [INFO] at org.codehaus.plexus.classworlds.launcher.Launcher.main(Launcher.java:356)
[windows-jdk9] [INFO] Caused by: org.apache.maven.model.building.ModelBuildingException: 1 problem was encountered while building the effective model for xml-apis:xml-apis:1.3.04
[windows-jdk9] [INFO] [ERROR] 'distributionManagement.status' must not be specified. @ line 39, column 13
[windows-jdk9] [INFO]
[windows-jdk9] [INFO] at org.apache.maven.model.building.DefaultModelProblemCollector.newModelBuildingException(DefaultModelProblemCollector.java:197)
[windows-jdk9] [INFO] at org.apache.maven.model.building.DefaultModelBuilder.build(DefaultModelBuilder.java:481)
[windows-jdk9] [INFO] at org.apache.maven.model.building.DefaultModelBuilder.build(DefaultModelBuilder.java:423)
[windows-jdk9] [INFO] at org.apache.maven.model.building.DefaultModelBuilder.build(DefaultModelBuilder.java:413)
[windows-jdk9] [INFO] at org.apache.maven.project.DefaultProjectBuilder.build(DefaultProjectBuilder.java:157)
[windows-jdk9] [INFO] ... 39 more
[windows-jdk9] [INFO] [DEBUG] Extension realms for project commons-lang:commons-lang:jar:2.4: (none)
[windows-jdk9] [INFO] [DEBUG] Looking up lifecycle mappings for packaging jar from ClassRealm[maven.ext, parent: ClassRealm[plexus.core, parent: null]]
[windows-jdk9] [INFO] [DEBUG] Extension realms for project org.apache.commons:commons-parent:pom:9: (none)
[windows-jdk9] [INFO] [DEBUG] Looking up lifecycle mappings for packaging pom from ClassRealm[maven.ext, parent: ClassRealm[plexus.core, parent: null]]
[windows-jdk9] [INFO] [DEBUG] Extension realms for project org.apache:apache:pom:4: (none)
[windows-jdk9] [INFO] [DEBUG] Looking up lifecycle mappings for packaging pom from ClassRealm[maven.ext, parent: ClassRealm[plexus.core, parent: null]]
[windows-jdk9] [INFO] [DEBUG] Extension realms for project org.apache.httpcomponents:httpclient:jar:4.0.2: (none)
[windows-jdk9] [INFO] [DEBUG] Looking up lifecycle mappings for packaging jar from ClassRealm[maven.ext, parent: ClassRealm[plexus.core, parent: null]]
[windows-jdk9] [INFO] [DEBUG] Extension realms for project org.apache.httpcomponents:httpcomponents-client:pom:4.0.2: (none)
[windows-jdk9] [INFO] [DEBUG] Looking up lifecycle mappings for packaging pom from ClassRealm[maven.ext, parent: ClassRealm[plexus.core, parent: null]]
[windows-jdk9] [INFO] [DEBUG] Extension realms for project org.apache.httpcomponents:project:pom:4.1: (none)
[windows-jdk9] [INFO] [DEBUG] Looking up lifecycle mappings for packaging pom from ClassRealm[maven.ext, parent: ClassRealm[plexus.core, parent: null]]
[windows-jdk9] [INFO] [DEBUG] Extension realms for project org.apache.httpcomponents:httpcore:jar:4.0.1: (none)
[windows-jdk9] [INFO] [DEBUG] Looking up lifecycle mappings for packaging jar from ClassRealm[maven.ext, parent: ClassRealm[plexus.core, parent: null]]
[windows-jdk9] [INFO] [DEBUG] Extension realms for project org.apache.httpcomponents:httpcomponents-core:pom:4.0.1: (none)
[windows-jdk9] [INFO] [DEBUG] Looking up lifecycle mappings for packaging pom from ClassRealm[maven.ext, parent: ClassRealm[plexus.core, parent: null]]
[windows-jdk9] [INFO] [DEBUG] Extension realms for project org.apache.httpcomponents:project:pom:4.0: (none)
[windows-jdk9] [INFO] [DEBUG] Looking up lifecycle mappings for packaging pom from ClassRealm[maven.ext, parent: ClassRealm[plexus.core, parent: null]]
[windows-jdk9] [INFO] [DEBUG] Extension realms for project commons-logging:commons-logging:jar:1.1.1: (none)
[windows-jdk9] [INFO] [DEBUG] Looking up lifecycle mappings for packaging jar from ClassRealm[maven.ext, parent: ClassRealm[plexus.core, parent: null]]
[windows-jdk9] [INFO] [DEBUG] Extension realms for project org.apache.commons:commons-parent:pom:5: (none)
[windows-jdk9] [INFO] [DEBUG] Looking up lifecycle mappings for packaging pom from ClassRealm[maven.ext, parent: ClassRealm[plexus.core, parent: null]]
[windows-jdk9] [INFO] [DEBUG] Extension realms for project org.apache:apache:pom:4: (none)
[windows-jdk9] [INFO] [DEBUG] Looking up lifecycle mappings for packaging pom from ClassRealm[maven.ext, parent: ClassRealm[plexus.core, parent: null]]
[windows-jdk9] [INFO] [DEBUG] Extension realms for project commons-codec:commons-codec:jar:1.3: (none)
[windows-jdk9] [INFO] [DEBUG] Looking up lifecycle mappings for packaging jar from ClassRealm[maven.ext, parent: ClassRealm[plexus.core, parent: null]]
[windows-jdk9] [INFO] [DEBUG] Extension realms for project org.apache.maven.doxia:doxia-core:jar:1.2: (none)
[windows-jdk9] [INFO] [DEBUG] Looking up lifecycle mappings for packaging jar from ClassRealm[maven.ext, parent: ClassRealm[plexus.core, parent: null]]
[windows-jdk9] [INFO] [DEBUG] Extension realms for project org.apache.maven.doxia:doxia:pom:1.2: (none)
[windows-jdk9] [INFO] [DEBUG] Looking up lifecycle mappings for packaging pom from ClassRealm[maven.ext, parent: ClassRealm[plexus.core, parent: null]]
[windows-jdk9] [INFO] [DEBUG] Extension realms for project org.apache.maven:maven-parent:pom:19: (none)
[windows-jdk9] [INFO] [DEBUG] Looking up lifecycle mappings for packaging pom from ClassRealm[maven.ext, parent: ClassRealm[plexus.core, parent: null]]
[windows-jdk9] [INFO] [DEBUG] Extension realms for project org.apache:apache:pom:9: (none)
[windows-jdk9] [INFO] [DEBUG] Looking up lifecycle mappings for packaging pom from ClassRealm[maven.ext, parent: ClassRealm[plexus.core, parent: null]]
[windows-jdk9] [INFO] [DEBUG] Verifying availability of F:\jenkins\jenkins-slave\workspace\nfo-reports-plugin_MPIR-366-S464FI4ATSVOULE3N7MCKV5FYYG6GVHDD7OLISMYBGUEPLQM2UNA@2\m\target\local-repo\org\apache\maven\doxia\doxia-sink-api\1.9-SNAPSHOT\doxia-sink-api-1.9-20180207.082429-1.pom from [local.central (file:///f:/jenkins/jenkins-slave/workspace/nfo-reports-plugin_MPIR-366-S464FI4ATSVOULE3N7MCKV5FYYG6GVHDD7OLISMYBGUEPLQM2UNA@2/.repository, default, releases+snapshots), mirror-test (http://repo.maven.apache.org/maven2/, default, releases), local.central (file:///f:/jenkins/jenkins-slave/workspace/nfo-reports-plugin_MPIR-366-S464FI4ATSVOULE3N7MCKV5FYYG6GVHDD7OLISMYBGUEPLQM2UNA@2/.repository, default, releases+snapshots), mirror-test (http://repo.maven.apache.org/maven2/, default, releases)]
[windows-jdk9] [INFO] [DEBUG] Skipped remote request for org.apache.maven.doxia:doxia-sink-api:pom:1.9-20180207.082429-1, already updated during this session.
[windows-jdk9] [INFO] [DEBUG] Skipped remote request for org.apache.maven.doxia:doxia-sink-api:pom:1.9-20180207.082429-1, already updated during this session.
[windows-jdk9] [INFO] [WARNING] The POM for org.apache.maven.doxia:doxia-sink-api:jar:1.9-20180207.082429-1 is missing, no dependency information available
[windows-jdk9] [INFO] [DEBUG] Verifying availability of F:\jenkins\jenkins-slave\workspace\nfo-reports-plugin_MPIR-366-S464FI4ATSVOULE3N7MCKV5FYYG6GVHDD7OLISMYBGUEPLQM2UNA@2\m\target\local-repo\org\apache\maven\doxia\doxia-sink-api\1.9-SNAPSHOT\doxia-sink-api-1.9-20180207.082429-1.jar from [local.central (file:///f:/jenkins/jenkins-slave/workspace/nfo-reports-plugin_MPIR-366-S464FI4ATSVOULE3N7MCKV5FYYG6GVHDD7OLISMYBGUEPLQM2UNA@2/.repository, default, releases+snapshots), mirror-test (http://repo.maven.apache.org/maven2/, default, releases), local.central (file:///f:/jenkins/jenkins-slave/workspace/nfo-reports-plugin_MPIR-366-S464FI4ATSVOULE3N7MCKV5FYYG6GVHDD7OLISMYBGUEPLQM2UNA@2/.repository, default, releases+snapshots), mirror-test (http://repo.maven.apache.org/maven2/, default, releases)]
[windows-jdk9] [INFO] [DEBUG] Skipped remote request for org.apache.maven.doxia:doxia-sink-api:jar:1.9-20180207.082429-1, already updated during this session.
[windows-jdk9] [INFO] [DEBUG] Skipped remote request for org.apache.maven.doxia:doxia-sink-api:jar:1.9-20180207.082429-1, already updated during this session.
[windows-jdk9] [INFO] [ERROR] Artifact org.apache.maven.doxia:doxia-sink-api:jar:1.9-SNAPSHOT can't be resolved.
[windows-jdk9] [INFO] org.apache.maven.shared.artifact.resolve.ArtifactResolverException: Failure to find org.apache.maven.doxia:doxia-sink-api:jar:1.9-20180207.082429-1 in file:///f:/jenkins/jenkins-slave/workspace/nfo-reports-plugin_MPIR-366-S464FI4ATSVOULE3N7MCKV5FYYG6GVHDD7OLISMYBGUEPLQM2UNA@2/.repository was cached in the local repository, resolution will not be reattempted until the update interval of local.central has elapsed or updates are forced
[windows-jdk9] [INFO] at org.apache.maven.shared.artifact.resolve.internal.Maven31ArtifactResolver.resolveArtifact(Maven31ArtifactResolver.java:116)
[windows-jdk9] [INFO] at org.apache.maven.shared.artifact.resolve.internal.Maven31ArtifactResolver.resolveArtifact(Maven31ArtifactResolver.java:66)
[windows-jdk9] [INFO] at org.apache.maven.shared.artifact.resolve.internal.DefaultArtifactResolver.resolveArtifact(DefaultArtifactResolver.java:55)
[windows-jdk9] [INFO] at org.apache.maven.report.projectinfo.dependencies.RepositoryUtils.resolve(RepositoryUtils.java:101)
[windows-jdk9] [INFO] at org.apache.maven.report.projectinfo.dependencies.renderer.DependenciesRenderer.resolveAtrifacts(DependenciesRenderer.java:1078)
[windows-jdk9] [INFO] at org.apache.maven.report.projectinfo.dependencies.renderer.DependenciesRenderer.renderSectionDependencyFileDetails(DependenciesRenderer.java:496)
[windows-jdk9] [INFO] at org.apache.maven.report.projectinfo.dependencies.renderer.DependenciesRenderer.renderBody(DependenciesRenderer.java:229)
[windows-jdk9] [INFO] at org.apache.maven.reporting.AbstractMavenReportRenderer.render(AbstractMavenReportRenderer.java:80)
[windows-jdk9] [INFO] at org.apache.maven.report.projectinfo.DependenciesReport.executeReport(DependenciesReport.java:185)
[windows-jdk9] [INFO] at org.apache.maven.reporting.AbstractMavenReport.generate(AbstractMavenReport.java:251)
[windows-jdk9] [INFO] at org.apache.maven.plugins.site.render.ReportDocumentRenderer.renderDocument(ReportDocumentRenderer.java:230)
[windows-jdk9] [INFO] at org.apache.maven.doxia.siterenderer.DefaultSiteRenderer.render(DefaultSiteRenderer.java:349)
[windows-jdk9] [INFO] at org.apache.maven.plugins.site.render.SiteMojo.renderLocale(SiteMojo.java:184)
[windows-jdk9] [INFO] at org.apache.maven.plugins.site.render.SiteMojo.execute(SiteMojo.java:133)
[windows-jdk9] [INFO] at org.apache.maven.plugin.DefaultBuildPluginManager.executeMojo(DefaultBuildPluginManager.java:134)
[windows-jdk9] [INFO] at org.apache.maven.lifecycle.internal.MojoExecutor.execute(MojoExecutor.java:208)
[windows-jdk9] [INFO] at org.apache.maven.lifecycle.internal.MojoExecutor.execute(MojoExecutor.java:154)
[windows-jdk9] [INFO] at org.apache.maven.lifecycle.internal.MojoExecutor.execute(MojoExecutor.java:146)
[windows-jdk9] [INFO] at org.apache.maven.lifecycle.internal.LifecycleModuleBuilder.buildProject(LifecycleModuleBuilder.java:117)
[windows-jdk9] [INFO] at org.apache.maven.lifecycle.internal.LifecycleModuleBuilder.buildProject(LifecycleModuleBuilder.java:81)
[windows-jdk9] [INFO] at org.apache.maven.lifecycle.internal.builder.singlethreaded.SingleThreadedBuilder.build(SingleThreadedBuilder.java:51)
[windows-jdk9] [INFO] at org.apache.maven.lifecycle.internal.LifecycleStarter.execute(LifecycleStarter.java:128)
[windows-jdk9] [INFO] at org.apache.maven.DefaultMaven.doExecute(DefaultMaven.java:309)
[windows-jdk9] [INFO] at org.apache.maven.DefaultMaven.doExecute(DefaultMaven.java:194)
[windows-jdk9] [INFO] at org.apache.maven.DefaultMaven.execute(DefaultMaven.java:107)
[windows-jdk9] [INFO] at org.apache.maven.cli.MavenCli.execute(MavenCli.java:993)
[windows-jdk9] [INFO] at org.apache.maven.cli.MavenCli.doMain(MavenCli.java:345)
[windows-jdk9] [INFO] at org.apache.maven.cli.MavenCli.main(MavenCli.java:191)
[windows-jdk9] [INFO] at java.base/jdk.internal.reflect.NativeMethodAccessorImpl.invoke0(Native Method)
[windows-jdk9] [INFO] at java.base/jdk.internal.reflect.NativeMethodAccessorImpl.invoke(NativeMethodAccessorImpl.java:62)
[windows-jdk9] [INFO] at java.base/jdk.internal.reflect.DelegatingMethodAccessorImpl.invoke(DelegatingMethodAccessorImpl.java:43)
[windows-jdk9] [INFO] at java.base/java.lang.reflect.Method.invoke(Method.java:564)
[windows-jdk9] [INFO] at org.codehaus.plexus.classworlds.launcher.Launcher.launchEnhanced(Launcher.java:289)
[windows-jdk9] [INFO] at org.codehaus.plexus.classworlds.launcher.Launcher.launch(Launcher.java:229)
[windows-jdk9] [INFO] at org.codehaus.plexus.classworlds.launcher.Launcher.mainWithExitCode(Launcher.java:415)
[windows-jdk9] [INFO] at org.codehaus.plexus.classworlds.launcher.Launcher.main(Launcher.java:356)
[windows-jdk9] [INFO] Caused by: org.eclipse.aether.resolution.ArtifactResolutionException: Failure to find org.apache.maven.doxia:doxia-sink-api:jar:1.9-20180207.082429-1 in file:///f:/jenkins/jenkins-slave/workspace/nfo-reports-plugin_MPIR-366-S464FI4ATSVOULE3N7MCKV5FYYG6GVHDD7OLISMYBGUEPLQM2UNA@2/.repository was cached in the local repository, resolution will not be reattempted until the update interval of local.central has elapsed or updates are forced
[windows-jdk9] [INFO] at org.eclipse.aether.internal.impl.DefaultArtifactResolver.resolve(DefaultArtifactResolver.java:453)
[windows-jdk9] [INFO] at org.eclipse.aether.internal.impl.DefaultArtifactResolver.resolveArtifacts(DefaultArtifactResolver.java:255)
[windows-jdk9] [INFO] at org.eclipse.aether.internal.impl.DefaultArtifactResolver.resolveArtifact(DefaultArtifactResolver.java:232)
[windows-jdk9] [INFO] at org.eclipse.aether.internal.impl.DefaultRepositorySystem.resolveArtifact(DefaultRepositorySystem.java:303)
[windows-jdk9] [INFO] at org.apache.maven.shared.artifact.resolve.internal.Maven31ArtifactResolver.resolveArtifact(Maven31ArtifactResolver.java:108)
[windows-jdk9] [INFO] ... 35 more
[windows-jdk9] [INFO] Caused by: org.eclipse.aether.transfer.ArtifactNotFoundException: Failure to find org.apache.maven.doxia:doxia-sink-api:jar:1.9-20180207.082429-1 in file:///f:/jenkins/jenkins-slave/workspace/nfo-reports-plugin_MPIR-366-S464FI4ATSVOULE3N7MCKV5FYYG6GVHDD7OLISMYBGUEPLQM2UNA@2/.repository was cached in the local repository, resolution will not be reattempted until the update interval of local.central has elapsed or updates are forced
[windows-jdk9] [INFO] at org.eclipse.aether.internal.impl.DefaultUpdateCheckManager.newException(DefaultUpdateCheckManager.java:240)
[windows-jdk9] [INFO] at org.eclipse.aether.internal.impl.DefaultUpdateCheckManager.checkArtifact(DefaultUpdateCheckManager.java:192)
[windows-jdk9] [INFO] at org.eclipse.aether.internal.impl.DefaultArtifactResolver.gatherDownloads(DefaultArtifactResolver.java:594)
[windows-jdk9] [INFO] at org.eclipse.aether.internal.impl.DefaultArtifactResolver.performDownloads(DefaultArtifactResolver.java:512)
[windows-jdk9] [INFO] at org.eclipse.aether.internal.impl.DefaultArtifactResolver.resolve(DefaultArtifactResolver.java:430)
[windows-jdk9] [INFO] ... 39 more
[windows-jdk9] [INFO] [WARNING] Artifact org.apache.maven.doxia:doxia-sink-api:jar:1.9-SNAPSHOT has no file and won't be listed in dependency files details.
[windows-jdk9] [INFO] [DEBUG] Processing Velocity for template org/apache/maven/doxia/siterenderer/resources/default-site.vm on dependencies.html
[windows-jdk9] [INFO] [DEBUG] Velocimacro : added VM link: source=org/apache/maven/doxia/siterenderer/resources/default-site-macros.vm
[windows-jdk9] [INFO] [DEBUG] Velocimacro : added VM image: source=org/apache/maven/doxia/siterenderer/resources/default-site-macros.vm
[windows-jdk9] [INFO] [DEBUG] Velocimacro : added VM banner: source=org/apache/maven/doxia/siterenderer/resources/default-site-macros.vm
[windows-jdk9] [INFO] [DEBUG] Velocimacro : added VM links: source=org/apache/maven/doxia/siterenderer/resources/default-site-macros.vm
[windows-jdk9] [INFO] [DEBUG] Velocimacro : added VM breadcrumbs: source=org/apache/maven/doxia/siterenderer/resources/default-site-macros.vm
[windows-jdk9] [INFO] [DEBUG] Velocimacro : added VM displayTree: source=org/apache/maven/doxia/siterenderer/resources/default-site-macros.vm
[windows-jdk9] [INFO] [DEBUG] Velocimacro : added VM menuItem: source=org/apache/maven/doxia/siterenderer/resources/default-site-macros.vm
[windows-jdk9] [INFO] [DEBUG] Velocimacro : added VM mainMenu: source=org/apache/maven/doxia/siterenderer/resources/default-site-macros.vm
[windows-jdk9] [INFO] [DEBUG] Velocimacro : added VM copyright: source=org/apache/maven/doxia/siterenderer/resources/default-site-macros.vm
[windows-jdk9] [INFO] [DEBUG] Velocimacro : added VM publishDate: source=org/apache/maven/doxia/siterenderer/resources/default-site-macros.vm
[windows-jdk9] [INFO] [DEBUG] Velocimacro : added VM poweredByLogo: source=org/apache/maven/doxia/siterenderer/resources/default-site-macros.vm
[windows-jdk9] [INFO] [DEBUG] Velocimacro : added VM googleAnalytics: source=org/apache/maven/doxia/siterenderer/resources/default-site-macros.vm
[windows-jdk9] [INFO] [DEBUG] Multipage report: 0 subreports
[windows-jdk9] [INFO] [DEBUG] Generating F:\jenkins\jenkins-slave\workspace\nfo-reports-plugin_MPIR-366-S464FI4ATSVOULE3N7MCKV5FYYG6GVHDD7OLISMYBGUEPLQM2UNA@2\m\target\it\full-pom\target\site\lt\dependency-convergence.html
[windows-jdk9] [INFO] [INFO] Generating "Priklausomybi? konvergencija" report --- maven-project-info-reports-plugin:2.10-SNAPSHOT:dependency-convergence
[windows-jdk9] [INFO] [DEBUG] Dependency tree resolution listener events:
[windows-jdk9] [INFO] [DEBUG] testArtifact: artifact=org.apache.maven.plugins.project-info-reports:full-pom:jar:1.0-SNAPSHOT
[windows-jdk9] [INFO] [DEBUG] includeArtifact: artifact=org.apache.maven.plugins.project-info-reports:full-pom:jar:1.0-SNAPSHOT
[windows-jdk9] [INFO] [DEBUG] startProcessChildren: artifact=org.apache.maven.plugins.project-info-reports:full-pom:jar:1.0-SNAPSHOT
[windows-jdk9] [INFO] [DEBUG]   testArtifact: artifact=org.apache.maven:maven-artifact:jar:2.1.0:compile
[windows-jdk9] [INFO] [DEBUG]   includeArtifact: artifact=org.apache.maven:maven-artifact:jar:2.1.0:compile
[windows-jdk9] [INFO] [DEBUG]   startProcessChildren: artifact=org.apache.maven:maven-artifact:jar:2.1.0:compile
[windows-jdk9] [INFO] [DEBUG]     testArtifact: artifact=org.codehaus.plexus:plexus-utils:jar:1.5.6:compile
[windows-jdk9] [INFO] [DEBUG]     includeArtifact: artifact=org.codehaus.plexus:plexus-utils:jar:1.5.6:compile
[windows-jdk9] [INFO] [DEBUG]     startProcessChildren: artifact=org.codehaus.plexus:plexus-utils:jar:1.5.6:compile
[windows-jdk9] [INFO] [DEBUG]     endProcessChildren: artifact=org.codehaus.plexus:plexus-utils:jar:1.5.6:compile
[windows-jdk9] [INFO] [DEBUG]   endProcessChildren: artifact=org.apache.maven:maven-artifact:jar:2.1.0:compile
[windows-jdk9] [INFO] [DEBUG]   testArtifact: artifact=org.apache.maven.doxia:doxia-core:jar:1.2:compile
[windows-jdk9] [INFO] [DEBUG]   includeArtifact: artifact=org.apache.maven.doxia:doxia-core:jar:1.2:compile
[windows-jdk9] [INFO] [DEBUG]   startProcessChildren: artifact=org.apache.maven.doxia:doxia-core:jar:1.2:compile
[windows-jdk9] [INFO] [DEBUG]     testArtifact: artifact=org.apache.maven.doxia:doxia-sink-api:jar:1.2:compile
[windows-jdk9] [INFO] [DEBUG]     includeArtifact: artifact=org.apache.maven.doxia:doxia-sink-api:jar:1.2:compile
[windows-jdk9] [INFO] [DEBUG]     startProcessChildren: artifact=org.apache.maven.doxia:doxia-sink-api:jar:1.2:compile
[windows-jdk9] [INFO] [DEBUG]       testArtifact: artifact=org.apache.maven.doxia:doxia-logging-api:jar:1.2:compile
[windows-jdk9] [INFO] [DEBUG]       includeArtifact: artifact=org.apache.maven.doxia:doxia-logging-api:jar:1.2:compile
[windows-jdk9] [INFO] [DEBUG]       startProcessChildren: artifact=org.apache.maven.doxia:doxia-logging-api:jar:1.2:compile
[windows-jdk9] [INFO] [DEBUG]         testArtifact: artifact=org.codehaus.plexus:plexus-container-default:jar:1.0-alpha-30:compile
[windows-jdk9] [INFO] [DEBUG]         includeArtifact: artifact=org.codehaus.plexus:plexus-container-default:jar:1.0-alpha-30:compile
[windows-jdk9] [INFO] [DEBUG]         startProcessChildren: artifact=org.codehaus.plexus:plexus-container-default:jar:1.0-alpha-30:compile
[windows-jdk9] [INFO] [DEBUG]           testArtifact: artifact=org.codehaus.plexus:plexus-utils:jar:1.4.5:compile
[windows-jdk9] [INFO] [DEBUG]           omitForNearer: omitted=org.codehaus.plexus:plexus-utils:jar:1.4.5:compile kept=org.codehaus.plexus:plexus-utils:jar:1.5.6:compile
[windows-jdk9] [INFO] [DEBUG]           testArtifact: artifact=org.codehaus.plexus:plexus-classworlds:jar:1.2-alpha-9:compile
[windows-jdk9] [INFO] [DEBUG]           includeArtifact: artifact=org.codehaus.plexus:plexus-classworlds:jar:1.2-alpha-9:compile
[windows-jdk9] [INFO] [DEBUG]           startProcessChildren: artifact=org.codehaus.plexus:plexus-classworlds:jar:1.2-alpha-9:compile
[windows-jdk9] [INFO] [DEBUG]             testArtifact: artifact=junit:junit:jar:3.8.1:compile
[windows-jdk9] [INFO] [DEBUG]             includeArtifact: artifact=junit:junit:jar:3.8.1:compile
[windows-jdk9] [INFO] [DEBUG]             startProcessChildren: artifact=junit:junit:jar:3.8.1:compile
[windows-jdk9] [INFO] [DEBUG]             endProcessChildren: artifact=junit:junit:jar:3.8.1:compile
[windows-jdk9] [INFO] [DEBUG]           endProcessChildren: artifact=org.codehaus.plexus:plexus-classworlds:jar:1.2-alpha-9:compile
[windows-jdk9] [INFO] [DEBUG]           testArtifact: artifact=junit:junit:jar:3.8.1:compile
[windows-jdk9] [INFO] [DEBUG]           omitForNearer: omitted=junit:junit:jar:3.8.1:compile kept=junit:junit:jar:3.8.1:compile
[windows-jdk9] [INFO] [DEBUG]           includeArtifact: artifact=junit:junit:jar:3.8.1:compile
[windows-jdk9] [INFO] [DEBUG]           startProcessChildren: artifact=junit:junit:jar:3.8.1:compile
[windows-jdk9] [INFO] [DEBUG]           endProcessChildren: artifact=junit:junit:jar:3.8.1:compile
[windows-jdk9] [INFO] [DEBUG]         endProcessChildren: artifact=org.codehaus.plexus:plexus-container-default:jar:1.0-alpha-30:compile
[windows-jdk9] [INFO] [DEBUG]       endProcessChildren: artifact=org.apache.maven.doxia:doxia-logging-api:jar:1.2:compile
[windows-jdk9] [INFO] [DEBUG]     endProcessChildren: artifact=org.apache.maven.doxia:doxia-sink-api:jar:1.2:compile
[windows-jdk9] [INFO] [DEBUG]     testArtifact: artifact=org.apache.maven.doxia:doxia-logging-api:jar:1.2:compile
[windows-jdk9] [INFO] [DEBUG]     omitForNearer: omitted=org.apache.maven.doxia:doxia-logging-api:jar:1.2:compile kept=org.apache.maven.doxia:doxia-logging-api:jar:1.2:compile
[windows-jdk9] [INFO] [DEBUG]     includeArtifact: artifact=org.apache.maven.doxia:doxia-logging-api:jar:1.2:compile
[windows-jdk9] [INFO] [DEBUG]     startProcessChildren: artifact=org.apache.maven.doxia:doxia-logging-api:jar:1.2:compile
[windows-jdk9] [INFO] [DEBUG]       testArtifact: artifact=org.codehaus.plexus:plexus-container-default:jar:1.0-alpha-30:compile
[windows-jdk9] [INFO] [DEBUG]       includeArtifact: artifact=org.codehaus.plexus:plexus-container-default:jar:1.0-alpha-30:compile
[windows-jdk9] [INFO] [DEBUG]       startProcessChildren: artifact=org.codehaus.plexus:plexus-container-default:jar:1.0-alpha-30:compile
[windows-jdk9] [INFO] [DEBUG]         testArtifact: artifact=org.codehaus.plexus:plexus-utils:jar:1.4.5:compile
[windows-jdk9] [INFO] [DEBUG]         omitForNearer: omitted=org.codehaus.plexus:plexus-utils:jar:1.4.5:compile kept=org.codehaus.plexus:plexus-utils:jar:1.5.6:compile
[windows-jdk9] [INFO] [DEBUG]         testArtifact: artifact=org.codehaus.plexus:plexus-classworlds:jar:1.2-alpha-9:compile
[windows-jdk9] [INFO] [DEBUG]         includeArtifact: artifact=org.codehaus.plexus:plexus-classworlds:jar:1.2-alpha-9:compile
[windows-jdk9] [INFO] [DEBUG]         startProcessChildren: artifact=org.codehaus.plexus:plexus-classworlds:jar:1.2-alpha-9:compile
[windows-jdk9] [INFO] [DEBUG]           testArtifact: artifact=junit:junit:jar:3.8.1:compile
[windows-jdk9] [INFO] [DEBUG]           includeArtifact: artifact=junit:junit:jar:3.8.1:compile
[windows-jdk9] [INFO] [DEBUG]           startProcessChildren: artifact=junit:junit:jar:3.8.1:compile
[windows-jdk9] [INFO] [DEBUG]           endProcessChildren: artifact=junit:junit:jar:3.8.1:compile
[windows-jdk9] [INFO] [DEBUG]         endProcessChildren: artifact=org.codehaus.plexus:plexus-classworlds:jar:1.2-alpha-9:compile
[windows-jdk9] [INFO] [DEBUG]         testArtifact: artifact=junit:junit:jar:3.8.1:compile
[windows-jdk9] [INFO] [DEBUG]         omitForNearer: omitted=junit:junit:jar:3.8.1:compile kept=junit:junit:jar:3.8.1:compile
[windows-jdk9] [INFO] [DEBUG]         includeArtifact: artifact=junit:junit:jar:3.8.1:compile
[windows-jdk9] [INFO] [DEBUG]         startProcessChildren: artifact=junit:junit:jar:3.8.1:compile
[windows-jdk9] [INFO] [DEBUG]         endProcessChildren: artifact=junit:junit:jar:3.8.1:compile
[windows-jdk9] [INFO] [DEBUG]       endProcessChildren: artifact=org.codehaus.plexus:plexus-container-default:jar:1.0-alpha-30:compile
[windows-jdk9] [INFO] [DEBUG]     endProcessChildren: artifact=org.apache.maven.doxia:doxia-logging-api:jar:1.2:compile
[windows-jdk9] [INFO] [DEBUG]     testArtifact: artifact=org.codehaus.plexus:plexus-utils:jar:2.0.5:compile
[windows-jdk9] [INFO] [DEBUG]     omitForNearer: omitted=org.codehaus.plexus:plexus-utils:jar:2.0.5:compile kept=org.codehaus.plexus:plexus-utils:jar:1.5.6:compile
[windows-jdk9] [INFO] [DEBUG]     testArtifact: artifact=org.codehaus.plexus:plexus-container-default:jar:1.0-alpha-30:compile
[windows-jdk9] [INFO] [DEBUG]     omitForNearer: omitted=org.codehaus.plexus:plexus-container-default:jar:1.0-alpha-30:compile kept=org.codehaus.plexus:plexus-container-default:jar:1.0-alpha-30:compile
[windows-jdk9] [INFO] [DEBUG]     includeArtifact: artifact=org.codehaus.plexus:plexus-container-default:jar:1.0-alpha-30:compile
[windows-jdk9] [INFO] [DEBUG]     startProcessChildren: artifact=org.codehaus.plexus:plexus-container-default:jar:1.0-alpha-30:compile
[windows-jdk9] [INFO] [DEBUG]       testArtifact: artifact=org.codehaus.plexus:plexus-utils:jar:1.4.5:compile
[windows-jdk9] [INFO] [DEBUG]       omitForNearer: omitted=org.codehaus.plexus:plexus-utils:jar:1.4.5:compile kept=org.codehaus.plexus:plexus-utils:jar:1.5.6:compile
[windows-jdk9] [INFO] [DEBUG]       testArtifact: artifact=org.codehaus.plexus:plexus-classworlds:jar:1.2-alpha-9:compile
[windows-jdk9] [INFO] [DEBUG]       includeArtifact: artifact=org.codehaus.plexus:plexus-classworlds:jar:1.2-alpha-9:compile
[windows-jdk9] [INFO] [DEBUG]       startProcessChildren: artifact=org.codehaus.plexus:plexus-classworlds:jar:1.2-alpha-9:compile
[windows-jdk9] [INFO] [DEBUG] [Pipeline] [windows-jdk9] }
[Pipeline] [windows-jdk9] // dir
[Pipeline] [windows-jdk9] }
[windows-jdk9] [withMaven] junitPublisher - Archive test results for Maven artifact org.apache.maven.plugins:maven-project-info-reports-plugin:2.10-SNAPSHOT generated by maven-surefire-plugin:test (default-test): m\target\surefire-reports\*.xml
[windows-jdk9] [withMaven] junitPublisher - Jenkins JUnit Attachments Plugin not found, can't publish test attachments.Recording test results
[windows-jdk9] [withMaven] junitPublisher - Archive test results for Maven artifact org.apache.maven.plugins.project-info-reports.its:dep:1.0-SNAPSHOT generated by maven-surefire-plugin:test (default-test): m\target\it\multi-module\dep\target\surefire-reports\*.xml
[windows-jdk9] [withMaven] junitPublisher - Jenkins JUnit Attachments Plugin not found, can't publish test attachments.Recording test results
[windows-jdk9] None of the test reports contained any result
[windows-jdk9] [withMaven] junitPublisher - Archive test results for Maven artifact org.apache.maven.plugins.project-info-reports.its:main:1.0-SNAPSHOT generated by maven-surefire-plugin:test (default-test): m\target\it\multi-module\main\target\surefire-reports\*.xml
[windows-jdk9] [withMaven] junitPublisher - Jenkins JUnit Attachments Plugin not found, can't publish test attachments.Recording test results
[windows-jdk9] None of the test reports contained any result
[Pipeline] [windows-jdk9] // withMaven
[Pipeline] [windows-jdk9] }
[Pipeline] [windows-jdk9] // stage
[Pipeline] [windows-jdk9] }
[Pipeline] [windows-jdk9] // node
[Pipeline] [windows-jdk9] }
[windows-jdk9] Failed in branch windows-jdk9
[Pipeline] // parallel
[Pipeline] stage
[Pipeline] { (Notifications)
[Pipeline] echo
Build result: ABORTED
[Pipeline] jiraIssueSelector
[Pipeline] emailext