Build failed in Jenkins: Maven TLP » maven-project-info-reports-plugin » MPIR-361 #1

Previous Topic Next Topic
 
classic Classic list List threaded Threaded
1 message Options
Reply | Threaded
Open this post in threaded view
|

Build failed in Jenkins: Maven TLP » maven-project-info-reports-plugin » MPIR-361 #1

Apache Jenkins Server-2
See https://builds.apache.org/job/maven-box/job/maven-project-info-reports-plugin/job/MPIR-361/1/

No changes.

No tests ran.

Build log:
[...truncated 485.99 KB...]
[windows-jdk8] [INFO] --- maven-compiler-plugin:3.7.0:testCompile (default-testCompile) @ maven-project-info-reports-plugin ---
[windows-jdk8] [INFO] Changes detected - recompiling the module!
[windows-jdk8] [INFO] Compiling 36 source files to f:\jenkins\jenkins-slave\workspace\nfo-reports-plugin_MPIR-361-USOHCFAWZ4BXXFD3QLHLQ2HOCUSPDFM5URQGLU7AUHHJFZBJBXTQ\m\target\test-classes
[windows-jdk7] [INFO] /f:/jenkins/jenkins-slave/workspace/nfo-reports-plugin_MPIR-361-USOHCFAWZ4BXXFD3QLHLQ2HOCUSPDFM5URQGLU7AUHHJFZBJBXTQ/m/src/main/java/org/apache/maven/report/projectinfo/AbstractProjectInfoReport.java: f:\jenkins\jenkins-slave\workspace\nfo-reports-plugin_MPIR-361-USOHCFAWZ4BXXFD3QLHLQ2HOCUSPDFM5URQGLU7AUHHJFZBJBXTQ\m\src\main\java\org\apache\maven\report\projectinfo\AbstractProjectInfoReport.java uses unchecked or unsafe operations.
[windows-jdk7] [INFO] /f:/jenkins/jenkins-slave/workspace/nfo-reports-plugin_MPIR-361-USOHCFAWZ4BXXFD3QLHLQ2HOCUSPDFM5URQGLU7AUHHJFZBJBXTQ/m/src/main/java/org/apache/maven/report/projectinfo/AbstractProjectInfoReport.java: Recompile with -Xlint:unchecked for details.
[windows-jdk7] [INFO]
[windows-jdk7] [INFO] --- maven-plugin-plugin:3.5.1:descriptor (default-descriptor) @ maven-project-info-reports-plugin ---
[windows-jdk7] [INFO] Using 'UTF-8' encoding to read mojo source files.
[windows-jdk8] [INFO] /f:/jenkins/jenkins-slave/workspace/nfo-reports-plugin_MPIR-361-USOHCFAWZ4BXXFD3QLHLQ2HOCUSPDFM5URQGLU7AUHHJFZBJBXTQ/m/src/test/java/org/apache/maven/report/projectinfo/stubs/ProjectInfoPluginArtifactStub.java: f:\jenkins\jenkins-slave\workspace\nfo-reports-plugin_MPIR-361-USOHCFAWZ4BXXFD3QLHLQ2HOCUSPDFM5URQGLU7AUHHJFZBJBXTQ\m\src\test\java\org\apache\maven\report\projectinfo\stubs\ProjectInfoPluginArtifactStub.java uses unchecked or unsafe operations.
[windows-jdk8] [INFO] /f:/jenkins/jenkins-slave/workspace/nfo-reports-plugin_MPIR-361-USOHCFAWZ4BXXFD3QLHLQ2HOCUSPDFM5URQGLU7AUHHJFZBJBXTQ/m/src/test/java/org/apache/maven/report/projectinfo/stubs/ProjectInfoPluginArtifactStub.java: Recompile with -Xlint:unchecked for details.
[windows-jdk8] [INFO]
[windows-jdk8] [INFO] --- maven-surefire-plugin:2.20.1:test (default-test) @ maven-project-info-reports-plugin ---
[windows-jdk8] [INFO] Downloading: https://repo.maven.apache.org/maven2/org/apache/maven/surefire/maven-surefire-common/2.20.1/maven-surefire-common-2.20.1.pom
[windows-jdk8] [INFO] Downloaded: https://repo.maven.apache.org/maven2/org/apache/maven/surefire/maven-surefire-common/2.20.1/maven-surefire-common-2.20.1.pom (9.3 kB at 1.0 MB/s)
[windows-jdk8] [INFO] Downloading: https://repo.maven.apache.org/maven2/org/apache/maven/plugin-tools/maven-plugin-annotations/3.3/maven-plugin-annotations-3.3.pom
[windows-jdk8] [INFO] Downloaded: https://repo.maven.apache.org/maven2/org/apache/maven/plugin-tools/maven-plugin-annotations/3.3/maven-plugin-annotations-3.3.pom (1.6 kB at 272 kB/s)
[windows-jdk8] [INFO] Downloading: https://repo.maven.apache.org/maven2/org/apache/maven/plugin-tools/maven-plugin-tools/3.3/maven-plugin-tools-3.3.pom
[windows-jdk8] [INFO] Downloaded: https://repo.maven.apache.org/maven2/org/apache/maven/plugin-tools/maven-plugin-tools/3.3/maven-plugin-tools-3.3.pom (13 kB at 1.8 MB/s)
[windows-jdk8] [INFO] Downloading: https://repo.maven.apache.org/maven2/org/apache/maven/surefire/surefire-api/2.20.1/surefire-api-2.20.1.pom
[windows-jdk8] [INFO] Downloaded: https://repo.maven.apache.org/maven2/org/apache/maven/surefire/surefire-api/2.20.1/surefire-api-2.20.1.pom (3.7 kB at 522 kB/s)
[windows-jdk8] [INFO] Downloading: https://repo.maven.apache.org/maven2/org/apache/maven/surefire/surefire-logger-api/2.20.1/surefire-logger-api-2.20.1.pom
[windows-jdk8] [INFO] Downloaded: https://repo.maven.apache.org/maven2/org/apache/maven/surefire/surefire-logger-api/2.20.1/surefire-logger-api-2.20.1.pom (2.0 kB at 287 kB/s)
[windows-jdk8] [INFO] Downloading: https://repo.maven.apache.org/maven2/org/apache/maven/surefire/surefire-booter/2.20.1/surefire-booter-2.20.1.pom
[windows-jdk8] [INFO] Downloaded: https://repo.maven.apache.org/maven2/org/apache/maven/surefire/surefire-booter/2.20.1/surefire-booter-2.20.1.pom (8.5 kB at 1.2 MB/s)
[windows-jdk8] [INFO] Downloading: https://repo.maven.apache.org/maven2/org/apache/maven/surefire/maven-surefire-common/2.20.1/maven-surefire-common-2.20.1.jar
[windows-jdk8] [INFO] Downloading: https://repo.maven.apache.org/maven2/org/apache/maven/surefire/surefire-booter/2.20.1/surefire-booter-2.20.1.jar
[windows-jdk8] [INFO] Downloading: https://repo.maven.apache.org/maven2/org/apache/maven/surefire/surefire-logger-api/2.20.1/surefire-logger-api-2.20.1.jar
[windows-jdk8] [INFO] Downloading: https://repo.maven.apache.org/maven2/org/apache/maven/plugin-tools/maven-plugin-annotations/3.3/maven-plugin-annotations-3.3.jar
[windows-jdk8] [INFO] Downloading: https://repo.maven.apache.org/maven2/org/apache/maven/surefire/surefire-api/2.20.1/surefire-api-2.20.1.jar
[windows-jdk8] [INFO] Downloaded: https://repo.maven.apache.org/maven2/org/apache/maven/plugin-tools/maven-plugin-annotations/3.3/maven-plugin-annotations-3.3.jar (14 kB at 484 kB/s)
[windows-jdk8] [INFO] Downloading: https://repo.maven.apache.org/maven2/junit/junit/4.12/junit-4.12.jar
[windows-jdk8] [INFO] Downloaded: https://repo.maven.apache.org/maven2/org/apache/maven/surefire/surefire-booter/2.20.1/surefire-booter-2.20.1.jar (268 kB at 8.6 MB/s)
[windows-jdk8] [INFO] Downloaded: https://repo.maven.apache.org/maven2/org/apache/maven/surefire/surefire-logger-api/2.20.1/surefire-logger-api-2.20.1.jar (13 kB at 324 kB/s)
[windows-jdk8] [INFO] Downloaded: https://repo.maven.apache.org/maven2/org/apache/maven/surefire/maven-surefire-common/2.20.1/maven-surefire-common-2.20.1.jar (509 kB at 8.5 MB/s)
[windows-jdk8] [INFO] Downloaded: https://repo.maven.apache.org/maven2/junit/junit/4.12/junit-4.12.jar (315 kB at 2.5 MB/s)
[windows-jdk8] [INFO] Downloaded: https://repo.maven.apache.org/maven2/org/apache/maven/surefire/surefire-api/2.20.1/surefire-api-2.20.1.jar (183 kB at 1.4 MB/s)
[windows-jdk8] [INFO] Downloading: https://repo.maven.apache.org/maven2/org/apache/maven/surefire/surefire-junit3/2.20.1/surefire-junit3-2.20.1.pom
[windows-jdk8] [INFO] Downloaded: https://repo.maven.apache.org/maven2/org/apache/maven/surefire/surefire-junit3/2.20.1/surefire-junit3-2.20.1.pom (2.5 kB at 310 kB/s)
[windows-jdk8] [INFO] Downloading: https://repo.maven.apache.org/maven2/org/apache/maven/surefire/surefire-providers/2.20.1/surefire-providers-2.20.1.pom
[windows-jdk8] [INFO] Downloaded: https://repo.maven.apache.org/maven2/org/apache/maven/surefire/surefire-providers/2.20.1/surefire-providers-2.20.1.pom (2.6 kB at 378 kB/s)
[windows-jdk8] [INFO] Downloading: https://repo.maven.apache.org/maven2/org/apache/maven/surefire/surefire-junit3/2.20.1/surefire-junit3-2.20.1.jar
[windows-jdk8] [INFO] Downloaded: https://repo.maven.apache.org/maven2/org/apache/maven/surefire/surefire-junit3/2.20.1/surefire-junit3-2.20.1.jar (27 kB at 2.7 MB/s)
[windows-jdk8] [INFO]
[windows-jdk8] [INFO] -------------------------------------------------------
[windows-jdk8] [INFO]  T E S T S
[windows-jdk8] [INFO] -------------------------------------------------------
[windows-jdk8] [INFO] Running org.apache.maven.report.projectinfo.CiManagementReportTest
[windows-jdk7] [INFO] java-annotations mojo extractor found 17 mojo descriptors.
[windows-jdk7] [INFO] java-javadoc mojo extractor found 0 mojo descriptor.
[windows-jdk7] [INFO]
[windows-jdk7] [INFO] --- maven-resources-plugin:3.0.2:testResources (default-testResources) @ maven-project-info-reports-plugin ---
[windows-jdk7] [INFO] Using 'UTF-8' encoding to copy filtered resources.
[windows-jdk7] [INFO] Copying 22 resources
[windows-jdk7] [INFO] Copying 3 resources
[windows-jdk7] [INFO]
[windows-jdk7] [INFO] --- maven-compiler-plugin:3.7.0:testCompile (default-testCompile) @ maven-project-info-reports-plugin ---
[windows-jdk7] [INFO] Changes detected - recompiling the module!
[windows-jdk7] [INFO] Compiling 36 source files to f:\jenkins\jenkins-slave\workspace\nfo-reports-plugin_MPIR-361-USOHCFAWZ4BXXFD3QLHLQ2HOCUSPDFM5URQGLU7AUHHJFZBJBXTQ\m\target\test-classes
[windows-jdk7] [INFO] /f:/jenkins/jenkins-slave/workspace/nfo-reports-plugin_MPIR-361-USOHCFAWZ4BXXFD3QLHLQ2HOCUSPDFM5URQGLU7AUHHJFZBJBXTQ/m/src/test/java/org/apache/maven/report/projectinfo/stubs/ProjectInfoPluginArtifactStub.java: f:\jenkins\jenkins-slave\workspace\nfo-reports-plugin_MPIR-361-USOHCFAWZ4BXXFD3QLHLQ2HOCUSPDFM5URQGLU7AUHHJFZBJBXTQ\m\src\test\java\org\apache\maven\report\projectinfo\stubs\ProjectInfoPluginArtifactStub.java uses unchecked or unsafe operations.
[windows-jdk7] [INFO] /f:/jenkins/jenkins-slave/workspace/nfo-reports-plugin_MPIR-361-USOHCFAWZ4BXXFD3QLHLQ2HOCUSPDFM5URQGLU7AUHHJFZBJBXTQ/m/src/test/java/org/apache/maven/report/projectinfo/stubs/ProjectInfoPluginArtifactStub.java: Recompile with -Xlint:unchecked for details.
[windows-jdk7] [INFO]
[windows-jdk7] [INFO] --- maven-surefire-plugin:2.20.1:test (default-test) @ maven-project-info-reports-plugin ---
[windows-jdk7] [INFO] Downloading: https://repo.maven.apache.org/maven2/org/apache/maven/surefire/maven-surefire-common/2.20.1/maven-surefire-common-2.20.1.pom
[windows-jdk7] [INFO] Downloaded: https://repo.maven.apache.org/maven2/org/apache/maven/surefire/maven-surefire-common/2.20.1/maven-surefire-common-2.20.1.pom (9.3 kB at 490 kB/s)
[windows-jdk7] [INFO] Downloading: https://repo.maven.apache.org/maven2/org/apache/maven/plugin-tools/maven-plugin-annotations/3.3/maven-plugin-annotations-3.3.pom
[windows-jdk7] [INFO] Downloaded: https://repo.maven.apache.org/maven2/org/apache/maven/plugin-tools/maven-plugin-annotations/3.3/maven-plugin-annotations-3.3.pom (1.6 kB at 78 kB/s)
[windows-jdk7] [INFO] Downloading: https://repo.maven.apache.org/maven2/org/apache/maven/plugin-tools/maven-plugin-tools/3.3/maven-plugin-tools-3.3.pom
[windows-jdk7] [INFO] Downloaded: https://repo.maven.apache.org/maven2/org/apache/maven/plugin-tools/maven-plugin-tools/3.3/maven-plugin-tools-3.3.pom (13 kB at 744 kB/s)
[windows-jdk7] [INFO] Downloading: https://repo.maven.apache.org/maven2/org/apache/maven/surefire/surefire-api/2.20.1/surefire-api-2.20.1.pom
[windows-jdk7] [INFO] Downloaded: https://repo.maven.apache.org/maven2/org/apache/maven/surefire/surefire-api/2.20.1/surefire-api-2.20.1.pom (3.7 kB at 304 kB/s)
[windows-jdk7] [INFO] Downloading: https://repo.maven.apache.org/maven2/org/apache/maven/surefire/surefire-logger-api/2.20.1/surefire-logger-api-2.20.1.pom
[windows-jdk7] [INFO] Downloaded: https://repo.maven.apache.org/maven2/org/apache/maven/surefire/surefire-logger-api/2.20.1/surefire-logger-api-2.20.1.pom (2.0 kB at 223 kB/s)
[windows-jdk7] [INFO] Downloading: https://repo.maven.apache.org/maven2/org/apache/maven/surefire/surefire-booter/2.20.1/surefire-booter-2.20.1.pom
[windows-jdk7] [INFO] Downloaded: https://repo.maven.apache.org/maven2/org/apache/maven/surefire/surefire-booter/2.20.1/surefire-booter-2.20.1.pom (8.5 kB at 939 kB/s)
[windows-jdk7] [INFO] Downloading: https://repo.maven.apache.org/maven2/org/apache/maven/surefire/maven-surefire-common/2.20.1/maven-surefire-common-2.20.1.jar
[windows-jdk7] [INFO] Downloading: https://repo.maven.apache.org/maven2/org/apache/maven/surefire/surefire-logger-api/2.20.1/surefire-logger-api-2.20.1.jar
[windows-jdk7] [INFO] Downloading: https://repo.maven.apache.org/maven2/org/apache/maven/surefire/surefire-booter/2.20.1/surefire-booter-2.20.1.jar
[windows-jdk7] [INFO] Downloading: https://repo.maven.apache.org/maven2/org/apache/maven/plugin-tools/maven-plugin-annotations/3.3/maven-plugin-annotations-3.3.jar
[windows-jdk7] [INFO] Downloading: https://repo.maven.apache.org/maven2/org/apache/maven/surefire/surefire-api/2.20.1/surefire-api-2.20.1.jar
[windows-jdk7] [INFO] Downloaded: https://repo.maven.apache.org/maven2/org/apache/maven/surefire/surefire-logger-api/2.20.1/surefire-logger-api-2.20.1.jar (13 kB at 1.1 MB/s)
[windows-jdk7] [INFO] Downloading: https://repo.maven.apache.org/maven2/junit/junit/4.12/junit-4.12.jar
[windows-jdk7] [INFO] Downloaded: https://repo.maven.apache.org/maven2/org/apache/maven/plugin-tools/maven-plugin-annotations/3.3/maven-plugin-annotations-3.3.jar (14 kB at 702 kB/s)
[windows-jdk7] [INFO] Downloaded: https://repo.maven.apache.org/maven2/org/apache/maven/surefire/surefire-api/2.20.1/surefire-api-2.20.1.jar (183 kB at 7.1 MB/s)
[windows-jdk7] [INFO] Downloaded: https://repo.maven.apache.org/maven2/org/apache/maven/surefire/surefire-booter/2.20.1/surefire-booter-2.20.1.jar (268 kB at 9.9 MB/s)
[windows-jdk7] [INFO] Downloaded: https://repo.maven.apache.org/maven2/org/apache/maven/surefire/maven-surefire-common/2.20.1/maven-surefire-common-2.20.1.jar (509 kB at 14 MB/s)
[windows-jdk7] [INFO] Downloaded: https://repo.maven.apache.org/maven2/junit/junit/4.12/junit-4.12.jar (315 kB at 8.1 MB/s)
[windows-jdk7] [INFO] Downloading: https://repo.maven.apache.org/maven2/org/apache/maven/surefire/surefire-junit3/2.20.1/surefire-junit3-2.20.1.pom
[windows-jdk7] [INFO] Downloaded: https://repo.maven.apache.org/maven2/org/apache/maven/surefire/surefire-junit3/2.20.1/surefire-junit3-2.20.1.pom (2.5 kB at 248 kB/s)
[windows-jdk7] [INFO] Downloading: https://repo.maven.apache.org/maven2/org/apache/maven/surefire/surefire-providers/2.20.1/surefire-providers-2.20.1.pom
[windows-jdk7] [INFO] Downloaded: https://repo.maven.apache.org/maven2/org/apache/maven/surefire/surefire-providers/2.20.1/surefire-providers-2.20.1.pom (2.6 kB at 331 kB/s)
[windows-jdk7] [INFO] Downloading: https://repo.maven.apache.org/maven2/org/apache/maven/surefire/surefire-junit3/2.20.1/surefire-junit3-2.20.1.jar
[windows-jdk7] [INFO] Downloaded: https://repo.maven.apache.org/maven2/org/apache/maven/surefire/surefire-junit3/2.20.1/surefire-junit3-2.20.1.jar (27 kB at 2.1 MB/s)
[windows-jdk7] [INFO]
[windows-jdk7] [INFO] -------------------------------------------------------
[windows-jdk7] [INFO]  T E S T S
[windows-jdk7] [INFO] -------------------------------------------------------
[windows-jdk8] [INFO] Tests run: 1, Failures: 0, Errors: 0, Skipped: 0, Time elapsed: 2.9 s - in org.apache.maven.report.projectinfo.CiManagementReportTest
[windows-jdk8] [INFO] Running org.apache.maven.report.projectinfo.DependencyConvergenceReportTest
[windows-jdk8] [INFO] Tests run: 1, Failures: 0, Errors: 0, Skipped: 0, Time elapsed: 0.315 s - in org.apache.maven.report.projectinfo.DependencyConvergenceReportTest
[windows-jdk8] [INFO] Running org.apache.maven.report.projectinfo.DependencyManagementReportTest
[windows-jdk7] [INFO] Running org.apache.maven.report.projectinfo.CiManagementReportTest
[windows-jdk8] [INFO] Tests run: 1, Failures: 0, Errors: 0, Skipped: 0, Time elapsed: 0.25 s - in org.apache.maven.report.projectinfo.DependencyManagementReportTest
[windows-jdk8] [INFO] Running org.apache.maven.report.projectinfo.IndexReportTest
[windows-jdk8] [INFO] Tests run: 1, Failures: 0, Errors: 0, Skipped: 0, Time elapsed: 0.17 s - in org.apache.maven.report.projectinfo.IndexReportTest
[windows-jdk8] [INFO] Running org.apache.maven.report.projectinfo.IssueManagementReportTest
[windows-jdk8] [INFO] Tests run: 1, Failures: 0, Errors: 0, Skipped: 0, Time elapsed: 0.19 s - in org.apache.maven.report.projectinfo.IssueManagementReportTest
[windows-jdk8] [INFO] Running org.apache.maven.report.projectinfo.LicensesReportTest
[windows-jdk8] [INFO] Tests run: 2, Failures: 0, Errors: 0, Skipped: 0, Time elapsed: 0.642 s - in org.apache.maven.report.projectinfo.LicensesReportTest
[windows-jdk8] [INFO] Running org.apache.maven.report.projectinfo.MailingListsReportTest
[windows-jdk8] [INFO] Tests run: 3, Failures: 0, Errors: 0, Skipped: 0, Time elapsed: 0.305 s - in org.apache.maven.report.projectinfo.MailingListsReportTest
[windows-jdk8] [INFO] Running org.apache.maven.report.projectinfo.ModulesReportTest
[windows-jdk8] [WARNING] Module subproject1 not found in reactor: loading locally
[windows-jdk8] [WARNING] Module subproject2 not found in reactor: loading locally
[windows-jdk8] [INFO] Tests run: 2, Failures: 0, Errors: 0, Skipped: 0, Time elapsed: 0.339 s - in org.apache.maven.report.projectinfo.ModulesReportTest
[windows-jdk8] [INFO] Running org.apache.maven.report.projectinfo.PluginManagementReportTest
[windows-jdk8] [INFO] Tests run: 1, Failures: 0, Errors: 0, Skipped: 0, Time elapsed: 0.17 s - in org.apache.maven.report.projectinfo.PluginManagementReportTest
[windows-jdk8] [INFO] Running org.apache.maven.report.projectinfo.ProjectInfoReportUtilsTest
[windows-jdk9] ERROR: Error fetching remote repo 'origin'
[windows-jdk9] hudson.plugins.git.GitException: Failed to fetch from https://gitbox.apache.org/repos/asf/maven-project-info-reports-plugin.git
[windows-jdk9] at hudson.plugins.git.GitSCM.fetchFrom(GitSCM.java:825)
[windows-jdk9] at hudson.plugins.git.GitSCM.retrieveChanges(GitSCM.java:1092)
[windows-jdk9] at hudson.plugins.git.GitSCM.checkout(GitSCM.java:1123)
[windows-jdk9] at org.jenkinsci.plugins.workflow.steps.scm.SCMStep.checkout(SCMStep.java:113)
[windows-jdk9] at org.jenkinsci.plugins.workflow.steps.scm.SCMStep$StepExecutionImpl.run(SCMStep.java:85)
[windows-jdk9] at org.jenkinsci.plugins.workflow.steps.scm.SCMStep$StepExecutionImpl.run(SCMStep.java:75)
[windows-jdk9] at org.jenkinsci.plugins.workflow.steps.AbstractSynchronousNonBlockingStepExecution$1$1.call(AbstractSynchronousNonBlockingStepExecution.java:47)
[windows-jdk9] at hudson.security.ACL.impersonate(ACL.java:260)
[windows-jdk9] at org.jenkinsci.plugins.workflow.steps.AbstractSynchronousNonBlockingStepExecution$1.run(AbstractSynchronousNonBlockingStepExecution.java:44)
[windows-jdk9] at java.util.concurrent.Executors$RunnableAdapter.call(Executors.java:511)
[windows-jdk9] at java.util.concurrent.FutureTask.run(FutureTask.java:266)
[windows-jdk9] at java.util.concurrent.ThreadPoolExecutor.runWorker(ThreadPoolExecutor.java:1149)
[windows-jdk9] at java.util.concurrent.ThreadPoolExecutor$Worker.run(ThreadPoolExecutor.java:624)
[windows-jdk9] at java.lang.Thread.run(Thread.java:748)
[windows-jdk9] Caused by: hudson.plugins.git.GitException: Command "git fetch --no-tags --progress https://gitbox.apache.org/repos/asf/maven-project-info-reports-plugin.git +refs/heads/*:refs/remotes/origin/*" returned status code 128:
[windows-jdk9] stdout:
[windows-jdk9] stderr: fatal: unable to access 'https://gitbox.apache.org/repos/asf/maven-project-info-reports-plugin.git/': Empty reply from server
[windows-jdk9]
[windows-jdk9] at org.jenkinsci.plugins.gitclient.CliGitAPIImpl.launchCommandIn(CliGitAPIImpl.java:1970)
[windows-jdk9] at org.jenkinsci.plugins.gitclient.CliGitAPIImpl.launchCommandWithCredentials(CliGitAPIImpl.java:1689)
[windows-jdk9] at org.jenkinsci.plugins.gitclient.CliGitAPIImpl.access$300(CliGitAPIImpl.java:71)
[windows-jdk9] at org.jenkinsci.plugins.gitclient.CliGitAPIImpl$1.execute(CliGitAPIImpl.java:380)
[windows-jdk9] at org.jenkinsci.plugins.gitclient.RemoteGitImpl$CommandInvocationHandler$1.call(RemoteGitImpl.java:153)
[windows-jdk9] at org.jenkinsci.plugins.gitclient.RemoteGitImpl$CommandInvocationHandler$1.call(RemoteGitImpl.java:146)
[windows-jdk9] at hudson.remoting.UserRequest.perform(UserRequest.java:153)
[windows-jdk9] at hudson.remoting.UserRequest.perform(UserRequest.java:50)
[windows-jdk9] at hudson.remoting.Request$2.run(Request.java:336)
[windows-jdk9] at hudson.remoting.InterceptingExecutorService$1.call(InterceptingExecutorService.java:68)
[windows-jdk9] at java.util.concurrent.FutureTask.run(Unknown Source)
[windows-jdk9] at java.util.concurrent.ThreadPoolExecutor.runWorker(Unknown Source)
[windows-jdk9] at java.util.concurrent.ThreadPoolExecutor$Worker.run(Unknown Source)
[windows-jdk9] at hudson.remoting.Engine$1$1.run(Engine.java:94)
[windows-jdk9] at java.lang.Thread.run(Unknown Source)
[windows-jdk9] Suppressed: hudson.remoting.Channel$CallSiteStackTrace: Remote call to JNLP4-connect connection from 37.48.69.226/37.48.69.226:54801
[windows-jdk9] at hudson.remoting.Channel.attachCallSiteStackTrace(Channel.java:1693)
[windows-jdk9] at hudson.remoting.UserResponse.retrieve(UserRequest.java:310)
[windows-jdk9] at hudson.remoting.Channel.call(Channel.java:908)
[windows-jdk9] at org.jenkinsci.plugins.gitclient.RemoteGitImpl$CommandInvocationHandler.execute(RemoteGitImpl.java:146)
[windows-jdk9] at sun.reflect.GeneratedMethodAccessor728.invoke(Unknown Source)
[windows-jdk9] at sun.reflect.DelegatingMethodAccessorImpl.invoke(DelegatingMethodAccessorImpl.java:43)
[windows-jdk9] at java.lang.reflect.Method.invoke(Method.java:498)
[windows-jdk9] at org.jenkinsci.plugins.gitclient.RemoteGitImpl$CommandInvocationHandler.invoke(RemoteGitImpl.java:132)
[windows-jdk9] at com.sun.proxy.$Proxy111.execute(Unknown Source)
[windows-jdk9] at hudson.plugins.git.GitSCM.fetchFrom(GitSCM.java:823)
[windows-jdk9] at hudson.plugins.git.GitSCM.retrieveChanges(GitSCM.java:1092)
[windows-jdk9] at hudson.plugins.git.GitSCM.checkout(GitSCM.java:1123)
[windows-jdk9] at org.jenkinsci.plugins.workflow.steps.scm.SCMStep.checkout(SCMStep.java:113)
[windows-jdk9] at org.jenkinsci.plugins.workflow.steps.scm.SCMStep$StepExecutionImpl.run(SCMStep.java:85)
[windows-jdk9] at org.jenkinsci.plugins.workflow.steps.scm.SCMStep$StepExecutionImpl.run(SCMStep.java:75)
[windows-jdk9] at org.jenkinsci.plugins.workflow.steps.AbstractSynchronousNonBlockingStepExecution$1$1.call(AbstractSynchronousNonBlockingStepExecution.java:47)
[windows-jdk9] at hudson.security.ACL.impersonate(ACL.java:260)
[windows-jdk9] at org.jenkinsci.plugins.workflow.steps.AbstractSynchronousNonBlockingStepExecution$1.run(AbstractSynchronousNonBlockingStepExecution.java:44)
[windows-jdk9] at java.util.concurrent.Executors$RunnableAdapter.call(Executors.java:511)
[windows-jdk9] at java.util.concurrent.FutureTask.run(FutureTask.java:266)
[windows-jdk9] at java.util.concurrent.ThreadPoolExecutor.runWorker(ThreadPoolExecutor.java:1149)
[windows-jdk9] at java.util.concurrent.ThreadPoolExecutor$Worker.run(ThreadPoolExecutor.java:624)
[windows-jdk9] at java.lang.Thread.run(Thread.java:748)
[windows-jdk8] [INFO] Tests run: 1, Failures: 0, Errors: 0, Skipped: 0, Time elapsed: 1.592 s - in org.apache.maven.report.projectinfo.ProjectInfoReportUtilsTest
[windows-jdk8] [INFO] Running org.apache.maven.report.projectinfo.ScmReportTest
[Pipeline] [windows-jdk9] }
[Pipeline] [windows-jdk9] // dir
[windows-jdk8] [INFO] Tests run: 2, Failures: 0, Errors: 0, Skipped: 0, Time elapsed: 0.306 s - in org.apache.maven.report.projectinfo.ScmReportTest
[windows-jdk8] [INFO] Running org.apache.maven.report.projectinfo.SummaryReportTest
[windows-jdk8] [INFO] Tests run: 1, Failures: 0, Errors: 0, Skipped: 0, Time elapsed: 0.109 s - in org.apache.maven.report.projectinfo.SummaryReportTest
[windows-jdk8] [INFO] Running org.apache.maven.report.projectinfo.TeamReportTest
[windows-jdk7] [INFO] Tests run: 1, Failures: 0, Errors: 0, Skipped: 0, Time elapsed: 3.403 s - in org.apache.maven.report.projectinfo.CiManagementReportTest
[windows-jdk7] [INFO] Running org.apache.maven.report.projectinfo.DependencyConvergenceReportTest
[windows-jdk7] [INFO] Tests run: 1, Failures: 0, Errors: 0, Skipped: 0, Time elapsed: 0.242 s - in org.apache.maven.report.projectinfo.DependencyConvergenceReportTest
[windows-jdk7] [INFO] Running org.apache.maven.report.projectinfo.DependencyManagementReportTest
[windows-jdk8] [INFO] Tests run: 1, Failures: 0, Errors: 0, Skipped: 0, Time elapsed: 0.114 s - in org.apache.maven.report.projectinfo.TeamReportTest
[Pipeline] [windows-jdk9] echo
[windows-jdk9] [FAIL FAST] This is the first failure and likely root cause
[Pipeline] [windows-jdk9] }
[Pipeline] [windows-jdk9] // stage
[Pipeline] [windows-jdk9] }
[Pipeline] [windows-jdk9] // node
[Pipeline] [windows-jdk9] }
[windows-jdk7] Sending interrupt signal to process
[windows-jdk7] [INFO] Tests run: 1, Failures: 0, Errors: 0, Skipped: 0, Time elapsed: 0.396 s - in org.apache.maven.report.projectinfo.DependencyManagementReportTest
[windows-jdk7] [INFO] Running org.apache.maven.report.projectinfo.IndexReportTest
[windows-jdk8] Sending interrupt signal to process
[windows-jdk9] Failed in branch windows-jdk9
[windows-jdk7] [INFO] Tests run: 1, Failures: 0, Errors: 0, Skipped: 0, Time elapsed: 0.278 s - in org.apache.maven.report.projectinfo.IndexReportTest
[windows-jdk7] [INFO] Running org.apache.maven.report.projectinfo.IssueManagementReportTest
[Pipeline] [linux-jdk7] // node
[Pipeline] [linux-jdk8] // node
[Pipeline] [linux-jdk9] // node
[Pipeline] [linux-jdk7] }
[linux-jdk7] Failed in branch linux-jdk7
[Pipeline] [linux-jdk8] }
[linux-jdk8] Failed in branch linux-jdk8
[Pipeline] [linux-jdk9] }
[linux-jdk9] Failed in branch linux-jdk9
[Pipeline] [windows-jdk7] }
[Pipeline] [windows-jdk7] // dir
[Pipeline] [windows-jdk7] }
[windows-jdk7] [withMaven] One or multiple Maven executions have been ignored by the Jenkins Pipeline Maven Plugin because they have been interrupted before completion (1). See Pipeline Maven Plugin FAQ for more details.
[Pipeline] [windows-jdk7] // withMaven
[Pipeline] [windows-jdk7] echo
[windows-jdk7] [FAIL FAST] windows-jdk9 had first failure, ignoring script returned exit code -1
[Pipeline] [windows-jdk7] }
[Pipeline] [windows-jdk8] }
[Pipeline] [windows-jdk7] // stage
[Pipeline] [windows-jdk8] // dir
[Pipeline] [windows-jdk7] }
[Pipeline] [windows-jdk8] }
[windows-jdk8] [withMaven] One or multiple Maven executions have been ignored by the Jenkins Pipeline Maven Plugin because they have been interrupted before completion (1). See Pipeline Maven Plugin FAQ for more details.
[Pipeline] [windows-jdk7] // node
[Pipeline] [windows-jdk8] // withMaven
[Pipeline] [windows-jdk7] }
[Pipeline] [windows-jdk8] echo
[windows-jdk8] [FAIL FAST] windows-jdk9 had first failure, ignoring script returned exit code -1
[Pipeline] [windows-jdk8] }
[Pipeline] [windows-jdk8] // stage
[Pipeline] [windows-jdk8] }
[Pipeline] [windows-jdk8] // node
[Pipeline] [windows-jdk8] }
[Pipeline] // parallel
[Pipeline] echo
***** FAST FAILURE *****

Fast failure triggered by windows-jdk9

***** FAST FAILURE *****
[Pipeline] stage
[Pipeline] { (Notifications)
[Pipeline] echo
Build result: FAILURE
[Pipeline] jiraIssueSelector
[Pipeline] emailext