Build failed in Jenkins: Maven TLP » maven-pmd-plugin » MPMD-266 #1

classic Classic list List threaded Threaded
2 messages Options
Reply | Threaded
Open this post in threaded view
|

Build failed in Jenkins: Maven TLP » maven-pmd-plugin » MPMD-266 #1

Apache Jenkins Server-2
See https://builds.apache.org/job/maven-box/job/maven-pmd-plugin/job/MPMD-266/1/

No changes.

All tests passed

Build log:
[...truncated 10.48 MB...]
[linux-jdk10-m3.5.x_build] [INFO] run post-build script verify.groovy
[linux-jdk10-m3.5.x_build] [INFO]           mpmd-168/pom.xml ................................. SUCCESS (14.3 s)
[linux-jdk10-m3.5.x_build] [INFO] Building: MPMD-187/pom.xml
[linux-jdk11-m3.5.x_build] [INFO] run post-build script verify.groovy
[linux-jdk11-m3.5.x_build] [INFO]           MPMD-266-typeresolution-aggregated/pom.xml ....... SUCCESS (18.0 s)
[linux-jdk11-m3.5.x_build] [INFO] Building: MPMD-172/pom.xml
[linux-jdk10-m3.5.x_build] [INFO] run post-build script verify.groovy
[linux-jdk10-m3.5.x_build] [INFO]           MPMD-187/pom.xml ................................. SUCCESS (6.0 s)
[linux-jdk10-m3.5.x_build] [INFO] Building: mpmd-138/pom.xml
[linux-jdk11-m3.5.x_build] [INFO] run post-build script verify.groovy
[linux-jdk11-m3.5.x_build] [INFO]           MPMD-172/pom.xml ................................. SUCCESS (6.9 s)
[linux-jdk11-m3.5.x_build] [INFO] Building: MPMD-165/pom.xml
[linux-jdk11-m3.5.x_build] [INFO] run post-build script verify.groovy
[linux-jdk11-m3.5.x_build] [INFO]           MPMD-165/pom.xml ................................. SUCCESS (5.1 s)
[linux-jdk11-m3.5.x_build] [INFO]
[linux-jdk11-m3.5.x_build] [INFO] --- maven-checkstyle-plugin:3.0.0:check (checkstyle-check) @ maven-pmd-plugin ---
[linux-jdk11-m3.5.x_build] [INFO] Downloading from central: https://repo.maven.apache.org/maven2/org/apache/maven/shared/maven-shared-resources/2/maven-shared-resources-2.pom
[linux-jdk11-m3.5.x_build] [INFO] Downloaded from central: https://repo.maven.apache.org/maven2/org/apache/maven/shared/maven-shared-resources/2/maven-shared-resources-2.pom (3.0 kB at 197 kB/s)
[linux-jdk11-m3.5.x_build] [INFO] Downloading from central: https://repo.maven.apache.org/maven2/org/codehaus/plexus/plexus-utils/3.0.10/plexus-utils-3.0.10.pom
[linux-jdk11-m3.5.x_build] [INFO] Downloaded from central: https://repo.maven.apache.org/maven2/org/codehaus/plexus/plexus-utils/3.0.10/plexus-utils-3.0.10.pom (3.1 kB at 262 kB/s)
[linux-jdk11-m3.5.x_build] [INFO] Downloading from central: https://repo.maven.apache.org/maven2/org/codehaus/plexus/plexus/3.3/plexus-3.3.pom
[linux-jdk11-m3.5.x_build] [INFO] Downloaded from central: https://repo.maven.apache.org/maven2/org/codehaus/plexus/plexus/3.3/plexus-3.3.pom (20 kB at 1.7 MB/s)
[linux-jdk11-m3.5.x_build] [INFO] Downloading from central: https://repo.maven.apache.org/maven2/org/apache/maven/doxia/doxia-integration-tools/1.6/doxia-integration-tools-1.6.pom
[linux-jdk11-m3.5.x_build] [INFO] Downloaded from central: https://repo.maven.apache.org/maven2/org/apache/maven/doxia/doxia-integration-tools/1.6/doxia-integration-tools-1.6.pom (7.0 kB at 535 kB/s)
[linux-jdk11-m3.5.x_build] [INFO] Downloading from central: https://repo.maven.apache.org/maven2/org/apache/maven/doxia/doxia-tools/3/doxia-tools-3.pom
[linux-jdk11-m3.5.x_build] [INFO] Downloaded from central: https://repo.maven.apache.org/maven2/org/apache/maven/doxia/doxia-tools/3/doxia-tools-3.pom (9.9 kB at 827 kB/s)
[linux-jdk11-m3.5.x_build] [INFO] Downloading from central: https://repo.maven.apache.org/maven2/org/codehaus/plexus/plexus-resources/1.1.0/plexus-resources-1.1.0.pom
[linux-jdk11-m3.5.x_build] [INFO] Downloaded from central: https://repo.maven.apache.org/maven2/org/codehaus/plexus/plexus-resources/1.1.0/plexus-resources-1.1.0.pom (3.2 kB at 265 kB/s)
[linux-jdk11-m3.5.x_build] [INFO] Downloading from central: https://repo.maven.apache.org/maven2/com/puppycrawl/tools/checkstyle/6.18/checkstyle-6.18.pom
[linux-jdk11-m3.5.x_build] [INFO] Downloaded from central: https://repo.maven.apache.org/maven2/com/puppycrawl/tools/checkstyle/6.18/checkstyle-6.18.pom (71 kB at 4.7 MB/s)
[linux-jdk11-m3.5.x_build] [INFO] Downloading from central: https://repo.maven.apache.org/maven2/antlr/antlr/2.7.7/antlr-2.7.7.pom
[linux-jdk11-m3.5.x_build] [INFO] Downloaded from central: https://repo.maven.apache.org/maven2/antlr/antlr/2.7.7/antlr-2.7.7.pom (632 B at 53 kB/s)
[linux-jdk11-m3.5.x_build] [INFO] Downloading from central: https://repo.maven.apache.org/maven2/org/antlr/antlr4-runtime/4.5.3/antlr4-runtime-4.5.3.pom
[linux-jdk11-m3.5.x_build] [INFO] Downloaded from central: https://repo.maven.apache.org/maven2/org/antlr/antlr4-runtime/4.5.3/antlr4-runtime-4.5.3.pom (2.3 kB at 210 kB/s)
[linux-jdk11-m3.5.x_build] [INFO] Downloading from central: https://repo.maven.apache.org/maven2/org/antlr/antlr4-master/4.5.3/antlr4-master-4.5.3.pom
[linux-jdk11-m3.5.x_build] [INFO] Downloaded from central: https://repo.maven.apache.org/maven2/org/antlr/antlr4-master/4.5.3/antlr4-master-4.5.3.pom (3.7 kB at 307 kB/s)
[linux-jdk11-m3.5.x_build] [INFO] Downloading from central: https://repo.maven.apache.org/maven2/commons-beanutils/commons-beanutils/1.9.2/commons-beanutils-1.9.2.pom
[linux-jdk11-m3.5.x_build] [INFO] Downloaded from central: https://repo.maven.apache.org/maven2/commons-beanutils/commons-beanutils/1.9.2/commons-beanutils-1.9.2.pom (14 kB at 1.1 MB/s)
[linux-jdk11-m3.5.x_build] [INFO] Downloading from central: https://repo.maven.apache.org/maven2/org/apache/commons/commons-parent/33/commons-parent-33.pom
[linux-jdk11-m3.5.x_build] [INFO] Downloaded from central: https://repo.maven.apache.org/maven2/org/apache/commons/commons-parent/33/commons-parent-33.pom (53 kB at 4.1 MB/s)
[linux-jdk11-m3.5.x_build] [INFO] Downloading from central: https://repo.maven.apache.org/maven2/commons-cli/commons-cli/1.3.1/commons-cli-1.3.1.pom
[linux-jdk11-m3.5.x_build] [INFO] Downloaded from central: https://repo.maven.apache.org/maven2/commons-cli/commons-cli/1.3.1/commons-cli-1.3.1.pom (10 kB at 866 kB/s)
[linux-jdk11-m3.5.x_build] [INFO] Downloading from central: https://repo.maven.apache.org/maven2/com/google/guava/guava/19.0/guava-19.0.pom
[linux-jdk11-m3.5.x_build] [INFO] Downloaded from central: https://repo.maven.apache.org/maven2/com/google/guava/guava/19.0/guava-19.0.pom (6.8 kB at 566 kB/s)
[linux-jdk11-m3.5.x_build] [INFO] Downloading from central: https://repo.maven.apache.org/maven2/com/google/guava/guava-parent/19.0/guava-parent-19.0.pom
[linux-jdk11-m3.5.x_build] [INFO] Downloaded from central: https://repo.maven.apache.org/maven2/com/google/guava/guava-parent/19.0/guava-parent-19.0.pom (9.9 kB at 760 kB/s)
[linux-jdk11-m3.5.x_build] [INFO] Downloading from central: https://repo.maven.apache.org/maven2/javax/xml/bind/jaxb-api/2.3.0/jaxb-api-2.3.0.pom
[linux-jdk11-m3.5.x_build] [INFO] Downloaded from central: https://repo.maven.apache.org/maven2/javax/xml/bind/jaxb-api/2.3.0/jaxb-api-2.3.0.pom (23 kB at 1.6 MB/s)
[linux-jdk11-m3.5.x_build] [INFO] Downloading from central: https://repo.maven.apache.org/maven2/javax/xml/bind/jaxb-api-parent/2.3.0/jaxb-api-parent-2.3.0.pom
[linux-jdk11-m3.5.x_build] [INFO] Downloaded from central: https://repo.maven.apache.org/maven2/javax/xml/bind/jaxb-api-parent/2.3.0/jaxb-api-parent-2.3.0.pom (5.6 kB at 434 kB/s)
[linux-jdk11-m3.5.x_build] [INFO] Downloading from central: https://repo.maven.apache.org/maven2/net/java/jvnet-parent/5/jvnet-parent-5.pom
[linux-jdk11-m3.5.x_build] [INFO] Downloaded from central: https://repo.maven.apache.org/maven2/net/java/jvnet-parent/5/jvnet-parent-5.pom (8.9 kB at 739 kB/s)
[linux-jdk11-m3.5.x_build] [INFO] Downloading from central: https://repo.maven.apache.org/maven2/org/apache/maven/shared/maven-shared-resources/2/maven-shared-resources-2.jar
[linux-jdk11-m3.5.x_build] [INFO] Downloading from central: https://repo.maven.apache.org/maven2/commons-logging/commons-logging/1.0.4/commons-logging-1.0.4.jar
[linux-jdk11-m3.5.x_build] [INFO] Downloading from central: https://repo.maven.apache.org/maven2/commons-digester/commons-digester/1.6/commons-digester-1.6.jar
[linux-jdk11-m3.5.x_build] [INFO] Downloading from central: https://repo.maven.apache.org/maven2/org/apache/maven/doxia/doxia-core/1.2/doxia-core-1.2.jar
[linux-jdk11-m3.5.x_build] [INFO] Downloading from central: https://repo.maven.apache.org/maven2/org/apache/maven/doxia/doxia-integration-tools/1.6/doxia-integration-tools-1.6.jar
[linux-jdk11-m3.5.x_build] [INFO] Downloaded from central: https://repo.maven.apache.org/maven2/org/apache/maven/doxia/doxia-integration-tools/1.6/doxia-integration-tools-1.6.jar (45 kB at 2.3 MB/s)
[linux-jdk11-m3.5.x_build] [INFO] Downloading from central: https://repo.maven.apache.org/maven2/commons-io/commons-io/1.4/commons-io-1.4.jar
[linux-jdk11-m3.5.x_build] [INFO] Downloaded from central: https://repo.maven.apache.org/maven2/org/apache/maven/shared/maven-shared-resources/2/maven-shared-resources-2.jar (13 kB at 594 kB/s)
[linux-jdk11-m3.5.x_build] [INFO] Downloaded from central: https://repo.maven.apache.org/maven2/org/apache/maven/doxia/doxia-core/1.2/doxia-core-1.2.jar (154 kB at 6.7 MB/s)
[linux-jdk11-m3.5.x_build] [INFO] Downloading from central: https://repo.maven.apache.org/maven2/com/puppycrawl/tools/checkstyle/6.18/checkstyle-6.18.jar
[linux-jdk11-m3.5.x_build] [INFO] Downloaded from central: https://repo.maven.apache.org/maven2/commons-digester/commons-digester/1.6/commons-digester-1.6.jar (168 kB at 8.0 MB/s)
[linux-jdk11-m3.5.x_build] [INFO] Downloading from central: https://repo.maven.apache.org/maven2/antlr/antlr/2.7.7/antlr-2.7.7.jar
[linux-jdk11-m3.5.x_build] [INFO] Downloaded from central: https://repo.maven.apache.org/maven2/commons-logging/commons-logging/1.0.4/commons-logging-1.0.4.jar (38 kB at 1.7 MB/s)
[linux-jdk11-m3.5.x_build] [INFO] Downloading from central: https://repo.maven.apache.org/maven2/org/codehaus/plexus/plexus-resources/1.1.0/plexus-resources-1.1.0.jar
[linux-jdk11-m3.5.x_build] [INFO] Downloading from central: https://repo.maven.apache.org/maven2/org/antlr/antlr4-runtime/4.5.3/antlr4-runtime-4.5.3.jar
[linux-jdk11-m3.5.x_build] [INFO] Downloaded from central: https://repo.maven.apache.org/maven2/org/codehaus/plexus/plexus-resources/1.1.0/plexus-resources-1.1.0.jar (23 kB at 566 kB/s)
[linux-jdk11-m3.5.x_build] [INFO] Downloading from central: https://repo.maven.apache.org/maven2/commons-beanutils/commons-beanutils/1.9.2/commons-beanutils-1.9.2.jar
[linux-jdk11-m3.5.x_build] [INFO] Downloaded from central: https://repo.maven.apache.org/maven2/commons-io/commons-io/1.4/commons-io-1.4.jar (109 kB at 2.5 MB/s)
[linux-jdk11-m3.5.x_build] [INFO] Downloading from central: https://repo.maven.apache.org/maven2/commons-cli/commons-cli/1.3.1/commons-cli-1.3.1.jar
[linux-jdk11-m3.5.x_build] [INFO] Downloaded from central: https://repo.maven.apache.org/maven2/org/antlr/antlr4-runtime/4.5.3/antlr4-runtime-4.5.3.jar (302 kB at 5.9 MB/s)
[linux-jdk11-m3.5.x_build] [INFO] Downloading from central: https://repo.maven.apache.org/maven2/com/google/guava/guava/19.0/guava-19.0.jar
[linux-jdk11-m3.5.x_build] [INFO] Downloaded from central: https://repo.maven.apache.org/maven2/antlr/antlr/2.7.7/antlr-2.7.7.jar (445 kB at 8.6 MB/s)
[linux-jdk11-m3.5.x_build] [INFO] Downloading from central: https://repo.maven.apache.org/maven2/commons-lang/commons-lang/2.1/commons-lang-2.1.jar
[linux-jdk11-m3.5.x_build] [INFO] Downloaded from central: https://repo.maven.apache.org/maven2/commons-beanutils/commons-beanutils/1.9.2/commons-beanutils-1.9.2.jar (234 kB at 3.7 MB/s)
[linux-jdk11-m3.5.x_build] [INFO] Downloading from central: https://repo.maven.apache.org/maven2/javax/xml/bind/jaxb-api/2.3.0/jaxb-api-2.3.0.jar
[linux-jdk11-m3.5.x_build] [INFO] Downloaded from central: https://repo.maven.apache.org/maven2/commons-cli/commons-cli/1.3.1/commons-cli-1.3.1.jar (53 kB at 791 kB/s)
[linux-jdk11-m3.5.x_build] [INFO] Downloaded from central: https://repo.maven.apache.org/maven2/com/puppycrawl/tools/checkstyle/6.18/checkstyle-6.18.jar (1.2 MB at 17 MB/s)
[linux-jdk11-m3.5.x_build] [INFO] Downloaded from central: https://repo.maven.apache.org/maven2/commons-lang/commons-lang/2.1/commons-lang-2.1.jar (208 kB at 2.9 MB/s)
[linux-jdk11-m3.5.x_build] [INFO] Downloaded from central: https://repo.maven.apache.org/maven2/javax/xml/bind/jaxb-api/2.3.0/jaxb-api-2.3.0.jar (126 kB at 1.6 MB/s)
[linux-jdk11-m3.5.x_build] [INFO] Downloaded from central: https://repo.maven.apache.org/maven2/com/google/guava/guava/19.0/guava-19.0.jar (2.3 MB at 20 MB/s)
[linux-jdk11-m3.5.x_build] [INFO] There is 1 error reported by Checkstyle 6.18 with config/maven_checks.xml ruleset.
[linux-jdk11-m3.5.x_build] [ERROR] src/main/java/org/apache/maven/plugins/pmd/PmdReport.java:[745,96] (whitespace) ParenPad: ')' is not preceded with whitespace.
[linux-jdk11-m3.5.x_build] [INFO] ------------------------------------------------------------------------
[linux-jdk11-m3.5.x_build] [INFO] BUILD FAILURE
[linux-jdk11-m3.5.x_build] [INFO] ------------------------------------------------------------------------
[linux-jdk11-m3.5.x_build] [INFO] Total time: 04:44 min
[linux-jdk11-m3.5.x_build] [INFO] Finished at: 2018-10-11T19:46:23Z
[linux-jdk11-m3.5.x_build] [INFO] ------------------------------------------------------------------------
[linux-jdk11-m3.5.x_build] [INFO] [jenkins-event-spy] Generated /home/jenkins/jenkins-slave/workspace/x_maven-pmd-plugin_MPMD-266-KO4DEQSQU6LULLR6I6VDVZF2RKZRIL5NFCHXXO6Q3PB4DD6OJT6Q@2@tmp/withMaven43e7ad50/maven-spy-20181011-194139-4889965195896162629183.log
[linux-jdk11-m3.5.x_build] [ERROR] Failed to execute goal org.apache.maven.plugins:maven-checkstyle-plugin:3.0.0:check (checkstyle-check) on project maven-pmd-plugin: You have 1 Checkstyle violation. -> [Help 1]
[linux-jdk11-m3.5.x_build] [ERROR]
[linux-jdk11-m3.5.x_build] [ERROR] To see the full stack trace of the errors, re-run Maven with the -e switch.
[linux-jdk11-m3.5.x_build] [ERROR] Re-run Maven using the -X switch to enable full debug logging.
[linux-jdk11-m3.5.x_build] [ERROR]
[linux-jdk11-m3.5.x_build] [ERROR] For more information about the errors and possible solutions, please read the following articles:
[linux-jdk11-m3.5.x_build] [ERROR] [Help 1] http://cwiki.apache.org/confluence/display/MAVEN/MojoFailureException
[Pipeline] [linux-jdk11-m3.5.x_build] }
[Pipeline] [linux-jdk11-m3.5.x_build] // dir
[linux-jdk10-m3.5.x_build] [INFO] run post-build script verify.groovy
[linux-jdk10-m3.5.x_build] [INFO]           mpmd-138/pom.xml ................................. SUCCESS (13.1 s)
[linux-jdk10-m3.5.x_build] [INFO]
[linux-jdk10-m3.5.x_build] [INFO] --- maven-checkstyle-plugin:3.0.0:check (checkstyle-check) @ maven-pmd-plugin ---
[linux-jdk10-m3.5.x_build] [INFO] Downloading from central: https://repo.maven.apache.org/maven2/org/apache/maven/shared/maven-shared-resources/2/maven-shared-resources-2.pom
[linux-jdk10-m3.5.x_build] [INFO] Downloaded from central: https://repo.maven.apache.org/maven2/org/apache/maven/shared/maven-shared-resources/2/maven-shared-resources-2.pom (3.0 kB at 185 kB/s)
[linux-jdk10-m3.5.x_build] [INFO] Downloading from central: https://repo.maven.apache.org/maven2/org/codehaus/plexus/plexus-utils/3.0.10/plexus-utils-3.0.10.pom
[linux-jdk10-m3.5.x_build] [INFO] Downloaded from central: https://repo.maven.apache.org/maven2/org/codehaus/plexus/plexus-utils/3.0.10/plexus-utils-3.0.10.pom (3.1 kB at 242 kB/s)
[linux-jdk10-m3.5.x_build] [INFO] Downloading from central: https://repo.maven.apache.org/maven2/org/codehaus/plexus/plexus/3.3/plexus-3.3.pom
[linux-jdk10-m3.5.x_build] [INFO] Downloaded from central: https://repo.maven.apache.org/maven2/org/codehaus/plexus/plexus/3.3/plexus-3.3.pom (20 kB at 1.5 MB/s)
[linux-jdk10-m3.5.x_build] [INFO] Downloading from central: https://repo.maven.apache.org/maven2/org/apache/maven/doxia/doxia-integration-tools/1.6/doxia-integration-tools-1.6.pom
[linux-jdk10-m3.5.x_build] [INFO] Downloaded from central: https://repo.maven.apache.org/maven2/org/apache/maven/doxia/doxia-integration-tools/1.6/doxia-integration-tools-1.6.pom (7.0 kB at 580 kB/s)
[linux-jdk10-m3.5.x_build] [INFO] Downloading from central: https://repo.maven.apache.org/maven2/org/apache/maven/doxia/doxia-tools/3/doxia-tools-3.pom
[linux-jdk10-m3.5.x_build] [INFO] Downloaded from central: https://repo.maven.apache.org/maven2/org/apache/maven/doxia/doxia-tools/3/doxia-tools-3.pom (9.9 kB at 827 kB/s)
[linux-jdk10-m3.5.x_build] [INFO] Downloading from central: https://repo.maven.apache.org/maven2/org/codehaus/plexus/plexus-resources/1.1.0/plexus-resources-1.1.0.pom
[linux-jdk10-m3.5.x_build] [INFO] Downloaded from central: https://repo.maven.apache.org/maven2/org/codehaus/plexus/plexus-resources/1.1.0/plexus-resources-1.1.0.pom (3.2 kB at 289 kB/s)
[linux-jdk10-m3.5.x_build] [INFO] Downloading from central: https://repo.maven.apache.org/maven2/com/puppycrawl/tools/checkstyle/6.18/checkstyle-6.18.pom
[linux-jdk10-m3.5.x_build] [INFO] Downloaded from central: https://repo.maven.apache.org/maven2/com/puppycrawl/tools/checkstyle/6.18/checkstyle-6.18.pom (71 kB at 4.4 MB/s)
[linux-jdk10-m3.5.x_build] [INFO] Downloading from central: https://repo.maven.apache.org/maven2/antlr/antlr/2.7.7/antlr-2.7.7.pom
[linux-jdk10-m3.5.x_build] [INFO] Downloaded from central: https://repo.maven.apache.org/maven2/antlr/antlr/2.7.7/antlr-2.7.7.pom (632 B at 57 kB/s)
[linux-jdk10-m3.5.x_build] [INFO] Downloading from central: https://repo.maven.apache.org/maven2/org/antlr/antlr4-runtime/4.5.3/antlr4-runtime-4.5.3.pom
[linux-jdk10-m3.5.x_build] [INFO] Downloaded from central: https://repo.maven.apache.org/maven2/org/antlr/antlr4-runtime/4.5.3/antlr4-runtime-4.5.3.pom (2.3 kB at 192 kB/s)
[linux-jdk10-m3.5.x_build] [INFO] Downloading from central: https://repo.maven.apache.org/maven2/org/antlr/antlr4-master/4.5.3/antlr4-master-4.5.3.pom
[linux-jdk10-m3.5.x_build] [INFO] Downloaded from central: https://repo.maven.apache.org/maven2/org/antlr/antlr4-master/4.5.3/antlr4-master-4.5.3.pom (3.7 kB at 283 kB/s)
[linux-jdk10-m3.5.x_build] [INFO] Downloading from central: https://repo.maven.apache.org/maven2/commons-beanutils/commons-beanutils/1.9.2/commons-beanutils-1.9.2.pom
[linux-jdk10-m3.5.x_build] [INFO] Downloaded from central: https://repo.maven.apache.org/maven2/commons-beanutils/commons-beanutils/1.9.2/commons-beanutils-1.9.2.pom (14 kB at 1.2 MB/s)
[linux-jdk10-m3.5.x_build] [INFO] Downloading from central: https://repo.maven.apache.org/maven2/org/apache/commons/commons-parent/33/commons-parent-33.pom
[linux-jdk10-m3.5.x_build] [INFO] Downloaded from central: https://repo.maven.apache.org/maven2/org/apache/commons/commons-parent/33/commons-parent-33.pom (53 kB at 3.8 MB/s)
[linux-jdk10-m3.5.x_build] [INFO] Downloading from central: https://repo.maven.apache.org/maven2/commons-cli/commons-cli/1.3.1/commons-cli-1.3.1.pom
[linux-jdk10-m3.5.x_build] [INFO] Downloaded from central: https://repo.maven.apache.org/maven2/commons-cli/commons-cli/1.3.1/commons-cli-1.3.1.pom (10 kB at 742 kB/s)
[linux-jdk10-m3.5.x_build] [INFO] Downloading from central: https://repo.maven.apache.org/maven2/com/google/guava/guava/19.0/guava-19.0.pom
[linux-jdk10-m3.5.x_build] [INFO] Downloaded from central: https://repo.maven.apache.org/maven2/com/google/guava/guava/19.0/guava-19.0.pom (6.8 kB at 522 kB/s)
[linux-jdk10-m3.5.x_build] [INFO] Downloading from central: https://repo.maven.apache.org/maven2/com/google/guava/guava-parent/19.0/guava-parent-19.0.pom
[linux-jdk10-m3.5.x_build] [INFO] Downloaded from central: https://repo.maven.apache.org/maven2/com/google/guava/guava-parent/19.0/guava-parent-19.0.pom (9.9 kB at 823 kB/s)
[linux-jdk10-m3.5.x_build] [INFO] Downloading from central: https://repo.maven.apache.org/maven2/javax/xml/bind/jaxb-api/2.3.0/jaxb-api-2.3.0.pom
[linux-jdk10-m3.5.x_build] [INFO] Downloaded from central: https://repo.maven.apache.org/maven2/javax/xml/bind/jaxb-api/2.3.0/jaxb-api-2.3.0.pom (23 kB at 1.4 MB/s)
[linux-jdk10-m3.5.x_build] [INFO] Downloading from central: https://repo.maven.apache.org/maven2/javax/xml/bind/jaxb-api-parent/2.3.0/jaxb-api-parent-2.3.0.pom
[linux-jdk10-m3.5.x_build] [INFO] Downloaded from central: https://repo.maven.apache.org/maven2/javax/xml/bind/jaxb-api-parent/2.3.0/jaxb-api-parent-2.3.0.pom (5.6 kB at 403 kB/s)
[linux-jdk10-m3.5.x_build] [INFO] Downloading from central: https://repo.maven.apache.org/maven2/net/java/jvnet-parent/5/jvnet-parent-5.pom
[linux-jdk10-m3.5.x_build] [INFO] Downloaded from central: https://repo.maven.apache.org/maven2/net/java/jvnet-parent/5/jvnet-parent-5.pom (8.9 kB at 739 kB/s)
[linux-jdk10-m3.5.x_build] [INFO] Downloading from central: https://repo.maven.apache.org/maven2/org/apache/maven/shared/maven-shared-resources/2/maven-shared-resources-2.jar
[linux-jdk10-m3.5.x_build] [INFO] Downloading from central: https://repo.maven.apache.org/maven2/org/apache/maven/doxia/doxia-core/1.2/doxia-core-1.2.jar
[linux-jdk10-m3.5.x_build] [INFO] Downloading from central: https://repo.maven.apache.org/maven2/commons-logging/commons-logging/1.0.4/commons-logging-1.0.4.jar
[linux-jdk10-m3.5.x_build] [INFO] Downloading from central: https://repo.maven.apache.org/maven2/commons-digester/commons-digester/1.6/commons-digester-1.6.jar
[linux-jdk10-m3.5.x_build] [INFO] Downloading from central: https://repo.maven.apache.org/maven2/org/apache/maven/doxia/doxia-integration-tools/1.6/doxia-integration-tools-1.6.jar
[linux-jdk10-m3.5.x_build] [INFO] Downloaded from central: https://repo.maven.apache.org/maven2/org/apache/maven/shared/maven-shared-resources/2/maven-shared-resources-2.jar (13 kB at 816 kB/s)
[linux-jdk10-m3.5.x_build] [INFO] Downloading from central: https://repo.maven.apache.org/maven2/commons-io/commons-io/1.4/commons-io-1.4.jar
[linux-jdk10-m3.5.x_build] [INFO] Downloaded from central: https://repo.maven.apache.org/maven2/commons-logging/commons-logging/1.0.4/commons-logging-1.0.4.jar (38 kB at 2.2 MB/s)
[linux-jdk10-m3.5.x_build] [INFO] Downloading from central: https://repo.maven.apache.org/maven2/org/codehaus/plexus/plexus-resources/1.1.0/plexus-resources-1.1.0.jar
[linux-jdk10-m3.5.x_build] [INFO] Downloaded from central: https://repo.maven.apache.org/maven2/org/apache/maven/doxia/doxia-integration-tools/1.6/doxia-integration-tools-1.6.jar (45 kB at 2.2 MB/s)
[linux-jdk10-m3.5.x_build] [INFO] Downloading from central: https://repo.maven.apache.org/maven2/com/puppycrawl/tools/checkstyle/6.18/checkstyle-6.18.jar
[linux-jdk10-m3.5.x_build] [INFO] Downloaded from central: https://repo.maven.apache.org/maven2/org/apache/maven/doxia/doxia-core/1.2/doxia-core-1.2.jar (154 kB at 6.7 MB/s)
[linux-jdk10-m3.5.x_build] [INFO] Downloading from central: https://repo.maven.apache.org/maven2/antlr/antlr/2.7.7/antlr-2.7.7.jar
[linux-jdk10-m3.5.x_build] [INFO] Downloaded from central: https://repo.maven.apache.org/maven2/commons-digester/commons-digester/1.6/commons-digester-1.6.jar (168 kB at 7.0 MB/s)
[linux-jdk10-m3.5.x_build] [INFO] Downloading from central: https://repo.maven.apache.org/maven2/org/antlr/antlr4-runtime/4.5.3/antlr4-runtime-4.5.3.jar
[linux-jdk10-m3.5.x_build] [INFO] Downloaded from central: https://repo.maven.apache.org/maven2/commons-io/commons-io/1.4/commons-io-1.4.jar (109 kB at 3.5 MB/s)
[linux-jdk10-m3.5.x_build] [INFO] Downloading from central: https://repo.maven.apache.org/maven2/commons-beanutils/commons-beanutils/1.9.2/commons-beanutils-1.9.2.jar
[linux-jdk10-m3.5.x_build] [INFO] Downloaded from central: https://repo.maven.apache.org/maven2/org/codehaus/plexus/plexus-resources/1.1.0/plexus-resources-1.1.0.jar (23 kB at 663 kB/s)
[linux-jdk10-m3.5.x_build] [INFO] Downloading from central: https://repo.maven.apache.org/maven2/commons-cli/commons-cli/1.3.1/commons-cli-1.3.1.jar
[linux-jdk10-m3.5.x_build] [INFO] Downloaded from central: https://repo.maven.apache.org/maven2/antlr/antlr/2.7.7/antlr-2.7.7.jar (445 kB at 9.7 MB/s)
[linux-jdk10-m3.5.x_build] [INFO] Downloaded from central: https://repo.maven.apache.org/maven2/org/antlr/antlr4-runtime/4.5.3/antlr4-runtime-4.5.3.jar (302 kB at 6.6 MB/s)
[linux-jdk10-m3.5.x_build] [INFO] Downloading from central: https://repo.maven.apache.org/maven2/commons-lang/commons-lang/2.1/commons-lang-2.1.jar
[linux-jdk10-m3.5.x_build] [INFO] Downloading from central: https://repo.maven.apache.org/maven2/com/google/guava/guava/19.0/guava-19.0.jar
[linux-jdk10-m3.5.x_build] [INFO] Downloaded from central: https://repo.maven.apache.org/maven2/commons-cli/commons-cli/1.3.1/commons-cli-1.3.1.jar (53 kB at 1.0 MB/s)
[linux-jdk10-m3.5.x_build] [INFO] Downloading from central: https://repo.maven.apache.org/maven2/javax/xml/bind/jaxb-api/2.3.0/jaxb-api-2.3.0.jar
[linux-jdk10-m3.5.x_build] [INFO] Downloaded from central: https://repo.maven.apache.org/maven2/commons-beanutils/commons-beanutils/1.9.2/commons-beanutils-1.9.2.jar (234 kB at 4.4 MB/s)
[linux-jdk10-m3.5.x_build] [INFO] Downloaded from central: https://repo.maven.apache.org/maven2/com/puppycrawl/tools/checkstyle/6.18/checkstyle-6.18.jar (1.2 MB at 19 MB/s)
[linux-jdk10-m3.5.x_build] [INFO] Downloaded from central: https://repo.maven.apache.org/maven2/commons-lang/commons-lang/2.1/commons-lang-2.1.jar (208 kB at 3.3 MB/s)
[linux-jdk10-m3.5.x_build] [INFO] Downloaded from central: https://repo.maven.apache.org/maven2/javax/xml/bind/jaxb-api/2.3.0/jaxb-api-2.3.0.jar (126 kB at 1.9 MB/s)
[linux-jdk10-m3.5.x_build] [INFO] Downloaded from central: https://repo.maven.apache.org/maven2/com/google/guava/guava/19.0/guava-19.0.jar (2.3 MB at 20 MB/s)
[linux-jdk10-m3.5.x_build] [INFO] There is 1 error reported by Checkstyle 6.18 with config/maven_checks.xml ruleset.
[linux-jdk10-m3.5.x_build] [ERROR] src/main/java/org/apache/maven/plugins/pmd/PmdReport.java:[745,96] (whitespace) ParenPad: ')' is not preceded with whitespace.
[linux-jdk10-m3.5.x_build] [INFO] ------------------------------------------------------------------------
[linux-jdk10-m3.5.x_build] [INFO] BUILD FAILURE
[linux-jdk10-m3.5.x_build] [INFO] ------------------------------------------------------------------------
[linux-jdk10-m3.5.x_build] [INFO] Total time: 05:38 min
[linux-jdk10-m3.5.x_build] [INFO] Finished at: 2018-10-11T19:46:28Z
[linux-jdk10-m3.5.x_build] [INFO] ------------------------------------------------------------------------
[linux-jdk10-m3.5.x_build] [INFO] [jenkins-event-spy] Generated /home/jenkins/jenkins-slave/workspace/x_maven-pmd-plugin_MPMD-266-KO4DEQSQU6LULLR6I6VDVZF2RKZRIL5NFCHXXO6Q3PB4DD6OJT6Q@2@tmp/withMaven2209dcd8/maven-spy-20181011-194050-11490045506274027323.log
[linux-jdk10-m3.5.x_build] [ERROR] Failed to execute goal org.apache.maven.plugins:maven-checkstyle-plugin:3.0.0:check (checkstyle-check) on project maven-pmd-plugin: You have 1 Checkstyle violation. -> [Help 1]
[linux-jdk10-m3.5.x_build] [ERROR]
[linux-jdk10-m3.5.x_build] [ERROR] To see the full stack trace of the errors, re-run Maven with the -e switch.
[linux-jdk10-m3.5.x_build] [ERROR] Re-run Maven using the -X switch to enable full debug logging.
[linux-jdk10-m3.5.x_build] [ERROR]
[linux-jdk10-m3.5.x_build] [ERROR] For more information about the errors and possible solutions, please read the following articles:
[linux-jdk10-m3.5.x_build] [ERROR] [Help 1] http://cwiki.apache.org/confluence/display/MAVEN/MojoFailureException
[Pipeline] [linux-jdk11-m3.5.x_build] }
[linux-jdk11-m3.5.x_build] [Fast Archiver] No prior successful build to compare, so performing full copy of artifacts
[linux-jdk11-m3.5.x_build] [withMaven] invokerPublisher - Archive invoker results for Maven artifact MavenArtifact{org.apache.maven.plugins:maven-pmd-plugin::3.11.0-SNAPSHOT(version: 3.11.0-SNAPSHOT, snapshot:false) } generated by PluginInvocation{org.apache.maven.plugins:maven-invoker-plugin:3.0.1@integration-test  integration-test}: linux-jdk11-m3.5.x_build/target/invoker-reports/*.xml
[linux-jdk11-m3.5.x_build] performing MavenInvokerRecorder, reportsFilenamePattern:'**/linux-jdk11-m3.5.x_build/target/invoker-reports/BUILD*.xml', invokerBuildDir:'**/linux-jdk11-m3.5.x_build/target/it'
[linux-jdk11-m3.5.x_build] Found reports:[/home/jenkins/jenkins-slave/workspace/x_maven-pmd-plugin_MPMD-266-KO4DEQSQU6LULLR6I6VDVZF2RKZRIL5NFCHXXO6Q3PB4DD6OJT6Q@2/linux-jdk11-m3.5.x_build/target/invoker-reports/BUILD-MPMD-128-xref-link.xml, /home/jenkins/jenkins-slave/workspace/x_maven-pmd-plugin_MPMD-266-KO4DEQSQU6LULLR6I6VDVZF2RKZRIL5NFCHXXO6Q3PB4DD6OJT6Q@2/linux-jdk11-m3.5.x_build/target/invoker-reports/BUILD-MPMD-163.xml, /home/jenkins/jenkins-slave/workspace/x_maven-pmd-plugin_MPMD-266-KO4DEQSQU6LULLR6I6VDVZF2RKZRIL5NFCHXXO6Q3PB4DD6OJT6Q@2/linux-jdk11-m3.5.x_build/target/invoker-reports/BUILD-MPMD-165.xml, /home/jenkins/jenkins-slave/workspace/x_maven-pmd-plugin_MPMD-266-KO4DEQSQU6LULLR6I6VDVZF2RKZRIL5NFCHXXO6Q3PB4DD6OJT6Q@2/linux-jdk11-m3.5.x_build/target/invoker-reports/BUILD-MPMD-172.xml, /home/jenkins/jenkins-slave/workspace/x_maven-pmd-plugin_MPMD-266-KO4DEQSQU6LULLR6I6VDVZF2RKZRIL5NFCHXXO6Q3PB4DD6OJT6Q@2/linux-jdk11-m3.5.x_build/target/invoker-reports/BUILD-MPMD-181-benchmark.xml, /home/jenkins/jenkins-slave/workspace/x_maven-pmd-plugin_MPMD-266-KO4DEQSQU6LULLR6I6VDVZF2RKZRIL5NFCHXXO6Q3PB4DD6OJT6Q@2/linux-jdk11-m3.5.x_build/target/invoker-reports/BUILD-MPMD-181-no-benchmark.xml, /home/jenkins/jenkins-slave/workspace/x_maven-pmd-plugin_MPMD-266-KO4DEQSQU6LULLR6I6VDVZF2RKZRIL5NFCHXXO6Q3PB4DD6OJT6Q@2/linux-jdk11-m3.5.x_build/target/invoker-reports/BUILD-MPMD-182.xml, /home/jenkins/jenkins-slave/workspace/x_maven-pmd-plugin_MPMD-266-KO4DEQSQU6LULLR6I6VDVZF2RKZRIL5NFCHXXO6Q3PB4DD6OJT6Q@2/linux-jdk11-m3.5.x_build/target/invoker-reports/BUILD-MPMD-187.xml, /home/jenkins/jenkins-slave/workspace/x_maven-pmd-plugin_MPMD-266-KO4DEQSQU6LULLR6I6VDVZF2RKZRIL5NFCHXXO6Q3PB4DD6OJT6Q@2/linux-jdk11-m3.5.x_build/target/invoker-reports/BUILD-MPMD-205-pmd-js-check.xml, /home/jenkins/jenkins-slave/workspace/x_maven-pmd-plugin_MPMD-266-KO4DEQSQU6LULLR6I6VDVZF2RKZRIL5NFCHXXO6Q3PB4DD6OJT6Q@2/linux-jdk11-m3.5.x_build/target/invoker-reports/BUILD-MPMD-206-sourceDirectories-js.xml, /home/jenkins/jenkins-slave/workspace/x_maven-pmd-plugin_MPMD-266-KO4DEQSQU6LULLR6I6VDVZF2RKZRIL5NFCHXXO6Q3PB4DD6OJT6Q@2/linux-jdk11-m3.5.x_build/target/invoker-reports/BUILD-MPMD-219-pmd-processing-error.xml, /home/jenkins/jenkins-slave/workspace/x_maven-pmd-plugin_MPMD-266-KO4DEQSQU6LULLR6I6VDVZF2RKZRIL5NFCHXXO6Q3PB4DD6OJT6Q@2/linux-jdk11-m3.5.x_build/target/invoker-reports/BUILD-MPMD-234-analysis-cache.xml, /home/jenkins/jenkins-slave/workspace/x_maven-pmd-plugin_MPMD-266-KO4DEQSQU6LULLR6I6VDVZF2RKZRIL5NFCHXXO6Q3PB4DD6OJT6Q@2/linux-jdk11-m3.5.x_build/target/invoker-reports/BUILD-MPMD-243-excludeFromFailureFile.xml, /home/jenkins/jenkins-slave/workspace/x_maven-pmd-plugin_MPMD-266-KO4DEQSQU6LULLR6I6VDVZF2RKZRIL5NFCHXXO6Q3PB4DD6OJT6Q@2/linux-jdk11-m3.5.x_build/target/invoker-reports/BUILD-MPMD-244-logging.xml, /home/jenkins/jenkins-slave/workspace/x_maven-pmd-plugin_MPMD-266-KO4DEQSQU6LULLR6I6VDVZF2RKZRIL5NFCHXXO6Q3PB4DD6OJT6Q@2/linux-jdk11-m3.5.x_build/target/invoker-reports/BUILD-MPMD-253-xref-link-multi-module.xml, /home/jenkins/jenkins-slave/workspace/x_maven-pmd-plugin_MPMD-266-KO4DEQSQU6LULLR6I6VDVZF2RKZRIL5NFCHXXO6Q3PB4DD6OJT6Q@2/linux-jdk11-m3.5.x_build/target/invoker-reports/BUILD-MPMD-258-multiple-executions.xml, /home/jenkins/jenkins-slave/workspace/x_maven-pmd-plugin_MPMD-266-KO4DEQSQU6LULLR6I6VDVZF2RKZRIL5NFCHXXO6Q3PB4DD6OJT6Q@2/linux-jdk11-m3.5.x_build/target/invoker-reports/BUILD-MPMD-259-analysis-cache-auxclasspath.xml, /home/jenkins/jenkins-slave/workspace/x_maven-pmd-plugin_MPMD-266-KO4DEQSQU6LULLR6I6VDVZF2RKZRIL5NFCHXXO6Q3PB4DD6OJT6Q@2/linux-jdk11-m3.5.x_build/target/invoker-reports/BUILD-MPMD-266-typeresolution-aggregated.xml, /home/jenkins/jenkins-slave/workspace/x_maven-pmd-plugin_MPMD-266-KO4DEQSQU6LULLR6I6VDVZF2RKZRIL5NFCHXXO6Q3PB4DD6OJT6Q@2/linux-jdk11-m3.5.x_build/target/invoker-reports/BUILD-MPMD-268-deprecated-rules.xml, /home/jenkins/jenkins-slave/workspace/x_maven-pmd-plugin_MPMD-266-KO4DEQSQU6LULLR6I6VDVZF2RKZRIL5NFCHXXO6Q3PB4DD6OJT6Q@2/linux-jdk11-m3.5.x_build/target/invoker-reports/BUILD-MPMD-270-JDK11.xml, /home/jenkins/jenkins-slave/workspace/x_maven-pmd-plugin_MPMD-266-KO4DEQSQU6LULLR6I6VDVZF2RKZRIL5NFCHXXO6Q3PB4DD6OJT6Q@2/linux-jdk11-m3.5.x_build/target/invoker-reports/BUILD-MPMD-89-232-typeresolution.xml, /home/jenkins/jenkins-slave/workspace/x_maven-pmd-plugin_MPMD-266-KO4DEQSQU6LULLR6I6VDVZF2RKZRIL5NFCHXXO6Q3PB4DD6OJT6Q@2/linux-jdk11-m3.5.x_build/target/invoker-reports/BUILD-empty-rulesets.xml, /home/jenkins/jenkins-slave/workspace/x_maven-pmd-plugin_MPMD-266-KO4DEQSQU6LULLR6I6VDVZF2RKZRIL5NFCHXXO6Q3PB4DD6OJT6Q@2/linux-jdk11-m3.5.x_build/target/invoker-reports/BUILD-mpmd-138.xml, /home/jenkins/jenkins-slave/workspace/x_maven-pmd-plugin_MPMD-266-KO4DEQSQU6LULLR6I6VDVZF2RKZRIL5NFCHXXO6Q3PB4DD6OJT6Q@2/linux-jdk11-m3.5.x_build/target/invoker-reports/BUILD-mpmd-142.xml, /home/jenkins/jenkins-slave/workspace/x_maven-pmd-plugin_MPMD-266-KO4DEQSQU6LULLR6I6VDVZF2RKZRIL5NFCHXXO6Q3PB4DD6OJT6Q@2/linux-jdk11-m3.5.x_build/target/invoker-reports/BUILD-mpmd-168-empty-report.xml, /home/jenkins/jenkins-slave/workspace/x_maven-pmd-plugin_MPMD-266-KO4DEQSQU6LULLR6I6VDVZF2RKZRIL5NFCHXXO6Q3PB4DD6OJT6Q@2/linux-jdk11-m3.5.x_build/target/invoker-reports/BUILD-mpmd-168.xml, /home/jenkins/jenkins-slave/workspace/x_maven-pmd-plugin_MPMD-266-KO4DEQSQU6LULLR6I6VDVZF2RKZRIL5NFCHXXO6Q3PB4DD6OJT6Q@2/linux-jdk11-m3.5.x_build/target/invoker-reports/BUILD-mpmd-80-included.xml, /home/jenkins/jenkins-slave/workspace/x_maven-pmd-plugin_MPMD-266-KO4DEQSQU6LULLR6I6VDVZF2RKZRIL5NFCHXXO6Q3PB4DD6OJT6Q@2/linux-jdk11-m3.5.x_build/target/invoker-reports/BUILD-mpmd-80-not-included.xml, /home/jenkins/jenkins-slave/workspace/x_maven-pmd-plugin_MPMD-266-KO4DEQSQU6LULLR6I6VDVZF2RKZRIL5NFCHXXO6Q3PB4DD6OJT6Q@2/linux-jdk11-m3.5.x_build/target/invoker-reports/BUILD-multi-module.xml]
[linux-jdk11-m3.5.x_build] Found logs:[/home/jenkins/jenkins-slave/workspace/x_maven-pmd-plugin_MPMD-266-KO4DEQSQU6LULLR6I6VDVZF2RKZRIL5NFCHXXO6Q3PB4DD6OJT6Q@2/linux-jdk11-m3.5.x_build/target/it/MPMD-128-xref-link/build.log, /home/jenkins/jenkins-slave/workspace/x_maven-pmd-plugin_MPMD-266-KO4DEQSQU6LULLR6I6VDVZF2RKZRIL5NFCHXXO6Q3PB4DD6OJT6Q@2/linux-jdk11-m3.5.x_build/target/it/MPMD-163/build.log, /home/jenkins/jenkins-slave/workspace/x_maven-pmd-plugin_MPMD-266-KO4DEQSQU6LULLR6I6VDVZF2RKZRIL5NFCHXXO6Q3PB4DD6OJT6Q@2/linux-jdk11-m3.5.x_build/target/it/MPMD-165/build.log, /home/jenkins/jenkins-slave/workspace/x_maven-pmd-plugin_MPMD-266-KO4DEQSQU6LULLR6I6VDVZF2RKZRIL5NFCHXXO6Q3PB4DD6OJT6Q@2/linux-jdk11-m3.5.x_build/target/it/MPMD-172/build.log, /home/jenkins/jenkins-slave/workspace/x_maven-pmd-plugin_MPMD-266-KO4DEQSQU6LULLR6I6VDVZF2RKZRIL5NFCHXXO6Q3PB4DD6OJT6Q@2/linux-jdk11-m3.5.x_build/target/it/MPMD-181-benchmark/build.log, /home/jenkins/jenkins-slave/workspace/x_maven-pmd-plugin_MPMD-266-KO4DEQSQU6LULLR6I6VDVZF2RKZRIL5NFCHXXO6Q3PB4DD6OJT6Q@2/linux-jdk11-m3.5.x_build/target/it/MPMD-181-no-benchmark/build.log, /home/jenkins/jenkins-slave/workspace/x_maven-pmd-plugin_MPMD-266-KO4DEQSQU6LULLR6I6VDVZF2RKZRIL5NFCHXXO6Q3PB4DD6OJT6Q@2/linux-jdk11-m3.5.x_build/target/it/MPMD-182/build.log, /home/jenkins/jenkins-slave/workspace/x_maven-pmd-plugin_MPMD-266-KO4DEQSQU6LULLR6I6VDVZF2RKZRIL5NFCHXXO6Q3PB4DD6OJT6Q@2/linux-jdk11-m3.5.x_build/target/it/MPMD-187/build.log, /home/jenkins/jenkins-slave/workspace/x_maven-pmd-plugin_MPMD-266-KO4DEQSQU6LULLR6I6VDVZF2RKZRIL5NFCHXXO6Q3PB4DD6OJT6Q@2/linux-jdk11-m3.5.x_build/target/it/MPMD-205-pmd-js-check/build.log, /home/jenkins/jenkins-slave/workspace/x_maven-pmd-plugin_MPMD-266-KO4DEQSQU6LULLR6I6VDVZF2RKZRIL5NFCHXXO6Q3PB4DD6OJT6Q@2/linux-jdk11-m3.5.x_build/target/it/MPMD-206-sourceDirectories-js/build.log, /home/jenkins/jenkins-slave/workspace/x_maven-pmd-plugin_MPMD-266-KO4DEQSQU6LULLR6I6VDVZF2RKZRIL5NFCHXXO6Q3PB4DD6OJT6Q@2/linux-jdk11-m3.5.x_build/target/it/MPMD-219-pmd-processing-error/build.log, /home/jenkins/jenkins-slave/workspace/x_maven-pmd-plugin_MPMD-266-KO4DEQSQU6LULLR6I6VDVZF2RKZRIL5NFCHXXO6Q3PB4DD6OJT6Q@2/linux-jdk11-m3.5.x_build/target/it/MPMD-234-analysis-cache/build.log, /home/jenkins/jenkins-slave/workspace/x_maven-pmd-plugin_MPMD-266-KO4DEQSQU6LULLR6I6VDVZF2RKZRIL5NFCHXXO6Q3PB4DD6OJT6Q@2/linux-jdk11-m3.5.x_build/target/it/MPMD-243-excludeFromFailureFile/build.log, /home/jenkins/jenkins-slave/workspace/x_maven-pmd-plugin_MPMD-266-KO4DEQSQU6LULLR6I6VDVZF2RKZRIL5NFCHXXO6Q3PB4DD6OJT6Q@2/linux-jdk11-m3.5.x_build/target/it/MPMD-244-logging/build.log, /home/jenkins/jenkins-slave/workspace/x_maven-pmd-plugin_MPMD-266-KO4DEQSQU6LULLR6I6VDVZF2RKZRIL5NFCHXXO6Q3PB4DD6OJT6Q@2/linux-jdk11-m3.5.x_build/target/it/MPMD-253-xref-link-multi-module/build.log, /home/jenkins/jenkins-slave/workspace/x_maven-pmd-plugin_MPMD-266-KO4DEQSQU6LULLR6I6VDVZF2RKZRIL5NFCHXXO6Q3PB4DD6OJT6Q@2/linux-jdk11-m3.5.x_build/target/it/MPMD-258-multiple-executions/build.log, /home/jenkins/jenkins-slave/workspace/x_maven-pmd-plugin_MPMD-266-KO4DEQSQU6LULLR6I6VDVZF2RKZRIL5NFCHXXO6Q3PB4DD6OJT6Q@2/linux-jdk11-m3.5.x_build/target/it/MPMD-259-analysis-cache-auxclasspath/build.log, /home/jenkins/jenkins-slave/workspace/x_maven-pmd-plugin_MPMD-266-KO4DEQSQU6LULLR6I6VDVZF2RKZRIL5NFCHXXO6Q3PB4DD6OJT6Q@2/linux-jdk11-m3.5.x_build/target/it/MPMD-266-typeresolution-aggregated/build.log, /home/jenkins/jenkins-slave/workspace/x_maven-pmd-plugin_MPMD-266-KO4DEQSQU6LULLR6I6VDVZF2RKZRIL5NFCHXXO6Q3PB4DD6OJT6Q@2/linux-jdk11-m3.5.x_build/target/it/MPMD-268-deprecated-rules/build.log, /home/jenkins/jenkins-slave/workspace/x_maven-pmd-plugin_MPMD-266-KO4DEQSQU6LULLR6I6VDVZF2RKZRIL5NFCHXXO6Q3PB4DD6OJT6Q@2/linux-jdk11-m3.5.x_build/target/it/MPMD-270-JDK11/build.log, /home/jenkins/jenkins-slave/workspace/x_maven-pmd-plugin_MPMD-266-KO4DEQSQU6LULLR6I6VDVZF2RKZRIL5NFCHXXO6Q3PB4DD6OJT6Q@2/linux-jdk11-m3.5.x_build/target/it/MPMD-89-232-typeresolution/build.log, /home/jenkins/jenkins-slave/workspace/x_maven-pmd-plugin_MPMD-266-KO4DEQSQU6LULLR6I6VDVZF2RKZRIL5NFCHXXO6Q3PB4DD6OJT6Q@2/linux-jdk11-m3.5.x_build/target/it/empty-rulesets/build.log, /home/jenkins/jenkins-slave/workspace/x_maven-pmd-plugin_MPMD-266-KO4DEQSQU6LULLR6I6VDVZF2RKZRIL5NFCHXXO6Q3PB4DD6OJT6Q@2/linux-jdk11-m3.5.x_build/target/it/mpmd-138/build.log, /home/jenkins/jenkins-slave/workspace/x_maven-pmd-plugin_MPMD-266-KO4DEQSQU6LULLR6I6VDVZF2RKZRIL5NFCHXXO6Q3PB4DD6OJT6Q@2/linux-jdk11-m3.5.x_build/target/it/mpmd-142/build.log, /home/jenkins/jenkins-slave/workspace/x_maven-pmd-plugin_MPMD-266-KO4DEQSQU6LULLR6I6VDVZF2RKZRIL5NFCHXXO6Q3PB4DD6OJT6Q@2/linux-jdk11-m3.5.x_build/target/it/mpmd-168-empty-report/build.log, /home/jenkins/jenkins-slave/workspace/x_maven-pmd-plugin_MPMD-266-KO4DEQSQU6LULLR6I6VDVZF2RKZRIL5NFCHXXO6Q3PB4DD6OJT6Q@2/linux-jdk11-m3.5.x_build/target/it/mpmd-168/build.log, /home/jenkins/jenkins-slave/workspace/x_maven-pmd-plugin_MPMD-266-KO4DEQSQU6LULLR6I6VDVZF2RKZRIL5NFCHXXO6Q3PB4DD6OJT6Q@2/linux-jdk11-m3.5.x_build/target/it/mpmd-80-included/build.log, /home/jenkins/jenkins-slave/workspace/x_maven-pmd-plugin_MPMD-266-KO4DEQSQU6LULLR6I6VDVZF2RKZRIL5NFCHXXO6Q3PB4DD6OJT6Q@2/linux-jdk11-m3.5.x_build/target/it/mpmd-80-not-included/build.log, /home/jenkins/jenkins-slave/workspace/x_maven-pmd-plugin_MPMD-266-KO4DEQSQU6LULLR6I6VDVZF2RKZRIL5NFCHXXO6Q3PB4DD6OJT6Q@2/linux-jdk11-m3.5.x_build/target/it/multi-module/build.log]
[linux-jdk11-m3.5.x_build] Finished parsing Maven Invoker results (found 29)
[linux-jdk11-m3.5.x_build] [withMaven] junitPublisher - Archive test results for Maven artifact org.apache.maven.plugins:maven-pmd-plugin:3.11.0-SNAPSHOT generated by maven-surefire-plugin:test (default-test): linux-jdk11-m3.5.x_build/target/surefire-reports/*.xml
[linux-jdk11-m3.5.x_build] Recording test results
[linux-jdk11-m3.5.x_build] [withMaven] openTasksPublisher - Scan Tasks for Maven artifact org.apache.maven.plugins:maven-pmd-plugin:3.11.0-SNAPSHOT in source directory linux-jdk11-m3.5.x_build/src/main/java
[linux-jdk11-m3.5.x_build] [TASKS] Scanning folder '/home/jenkins/jenkins-slave/workspace/x_maven-pmd-plugin_MPMD-266-KO4DEQSQU6LULLR6I6VDVZF2RKZRIL5NFCHXXO6Q3PB4DD6OJT6Q@2' for files matching the pattern 'linux-jdk11-m3.5.x_build/src/main/java/**/*' - excludes: null
[linux-jdk11-m3.5.x_build] [TASKS] Found 14 files to scan for tasks
[linux-jdk11-m3.5.x_build] [TASKS] Found 6 open tasks.
[linux-jdk11-m3.5.x_build] Skipping warnings blame since pipelines do not have an SCM link.%n
[Pipeline] [linux-jdk11-m3.5.x_build] // withMaven
[Pipeline] [linux-jdk10-m3.5.x_build] }
[Pipeline] [linux-jdk11-m3.5.x_build] cleanWs
[Pipeline] [linux-jdk10-m3.5.x_build] // dir
[linux-jdk11-m3.5.x_build] [WS-CLEANUP] Deleting project workspace...[WS-CLEANUP] done
[Pipeline] [linux-jdk10-m3.5.x_build] }
[linux-jdk10-m3.5.x_build] [Fast Archiver] No prior successful build to compare, so performing full copy of artifacts
[linux-jdk10-m3.5.x_build] [withMaven] invokerPublisher - Archive invoker results for Maven artifact MavenArtifact{org.apache.maven.plugins:maven-pmd-plugin::3.11.0-SNAPSHOT(version: 3.11.0-SNAPSHOT, snapshot:false) } generated by PluginInvocation{org.apache.maven.plugins:maven-invoker-plugin:3.0.1@integration-test  integration-test}: linux-jdk10-m3.5.x_build/target/invoker-reports/*.xml
[linux-jdk10-m3.5.x_build] performing MavenInvokerRecorder, reportsFilenamePattern:'**/linux-jdk10-m3.5.x_build/target/invoker-reports/BUILD*.xml', invokerBuildDir:'**/linux-jdk10-m3.5.x_build/target/it'
[linux-jdk10-m3.5.x_build] Found reports:[/home/jenkins/jenkins-slave/workspace/x_maven-pmd-plugin_MPMD-266-KO4DEQSQU6LULLR6I6VDVZF2RKZRIL5NFCHXXO6Q3PB4DD6OJT6Q@2/linux-jdk10-m3.5.x_build/target/invoker-reports/BUILD-MPMD-128-xref-link.xml, /home/jenkins/jenkins-slave/workspace/x_maven-pmd-plugin_MPMD-266-KO4DEQSQU6LULLR6I6VDVZF2RKZRIL5NFCHXXO6Q3PB4DD6OJT6Q@2/linux-jdk10-m3.5.x_build/target/invoker-reports/BUILD-MPMD-163.xml, /home/jenkins/jenkins-slave/workspace/x_maven-pmd-plugin_MPMD-266-KO4DEQSQU6LULLR6I6VDVZF2RKZRIL5NFCHXXO6Q3PB4DD6OJT6Q@2/linux-jdk10-m3.5.x_build/target/invoker-reports/BUILD-MPMD-165.xml, /home/jenkins/jenkins-slave/workspace/x_maven-pmd-plugin_MPMD-266-KO4DEQSQU6LULLR6I6VDVZF2RKZRIL5NFCHXXO6Q3PB4DD6OJT6Q@2/linux-jdk10-m3.5.x_build/target/invoker-reports/BUILD-MPMD-172.xml, /home/jenkins/jenkins-slave/workspace/x_maven-pmd-plugin_MPMD-266-KO4DEQSQU6LULLR6I6VDVZF2RKZRIL5NFCHXXO6Q3PB4DD6OJT6Q@2/linux-jdk10-m3.5.x_build/target/invoker-reports/BUILD-MPMD-181-benchmark.xml, /home/jenkins/jenkins-slave/workspace/x_maven-pmd-plugin_MPMD-266-KO4DEQSQU6LULLR6I6VDVZF2RKZRIL5NFCHXXO6Q3PB4DD6OJT6Q@2/linux-jdk10-m3.5.x_build/target/invoker-reports/BUILD-MPMD-181-no-benchmark.xml, /home/jenkins/jenkins-slave/workspace/x_maven-pmd-plugin_MPMD-266-KO4DEQSQU6LULLR6I6VDVZF2RKZRIL5NFCHXXO6Q3PB4DD6OJT6Q@2/linux-jdk10-m3.5.x_build/target/invoker-reports/BUILD-MPMD-182.xml, /home/jenkins/jenkins-slave/workspace/x_maven-pmd-plugin_MPMD-266-KO4DEQSQU6LULLR6I6VDVZF2RKZRIL5NFCHXXO6Q3PB4DD6OJT6Q@2/linux-jdk10-m3.5.x_build/target/invoker-reports/BUILD-MPMD-187.xml, /home/jenkins/jenkins-slave/workspace/x_maven-pmd-plugin_MPMD-266-KO4DEQSQU6LULLR6I6VDVZF2RKZRIL5NFCHXXO6Q3PB4DD6OJT6Q@2/linux-jdk10-m3.5.x_build/target/invoker-reports/BUILD-MPMD-205-pmd-js-check.xml, /home/jenkins/jenkins-slave/workspace/x_maven-pmd-plugin_MPMD-266-KO4DEQSQU6LULLR6I6VDVZF2RKZRIL5NFCHXXO6Q3PB4DD6OJT6Q@2/linux-jdk10-m3.5.x_build/target/invoker-reports/BUILD-MPMD-206-sourceDirectories-js.xml, /home/jenkins/jenkins-slave/workspace/x_maven-pmd-plugin_MPMD-266-KO4DEQSQU6LULLR6I6VDVZF2RKZRIL5NFCHXXO6Q3PB4DD6OJT6Q@2/linux-jdk10-m3.5.x_build/target/invoker-reports/BUILD-MPMD-219-pmd-processing-error.xml, /home/jenkins/jenkins-slave/workspace/x_maven-pmd-plugin_MPMD-266-KO4DEQSQU6LULLR6I6VDVZF2RKZRIL5NFCHXXO6Q3PB4DD6OJT6Q@2/linux-jdk10-m3.5.x_build/target/invoker-reports/BUILD-MPMD-234-analysis-cache.xml, /home/jenkins/jenkins-slave/workspace/x_maven-pmd-plugin_MPMD-266-KO4DEQSQU6LULLR6I6VDVZF2RKZRIL5NFCHXXO6Q3PB4DD6OJT6Q@2/linux-jdk10-m3.5.x_build/target/invoker-reports/BUILD-MPMD-243-excludeFromFailureFile.xml, /home/jenkins/jenkins-slave/workspace/x_maven-pmd-plugin_MPMD-266-KO4DEQSQU6LULLR6I6VDVZF2RKZRIL5NFCHXXO6Q3PB4DD6OJT6Q@2/linux-jdk10-m3.5.x_build/target/invoker-reports/BUILD-MPMD-244-logging.xml, /home/jenkins/jenkins-slave/workspace/x_maven-pmd-plugin_MPMD-266-KO4DEQSQU6LULLR6I6VDVZF2RKZRIL5NFCHXXO6Q3PB4DD6OJT6Q@2/linux-jdk10-m3.5.x_build/target/invoker-reports/BUILD-MPMD-253-xref-link-multi-module.xml, /home/jenkins/jenkins-slave/workspace/x_maven-pmd-plugin_MPMD-266-KO4DEQSQU6LULLR6I6VDVZF2RKZRIL5NFCHXXO6Q3PB4DD6OJT6Q@2/linux-jdk10-m3.5.x_build/target/invoker-reports/BUILD-MPMD-258-multiple-executions.xml, /home/jenkins/jenkins-slave/workspace/x_maven-pmd-plugin_MPMD-266-KO4DEQSQU6LULLR6I6VDVZF2RKZRIL5NFCHXXO6Q3PB4DD6OJT6Q@2/linux-jdk10-m3.5.x_build/target/invoker-reports/BUILD-MPMD-259-analysis-cache-auxclasspath.xml, /home/jenkins/jenkins-slave/workspace/x_maven-pmd-plugin_MPMD-266-KO4DEQSQU6LULLR6I6VDVZF2RKZRIL5NFCHXXO6Q3PB4DD6OJT6Q@2/linux-jdk10-m3.5.x_build/target/invoker-reports/BUILD-MPMD-266-typeresolution-aggregated.xml, /home/jenkins/jenkins-slave/workspace/x_maven-pmd-plugin_MPMD-266-KO4DEQSQU6LULLR6I6VDVZF2RKZRIL5NFCHXXO6Q3PB4DD6OJT6Q@2/linux-jdk10-m3.5.x_build/target/invoker-reports/BUILD-MPMD-268-deprecated-rules.xml, /home/jenkins/jenkins-slave/workspace/x_maven-pmd-plugin_MPMD-266-KO4DEQSQU6LULLR6I6VDVZF2RKZRIL5NFCHXXO6Q3PB4DD6OJT6Q@2/linux-jdk10-m3.5.x_build/target/invoker-reports/BUILD-MPMD-270-JDK11.xml, /home/jenkins/jenkins-slave/workspace/x_maven-pmd-plugin_MPMD-266-KO4DEQSQU6LULLR6I6VDVZF2RKZRIL5NFCHXXO6Q3PB4DD6OJT6Q@2/linux-jdk10-m3.5.x_build/target/invoker-reports/BUILD-MPMD-89-232-typeresolution.xml, /home/jenkins/jenkins-slave/workspace/x_maven-pmd-plugin_MPMD-266-KO4DEQSQU6LULLR6I6VDVZF2RKZRIL5NFCHXXO6Q3PB4DD6OJT6Q@2/linux-jdk10-m3.5.x_build/target/invoker-reports/BUILD-empty-rulesets.xml, /home/jenkins/jenkins-slave/workspace/x_maven-pmd-plugin_MPMD-266-KO4DEQSQU6LULLR6I6VDVZF2RKZRIL5NFCHXXO6Q3PB4DD6OJT6Q@2/linux-jdk10-m3.5.x_build/target/invoker-reports/BUILD-mpmd-138.xml, /home/jenkins/jenkins-slave/workspace/x_maven-pmd-plugin_MPMD-266-KO4DEQSQU6LULLR6I6VDVZF2RKZRIL5NFCHXXO6Q3PB4DD6OJT6Q@2/linux-jdk10-m3.5.x_build/target/invoker-reports/BUILD-mpmd-142.xml, /home/jenkins/jenkins-slave/workspace/x_maven-pmd-plugin_MPMD-266-KO4DEQSQU6LULLR6I6VDVZF2RKZRIL5NFCHXXO6Q3PB4DD6OJT6Q@2/linux-jdk10-m3.5.x_build/target/invoker-reports/BUILD-mpmd-168-empty-report.xml, /home/jenkins/jenkins-slave/workspace/x_maven-pmd-plugin_MPMD-266-KO4DEQSQU6LULLR6I6VDVZF2RKZRIL5NFCHXXO6Q3PB4DD6OJT6Q@2/linux-jdk10-m3.5.x_build/target/invoker-reports/BUILD-mpmd-168.xml, /home/jenkins/jenkins-slave/workspace/x_maven-pmd-plugin_MPMD-266-KO4DEQSQU6LULLR6I6VDVZF2RKZRIL5NFCHXXO6Q3PB4DD6OJT6Q@2/linux-jdk10-m3.5.x_build/target/invoker-reports/BUILD-mpmd-80-included.xml, /home/jenkins/jenkins-slave/workspace/x_maven-pmd-plugin_MPMD-266-KO4DEQSQU6LULLR6I6VDVZF2RKZRIL5NFCHXXO6Q3PB4DD6OJT6Q@2/linux-jdk10-m3.5.x_build/target/invoker-reports/BUILD-mpmd-80-not-included.xml, /home/jenkins/jenkins-slave/workspace/x_maven-pmd-plugin_MPMD-266-KO4DEQSQU6LULLR6I6VDVZF2RKZRIL5NFCHXXO6Q3PB4DD6OJT6Q@2/linux-jdk10-m3.5.x_build/target/invoker-reports/BUILD-multi-module.xml]
[linux-jdk10-m3.5.x_build] Found logs:[/home/jenkins/jenkins-slave/workspace/x_maven-pmd-plugin_MPMD-266-KO4DEQSQU6LULLR6I6VDVZF2RKZRIL5NFCHXXO6Q3PB4DD6OJT6Q@2/linux-jdk10-m3.5.x_build/target/it/MPMD-128-xref-link/build.log, /home/jenkins/jenkins-slave/workspace/x_maven-pmd-plugin_MPMD-266-KO4DEQSQU6LULLR6I6VDVZF2RKZRIL5NFCHXXO6Q3PB4DD6OJT6Q@2/linux-jdk10-m3.5.x_build/target/it/MPMD-163/build.log, /home/jenkins/jenkins-slave/workspace/x_maven-pmd-plugin_MPMD-266-KO4DEQSQU6LULLR6I6VDVZF2RKZRIL5NFCHXXO6Q3PB4DD6OJT6Q@2/linux-jdk10-m3.5.x_build/target/it/MPMD-165/build.log, /home/jenkins/jenkins-slave/workspace/x_maven-pmd-plugin_MPMD-266-KO4DEQSQU6LULLR6I6VDVZF2RKZRIL5NFCHXXO6Q3PB4DD6OJT6Q@2/linux-jdk10-m3.5.x_build/target/it/MPMD-172/build.log, /home/jenkins/jenkins-slave/workspace/x_maven-pmd-plugin_MPMD-266-KO4DEQSQU6LULLR6I6VDVZF2RKZRIL5NFCHXXO6Q3PB4DD6OJT6Q@2/linux-jdk10-m3.5.x_build/target/it/MPMD-181-benchmark/build.log, /home/jenkins/jenkins-slave/workspace/x_maven-pmd-plugin_MPMD-266-KO4DEQSQU6LULLR6I6VDVZF2RKZRIL5NFCHXXO6Q3PB4DD6OJT6Q@2/linux-jdk10-m3.5.x_build/target/it/MPMD-181-no-benchmark/build.log, /home/jenkins/jenkins-slave/workspace/x_maven-pmd-plugin_MPMD-266-KO4DEQSQU6LULLR6I6VDVZF2RKZRIL5NFCHXXO6Q3PB4DD6OJT6Q@2/linux-jdk10-m3.5.x_build/target/it/MPMD-182/build.log, /home/jenkins/jenkins-slave/workspace/x_maven-pmd-plugin_MPMD-266-KO4DEQSQU6LULLR6I6VDVZF2RKZRIL5NFCHXXO6Q3PB4DD6OJT6Q@2/linux-jdk10-m3.5.x_build/target/it/MPMD-187/build.log, /home/jenkins/jenkins-slave/workspace/x_maven-pmd-plugin_MPMD-266-KO4DEQSQU6LULLR6I6VDVZF2RKZRIL5NFCHXXO6Q3PB4DD6OJT6Q@2/linux-jdk10-m3.5.x_build/target/it/MPMD-205-pmd-js-check/build.log, /home/jenkins/jenkins-slave/workspace/x_maven-pmd-plugin_MPMD-266-KO4DEQSQU6LULLR6I6VDVZF2RKZRIL5NFCHXXO6Q3PB4DD6OJT6Q@2/linux-jdk10-m3.5.x_build/target/it/MPMD-206-sourceDirectories-js/build.log, /home/jenkins/jenkins-slave/workspace/x_maven-pmd-plugin_MPMD-266-KO4DEQSQU6LULLR6I6VDVZF2RKZRIL5NFCHXXO6Q3PB4DD6OJT6Q@2/linux-jdk10-m3.5.x_build/target/it/MPMD-219-pmd-processing-error/build.log, /home/jenkins/jenkins-slave/workspace/x_maven-pmd-plugin_MPMD-266-KO4DEQSQU6LULLR6I6VDVZF2RKZRIL5NFCHXXO6Q3PB4DD6OJT6Q@2/linux-jdk10-m3.5.x_build/target/it/MPMD-234-analysis-cache/build.log, /home/jenkins/jenkins-slave/workspace/x_maven-pmd-plugin_MPMD-266-KO4DEQSQU6LULLR6I6VDVZF2RKZRIL5NFCHXXO6Q3PB4DD6OJT6Q@2/linux-jdk10-m3.5.x_build/target/it/MPMD-243-excludeFromFailureFile/build.log, /home/jenkins/jenkins-slave/workspace/x_maven-pmd-plugin_MPMD-266-KO4DEQSQU6LULLR6I6VDVZF2RKZRIL5NFCHXXO6Q3PB4DD6OJT6Q@2/linux-jdk10-m3.5.x_build/target/it/MPMD-244-logging/build.log, /home/jenkins/jenkins-slave/workspace/x_maven-pmd-plugin_MPMD-266-KO4DEQSQU6LULLR6I6VDVZF2RKZRIL5NFCHXXO6Q3PB4DD6OJT6Q@2/linux-jdk10-m3.5.x_build/target/it/MPMD-253-xref-link-multi-module/build.log, /home/jenkins/jenkins-slave/workspace/x_maven-pmd-plugin_MPMD-266-KO4DEQSQU6LULLR6I6VDVZF2RKZRIL5NFCHXXO6Q3PB4DD6OJT6Q@2/linux-jdk10-m3.5.x_build/target/it/MPMD-258-multiple-executions/build.log, /home/jenkins/jenkins-slave/workspace/x_maven-pmd-plugin_MPMD-266-KO4DEQSQU6LULLR6I6VDVZF2RKZRIL5NFCHXXO6Q3PB4DD6OJT6Q@2/linux-jdk10-m3.5.x_build/target/it/MPMD-259-analysis-cache-auxclasspath/build.log, /home/jenkins/jenkins-slave/workspace/x_maven-pmd-plugin_MPMD-266-KO4DEQSQU6LULLR6I6VDVZF2RKZRIL5NFCHXXO6Q3PB4DD6OJT6Q@2/linux-jdk10-m3.5.x_build/target/it/MPMD-266-typeresolution-aggregated/build.log, /home/jenkins/jenkins-slave/workspace/x_maven-pmd-plugin_MPMD-266-KO4DEQSQU6LULLR6I6VDVZF2RKZRIL5NFCHXXO6Q3PB4DD6OJT6Q@2/linux-jdk10-m3.5.x_build/target/it/MPMD-268-deprecated-rules/build.log, /home/jenkins/jenkins-slave/workspace/x_maven-pmd-plugin_MPMD-266-KO4DEQSQU6LULLR6I6VDVZF2RKZRIL5NFCHXXO6Q3PB4DD6OJT6Q@2/linux-jdk10-m3.5.x_build/target/it/MPMD-89-232-typeresolution/build.log, /home/jenkins/jenkins-slave/workspace/x_maven-pmd-plugin_MPMD-266-KO4DEQSQU6LULLR6I6VDVZF2RKZRIL5NFCHXXO6Q3PB4DD6OJT6Q@2/linux-jdk10-m3.5.x_build/target/it/empty-rulesets/build.log, /home/jenkins/jenkins-slave/workspace/x_maven-pmd-plugin_MPMD-266-KO4DEQSQU6LULLR6I6VDVZF2RKZRIL5NFCHXXO6Q3PB4DD6OJT6Q@2/linux-jdk10-m3.5.x_build/target/it/mpmd-138/build.log, /home/jenkins/jenkins-slave/workspace/x_maven-pmd-plugin_MPMD-266-KO4DEQSQU6LULLR6I6VDVZF2RKZRIL5NFCHXXO6Q3PB4DD6OJT6Q@2/linux-jdk10-m3.5.x_build/target/it/mpmd-142/build.log, /home/jenkins/jenkins-slave/workspace/x_maven-pmd-plugin_MPMD-266-KO4DEQSQU6LULLR6I6VDVZF2RKZRIL5NFCHXXO6Q3PB4DD6OJT6Q@2/linux-jdk10-m3.5.x_build/target/it/mpmd-168-empty-report/build.log, /home/jenkins/jenkins-slave/workspace/x_maven-pmd-plugin_MPMD-266-KO4DEQSQU6LULLR6I6VDVZF2RKZRIL5NFCHXXO6Q3PB4DD6OJT6Q@2/linux-jdk10-m3.5.x_build/target/it/mpmd-168/build.log, /home/jenkins/jenkins-slave/workspace/x_maven-pmd-plugin_MPMD-266-KO4DEQSQU6LULLR6I6VDVZF2RKZRIL5NFCHXXO6Q3PB4DD6OJT6Q@2/linux-jdk10-m3.5.x_build/target/it/mpmd-80-included/build.log, /home/jenkins/jenkins-slave/workspace/x_maven-pmd-plugin_MPMD-266-KO4DEQSQU6LULLR6I6VDVZF2RKZRIL5NFCHXXO6Q3PB4DD6OJT6Q@2/linux-jdk10-m3.5.x_build/target/it/mpmd-80-not-included/build.log, /home/jenkins/jenkins-slave/workspace/x_maven-pmd-plugin_MPMD-266-KO4DEQSQU6LULLR6I6VDVZF2RKZRIL5NFCHXXO6Q3PB4DD6OJT6Q@2/linux-jdk10-m3.5.x_build/target/it/multi-module/build.log]
[linux-jdk10-m3.5.x_build] Finished parsing Maven Invoker results (found 29)
[linux-jdk10-m3.5.x_build] [withMaven] junitPublisher - Archive test results for Maven artifact org.apache.maven.plugins:maven-pmd-plugin:3.11.0-SNAPSHOT generated by maven-surefire-plugin:test (default-test): linux-jdk10-m3.5.x_build/target/surefire-reports/*.xml
[linux-jdk10-m3.5.x_build] Recording test results
[linux-jdk10-m3.5.x_build] [withMaven] openTasksPublisher - Scan Tasks for Maven artifact org.apache.maven.plugins:maven-pmd-plugin:3.11.0-SNAPSHOT in source directory linux-jdk10-m3.5.x_build/src/main/java
[linux-jdk10-m3.5.x_build] [TASKS] Scanning folder '/home/jenkins/jenkins-slave/workspace/x_maven-pmd-plugin_MPMD-266-KO4DEQSQU6LULLR6I6VDVZF2RKZRIL5NFCHXXO6Q3PB4DD6OJT6Q@2' for files matching the pattern 'linux-jdk10-m3.5.x_build/src/main/java/**/*' - excludes: null
[linux-jdk10-m3.5.x_build] [TASKS] Found 14 files to scan for tasks
[linux-jdk10-m3.5.x_build] [TASKS] Found 6 open tasks.
[linux-jdk10-m3.5.x_build] Skipping warnings blame since pipelines do not have an SCM link.%n
[Pipeline] [linux-jdk10-m3.5.x_build] // withMaven
[Pipeline] [linux-jdk10-m3.5.x_build] cleanWs
[Pipeline] [linux-jdk11-m3.5.x_build] cleanWs
[linux-jdk10-m3.5.x_build] [WS-CLEANUP] Deleting project workspace...[WS-CLEANUP] done
[linux-jdk11-m3.5.x_build] [WS-CLEANUP] Deleting project workspace...[WS-CLEANUP] done
[Pipeline] [linux-jdk10-m3.5.x_build] cleanWs
[Pipeline] [linux-jdk11-m3.5.x_build] }
[Pipeline] [linux-jdk11-m3.5.x_build] // stage
[Pipeline] [linux-jdk11-m3.5.x_build] }
[Pipeline] [linux-jdk11-m3.5.x_build] // ws
[Pipeline] [linux-jdk11-m3.5.x_build] }
[Pipeline] [linux-jdk11-m3.5.x_build] // node
[Pipeline] [linux-jdk11-m3.5.x_build] }
[linux-jdk10-m3.5.x_build] [WS-CLEANUP] Deleting project workspace...[WS-CLEANUP] done
[linux-jdk11-m3.5.x_build] Failed in branch linux-jdk11-m3.5.x_build
[Pipeline] [linux-jdk10-m3.5.x_build] }
[Pipeline] [linux-jdk10-m3.5.x_build] // stage
[Pipeline] [linux-jdk10-m3.5.x_build] }
[Pipeline] [linux-jdk10-m3.5.x_build] // ws
[Pipeline] [linux-jdk10-m3.5.x_build] }
[Pipeline] [linux-jdk10-m3.5.x_build] // node
[Pipeline] [linux-jdk10-m3.5.x_build] }
[linux-jdk10-m3.5.x_build] Failed in branch linux-jdk10-m3.5.x_build
[Pipeline] // parallel
[Pipeline] stage
[Pipeline] { (Notifications)
[Pipeline] echo
Build result: FAILURE
[Pipeline] jiraIssueSelector
[Pipeline] emailext
Reply | Threaded
Open this post in threaded view
|

Build unstable in Jenkins: Maven TLP » maven-pmd-plugin » MPMD-266 #2

Apache Jenkins Server-2
See https://builds.apache.org/job/maven-box/job/maven-pmd-plugin/job/MPMD-266/2/

Changes:

* Fix checkstyle
* Fix checkstyle
* Fix checkstyle
* Fix checkstyle
* Fix checkstyle
* Fix checkstyle
* Fix checkstyle

All tests passed

Build log:
[...truncated 10.47 MB...]
[Pipeline] [linux-jdk8-m3.5.x_build] // stage
[Pipeline] [linux-jdk8-m3.5.x_build] }
[Pipeline] [linux-jdk8-m3.5.x_build] // ws
[Pipeline] [linux-jdk8-m3.5.x_build] }
[Pipeline] [linux-jdk8-m3.5.x_build] // node
[Pipeline] [linux-jdk8-m3.5.x_build] }
[linux-jdk11-m3.5.x_build] [INFO] run post-build script verify.groovy
[linux-jdk11-m3.5.x_build] [INFO]           MPMD-163/pom.xml ................................. SUCCESS (5.2 s)
[linux-jdk11-m3.5.x_build] [INFO] Building: mpmd-168-empty-report/pom.xml
[linux-jdk10-m3.5.x_build] [INFO] run post-build script verify.groovy
[linux-jdk10-m3.5.x_build] [INFO]           MPMD-206-sourceDirectories-js/pom.xml ............ SUCCESS (6.3 s)
[linux-jdk10-m3.5.x_build] [INFO] Building: mpmd-142/pom.xml
[linux-jdk11-m3.5.x_build] [INFO] run post-build script verify.groovy
[linux-jdk11-m3.5.x_build] [INFO]           mpmd-168-empty-report/pom.xml .................... SUCCESS (9.9 s)
[linux-jdk11-m3.5.x_build] [INFO] Building: MPMD-253-xref-link-multi-module/pom.xml
[linux-jdk10-m3.5.x_build] [INFO]           mpmd-142/pom.xml ................................. SUCCESS (11.8 s)
[linux-jdk10-m3.5.x_build] [INFO] Building: empty-rulesets/pom.xml
[linux-jdk11-m3.5.x_build] [INFO] run post-build script verify.groovy
[linux-jdk11-m3.5.x_build] [INFO]           MPMD-253-xref-link-multi-module/pom.xml .......... SUCCESS (7.2 s)
[linux-jdk11-m3.5.x_build] [INFO] Building: MPMD-187/pom.xml
[linux-jdk10-m3.5.x_build] [INFO] run post-build script verify.groovy
[linux-jdk10-m3.5.x_build] [INFO]           empty-rulesets/pom.xml ........................... SUCCESS (6.2 s)
[linux-jdk10-m3.5.x_build] [INFO]
[linux-jdk10-m3.5.x_build] [INFO] --- maven-checkstyle-plugin:3.0.0:check (checkstyle-check) @ maven-pmd-plugin ---
[linux-jdk10-m3.5.x_build] [INFO] Downloading from central: https://repo.maven.apache.org/maven2/org/apache/maven/shared/maven-shared-resources/2/maven-shared-resources-2.pom
[linux-jdk10-m3.5.x_build] [INFO] Downloaded from central: https://repo.maven.apache.org/maven2/org/apache/maven/shared/maven-shared-resources/2/maven-shared-resources-2.pom (3.0 kB at 156 kB/s)
[linux-jdk10-m3.5.x_build] [INFO] Downloading from central: https://repo.maven.apache.org/maven2/org/codehaus/plexus/plexus-utils/3.0.10/plexus-utils-3.0.10.pom
[linux-jdk10-m3.5.x_build] [INFO] Downloaded from central: https://repo.maven.apache.org/maven2/org/codehaus/plexus/plexus-utils/3.0.10/plexus-utils-3.0.10.pom (3.1 kB at 242 kB/s)
[linux-jdk10-m3.5.x_build] [INFO] Downloading from central: https://repo.maven.apache.org/maven2/org/codehaus/plexus/plexus/3.3/plexus-3.3.pom
[linux-jdk10-m3.5.x_build] [INFO] Downloaded from central: https://repo.maven.apache.org/maven2/org/codehaus/plexus/plexus/3.3/plexus-3.3.pom (20 kB at 1.5 MB/s)
[linux-jdk10-m3.5.x_build] [INFO] Downloading from central: https://repo.maven.apache.org/maven2/org/apache/maven/doxia/doxia-integration-tools/1.6/doxia-integration-tools-1.6.pom
[linux-jdk10-m3.5.x_build] [INFO] Downloaded from central: https://repo.maven.apache.org/maven2/org/apache/maven/doxia/doxia-integration-tools/1.6/doxia-integration-tools-1.6.pom (7.0 kB at 535 kB/s)
[linux-jdk10-m3.5.x_build] [INFO] Downloading from central: https://repo.maven.apache.org/maven2/org/apache/maven/doxia/doxia-tools/3/doxia-tools-3.pom
[linux-jdk10-m3.5.x_build] [INFO] Downloaded from central: https://repo.maven.apache.org/maven2/org/apache/maven/doxia/doxia-tools/3/doxia-tools-3.pom (9.9 kB at 709 kB/s)
[linux-jdk10-m3.5.x_build] [INFO] Downloading from central: https://repo.maven.apache.org/maven2/org/codehaus/plexus/plexus-resources/1.1.0/plexus-resources-1.1.0.pom
[linux-jdk10-m3.5.x_build] [INFO] Downloaded from central: https://repo.maven.apache.org/maven2/org/codehaus/plexus/plexus-resources/1.1.0/plexus-resources-1.1.0.pom (3.2 kB at 265 kB/s)
[linux-jdk10-m3.5.x_build] [INFO] Downloading from central: https://repo.maven.apache.org/maven2/com/puppycrawl/tools/checkstyle/6.18/checkstyle-6.18.pom
[linux-jdk10-m3.5.x_build] [INFO] Downloaded from central: https://repo.maven.apache.org/maven2/com/puppycrawl/tools/checkstyle/6.18/checkstyle-6.18.pom (71 kB at 4.4 MB/s)
[linux-jdk10-m3.5.x_build] [INFO] Downloading from central: https://repo.maven.apache.org/maven2/antlr/antlr/2.7.7/antlr-2.7.7.pom
[linux-jdk10-m3.5.x_build] [INFO] Downloaded from central: https://repo.maven.apache.org/maven2/antlr/antlr/2.7.7/antlr-2.7.7.pom (632 B at 53 kB/s)
[linux-jdk10-m3.5.x_build] [INFO] Downloading from central: https://repo.maven.apache.org/maven2/org/antlr/antlr4-runtime/4.5.3/antlr4-runtime-4.5.3.pom
[linux-jdk10-m3.5.x_build] [INFO] Downloaded from central: https://repo.maven.apache.org/maven2/org/antlr/antlr4-runtime/4.5.3/antlr4-runtime-4.5.3.pom (2.3 kB at 192 kB/s)
[linux-jdk10-m3.5.x_build] [INFO] Downloading from central: https://repo.maven.apache.org/maven2/org/antlr/antlr4-master/4.5.3/antlr4-master-4.5.3.pom
[linux-jdk10-m3.5.x_build] [INFO] Downloaded from central: https://repo.maven.apache.org/maven2/org/antlr/antlr4-master/4.5.3/antlr4-master-4.5.3.pom (3.7 kB at 283 kB/s)
[linux-jdk10-m3.5.x_build] [INFO] Downloading from central: https://repo.maven.apache.org/maven2/commons-beanutils/commons-beanutils/1.9.2/commons-beanutils-1.9.2.pom
[linux-jdk10-m3.5.x_build] [INFO] Downloaded from central: https://repo.maven.apache.org/maven2/commons-beanutils/commons-beanutils/1.9.2/commons-beanutils-1.9.2.pom (14 kB at 1.1 MB/s)
[linux-jdk10-m3.5.x_build] [INFO] Downloading from central: https://repo.maven.apache.org/maven2/org/apache/commons/commons-parent/33/commons-parent-33.pom
[linux-jdk10-m3.5.x_build] [INFO] Downloaded from central: https://repo.maven.apache.org/maven2/org/apache/commons/commons-parent/33/commons-parent-33.pom (53 kB at 3.8 MB/s)
[linux-jdk10-m3.5.x_build] [INFO] Downloading from central: https://repo.maven.apache.org/maven2/commons-cli/commons-cli/1.3.1/commons-cli-1.3.1.pom
[linux-jdk10-m3.5.x_build] [INFO] Downloaded from central: https://repo.maven.apache.org/maven2/commons-cli/commons-cli/1.3.1/commons-cli-1.3.1.pom (10 kB at 799 kB/s)
[linux-jdk10-m3.5.x_build] [INFO] Downloading from central: https://repo.maven.apache.org/maven2/com/google/guava/guava/19.0/guava-19.0.pom
[linux-jdk10-m3.5.x_build] [INFO] Downloaded from central: https://repo.maven.apache.org/maven2/com/google/guava/guava/19.0/guava-19.0.pom (6.8 kB at 566 kB/s)
[linux-jdk10-m3.5.x_build] [INFO] Downloading from central: https://repo.maven.apache.org/maven2/com/google/guava/guava-parent/19.0/guava-parent-19.0.pom
[linux-jdk10-m3.5.x_build] [INFO] Downloaded from central: https://repo.maven.apache.org/maven2/com/google/guava/guava-parent/19.0/guava-parent-19.0.pom (9.9 kB at 823 kB/s)
[linux-jdk10-m3.5.x_build] [INFO] Downloading from central: https://repo.maven.apache.org/maven2/javax/xml/bind/jaxb-api/2.3.0/jaxb-api-2.3.0.pom
[linux-jdk10-m3.5.x_build] [INFO] Downloaded from central: https://repo.maven.apache.org/maven2/javax/xml/bind/jaxb-api/2.3.0/jaxb-api-2.3.0.pom (23 kB at 1.9 MB/s)
[linux-jdk10-m3.5.x_build] [INFO] Downloading from central: https://repo.maven.apache.org/maven2/javax/xml/bind/jaxb-api-parent/2.3.0/jaxb-api-parent-2.3.0.pom
[linux-jdk10-m3.5.x_build] [INFO] Downloaded from central: https://repo.maven.apache.org/maven2/javax/xml/bind/jaxb-api-parent/2.3.0/jaxb-api-parent-2.3.0.pom (5.6 kB at 513 kB/s)
[linux-jdk10-m3.5.x_build] [INFO] Downloading from central: https://repo.maven.apache.org/maven2/net/java/jvnet-parent/5/jvnet-parent-5.pom
[linux-jdk10-m3.5.x_build] [INFO] Downloaded from central: https://repo.maven.apache.org/maven2/net/java/jvnet-parent/5/jvnet-parent-5.pom (8.9 kB at 739 kB/s)
[linux-jdk10-m3.5.x_build] [INFO] Downloading from central: https://repo.maven.apache.org/maven2/org/apache/maven/doxia/doxia-core/1.2/doxia-core-1.2.jar
[linux-jdk10-m3.5.x_build] [INFO] Downloading from central: https://repo.maven.apache.org/maven2/org/apache/maven/shared/maven-shared-resources/2/maven-shared-resources-2.jar
[linux-jdk10-m3.5.x_build] [INFO] Downloading from central: https://repo.maven.apache.org/maven2/commons-logging/commons-logging/1.0.4/commons-logging-1.0.4.jar
[linux-jdk10-m3.5.x_build] [INFO] Downloading from central: https://repo.maven.apache.org/maven2/commons-digester/commons-digester/1.6/commons-digester-1.6.jar
[linux-jdk10-m3.5.x_build] [INFO] Downloading from central: https://repo.maven.apache.org/maven2/org/apache/maven/doxia/doxia-integration-tools/1.6/doxia-integration-tools-1.6.jar
[linux-jdk10-m3.5.x_build] [INFO] Downloaded from central: https://repo.maven.apache.org/maven2/org/apache/maven/shared/maven-shared-resources/2/maven-shared-resources-2.jar (13 kB at 544 kB/s)
[linux-jdk10-m3.5.x_build] [INFO] Downloading from central: https://repo.maven.apache.org/maven2/commons-io/commons-io/1.4/commons-io-1.4.jar
[linux-jdk10-m3.5.x_build] [INFO] Downloaded from central: https://repo.maven.apache.org/maven2/commons-logging/commons-logging/1.0.4/commons-logging-1.0.4.jar (38 kB at 2.0 MB/s)
[linux-jdk10-m3.5.x_build] [INFO] Downloading from central: https://repo.maven.apache.org/maven2/org/codehaus/plexus/plexus-resources/1.1.0/plexus-resources-1.1.0.jar
[linux-jdk10-m3.5.x_build] [INFO] Downloaded from central: https://repo.maven.apache.org/maven2/org/apache/maven/doxia/doxia-integration-tools/1.6/doxia-integration-tools-1.6.jar (45 kB at 2.1 MB/s)
[linux-jdk10-m3.5.x_build] [INFO] Downloading from central: https://repo.maven.apache.org/maven2/com/puppycrawl/tools/checkstyle/6.18/checkstyle-6.18.jar
[linux-jdk10-m3.5.x_build] [INFO] Downloaded from central: https://repo.maven.apache.org/maven2/commons-digester/commons-digester/1.6/commons-digester-1.6.jar (168 kB at 6.5 MB/s)
[linux-jdk10-m3.5.x_build] [INFO] Downloading from central: https://repo.maven.apache.org/maven2/antlr/antlr/2.7.7/antlr-2.7.7.jar
[linux-jdk10-m3.5.x_build] [INFO] Downloaded from central: https://repo.maven.apache.org/maven2/org/apache/maven/doxia/doxia-core/1.2/doxia-core-1.2.jar (154 kB at 4.5 MB/s)
[linux-jdk10-m3.5.x_build] [INFO] Downloading from central: https://repo.maven.apache.org/maven2/org/antlr/antlr4-runtime/4.5.3/antlr4-runtime-4.5.3.jar
[linux-jdk10-m3.5.x_build] [INFO] Downloaded from central: https://repo.maven.apache.org/maven2/org/codehaus/plexus/plexus-resources/1.1.0/plexus-resources-1.1.0.jar (23 kB at 749 kB/s)
[linux-jdk10-m3.5.x_build] [INFO] Downloaded from central: https://repo.maven.apache.org/maven2/commons-io/commons-io/1.4/commons-io-1.4.jar (109 kB at 3.5 MB/s)
[linux-jdk10-m3.5.x_build] [INFO] Downloading from central: https://repo.maven.apache.org/maven2/commons-beanutils/commons-beanutils/1.9.2/commons-beanutils-1.9.2.jar
[linux-jdk10-m3.5.x_build] [INFO] Downloading from central: https://repo.maven.apache.org/maven2/commons-cli/commons-cli/1.3.1/commons-cli-1.3.1.jar
[linux-jdk10-m3.5.x_build] [INFO] Downloaded from central: https://repo.maven.apache.org/maven2/org/antlr/antlr4-runtime/4.5.3/antlr4-runtime-4.5.3.jar (302 kB at 6.3 MB/s)
[linux-jdk10-m3.5.x_build] [INFO] Downloading from central: https://repo.maven.apache.org/maven2/com/google/guava/guava/19.0/guava-19.0.jar
[linux-jdk10-m3.5.x_build] [INFO] Downloaded from central: https://repo.maven.apache.org/maven2/antlr/antlr/2.7.7/antlr-2.7.7.jar (445 kB at 8.9 MB/s)
[linux-jdk10-m3.5.x_build] [INFO] Downloading from central: https://repo.maven.apache.org/maven2/commons-lang/commons-lang/2.1/commons-lang-2.1.jar
[linux-jdk10-m3.5.x_build] [INFO] Downloaded from central: https://repo.maven.apache.org/maven2/commons-cli/commons-cli/1.3.1/commons-cli-1.3.1.jar (53 kB at 1.0 MB/s)
[linux-jdk10-m3.5.x_build] [INFO] Downloading from central: https://repo.maven.apache.org/maven2/javax/xml/bind/jaxb-api/2.3.0/jaxb-api-2.3.0.jar
[linux-jdk10-m3.5.x_build] [INFO] Downloaded from central: https://repo.maven.apache.org/maven2/commons-beanutils/commons-beanutils/1.9.2/commons-beanutils-1.9.2.jar (234 kB at 4.0 MB/s)
[linux-jdk10-m3.5.x_build] [INFO] Downloaded from central: https://repo.maven.apache.org/maven2/com/puppycrawl/tools/checkstyle/6.18/checkstyle-6.18.jar (1.2 MB at 18 MB/s)
[linux-jdk10-m3.5.x_build] [INFO] Downloaded from central: https://repo.maven.apache.org/maven2/javax/xml/bind/jaxb-api/2.3.0/jaxb-api-2.3.0.jar (126 kB at 1.8 MB/s)
[linux-jdk10-m3.5.x_build] [INFO] Downloaded from central: https://repo.maven.apache.org/maven2/commons-lang/commons-lang/2.1/commons-lang-2.1.jar (208 kB at 3.0 MB/s)
[linux-jdk10-m3.5.x_build] [INFO] Downloaded from central: https://repo.maven.apache.org/maven2/com/google/guava/guava/19.0/guava-19.0.jar (2.3 MB at 18 MB/s)
[linux-jdk11-m3.5.x_build] [INFO] run post-build script verify.groovy
[linux-jdk11-m3.5.x_build] [INFO]           MPMD-187/pom.xml ................................. SUCCESS (4.8 s)
[linux-jdk11-m3.5.x_build] [INFO]
[linux-jdk11-m3.5.x_build] [INFO] --- maven-checkstyle-plugin:3.0.0:check (checkstyle-check) @ maven-pmd-plugin ---
[linux-jdk11-m3.5.x_build] [INFO] Downloading from central: https://repo.maven.apache.org/maven2/org/apache/maven/shared/maven-shared-resources/2/maven-shared-resources-2.pom
[linux-jdk11-m3.5.x_build] [INFO] Downloaded from central: https://repo.maven.apache.org/maven2/org/apache/maven/shared/maven-shared-resources/2/maven-shared-resources-2.pom (3.0 kB at 164 kB/s)
[linux-jdk11-m3.5.x_build] [INFO] Downloading from central: https://repo.maven.apache.org/maven2/org/codehaus/plexus/plexus-utils/3.0.10/plexus-utils-3.0.10.pom
[linux-jdk11-m3.5.x_build] [INFO] Downloaded from central: https://repo.maven.apache.org/maven2/org/codehaus/plexus/plexus-utils/3.0.10/plexus-utils-3.0.10.pom (3.1 kB at 262 kB/s)
[linux-jdk11-m3.5.x_build] [INFO] Downloading from central: https://repo.maven.apache.org/maven2/org/codehaus/plexus/plexus/3.3/plexus-3.3.pom
[linux-jdk11-m3.5.x_build] [INFO] Downloaded from central: https://repo.maven.apache.org/maven2/org/codehaus/plexus/plexus/3.3/plexus-3.3.pom (20 kB at 1.7 MB/s)
[linux-jdk11-m3.5.x_build] [INFO] Downloading from central: https://repo.maven.apache.org/maven2/org/apache/maven/doxia/doxia-integration-tools/1.6/doxia-integration-tools-1.6.pom
[linux-jdk11-m3.5.x_build] [INFO] Downloaded from central: https://repo.maven.apache.org/maven2/org/apache/maven/doxia/doxia-integration-tools/1.6/doxia-integration-tools-1.6.pom (7.0 kB at 535 kB/s)
[linux-jdk11-m3.5.x_build] [INFO] Downloading from central: https://repo.maven.apache.org/maven2/org/apache/maven/doxia/doxia-tools/3/doxia-tools-3.pom
[linux-jdk11-m3.5.x_build] [INFO] Downloaded from central: https://repo.maven.apache.org/maven2/org/apache/maven/doxia/doxia-tools/3/doxia-tools-3.pom (9.9 kB at 827 kB/s)
[linux-jdk11-m3.5.x_build] [INFO] Downloading from central: https://repo.maven.apache.org/maven2/org/codehaus/plexus/plexus-resources/1.1.0/plexus-resources-1.1.0.pom
[linux-jdk11-m3.5.x_build] [INFO] Downloaded from central: https://repo.maven.apache.org/maven2/org/codehaus/plexus/plexus-resources/1.1.0/plexus-resources-1.1.0.pom (3.2 kB at 289 kB/s)
[linux-jdk11-m3.5.x_build] [INFO] Downloading from central: https://repo.maven.apache.org/maven2/com/puppycrawl/tools/checkstyle/6.18/checkstyle-6.18.pom
[linux-jdk11-m3.5.x_build] [INFO] Downloaded from central: https://repo.maven.apache.org/maven2/com/puppycrawl/tools/checkstyle/6.18/checkstyle-6.18.pom (71 kB at 4.4 MB/s)
[linux-jdk11-m3.5.x_build] [INFO] Downloading from central: https://repo.maven.apache.org/maven2/antlr/antlr/2.7.7/antlr-2.7.7.pom
[linux-jdk11-m3.5.x_build] [INFO] Downloaded from central: https://repo.maven.apache.org/maven2/antlr/antlr/2.7.7/antlr-2.7.7.pom (632 B at 53 kB/s)
[linux-jdk11-m3.5.x_build] [INFO] Downloading from central: https://repo.maven.apache.org/maven2/org/antlr/antlr4-runtime/4.5.3/antlr4-runtime-4.5.3.pom
[linux-jdk11-m3.5.x_build] [INFO] Downloaded from central: https://repo.maven.apache.org/maven2/org/antlr/antlr4-runtime/4.5.3/antlr4-runtime-4.5.3.pom (2.3 kB at 165 kB/s)
[linux-jdk11-m3.5.x_build] [INFO] Downloading from central: https://repo.maven.apache.org/maven2/org/antlr/antlr4-master/4.5.3/antlr4-master-4.5.3.pom
[linux-jdk11-m3.5.x_build] [INFO] Downloaded from central: https://repo.maven.apache.org/maven2/org/antlr/antlr4-master/4.5.3/antlr4-master-4.5.3.pom (3.7 kB at 167 kB/s)
[linux-jdk11-m3.5.x_build] [INFO] Downloading from central: https://repo.maven.apache.org/maven2/commons-beanutils/commons-beanutils/1.9.2/commons-beanutils-1.9.2.pom
[linux-jdk11-m3.5.x_build] [INFO] Downloaded from central: https://repo.maven.apache.org/maven2/commons-beanutils/commons-beanutils/1.9.2/commons-beanutils-1.9.2.pom (14 kB at 1.1 MB/s)
[linux-jdk11-m3.5.x_build] [INFO] Downloading from central: https://repo.maven.apache.org/maven2/org/apache/commons/commons-parent/33/commons-parent-33.pom
[linux-jdk11-m3.5.x_build] [INFO] Downloaded from central: https://repo.maven.apache.org/maven2/org/apache/commons/commons-parent/33/commons-parent-33.pom (53 kB at 4.1 MB/s)
[linux-jdk11-m3.5.x_build] [INFO] Downloading from central: https://repo.maven.apache.org/maven2/commons-cli/commons-cli/1.3.1/commons-cli-1.3.1.pom
[linux-jdk11-m3.5.x_build] [INFO] Downloaded from central: https://repo.maven.apache.org/maven2/commons-cli/commons-cli/1.3.1/commons-cli-1.3.1.pom (10 kB at 799 kB/s)
[linux-jdk11-m3.5.x_build] [INFO] Downloading from central: https://repo.maven.apache.org/maven2/com/google/guava/guava/19.0/guava-19.0.pom
[linux-jdk11-m3.5.x_build] [INFO] Downloaded from central: https://repo.maven.apache.org/maven2/com/google/guava/guava/19.0/guava-19.0.pom (6.8 kB at 566 kB/s)
[linux-jdk11-m3.5.x_build] [INFO] Downloading from central: https://repo.maven.apache.org/maven2/com/google/guava/guava-parent/19.0/guava-parent-19.0.pom
[linux-jdk11-m3.5.x_build] [INFO] Downloaded from central: https://repo.maven.apache.org/maven2/com/google/guava/guava-parent/19.0/guava-parent-19.0.pom (9.9 kB at 760 kB/s)
[linux-jdk11-m3.5.x_build] [INFO] Downloading from central: https://repo.maven.apache.org/maven2/javax/xml/bind/jaxb-api/2.3.0/jaxb-api-2.3.0.pom
[linux-jdk11-m3.5.x_build] [INFO] Downloaded from central: https://repo.maven.apache.org/maven2/javax/xml/bind/jaxb-api/2.3.0/jaxb-api-2.3.0.pom (23 kB at 1.6 MB/s)
[linux-jdk11-m3.5.x_build] [INFO] Downloading from central: https://repo.maven.apache.org/maven2/javax/xml/bind/jaxb-api-parent/2.3.0/jaxb-api-parent-2.3.0.pom
[linux-jdk11-m3.5.x_build] [INFO] Downloaded from central: https://repo.maven.apache.org/maven2/javax/xml/bind/jaxb-api-parent/2.3.0/jaxb-api-parent-2.3.0.pom (5.6 kB at 434 kB/s)
[linux-jdk11-m3.5.x_build] [INFO] Downloading from central: https://repo.maven.apache.org/maven2/net/java/jvnet-parent/5/jvnet-parent-5.pom
[linux-jdk11-m3.5.x_build] [INFO] Downloaded from central: https://repo.maven.apache.org/maven2/net/java/jvnet-parent/5/jvnet-parent-5.pom (8.9 kB at 739 kB/s)
[linux-jdk11-m3.5.x_build] [INFO] Downloading from central: https://repo.maven.apache.org/maven2/org/apache/maven/shared/maven-shared-resources/2/maven-shared-resources-2.jar
[linux-jdk11-m3.5.x_build] [INFO] Downloading from central: https://repo.maven.apache.org/maven2/commons-digester/commons-digester/1.6/commons-digester-1.6.jar
[linux-jdk11-m3.5.x_build] [INFO] Downloading from central: https://repo.maven.apache.org/maven2/org/apache/maven/doxia/doxia-core/1.2/doxia-core-1.2.jar
[linux-jdk11-m3.5.x_build] [INFO] Downloading from central: https://repo.maven.apache.org/maven2/commons-logging/commons-logging/1.0.4/commons-logging-1.0.4.jar
[linux-jdk11-m3.5.x_build] [INFO] Downloading from central: https://repo.maven.apache.org/maven2/org/apache/maven/doxia/doxia-integration-tools/1.6/doxia-integration-tools-1.6.jar
[linux-jdk11-m3.5.x_build] [INFO] Downloaded from central: https://repo.maven.apache.org/maven2/org/apache/maven/shared/maven-shared-resources/2/maven-shared-resources-2.jar (13 kB at 687 kB/s)
[linux-jdk11-m3.5.x_build] [INFO] Downloaded from central: https://repo.maven.apache.org/maven2/org/apache/maven/doxia/doxia-integration-tools/1.6/doxia-integration-tools-1.6.jar (45 kB at 2.5 MB/s)
[linux-jdk11-m3.5.x_build] [INFO] Downloaded from central: https://repo.maven.apache.org/maven2/commons-logging/commons-logging/1.0.4/commons-logging-1.0.4.jar (38 kB at 2.1 MB/s)
[linux-jdk11-m3.5.x_build] [INFO] Downloading from central: https://repo.maven.apache.org/maven2/com/puppycrawl/tools/checkstyle/6.18/checkstyle-6.18.jar
[linux-jdk11-m3.5.x_build] [INFO] Downloading from central: https://repo.maven.apache.org/maven2/org/codehaus/plexus/plexus-resources/1.1.0/plexus-resources-1.1.0.jar
[linux-jdk11-m3.5.x_build] [INFO] Downloaded from central: https://repo.maven.apache.org/maven2/org/apache/maven/doxia/doxia-core/1.2/doxia-core-1.2.jar (154 kB at 8.1 MB/s)
[linux-jdk11-m3.5.x_build] [INFO] Downloading from central: https://repo.maven.apache.org/maven2/antlr/antlr/2.7.7/antlr-2.7.7.jar
[linux-jdk11-m3.5.x_build] [INFO] Downloading from central: https://repo.maven.apache.org/maven2/commons-io/commons-io/1.4/commons-io-1.4.jar
[linux-jdk11-m3.5.x_build] [INFO] Downloaded from central: https://repo.maven.apache.org/maven2/commons-digester/commons-digester/1.6/commons-digester-1.6.jar (168 kB at 7.3 MB/s)
[linux-jdk11-m3.5.x_build] [INFO] Downloading from central: https://repo.maven.apache.org/maven2/org/antlr/antlr4-runtime/4.5.3/antlr4-runtime-4.5.3.jar
[linux-jdk11-m3.5.x_build] [INFO] Downloaded from central: https://repo.maven.apache.org/maven2/org/codehaus/plexus/plexus-resources/1.1.0/plexus-resources-1.1.0.jar (23 kB at 703 kB/s)
[linux-jdk11-m3.5.x_build] [INFO] Downloading from central: https://repo.maven.apache.org/maven2/commons-beanutils/commons-beanutils/1.9.2/commons-beanutils-1.9.2.jar
[linux-jdk11-m3.5.x_build] [INFO] Downloaded from central: https://repo.maven.apache.org/maven2/commons-io/commons-io/1.4/commons-io-1.4.jar (109 kB at 2.9 MB/s)
[linux-jdk11-m3.5.x_build] [INFO] Downloading from central: https://repo.maven.apache.org/maven2/commons-cli/commons-cli/1.3.1/commons-cli-1.3.1.jar
[linux-jdk11-m3.5.x_build] [INFO] Downloaded from central: https://repo.maven.apache.org/maven2/antlr/antlr/2.7.7/antlr-2.7.7.jar (445 kB at 10 MB/s)
[linux-jdk11-m3.5.x_build] [INFO] Downloading from central: https://repo.maven.apache.org/maven2/com/google/guava/guava/19.0/guava-19.0.jar
[linux-jdk11-m3.5.x_build] [INFO] Downloaded from central: https://repo.maven.apache.org/maven2/org/antlr/antlr4-runtime/4.5.3/antlr4-runtime-4.5.3.jar (302 kB at 6.9 MB/s)
[linux-jdk11-m3.5.x_build] [INFO] Downloading from central: https://repo.maven.apache.org/maven2/commons-lang/commons-lang/2.1/commons-lang-2.1.jar
[linux-jdk11-m3.5.x_build] [INFO] Downloaded from central: https://repo.maven.apache.org/maven2/commons-beanutils/commons-beanutils/1.9.2/commons-beanutils-1.9.2.jar (234 kB at 4.7 MB/s)
[linux-jdk11-m3.5.x_build] [INFO] Downloaded from central: https://repo.maven.apache.org/maven2/commons-cli/commons-cli/1.3.1/commons-cli-1.3.1.jar (53 kB at 1.1 MB/s)
[linux-jdk11-m3.5.x_build] [INFO] Downloading from central: https://repo.maven.apache.org/maven2/javax/xml/bind/jaxb-api/2.3.0/jaxb-api-2.3.0.jar
[linux-jdk11-m3.5.x_build] [INFO] Downloaded from central: https://repo.maven.apache.org/maven2/com/puppycrawl/tools/checkstyle/6.18/checkstyle-6.18.jar (1.2 MB at 21 MB/s)
[linux-jdk11-m3.5.x_build] [INFO] Downloaded from central: https://repo.maven.apache.org/maven2/commons-lang/commons-lang/2.1/commons-lang-2.1.jar (208 kB at 3.4 MB/s)
[linux-jdk11-m3.5.x_build] [INFO] Downloaded from central: https://repo.maven.apache.org/maven2/javax/xml/bind/jaxb-api/2.3.0/jaxb-api-2.3.0.jar (126 kB at 1.8 MB/s)
[linux-jdk11-m3.5.x_build] [INFO] Downloaded from central: https://repo.maven.apache.org/maven2/com/google/guava/guava/19.0/guava-19.0.jar (2.3 MB at 22 MB/s)
[linux-jdk10-m3.5.x_build] [INFO]
[linux-jdk10-m3.5.x_build] [INFO] --- maven-invoker-plugin:3.0.1:verify (integration-test) @ maven-pmd-plugin ---
[linux-jdk10-m3.5.x_build] [INFO] -------------------------------------------------
[linux-jdk10-m3.5.x_build] [INFO] Build Summary:
[linux-jdk10-m3.5.x_build] [INFO]   Passed: 28, Failed: 0, Errors: 0, Skipped: 1
[linux-jdk10-m3.5.x_build] [INFO] -------------------------------------------------
[linux-jdk10-m3.5.x_build] [INFO] ------------------------------------------------------------------------
[linux-jdk10-m3.5.x_build] [INFO] BUILD SUCCESS
[linux-jdk10-m3.5.x_build] [INFO] ------------------------------------------------------------------------
[linux-jdk10-m3.5.x_build] [INFO] Total time: 05:45 min
[linux-jdk10-m3.5.x_build] [INFO] Finished at: 2018-10-11T20:23:27Z
[linux-jdk10-m3.5.x_build] [INFO] ------------------------------------------------------------------------
[linux-jdk10-m3.5.x_build] [INFO] [jenkins-event-spy] Generated /home/jenkins/jenkins-slave/workspace/x_maven-pmd-plugin_MPMD-266-KO4DEQSQU6LULLR6I6VDVZF2RKZRIL5NFCHXXO6Q3PB4DD6OJT6Q@3@2@tmp/withMavenfc17d678/maven-spy-20181011-201742-451547504422928880526.log
[linux-jdk11-m3.5.x_build] [INFO]
[linux-jdk11-m3.5.x_build] [INFO] --- maven-invoker-plugin:3.0.1:verify (integration-test) @ maven-pmd-plugin ---
[linux-jdk11-m3.5.x_build] [INFO] -------------------------------------------------
[linux-jdk11-m3.5.x_build] [INFO] Build Summary:
[linux-jdk11-m3.5.x_build] [INFO]   Passed: 29, Failed: 0, Errors: 0, Skipped: 0
[linux-jdk11-m3.5.x_build] [INFO] -------------------------------------------------
[linux-jdk11-m3.5.x_build] [INFO] ------------------------------------------------------------------------
[linux-jdk11-m3.5.x_build] [INFO] BUILD SUCCESS
[linux-jdk11-m3.5.x_build] [INFO] ------------------------------------------------------------------------
[linux-jdk11-m3.5.x_build] [INFO] Total time: 04:20 min
[linux-jdk11-m3.5.x_build] [INFO] Finished at: 2018-10-11T20:23:27Z
[linux-jdk11-m3.5.x_build] [INFO] ------------------------------------------------------------------------
[linux-jdk11-m3.5.x_build] [INFO] [jenkins-event-spy] Generated /home/jenkins/jenkins-slave/workspace/x_maven-pmd-plugin_MPMD-266-KO4DEQSQU6LULLR6I6VDVZF2RKZRIL5NFCHXXO6Q3PB4DD6OJT6Q@2@tmp/withMaven8784db7b/maven-spy-20181011-201907-50610431628684082149887.log
[Pipeline] [linux-jdk10-m3.5.x_build] }
[Pipeline] [linux-jdk10-m3.5.x_build] // dir
[Pipeline] [linux-jdk10-m3.5.x_build] }
[linux-jdk10-m3.5.x_build] [withMaven] artifactsPublisher - Archive artifact linux-jdk10-m3.5.x_build/pom.xml under org/apache/maven/plugins/maven-pmd-plugin/3.11.0-SNAPSHOT/maven-pmd-plugin-3.11.0-SNAPSHOT.pom
[linux-jdk10-m3.5.x_build] [withMaven] artifactsPublisher - Archive artifact linux-jdk10-m3.5.x_build/target/maven-pmd-plugin-3.11.0-SNAPSHOT.jar under org/apache/maven/plugins/maven-pmd-plugin/3.11.0-SNAPSHOT/maven-pmd-plugin-3.11.0-SNAPSHOT.jar
[linux-jdk10-m3.5.x_build] [Fast Archiver] No prior successful build to compare, so performing full copy of artifacts
[linux-jdk10-m3.5.x_build] [withMaven] invokerPublisher - Archive invoker results for Maven artifact MavenArtifact{org.apache.maven.plugins:maven-pmd-plugin::3.11.0-SNAPSHOT(version: 3.11.0-SNAPSHOT, snapshot:false) } generated by PluginInvocation{org.apache.maven.plugins:maven-invoker-plugin:3.0.1@integration-test  integration-test}: linux-jdk10-m3.5.x_build/target/invoker-reports/*.xml
[linux-jdk10-m3.5.x_build] performing MavenInvokerRecorder, reportsFilenamePattern:'**/linux-jdk10-m3.5.x_build/target/invoker-reports/BUILD*.xml', invokerBuildDir:'**/linux-jdk10-m3.5.x_build/target/it'
[linux-jdk10-m3.5.x_build] Found reports:[/home/jenkins/jenkins-slave/workspace/x_maven-pmd-plugin_MPMD-266-KO4DEQSQU6LULLR6I6VDVZF2RKZRIL5NFCHXXO6Q3PB4DD6OJT6Q@3@2/linux-jdk10-m3.5.x_build/target/invoker-reports/BUILD-MPMD-128-xref-link.xml, /home/jenkins/jenkins-slave/workspace/x_maven-pmd-plugin_MPMD-266-KO4DEQSQU6LULLR6I6VDVZF2RKZRIL5NFCHXXO6Q3PB4DD6OJT6Q@3@2/linux-jdk10-m3.5.x_build/target/invoker-reports/BUILD-MPMD-163.xml, /home/jenkins/jenkins-slave/workspace/x_maven-pmd-plugin_MPMD-266-KO4DEQSQU6LULLR6I6VDVZF2RKZRIL5NFCHXXO6Q3PB4DD6OJT6Q@3@2/linux-jdk10-m3.5.x_build/target/invoker-reports/BUILD-MPMD-165.xml, /home/jenkins/jenkins-slave/workspace/x_maven-pmd-plugin_MPMD-266-KO4DEQSQU6LULLR6I6VDVZF2RKZRIL5NFCHXXO6Q3PB4DD6OJT6Q@3@2/linux-jdk10-m3.5.x_build/target/invoker-reports/BUILD-MPMD-172.xml, /home/jenkins/jenkins-slave/workspace/x_maven-pmd-plugin_MPMD-266-KO4DEQSQU6LULLR6I6VDVZF2RKZRIL5NFCHXXO6Q3PB4DD6OJT6Q@3@2/linux-jdk10-m3.5.x_build/target/invoker-reports/BUILD-MPMD-181-benchmark.xml, /home/jenkins/jenkins-slave/workspace/x_maven-pmd-plugin_MPMD-266-KO4DEQSQU6LULLR6I6VDVZF2RKZRIL5NFCHXXO6Q3PB4DD6OJT6Q@3@2/linux-jdk10-m3.5.x_build/target/invoker-reports/BUILD-MPMD-181-no-benchmark.xml, /home/jenkins/jenkins-slave/workspace/x_maven-pmd-plugin_MPMD-266-KO4DEQSQU6LULLR6I6VDVZF2RKZRIL5NFCHXXO6Q3PB4DD6OJT6Q@3@2/linux-jdk10-m3.5.x_build/target/invoker-reports/BUILD-MPMD-182.xml, /home/jenkins/jenkins-slave/workspace/x_maven-pmd-plugin_MPMD-266-KO4DEQSQU6LULLR6I6VDVZF2RKZRIL5NFCHXXO6Q3PB4DD6OJT6Q@3@2/linux-jdk10-m3.5.x_build/target/invoker-reports/BUILD-MPMD-187.xml, /home/jenkins/jenkins-slave/workspace/x_maven-pmd-plugin_MPMD-266-KO4DEQSQU6LULLR6I6VDVZF2RKZRIL5NFCHXXO6Q3PB4DD6OJT6Q@3@2/linux-jdk10-m3.5.x_build/target/invoker-reports/BUILD-MPMD-205-pmd-js-check.xml, /home/jenkins/jenkins-slave/workspace/x_maven-pmd-plugin_MPMD-266-KO4DEQSQU6LULLR6I6VDVZF2RKZRIL5NFCHXXO6Q3PB4DD6OJT6Q@3@2/linux-jdk10-m3.5.x_build/target/invoker-reports/BUILD-MPMD-206-sourceDirectories-js.xml, /home/jenkins/jenkins-slave/workspace/x_maven-pmd-plugin_MPMD-266-KO4DEQSQU6LULLR6I6VDVZF2RKZRIL5NFCHXXO6Q3PB4DD6OJT6Q@3@2/linux-jdk10-m3.5.x_build/target/invoker-reports/BUILD-MPMD-219-pmd-processing-error.xml, /home/jenkins/jenkins-slave/workspace/x_maven-pmd-plugin_MPMD-266-KO4DEQSQU6LULLR6I6VDVZF2RKZRIL5NFCHXXO6Q3PB4DD6OJT6Q@3@2/linux-jdk10-m3.5.x_build/target/invoker-reports/BUILD-MPMD-234-analysis-cache.xml, /home/jenkins/jenkins-slave/workspace/x_maven-pmd-plugin_MPMD-266-KO4DEQSQU6LULLR6I6VDVZF2RKZRIL5NFCHXXO6Q3PB4DD6OJT6Q@3@2/linux-jdk10-m3.5.x_build/target/invoker-reports/BUILD-MPMD-243-excludeFromFailureFile.xml, /home/jenkins/jenkins-slave/workspace/x_maven-pmd-plugin_MPMD-266-KO4DEQSQU6LULLR6I6VDVZF2RKZRIL5NFCHXXO6Q3PB4DD6OJT6Q@3@2/linux-jdk10-m3.5.x_build/target/invoker-reports/BUILD-MPMD-244-logging.xml, /home/jenkins/jenkins-slave/workspace/x_maven-pmd-plugin_MPMD-266-KO4DEQSQU6LULLR6I6VDVZF2RKZRIL5NFCHXXO6Q3PB4DD6OJT6Q@3@2/linux-jdk10-m3.5.x_build/target/invoker-reports/BUILD-MPMD-253-xref-link-multi-module.xml, /home/jenkins/jenkins-slave/workspace/x_maven-pmd-plugin_MPMD-266-KO4DEQSQU6LULLR6I6VDVZF2RKZRIL5NFCHXXO6Q3PB4DD6OJT6Q@3@2/linux-jdk10-m3.5.x_build/target/invoker-reports/BUILD-MPMD-258-multiple-executions.xml, /home/jenkins/jenkins-slave/workspace/x_maven-pmd-plugin_MPMD-266-KO4DEQSQU6LULLR6I6VDVZF2RKZRIL5NFCHXXO6Q3PB4DD6OJT6Q@3@2/linux-jdk10-m3.5.x_build/target/invoker-reports/BUILD-MPMD-259-analysis-cache-auxclasspath.xml, /home/jenkins/jenkins-slave/workspace/x_maven-pmd-plugin_MPMD-266-KO4DEQSQU6LULLR6I6VDVZF2RKZRIL5NFCHXXO6Q3PB4DD6OJT6Q@3@2/linux-jdk10-m3.5.x_build/target/invoker-reports/BUILD-MPMD-266-typeresolution-aggregated.xml, /home/jenkins/jenkins-slave/workspace/x_maven-pmd-plugin_MPMD-266-KO4DEQSQU6LULLR6I6VDVZF2RKZRIL5NFCHXXO6Q3PB4DD6OJT6Q@3@2/linux-jdk10-m3.5.x_build/target/invoker-reports/BUILD-MPMD-268-deprecated-rules.xml, /home/jenkins/jenkins-slave/workspace/x_maven-pmd-plugin_MPMD-266-KO4DEQSQU6LULLR6I6VDVZF2RKZRIL5NFCHXXO6Q3PB4DD6OJT6Q@3@2/linux-jdk10-m3.5.x_build/target/invoker-reports/BUILD-MPMD-270-JDK11.xml, /home/jenkins/jenkins-slave/workspace/x_maven-pmd-plugin_MPMD-266-KO4DEQSQU6LULLR6I6VDVZF2RKZRIL5NFCHXXO6Q3PB4DD6OJT6Q@3@2/linux-jdk10-m3.5.x_build/target/invoker-reports/BUILD-MPMD-89-232-typeresolution.xml, /home/jenkins/jenkins-slave/workspace/x_maven-pmd-plugin_MPMD-266-KO4DEQSQU6LULLR6I6VDVZF2RKZRIL5NFCHXXO6Q3PB4DD6OJT6Q@3@2/linux-jdk10-m3.5.x_build/target/invoker-reports/BUILD-empty-rulesets.xml, /home/jenkins/jenkins-slave/workspace/x_maven-pmd-plugin_MPMD-266-KO4DEQSQU6LULLR6I6VDVZF2RKZRIL5NFCHXXO6Q3PB4DD6OJT6Q@3@2/linux-jdk10-m3.5.x_build/target/invoker-reports/BUILD-mpmd-138.xml, /home/jenkins/jenkins-slave/workspace/x_maven-pmd-plugin_MPMD-266-KO4DEQSQU6LULLR6I6VDVZF2RKZRIL5NFCHXXO6Q3PB4DD6OJT6Q@3@2/linux-jdk10-m3.5.x_build/target/invoker-reports/BUILD-mpmd-142.xml, /home/jenkins/jenkins-slave/workspace/x_maven-pmd-plugin_MPMD-266-KO4DEQSQU6LULLR6I6VDVZF2RKZRIL5NFCHXXO6Q3PB4DD6OJT6Q@3@2/linux-jdk10-m3.5.x_build/target/invoker-reports/BUILD-mpmd-168-empty-report.xml, /home/jenkins/jenkins-slave/workspace/x_maven-pmd-plugin_MPMD-266-KO4DEQSQU6LULLR6I6VDVZF2RKZRIL5NFCHXXO6Q3PB4DD6OJT6Q@3@2/linux-jdk10-m3.5.x_build/target/invoker-reports/BUILD-mpmd-168.xml, /home/jenkins/jenkins-slave/workspace/x_maven-pmd-plugin_MPMD-266-KO4DEQSQU6LULLR6I6VDVZF2RKZRIL5NFCHXXO6Q3PB4DD6OJT6Q@3@2/linux-jdk10-m3.5.x_build/target/invoker-reports/BUILD-mpmd-80-included.xml, /home/jenkins/jenkins-slave/workspace/x_maven-pmd-plugin_MPMD-266-KO4DEQSQU6LULLR6I6VDVZF2RKZRIL5NFCHXXO6Q3PB4DD6OJT6Q@3@2/linux-jdk10-m3.5.x_build/target/invoker-reports/BUILD-mpmd-80-not-included.xml, /home/jenkins/jenkins-slave/workspace/x_maven-pmd-plugin_MPMD-266-KO4DEQSQU6LULLR6I6VDVZF2RKZRIL5NFCHXXO6Q3PB4DD6OJT6Q@3@2/linux-jdk10-m3.5.x_build/target/invoker-reports/BUILD-multi-module.xml]
[linux-jdk10-m3.5.x_build] Found logs:[/home/jenkins/jenkins-slave/workspace/x_maven-pmd-plugin_MPMD-266-KO4DEQSQU6LULLR6I6VDVZF2RKZRIL5NFCHXXO6Q3PB4DD6OJT6Q@3@2/linux-jdk10-m3.5.x_build/target/it/MPMD-128-xref-link/build.log, /home/jenkins/jenkins-slave/workspace/x_maven-pmd-plugin_MPMD-266-KO4DEQSQU6LULLR6I6VDVZF2RKZRIL5NFCHXXO6Q3PB4DD6OJT6Q@3@2/linux-jdk10-m3.5.x_build/target/it/MPMD-163/build.log, /home/jenkins/jenkins-slave/workspace/x_maven-pmd-plugin_MPMD-266-KO4DEQSQU6LULLR6I6VDVZF2RKZRIL5NFCHXXO6Q3PB4DD6OJT6Q@3@2/linux-jdk10-m3.5.x_build/target/it/MPMD-165/build.log, /home/jenkins/jenkins-slave/workspace/x_maven-pmd-plugin_MPMD-266-KO4DEQSQU6LULLR6I6VDVZF2RKZRIL5NFCHXXO6Q3PB4DD6OJT6Q@3@2/linux-jdk10-m3.5.x_build/target/it/MPMD-172/build.log, /home/jenkins/jenkins-slave/workspace/x_maven-pmd-plugin_MPMD-266-KO4DEQSQU6LULLR6I6VDVZF2RKZRIL5NFCHXXO6Q3PB4DD6OJT6Q@3@2/linux-jdk10-m3.5.x_build/target/it/MPMD-181-benchmark/build.log, /home/jenkins/jenkins-slave/workspace/x_maven-pmd-plugin_MPMD-266-KO4DEQSQU6LULLR6I6VDVZF2RKZRIL5NFCHXXO6Q3PB4DD6OJT6Q@3@2/linux-jdk10-m3.5.x_build/target/it/MPMD-181-no-benchmark/build.log, /home/jenkins/jenkins-slave/workspace/x_maven-pmd-plugin_MPMD-266-KO4DEQSQU6LULLR6I6VDVZF2RKZRIL5NFCHXXO6Q3PB4DD6OJT6Q@3@2/linux-jdk10-m3.5.x_build/target/it/MPMD-182/build.log, /home/jenkins/jenkins-slave/workspace/x_maven-pmd-plugin_MPMD-266-KO4DEQSQU6LULLR6I6VDVZF2RKZRIL5NFCHXXO6Q3PB4DD6OJT6Q@3@2/linux-jdk10-m3.5.x_build/target/it/MPMD-187/build.log, /home/jenkins/jenkins-slave/workspace/x_maven-pmd-plugin_MPMD-266-KO4DEQSQU6LULLR6I6VDVZF2RKZRIL5NFCHXXO6Q3PB4DD6OJT6Q@3@2/linux-jdk10-m3.5.x_build/target/it/MPMD-205-pmd-js-check/build.log, /home/jenkins/jenkins-slave/workspace/x_maven-pmd-plugin_MPMD-266-KO4DEQSQU6LULLR6I6VDVZF2RKZRIL5NFCHXXO6Q3PB4DD6OJT6Q@3@2/linux-jdk10-m3.5.x_build/target/it/MPMD-206-sourceDirectories-js/build.log, /home/jenkins/jenkins-slave/workspace/x_maven-pmd-plugin_MPMD-266-KO4DEQSQU6LULLR6I6VDVZF2RKZRIL5NFCHXXO6Q3PB4DD6OJT6Q@3@2/linux-jdk10-m3.5.x_build/target/it/MPMD-219-pmd-processing-error/build.log, /home/jenkins/jenkins-slave/workspace/x_maven-pmd-plugin_MPMD-266-KO4DEQSQU6LULLR6I6VDVZF2RKZRIL5NFCHXXO6Q3PB4DD6OJT6Q@3@2/linux-jdk10-m3.5.x_build/target/it/MPMD-234-analysis-cache/build.log, /home/jenkins/jenkins-slave/workspace/x_maven-pmd-plugin_MPMD-266-KO4DEQSQU6LULLR6I6VDVZF2RKZRIL5NFCHXXO6Q3PB4DD6OJT6Q@3@2/linux-jdk10-m3.5.x_build/target/it/MPMD-243-excludeFromFailureFile/build.log, /home/jenkins/jenkins-slave/workspace/x_maven-pmd-plugin_MPMD-266-KO4DEQSQU6LULLR6I6VDVZF2RKZRIL5NFCHXXO6Q3PB4DD6OJT6Q@3@2/linux-jdk10-m3.5.x_build/target/it/MPMD-244-logging/build.log, /home/jenkins/jenkins-slave/workspace/x_maven-pmd-plugin_MPMD-266-KO4DEQSQU6LULLR6I6VDVZF2RKZRIL5NFCHXXO6Q3PB4DD6OJT6Q@3@2/linux-jdk10-m3.5.x_build/target/it/MPMD-253-xref-link-multi-module/build.log, /home/jenkins/jenkins-slave/workspace/x_maven-pmd-plugin_MPMD-266-KO4DEQSQU6LULLR6I6VDVZF2RKZRIL5NFCHXXO6Q3PB4DD6OJT6Q@3@2/linux-jdk10-m3.5.x_build/target/it/MPMD-258-multiple-executions/build.log, /home/jenkins/jenkins-slave/workspace/x_maven-pmd-plugin_MPMD-266-KO4DEQSQU6LULLR6I6VDVZF2RKZRIL5NFCHXXO6Q3PB4DD6OJT6Q@3@2/linux-jdk10-m3.5.x_build/target/it/MPMD-259-analysis-cache-auxclasspath/build.log, /home/jenkins/jenkins-slave/workspace/x_maven-pmd-plugin_MPMD-266-KO4DEQSQU6LULLR6I6VDVZF2RKZRIL5NFCHXXO6Q3PB4DD6OJT6Q@3@2/linux-jdk10-m3.5.x_build/target/it/MPMD-266-typeresolution-aggregated/build.log, /home/jenkins/jenkins-slave/workspace/x_maven-pmd-plugin_MPMD-266-KO4DEQSQU6LULLR6I6VDVZF2RKZRIL5NFCHXXO6Q3PB4DD6OJT6Q@3@2/linux-jdk10-m3.5.x_build/target/it/MPMD-268-deprecated-rules/build.log, /home/jenkins/jenkins-slave/workspace/x_maven-pmd-plugin_MPMD-266-KO4DEQSQU6LULLR6I6VDVZF2RKZRIL5NFCHXXO6Q3PB4DD6OJT6Q@3@2/linux-jdk10-m3.5.x_build/target/it/MPMD-89-232-typeresolution/build.log, /home/jenkins/jenkins-slave/workspace/x_maven-pmd-plugin_MPMD-266-KO4DEQSQU6LULLR6I6VDVZF2RKZRIL5NFCHXXO6Q3PB4DD6OJT6Q@3@2/linux-jdk10-m3.5.x_build/target/it/empty-rulesets/build.log, /home/jenkins/jenkins-slave/workspace/x_maven-pmd-plugin_MPMD-266-KO4DEQSQU6LULLR6I6VDVZF2RKZRIL5NFCHXXO6Q3PB4DD6OJT6Q@3@2/linux-jdk10-m3.5.x_build/target/it/mpmd-138/build.log, /home/jenkins/jenkins-slave/workspace/x_maven-pmd-plugin_MPMD-266-KO4DEQSQU6LULLR6I6VDVZF2RKZRIL5NFCHXXO6Q3PB4DD6OJT6Q@3@2/linux-jdk10-m3.5.x_build/target/it/mpmd-142/build.log, /home/jenkins/jenkins-slave/workspace/x_maven-pmd-plugin_MPMD-266-KO4DEQSQU6LULLR6I6VDVZF2RKZRIL5NFCHXXO6Q3PB4DD6OJT6Q@3@2/linux-jdk10-m3.5.x_build/target/it/mpmd-168-empty-report/build.log, /home/jenkins/jenkins-slave/workspace/x_maven-pmd-plugin_MPMD-266-KO4DEQSQU6LULLR6I6VDVZF2RKZRIL5NFCHXXO6Q3PB4DD6OJT6Q@3@2/linux-jdk10-m3.5.x_build/target/it/mpmd-168/build.log, /home/jenkins/jenkins-slave/workspace/x_maven-pmd-plugin_MPMD-266-KO4DEQSQU6LULLR6I6VDVZF2RKZRIL5NFCHXXO6Q3PB4DD6OJT6Q@3@2/linux-jdk10-m3.5.x_build/target/it/mpmd-80-included/build.log, /home/jenkins/jenkins-slave/workspace/x_maven-pmd-plugin_MPMD-266-KO4DEQSQU6LULLR6I6VDVZF2RKZRIL5NFCHXXO6Q3PB4DD6OJT6Q@3@2/linux-jdk10-m3.5.x_build/target/it/mpmd-80-not-included/build.log, /home/jenkins/jenkins-slave/workspace/x_maven-pmd-plugin_MPMD-266-KO4DEQSQU6LULLR6I6VDVZF2RKZRIL5NFCHXXO6Q3PB4DD6OJT6Q@3@2/linux-jdk10-m3.5.x_build/target/it/multi-module/build.log]
[linux-jdk10-m3.5.x_build] Finished parsing Maven Invoker results (found 29)
[linux-jdk10-m3.5.x_build] [withMaven] junitPublisher - Archive test results for Maven artifact org.apache.maven.plugins:maven-pmd-plugin:3.11.0-SNAPSHOT generated by maven-surefire-plugin:test (default-test): linux-jdk10-m3.5.x_build/target/surefire-reports/*.xml
[linux-jdk10-m3.5.x_build] Recording test results
[linux-jdk10-m3.5.x_build] [withMaven] openTasksPublisher - Scan Tasks for Maven artifact org.apache.maven.plugins:maven-pmd-plugin:3.11.0-SNAPSHOT in source directory linux-jdk10-m3.5.x_build/src/main/java
[linux-jdk10-m3.5.x_build] [TASKS] Scanning folder '/home/jenkins/jenkins-slave/workspace/x_maven-pmd-plugin_MPMD-266-KO4DEQSQU6LULLR6I6VDVZF2RKZRIL5NFCHXXO6Q3PB4DD6OJT6Q@3@2' for files matching the pattern 'linux-jdk10-m3.5.x_build/src/main/java/**/*' - excludes: null
[linux-jdk10-m3.5.x_build] [TASKS] Found 14 files to scan for tasks
[linux-jdk10-m3.5.x_build] [TASKS] Found 6 open tasks.
[linux-jdk10-m3.5.x_build] Skipping warnings blame since pipelines do not have an SCM link.%n
[Pipeline] [linux-jdk10-m3.5.x_build] // withMaven
[Pipeline] [linux-jdk10-m3.5.x_build] cleanWs
[Pipeline] [linux-jdk11-m3.5.x_build] }
[Pipeline] [linux-jdk11-m3.5.x_build] // dir
[linux-jdk10-m3.5.x_build] [WS-CLEANUP] Deleting project workspace...[WS-CLEANUP] done
[Pipeline] [linux-jdk11-m3.5.x_build] }
[linux-jdk11-m3.5.x_build] [withMaven] artifactsPublisher - Archive artifact linux-jdk11-m3.5.x_build/pom.xml under org/apache/maven/plugins/maven-pmd-plugin/3.11.0-SNAPSHOT/maven-pmd-plugin-3.11.0-SNAPSHOT.pom
[linux-jdk11-m3.5.x_build] [withMaven] artifactsPublisher - Archive artifact linux-jdk11-m3.5.x_build/target/maven-pmd-plugin-3.11.0-SNAPSHOT.jar under org/apache/maven/plugins/maven-pmd-plugin/3.11.0-SNAPSHOT/maven-pmd-plugin-3.11.0-SNAPSHOT.jar
[linux-jdk11-m3.5.x_build] [Fast Archiver] No prior successful build to compare, so performing full copy of artifacts
[linux-jdk11-m3.5.x_build] [withMaven] invokerPublisher - Archive invoker results for Maven artifact MavenArtifact{org.apache.maven.plugins:maven-pmd-plugin::3.11.0-SNAPSHOT(version: 3.11.0-SNAPSHOT, snapshot:false) } generated by PluginInvocation{org.apache.maven.plugins:maven-invoker-plugin:3.0.1@integration-test  integration-test}: linux-jdk11-m3.5.x_build/target/invoker-reports/*.xml
[linux-jdk11-m3.5.x_build] performing MavenInvokerRecorder, reportsFilenamePattern:'**/linux-jdk11-m3.5.x_build/target/invoker-reports/BUILD*.xml', invokerBuildDir:'**/linux-jdk11-m3.5.x_build/target/it'
[linux-jdk11-m3.5.x_build] Found reports:[/home/jenkins/jenkins-slave/workspace/x_maven-pmd-plugin_MPMD-266-KO4DEQSQU6LULLR6I6VDVZF2RKZRIL5NFCHXXO6Q3PB4DD6OJT6Q@2/linux-jdk11-m3.5.x_build/target/invoker-reports/BUILD-MPMD-128-xref-link.xml, /home/jenkins/jenkins-slave/workspace/x_maven-pmd-plugin_MPMD-266-KO4DEQSQU6LULLR6I6VDVZF2RKZRIL5NFCHXXO6Q3PB4DD6OJT6Q@2/linux-jdk11-m3.5.x_build/target/invoker-reports/BUILD-MPMD-163.xml, /home/jenkins/jenkins-slave/workspace/x_maven-pmd-plugin_MPMD-266-KO4DEQSQU6LULLR6I6VDVZF2RKZRIL5NFCHXXO6Q3PB4DD6OJT6Q@2/linux-jdk11-m3.5.x_build/target/invoker-reports/BUILD-MPMD-165.xml, /home/jenkins/jenkins-slave/workspace/x_maven-pmd-plugin_MPMD-266-KO4DEQSQU6LULLR6I6VDVZF2RKZRIL5NFCHXXO6Q3PB4DD6OJT6Q@2/linux-jdk11-m3.5.x_build/target/invoker-reports/BUILD-MPMD-172.xml, /home/jenkins/jenkins-slave/workspace/x_maven-pmd-plugin_MPMD-266-KO4DEQSQU6LULLR6I6VDVZF2RKZRIL5NFCHXXO6Q3PB4DD6OJT6Q@2/linux-jdk11-m3.5.x_build/target/invoker-reports/BUILD-MPMD-181-benchmark.xml, /home/jenkins/jenkins-slave/workspace/x_maven-pmd-plugin_MPMD-266-KO4DEQSQU6LULLR6I6VDVZF2RKZRIL5NFCHXXO6Q3PB4DD6OJT6Q@2/linux-jdk11-m3.5.x_build/target/invoker-reports/BUILD-MPMD-181-no-benchmark.xml, /home/jenkins/jenkins-slave/workspace/x_maven-pmd-plugin_MPMD-266-KO4DEQSQU6LULLR6I6VDVZF2RKZRIL5NFCHXXO6Q3PB4DD6OJT6Q@2/linux-jdk11-m3.5.x_build/target/invoker-reports/BUILD-MPMD-182.xml, /home/jenkins/jenkins-slave/workspace/x_maven-pmd-plugin_MPMD-266-KO4DEQSQU6LULLR6I6VDVZF2RKZRIL5NFCHXXO6Q3PB4DD6OJT6Q@2/linux-jdk11-m3.5.x_build/target/invoker-reports/BUILD-MPMD-187.xml, /home/jenkins/jenkins-slave/workspace/x_maven-pmd-plugin_MPMD-266-KO4DEQSQU6LULLR6I6VDVZF2RKZRIL5NFCHXXO6Q3PB4DD6OJT6Q@2/linux-jdk11-m3.5.x_build/target/invoker-reports/BUILD-MPMD-205-pmd-js-check.xml, /home/jenkins/jenkins-slave/workspace/x_maven-pmd-plugin_MPMD-266-KO4DEQSQU6LULLR6I6VDVZF2RKZRIL5NFCHXXO6Q3PB4DD6OJT6Q@2/linux-jdk11-m3.5.x_build/target/invoker-reports/BUILD-MPMD-206-sourceDirectories-js.xml, /home/jenkins/jenkins-slave/workspace/x_maven-pmd-plugin_MPMD-266-KO4DEQSQU6LULLR6I6VDVZF2RKZRIL5NFCHXXO6Q3PB4DD6OJT6Q@2/linux-jdk11-m3.5.x_build/target/invoker-reports/BUILD-MPMD-219-pmd-processing-error.xml, /home/jenkins/jenkins-slave/workspace/x_maven-pmd-plugin_MPMD-266-KO4DEQSQU6LULLR6I6VDVZF2RKZRIL5NFCHXXO6Q3PB4DD6OJT6Q@2/linux-jdk11-m3.5.x_build/target/invoker-reports/BUILD-MPMD-234-analysis-cache.xml, /home/jenkins/jenkins-slave/workspace/x_maven-pmd-plugin_MPMD-266-KO4DEQSQU6LULLR6I6VDVZF2RKZRIL5NFCHXXO6Q3PB4DD6OJT6Q@2/linux-jdk11-m3.5.x_build/target/invoker-reports/BUILD-MPMD-243-excludeFromFailureFile.xml, /home/jenkins/jenkins-slave/workspace/x_maven-pmd-plugin_MPMD-266-KO4DEQSQU6LULLR6I6VDVZF2RKZRIL5NFCHXXO6Q3PB4DD6OJT6Q@2/linux-jdk11-m3.5.x_build/target/invoker-reports/BUILD-MPMD-244-logging.xml, /home/jenkins/jenkins-slave/workspace/x_maven-pmd-plugin_MPMD-266-KO4DEQSQU6LULLR6I6VDVZF2RKZRIL5NFCHXXO6Q3PB4DD6OJT6Q@2/linux-jdk11-m3.5.x_build/target/invoker-reports/BUILD-MPMD-253-xref-link-multi-module.xml, /home/jenkins/jenkins-slave/workspace/x_maven-pmd-plugin_MPMD-266-KO4DEQSQU6LULLR6I6VDVZF2RKZRIL5NFCHXXO6Q3PB4DD6OJT6Q@2/linux-jdk11-m3.5.x_build/target/invoker-reports/BUILD-MPMD-258-multiple-executions.xml, /home/jenkins/jenkins-slave/workspace/x_maven-pmd-plugin_MPMD-266-KO4DEQSQU6LULLR6I6VDVZF2RKZRIL5NFCHXXO6Q3PB4DD6OJT6Q@2/linux-jdk11-m3.5.x_build/target/invoker-reports/BUILD-MPMD-259-analysis-cache-auxclasspath.xml, /home/jenkins/jenkins-slave/workspace/x_maven-pmd-plugin_MPMD-266-KO4DEQSQU6LULLR6I6VDVZF2RKZRIL5NFCHXXO6Q3PB4DD6OJT6Q@2/linux-jdk11-m3.5.x_build/target/invoker-reports/BUILD-MPMD-266-typeresolution-aggregated.xml, /home/jenkins/jenkins-slave/workspace/x_maven-pmd-plugin_MPMD-266-KO4DEQSQU6LULLR6I6VDVZF2RKZRIL5NFCHXXO6Q3PB4DD6OJT6Q@2/linux-jdk11-m3.5.x_build/target/invoker-reports/BUILD-MPMD-268-deprecated-rules.xml, /home/jenkins/jenkins-slave/workspace/x_maven-pmd-plugin_MPMD-266-KO4DEQSQU6LULLR6I6VDVZF2RKZRIL5NFCHXXO6Q3PB4DD6OJT6Q@2/linux-jdk11-m3.5.x_build/target/invoker-reports/BUILD-MPMD-270-JDK11.xml, /home/jenkins/jenkins-slave/workspace/x_maven-pmd-plugin_MPMD-266-KO4DEQSQU6LULLR6I6VDVZF2RKZRIL5NFCHXXO6Q3PB4DD6OJT6Q@2/linux-jdk11-m3.5.x_build/target/invoker-reports/BUILD-MPMD-89-232-typeresolution.xml, /home/jenkins/jenkins-slave/workspace/x_maven-pmd-plugin_MPMD-266-KO4DEQSQU6LULLR6I6VDVZF2RKZRIL5NFCHXXO6Q3PB4DD6OJT6Q@2/linux-jdk11-m3.5.x_build/target/invoker-reports/BUILD-empty-rulesets.xml, /home/jenkins/jenkins-slave/workspace/x_maven-pmd-plugin_MPMD-266-KO4DEQSQU6LULLR6I6VDVZF2RKZRIL5NFCHXXO6Q3PB4DD6OJT6Q@2/linux-jdk11-m3.5.x_build/target/invoker-reports/BUILD-mpmd-138.xml, /home/jenkins/jenkins-slave/workspace/x_maven-pmd-plugin_MPMD-266-KO4DEQSQU6LULLR6I6VDVZF2RKZRIL5NFCHXXO6Q3PB4DD6OJT6Q@2/linux-jdk11-m3.5.x_build/target/invoker-reports/BUILD-mpmd-142.xml, /home/jenkins/jenkins-slave/workspace/x_maven-pmd-plugin_MPMD-266-KO4DEQSQU6LULLR6I6VDVZF2RKZRIL5NFCHXXO6Q3PB4DD6OJT6Q@2/linux-jdk11-m3.5.x_build/target/invoker-reports/BUILD-mpmd-168-empty-report.xml, /home/jenkins/jenkins-slave/workspace/x_maven-pmd-plugin_MPMD-266-KO4DEQSQU6LULLR6I6VDVZF2RKZRIL5NFCHXXO6Q3PB4DD6OJT6Q@2/linux-jdk11-m3.5.x_build/target/invoker-reports/BUILD-mpmd-168.xml, /home/jenkins/jenkins-slave/workspace/x_maven-pmd-plugin_MPMD-266-KO4DEQSQU6LULLR6I6VDVZF2RKZRIL5NFCHXXO6Q3PB4DD6OJT6Q@2/linux-jdk11-m3.5.x_build/target/invoker-reports/BUILD-mpmd-80-included.xml, /home/jenkins/jenkins-slave/workspace/x_maven-pmd-plugin_MPMD-266-KO4DEQSQU6LULLR6I6VDVZF2RKZRIL5NFCHXXO6Q3PB4DD6OJT6Q@2/linux-jdk11-m3.5.x_build/target/invoker-reports/BUILD-mpmd-80-not-included.xml, /home/jenkins/jenkins-slave/workspace/x_maven-pmd-plugin_MPMD-266-KO4DEQSQU6LULLR6I6VDVZF2RKZRIL5NFCHXXO6Q3PB4DD6OJT6Q@2/linux-jdk11-m3.5.x_build/target/invoker-reports/BUILD-multi-module.xml]
[linux-jdk11-m3.5.x_build] Found logs:[/home/jenkins/jenkins-slave/workspace/x_maven-pmd-plugin_MPMD-266-KO4DEQSQU6LULLR6I6VDVZF2RKZRIL5NFCHXXO6Q3PB4DD6OJT6Q@2/linux-jdk11-m3.5.x_build/target/it/MPMD-128-xref-link/build.log, /home/jenkins/jenkins-slave/workspace/x_maven-pmd-plugin_MPMD-266-KO4DEQSQU6LULLR6I6VDVZF2RKZRIL5NFCHXXO6Q3PB4DD6OJT6Q@2/linux-jdk11-m3.5.x_build/target/it/MPMD-163/build.log, /home/jenkins/jenkins-slave/workspace/x_maven-pmd-plugin_MPMD-266-KO4DEQSQU6LULLR6I6VDVZF2RKZRIL5NFCHXXO6Q3PB4DD6OJT6Q@2/linux-jdk11-m3.5.x_build/target/it/MPMD-165/build.log, /home/jenkins/jenkins-slave/workspace/x_maven-pmd-plugin_MPMD-266-KO4DEQSQU6LULLR6I6VDVZF2RKZRIL5NFCHXXO6Q3PB4DD6OJT6Q@2/linux-jdk11-m3.5.x_build/target/it/MPMD-172/build.log, /home/jenkins/jenkins-slave/workspace/x_maven-pmd-plugin_MPMD-266-KO4DEQSQU6LULLR6I6VDVZF2RKZRIL5NFCHXXO6Q3PB4DD6OJT6Q@2/linux-jdk11-m3.5.x_build/target/it/MPMD-181-benchmark/build.log, /home/jenkins/jenkins-slave/workspace/x_maven-pmd-plugin_MPMD-266-KO4DEQSQU6LULLR6I6VDVZF2RKZRIL5NFCHXXO6Q3PB4DD6OJT6Q@2/linux-jdk11-m3.5.x_build/target/it/MPMD-181-no-benchmark/build.log, /home/jenkins/jenkins-slave/workspace/x_maven-pmd-plugin_MPMD-266-KO4DEQSQU6LULLR6I6VDVZF2RKZRIL5NFCHXXO6Q3PB4DD6OJT6Q@2/linux-jdk11-m3.5.x_build/target/it/MPMD-182/build.log, /home/jenkins/jenkins-slave/workspace/x_maven-pmd-plugin_MPMD-266-KO4DEQSQU6LULLR6I6VDVZF2RKZRIL5NFCHXXO6Q3PB4DD6OJT6Q@2/linux-jdk11-m3.5.x_build/target/it/MPMD-187/build.log, /home/jenkins/jenkins-slave/workspace/x_maven-pmd-plugin_MPMD-266-KO4DEQSQU6LULLR6I6VDVZF2RKZRIL5NFCHXXO6Q3PB4DD6OJT6Q@2/linux-jdk11-m3.5.x_build/target/it/MPMD-205-pmd-js-check/build.log, /home/jenkins/jenkins-slave/workspace/x_maven-pmd-plugin_MPMD-266-KO4DEQSQU6LULLR6I6VDVZF2RKZRIL5NFCHXXO6Q3PB4DD6OJT6Q@2/linux-jdk11-m3.5.x_build/target/it/MPMD-206-sourceDirectories-js/build.log, /home/jenkins/jenkins-slave/workspace/x_maven-pmd-plugin_MPMD-266-KO4DEQSQU6LULLR6I6VDVZF2RKZRIL5NFCHXXO6Q3PB4DD6OJT6Q@2/linux-jdk11-m3.5.x_build/target/it/MPMD-219-pmd-processing-error/build.log, /home/jenkins/jenkins-slave/workspace/x_maven-pmd-plugin_MPMD-266-KO4DEQSQU6LULLR6I6VDVZF2RKZRIL5NFCHXXO6Q3PB4DD6OJT6Q@2/linux-jdk11-m3.5.x_build/target/it/MPMD-234-analysis-cache/build.log, /home/jenkins/jenkins-slave/workspace/x_maven-pmd-plugin_MPMD-266-KO4DEQSQU6LULLR6I6VDVZF2RKZRIL5NFCHXXO6Q3PB4DD6OJT6Q@2/linux-jdk11-m3.5.x_build/target/it/MPMD-243-excludeFromFailureFile/build.log, /home/jenkins/jenkins-slave/workspace/x_maven-pmd-plugin_MPMD-266-KO4DEQSQU6LULLR6I6VDVZF2RKZRIL5NFCHXXO6Q3PB4DD6OJT6Q@2/linux-jdk11-m3.5.x_build/target/it/MPMD-244-logging/build.log, /home/jenkins/jenkins-slave/workspace/x_maven-pmd-plugin_MPMD-266-KO4DEQSQU6LULLR6I6VDVZF2RKZRIL5NFCHXXO6Q3PB4DD6OJT6Q@2/linux-jdk11-m3.5.x_build/target/it/MPMD-253-xref-link-multi-module/build.log, /home/jenkins/jenkins-slave/workspace/x_maven-pmd-plugin_MPMD-266-KO4DEQSQU6LULLR6I6VDVZF2RKZRIL5NFCHXXO6Q3PB4DD6OJT6Q@2/linux-jdk11-m3.5.x_build/target/it/MPMD-258-multiple-executions/build.log, /home/jenkins/jenkins-slave/workspace/x_maven-pmd-plugin_MPMD-266-KO4DEQSQU6LULLR6I6VDVZF2RKZRIL5NFCHXXO6Q3PB4DD6OJT6Q@2/linux-jdk11-m3.5.x_build/target/it/MPMD-259-analysis-cache-auxclasspath/build.log, /home/jenkins/jenkins-slave/workspace/x_maven-pmd-plugin_MPMD-266-KO4DEQSQU6LULLR6I6VDVZF2RKZRIL5NFCHXXO6Q3PB4DD6OJT6Q@2/linux-jdk11-m3.5.x_build/target/it/MPMD-266-typeresolution-aggregated/build.log, /home/jenkins/jenkins-slave/workspace/x_maven-pmd-plugin_MPMD-266-KO4DEQSQU6LULLR6I6VDVZF2RKZRIL5NFCHXXO6Q3PB4DD6OJT6Q@2/linux-jdk11-m3.5.x_build/target/it/MPMD-268-deprecated-rules/build.log, /home/jenkins/jenkins-slave/workspace/x_maven-pmd-plugin_MPMD-266-KO4DEQSQU6LULLR6I6VDVZF2RKZRIL5NFCHXXO6Q3PB4DD6OJT6Q@2/linux-jdk11-m3.5.x_build/target/it/MPMD-270-JDK11/build.log, /home/jenkins/jenkins-slave/workspace/x_maven-pmd-plugin_MPMD-266-KO4DEQSQU6LULLR6I6VDVZF2RKZRIL5NFCHXXO6Q3PB4DD6OJT6Q@2/linux-jdk11-m3.5.x_build/target/it/MPMD-89-232-typeresolution/build.log, /home/jenkins/jenkins-slave/workspace/x_maven-pmd-plugin_MPMD-266-KO4DEQSQU6LULLR6I6VDVZF2RKZRIL5NFCHXXO6Q3PB4DD6OJT6Q@2/linux-jdk11-m3.5.x_build/target/it/empty-rulesets/build.log, /home/jenkins/jenkins-slave/workspace/x_maven-pmd-plugin_MPMD-266-KO4DEQSQU6LULLR6I6VDVZF2RKZRIL5NFCHXXO6Q3PB4DD6OJT6Q@2/linux-jdk11-m3.5.x_build/target/it/mpmd-138/build.log, /home/jenkins/jenkins-slave/workspace/x_maven-pmd-plugin_MPMD-266-KO4DEQSQU6LULLR6I6VDVZF2RKZRIL5NFCHXXO6Q3PB4DD6OJT6Q@2/linux-jdk11-m3.5.x_build/target/it/mpmd-142/build.log, /home/jenkins/jenkins-slave/workspace/x_maven-pmd-plugin_MPMD-266-KO4DEQSQU6LULLR6I6VDVZF2RKZRIL5NFCHXXO6Q3PB4DD6OJT6Q@2/linux-jdk11-m3.5.x_build/target/it/mpmd-168-empty-report/build.log, /home/jenkins/jenkins-slave/workspace/x_maven-pmd-plugin_MPMD-266-KO4DEQSQU6LULLR6I6VDVZF2RKZRIL5NFCHXXO6Q3PB4DD6OJT6Q@2/linux-jdk11-m3.5.x_build/target/it/mpmd-168/build.log, /home/jenkins/jenkins-slave/workspace/x_maven-pmd-plugin_MPMD-266-KO4DEQSQU6LULLR6I6VDVZF2RKZRIL5NFCHXXO6Q3PB4DD6OJT6Q@2/linux-jdk11-m3.5.x_build/target/it/mpmd-80-included/build.log, /home/jenkins/jenkins-slave/workspace/x_maven-pmd-plugin_MPMD-266-KO4DEQSQU6LULLR6I6VDVZF2RKZRIL5NFCHXXO6Q3PB4DD6OJT6Q@2/linux-jdk11-m3.5.x_build/target/it/mpmd-80-not-included/build.log, /home/jenkins/jenkins-slave/workspace/x_maven-pmd-plugin_MPMD-266-KO4DEQSQU6LULLR6I6VDVZF2RKZRIL5NFCHXXO6Q3PB4DD6OJT6Q@2/linux-jdk11-m3.5.x_build/target/it/multi-module/build.log]
[linux-jdk11-m3.5.x_build] Finished parsing Maven Invoker results (found 29)
[linux-jdk11-m3.5.x_build] [withMaven] junitPublisher - Archive test results for Maven artifact org.apache.maven.plugins:maven-pmd-plugin:3.11.0-SNAPSHOT generated by maven-surefire-plugin:test (default-test): linux-jdk11-m3.5.x_build/target/surefire-reports/*.xml
[linux-jdk11-m3.5.x_build] Recording test results
[linux-jdk11-m3.5.x_build] [withMaven] openTasksPublisher - Scan Tasks for Maven artifact org.apache.maven.plugins:maven-pmd-plugin:3.11.0-SNAPSHOT in source directory linux-jdk11-m3.5.x_build/src/main/java
[linux-jdk11-m3.5.x_build] [TASKS] Scanning folder '/home/jenkins/jenkins-slave/workspace/x_maven-pmd-plugin_MPMD-266-KO4DEQSQU6LULLR6I6VDVZF2RKZRIL5NFCHXXO6Q3PB4DD6OJT6Q@2' for files matching the pattern 'linux-jdk11-m3.5.x_build/src/main/java/**/*' - excludes: null
[linux-jdk11-m3.5.x_build] [TASKS] Found 14 files to scan for tasks
[linux-jdk11-m3.5.x_build] [TASKS] Found 6 open tasks.
[linux-jdk11-m3.5.x_build] Skipping warnings blame since pipelines do not have an SCM link.%n
[Pipeline] [linux-jdk11-m3.5.x_build] // withMaven
[Pipeline] [linux-jdk10-m3.5.x_build] }
[Pipeline] [linux-jdk11-m3.5.x_build] cleanWs
[Pipeline] [linux-jdk10-m3.5.x_build] // stage
[Pipeline] [linux-jdk10-m3.5.x_build] }
[Pipeline] [linux-jdk10-m3.5.x_build] // ws
[Pipeline] [linux-jdk10-m3.5.x_build] }
[Pipeline] [linux-jdk10-m3.5.x_build] // node
[Pipeline] [linux-jdk10-m3.5.x_build] }
[linux-jdk11-m3.5.x_build] [WS-CLEANUP] Deleting project workspace...[WS-CLEANUP] done
[Pipeline] [linux-jdk11-m3.5.x_build] }
[Pipeline] [linux-jdk11-m3.5.x_build] // stage
[Pipeline] [linux-jdk11-m3.5.x_build] }
[Pipeline] [linux-jdk11-m3.5.x_build] // ws
[Pipeline] [linux-jdk11-m3.5.x_build] }
[Pipeline] [linux-jdk11-m3.5.x_build] // node
[Pipeline] [linux-jdk11-m3.5.x_build] }
[Pipeline] // parallel
[Pipeline] stage
[Pipeline] { (Notifications)
[Pipeline] echo
Build result: UNSTABLE
[Pipeline] jiraIssueSelector
[Pipeline] emailext