Build failed in Jenkins: Maven TLP » maven-plugin-tools » master #42

classic Classic list List threaded Threaded
2 messages Options
Reply | Threaded
Open this post in threaded view
|

Build failed in Jenkins: Maven TLP » maven-plugin-tools » master #42

Apache Jenkins Server-2
See https://builds.apache.org/job/maven-box/job/maven-plugin-tools/job/master/42/

No changes.

1 tests failed.
FAILED:  org.apache.maven.tools.plugin.generator.PluginHelpGeneratorTest.testGenerator

Error Message:
C:\Users\jenkins\AppData\Local\Temp\1\testGenerator-outDir\org\apache\maven\tools\plugin\generator\HelpMojo.java (The system cannot find the path specified)

Stack Trace:
org.apache.maven.tools.plugin.generator.GeneratorException: C:\Users\jenkins\AppData\Local\Temp\1\testGenerator-outDir\org\apache\maven\tools\plugin\generator\HelpMojo.java (The system cannot find the path specified)
        at org.apache.maven.tools.plugin.generator.PluginHelpGenerator.execute(PluginHelpGenerator.java:159)
        at org.apache.maven.tools.plugin.generator.AbstractGeneratorTestCase.testGenerator(AbstractGeneratorTestCase.java:123)
        at sun.reflect.NativeMethodAccessorImpl.invoke0(Native Method)
        at sun.reflect.NativeMethodAccessorImpl.invoke(NativeMethodAccessorImpl.java:57)
        at sun.reflect.DelegatingMethodAccessorImpl.invoke(DelegatingMethodAccessorImpl.java:43)
        at java.lang.reflect.Method.invoke(Method.java:606)
        at junit.framework.TestCase.runTest(TestCase.java:164)
        at junit.framework.TestCase.runBare(TestCase.java:130)
        at junit.framework.TestResult$1.protect(TestResult.java:106)
        at junit.framework.TestResult.runProtected(TestResult.java:124)
        at junit.framework.TestResult.run(TestResult.java:109)
        at junit.framework.TestCase.run(TestCase.java:120)
        at junit.framework.TestSuite.runTest(TestSuite.java:230)
        at junit.framework.TestSuite.run(TestSuite.java:225)
        at sun.reflect.NativeMethodAccessorImpl.invoke0(Native Method)
        at sun.reflect.NativeMethodAccessorImpl.invoke(NativeMethodAccessorImpl.java:57)
        at sun.reflect.DelegatingMethodAccessorImpl.invoke(DelegatingMethodAccessorImpl.java:43)
        at java.lang.reflect.Method.invoke(Method.java:606)
        at org.apache.maven.surefire.junit.JUnitTestSet.execute(JUnitTestSet.java:100)
        at org.apache.maven.surefire.junit.JUnit3Provider.executeTestSet(JUnit3Provider.java:140)
        at org.apache.maven.surefire.junit.JUnit3Provider.invoke(JUnit3Provider.java:113)
        at org.apache.maven.surefire.booter.ForkedBooter.invokeProviderInSameClassLoader(ForkedBooter.java:379)
        at org.apache.maven.surefire.booter.ForkedBooter.runSuitesInProcess(ForkedBooter.java:340)
        at org.apache.maven.surefire.booter.ForkedBooter.execute(ForkedBooter.java:125)
        at org.apache.maven.surefire.booter.ForkedBooter.main(ForkedBooter.java:413)
Caused by: java.io.FileNotFoundException: C:\Users\jenkins\AppData\Local\Temp\1\testGenerator-outDir\org\apache\maven\tools\plugin\generator\HelpMojo.java (The system cannot find the path specified)
        at java.io.FileOutputStream.open(Native Method)
        at java.io.FileOutputStream.<init>(FileOutputStream.java:221)
        at java.io.FileOutputStream.<init>(FileOutputStream.java:171)
        at org.codehaus.plexus.util.FileUtils.fileWrite(FileUtils.java:508)
        at org.apache.maven.tools.plugin.generator.PluginHelpGenerator.execute(PluginHelpGenerator.java:155)
        ... 24 more
Caused by: java.io.FileNotFoundException: C:\Users\jenkins\AppData\Local\Temp\1\testGenerator-outDir\org\apache\maven\tools\plugin\generator\HelpMojo.java (The system cannot find the path specified)
        at java.io.FileOutputStream.open(Native Method)
        at java.io.FileOutputStream.<init>(FileOutputStream.java:221)
        at java.io.FileOutputStream.<init>(FileOutputStream.java:171)
        at org.codehaus.plexus.util.FileUtils.fileWrite(FileUtils.java:508)
        at org.apache.maven.tools.plugin.generator.PluginHelpGenerator.execute(PluginHelpGenerator.java:155)
        ... 24 more




Build log:
[...truncated 3.87 MB...]
[linux-jdk10] None of the test reports contained any result
[linux-jdk10] [withMaven] junitPublisher - Archive test results for Maven artifact org.apache.maven.plugin-tools:maven-plugin-tools-annotations:3.6-SNAPSHOT generated by maven-surefire-plugin:test (default-test): m/maven-plugin-tools-annotations/target/surefire-reports/*.xml
[linux-jdk10] Recording test results
[Pipeline] [linux-jdk10] // withMaven
[Pipeline] [linux-jdk10] cleanWs
[linux-jdk8] [INFO]           mplugin-187/pom.xml .............................. SUCCESS (3.5 s)
[linux-jdk8] [INFO] Building: skip/pom.xml
[linux-jdk10] [WS-CLEANUP] Deleting project workspace...[WS-CLEANUP] done
[Pipeline] [linux-jdk10] cleanWs
[linux-jdk10] [WS-CLEANUP] Deleting project workspace...[WS-CLEANUP] done
[Pipeline] [linux-jdk10] }
[Pipeline] [linux-jdk10] // stage
[Pipeline] [linux-jdk10] }
[Pipeline] [linux-jdk10] // node
[Pipeline] [linux-jdk10] }
[linux-jdk10] Failed in branch linux-jdk10
[linux-jdk8] [INFO] run post-build script verify.groovy
[linux-jdk8] [INFO]           skip/pom.xml ..................................... SUCCESS (4.7 s)
[linux-jdk8] [INFO] Building: mplugin-324_javadoc/pom.xml
[linux-jdk9] [INFO] run post-build script verify.groovy
[linux-jdk9] [INFO]           asm-failure/pom.xml .............................. SUCCESS (7.6 s)
[linux-jdk9] [INFO] Building: plugin-info-jdk-default-version/pom.xml
[linux-jdk8] [INFO]           mplugin-324_javadoc/pom.xml ...................... SUCCESS (8.6 s)
[linux-jdk8] [INFO] Building: plugin-report-annotations/pom.xml
[linux-jdk9] [INFO] run post-build script verify.groovy
[linux-jdk9] [INFO]           plugin-info-jdk-default-version/pom.xml .......... SUCCESS (7.9 s)
[linux-jdk9] [INFO] Building: help-basic/pom.xml
[linux-jdk8] [INFO] run post-build script verify.bsh
[linux-jdk8] [INFO]           plugin-report-annotations/pom.xml ................ SUCCESS (8.5 s)
[linux-jdk8] [INFO] Building: mplugin-305_defaultMojoDependencies/pom.xml
[linux-jdk8] [INFO] run post-build script verify.groovy
[linux-jdk8] [INFO]           mplugin-305_defaultMojoDependencies/pom.xml ...... SUCCESS (5.9 s)
[linux-jdk8] [INFO] Building: help-basic/pom.xml
[linux-jdk9] [INFO] run post-build script verify.groovy
[linux-jdk9] [INFO]           help-basic/pom.xml ............................... SUCCESS (13.5 s)
[linux-jdk9] [INFO] Building: beanshell-simple/pom.xml
[linux-jdk9] [INFO] run post-build script verify.groovy
[linux-jdk8] [INFO] run post-build script verify.groovy
[linux-jdk8] [INFO]           help-basic/pom.xml ............................... SUCCESS (9.0 s)
[linux-jdk8] [INFO] -------------------------------------------------
[linux-jdk8] [INFO] Build Summary:
[linux-jdk8] [INFO]   Passed: 33, Failed: 0, Errors: 0, Skipped: 0
[linux-jdk8] [INFO] -------------------------------------------------
[linux-jdk8] [INFO]
[linux-jdk8] [INFO] --- maven-checkstyle-plugin:3.0.0:check (checkstyle-check) @ maven-plugin-plugin ---
[linux-jdk8] [INFO] ------------------------------------------------------------------------
[linux-jdk8] [INFO] Reactor Summary:
[linux-jdk8] [INFO]
[linux-jdk8] [INFO] Maven Plugin Tools 3.6-SNAPSHOT .................... SUCCESS [ 16.634 s]
[linux-jdk8] [INFO] Maven Plugin Tools Extractor API ................... SUCCESS [  7.117 s]
[linux-jdk8] [INFO] Maven Plugin Tools Generators ...................... SUCCESS [  4.036 s]
[linux-jdk8] [INFO] Maven Plugin Tool for Java with Javadoc Tags ....... SUCCESS [  3.492 s]
[linux-jdk8] [INFO] Maven Plugin Tools Java 5 Annotations .............. SUCCESS [  0.581 s]
[linux-jdk8] [INFO] Maven Plugin Tool for Java with Annotations ........ SUCCESS [  3.594 s]
[linux-jdk8] [INFO] Maven Plugin Tools Javadoc Taglets ................. SUCCESS [ 11.179 s]
[linux-jdk8] [INFO] Maven Script Mojo Support .......................... SUCCESS [  0.420 s]
[linux-jdk8] [INFO] Maven Plugin Metadata Model ........................ SUCCESS [  2.666 s]
[linux-jdk8] [INFO] Maven Plugin Tool for Ant .......................... SUCCESS [  1.848 s]
[linux-jdk8] [INFO] Maven Ant Mojo Support ............................. SUCCESS [  3.625 s]
[linux-jdk8] [INFO] Maven Plugin Tool for Beanshell .................... SUCCESS [  0.849 s]
[linux-jdk8] [INFO] Maven Beanshell Mojo Support ....................... SUCCESS [  0.644 s]
[linux-jdk8] [INFO] Maven Plugin Plugin 3.6-SNAPSHOT ................... SUCCESS [05:06 min]
[linux-jdk8] [INFO] ------------------------------------------------------------------------
[linux-jdk8] [INFO] BUILD SUCCESS
[linux-jdk8] [INFO] ------------------------------------------------------------------------
[linux-jdk8] [INFO] Total time: 06:06 min
[linux-jdk8] [INFO] Finished at: 2018-09-12T16:24:50Z
[linux-jdk8] [INFO] ------------------------------------------------------------------------
[linux-jdk8] [INFO] [jenkins-event-spy] Generated /home/jenkins/jenkins-slave/workspace/x_maven-plugin-tools_master-XKS4EHY3PSXHGP4DHIXUDAAM6TMAKT3YNFP2XDSSXFM24ZMKWIXQ@tmp/withMavenb208f340/maven-spy-20180912-161843-9337177099446466927678.log
[Pipeline] [linux-jdk8] }
[Pipeline] [linux-jdk8] // dir
[linux-jdk9] [INFO]           beanshell-simple/pom.xml ......................... SUCCESS (10.4 s)
[linux-jdk9] [INFO] Building: annotation-with-inheritance/pom.xml
[linux-jdk9] [INFO] run post-build script verify.groovy
[linux-jdk9] [INFO]           annotation-with-inheritance/pom.xml .............. SUCCESS (25.9 s)
[linux-jdk9] [INFO] Building: mplugin-299_no-configuration/pom.xml
[Pipeline] [linux-jdk8] }
[linux-jdk8] [withMaven] invokerPublisher - Archive invoker results for Maven artifact MavenArtifact{org.apache.maven.plugin-tools:maven-plugin-tools-javadoc::3.6-SNAPSHOT(version: 3.6-SNAPSHOT, snapshot:false) } generated by PluginInvocation{org.apache.maven.plugins:maven-invoker-plugin:3.0.1@run  integration-test}: m/maven-plugin-tools-javadoc/target/invoker-reports/*.xml
[linux-jdk8] performing MavenInvokerRecorder, reportsFilenamePattern:'**/m/maven-plugin-tools-javadoc/target/invoker-reports/BUILD*.xml', invokerBuildDir:'**/m/maven-plugin-tools-javadoc/target/it'
[linux-jdk8] Found reports:[/home/jenkins/jenkins-slave/workspace/x_maven-plugin-tools_master-XKS4EHY3PSXHGP4DHIXUDAAM6TMAKT3YNFP2XDSSXFM24ZMKWIXQ/m/maven-plugin-tools-javadoc/target/invoker-reports/BUILD-basic.xml]
[linux-jdk8] Found logs:[/home/jenkins/jenkins-slave/workspace/x_maven-plugin-tools_master-XKS4EHY3PSXHGP4DHIXUDAAM6TMAKT3YNFP2XDSSXFM24ZMKWIXQ/m/maven-plugin-tools-javadoc/target/it/basic/build.log]
[linux-jdk8] Finished parsing Maven Invoker results (found 1)
[linux-jdk8] [withMaven] invokerPublisher - Archive invoker results for Maven artifact MavenArtifact{org.apache.maven.plugins:maven-plugin-plugin::3.6-SNAPSHOT(version: 3.6-SNAPSHOT, snapshot:false) } generated by PluginInvocation{org.apache.maven.plugins:maven-invoker-plugin:3.0.1@run  integration-test}: m/maven-plugin-plugin/target/invoker-reports/*.xml
[linux-jdk8] performing MavenInvokerRecorder, reportsFilenamePattern:'**/m/maven-plugin-plugin/target/invoker-reports/BUILD*.xml', invokerBuildDir:'**/m/maven-plugin-plugin/target/it'
[linux-jdk8] Found reports:[/home/jenkins/jenkins-slave/workspace/x_maven-plugin-tools_master-XKS4EHY3PSXHGP4DHIXUDAAM6TMAKT3YNFP2XDSSXFM24ZMKWIXQ/m/maven-plugin-plugin/target/invoker-reports/BUILD-annotation-with-inheritance-from-deps.xml, /home/jenkins/jenkins-slave/workspace/x_maven-plugin-tools_master-XKS4EHY3PSXHGP4DHIXUDAAM6TMAKT3YNFP2XDSSXFM24ZMKWIXQ/m/maven-plugin-plugin/target/invoker-reports/BUILD-annotation-with-inheritance-reactor.xml, /home/jenkins/jenkins-slave/workspace/x_maven-plugin-tools_master-XKS4EHY3PSXHGP4DHIXUDAAM6TMAKT3YNFP2XDSSXFM24ZMKWIXQ/m/maven-plugin-plugin/target/invoker-reports/BUILD-annotation-with-inheritance.xml, /home/jenkins/jenkins-slave/workspace/x_maven-plugin-tools_master-XKS4EHY3PSXHGP4DHIXUDAAM6TMAKT3YNFP2XDSSXFM24ZMKWIXQ/m/maven-plugin-plugin/target/invoker-reports/BUILD-ant-basic.xml, /home/jenkins/jenkins-slave/workspace/x_maven-plugin-tools_master-XKS4EHY3PSXHGP4DHIXUDAAM6TMAKT3YNFP2XDSSXFM24ZMKWIXQ/m/maven-plugin-plugin/target/invoker-reports/BUILD-ant-reference-parameter.xml, /home/jenkins/jenkins-slave/workspace/x_maven-plugin-tools_master-XKS4EHY3PSXHGP4DHIXUDAAM6TMAKT3YNFP2XDSSXFM24ZMKWIXQ/m/maven-plugin-plugin/target/invoker-reports/BUILD-ant-simple-usage.xml, /home/jenkins/jenkins-slave/workspace/x_maven-plugin-tools_master-XKS4EHY3PSXHGP4DHIXUDAAM6TMAKT3YNFP2XDSSXFM24ZMKWIXQ/m/maven-plugin-plugin/target/invoker-reports/BUILD-ant-since-maven-plugin.xml, /home/jenkins/jenkins-slave/workspace/x_maven-plugin-tools_master-XKS4EHY3PSXHGP4DHIXUDAAM6TMAKT3YNFP2XDSSXFM24ZMKWIXQ/m/maven-plugin-plugin/target/invoker-reports/BUILD-asm-failure.xml, /home/jenkins/jenkins-slave/workspace/x_maven-plugin-tools_master-XKS4EHY3PSXHGP4DHIXUDAAM6TMAKT3YNFP2XDSSXFM24ZMKWIXQ/m/maven-plugin-plugin/target/invoker-reports/BUILD-beanshell-simple.xml, /home/jenkins/jenkins-slave/workspace/x_maven-plugin-tools_master-XKS4EHY3PSXHGP4DHIXUDAAM6TMAKT3YNFP2XDSSXFM24ZMKWIXQ/m/maven-plugin-plugin/target/invoker-reports/BUILD-fix-maven-since-3.x.xml, /home/jenkins/jenkins-slave/workspace/x_maven-plugin-tools_master-XKS4EHY3PSXHGP4DHIXUDAAM6TMAKT3YNFP2XDSSXFM24ZMKWIXQ/m/maven-plugin-plugin/target/invoker-reports/BUILD-help-basic.xml, /home/jenkins/jenkins-slave/workspace/x_maven-plugin-tools_master-XKS4EHY3PSXHGP4DHIXUDAAM6TMAKT3YNFP2XDSSXFM24ZMKWIXQ/m/maven-plugin-plugin/target/invoker-reports/BUILD-help-package.xml, /home/jenkins/jenkins-slave/workspace/x_maven-plugin-tools_master-XKS4EHY3PSXHGP4DHIXUDAAM6TMAKT3YNFP2XDSSXFM24ZMKWIXQ/m/maven-plugin-plugin/target/invoker-reports/BUILD-ignore-plugin-class-realm.xml, /home/jenkins/jenkins-slave/workspace/x_maven-plugin-tools_master-XKS4EHY3PSXHGP4DHIXUDAAM6TMAKT3YNFP2XDSSXFM24ZMKWIXQ/m/maven-plugin-plugin/target/invoker-reports/BUILD-java-basic-annotations-jdk8.xml, /home/jenkins/jenkins-slave/workspace/x_maven-plugin-tools_master-XKS4EHY3PSXHGP4DHIXUDAAM6TMAKT3YNFP2XDSSXFM24ZMKWIXQ/m/maven-plugin-plugin/target/invoker-reports/BUILD-java-basic-annotations.xml, /home/jenkins/jenkins-slave/workspace/x_maven-plugin-tools_master-XKS4EHY3PSXHGP4DHIXUDAAM6TMAKT3YNFP2XDSSXFM24ZMKWIXQ/m/maven-plugin-plugin/target/invoker-reports/BUILD-java-basic.xml, /home/jenkins/jenkins-slave/workspace/x_maven-plugin-tools_master-XKS4EHY3PSXHGP4DHIXUDAAM6TMAKT3YNFP2XDSSXFM24ZMKWIXQ/m/maven-plugin-plugin/target/invoker-reports/BUILD-mplugin-187.xml, /home/jenkins/jenkins-slave/workspace/x_maven-plugin-tools_master-XKS4EHY3PSXHGP4DHIXUDAAM6TMAKT3YNFP2XDSSXFM24ZMKWIXQ/m/maven-plugin-plugin/target/invoker-reports/BUILD-mplugin-191.xml, /home/jenkins/jenkins-slave/workspace/x_maven-plugin-tools_master-XKS4EHY3PSXHGP4DHIXUDAAM6TMAKT3YNFP2XDSSXFM24ZMKWIXQ/m/maven-plugin-plugin/target/invoker-reports/BUILD-mplugin-223.xml, /home/jenkins/jenkins-slave/workspace/x_maven-plugin-tools_master-XKS4EHY3PSXHGP4DHIXUDAAM6TMAKT3YNFP2XDSSXFM24ZMKWIXQ/m/maven-plugin-plugin/target/invoker-reports/BUILD-mplugin-272_java8.xml, /home/jenkins/jenkins-slave/workspace/x_maven-plugin-tools_master-XKS4EHY3PSXHGP4DHIXUDAAM6TMAKT3YNFP2XDSSXFM24ZMKWIXQ/m/maven-plugin-plugin/target/invoker-reports/BUILD-mplugin-299_no-configuration.xml, /home/jenkins/jenkins-slave/workspace/x_maven-plugin-tools_master-XKS4EHY3PSXHGP4DHIXUDAAM6TMAKT3YNFP2XDSSXFM24ZMKWIXQ/m/maven-plugin-plugin/target/invoker-reports/BUILD-mplugin-305_defaultMojoDependencies.xml, /home/jenkins/jenkins-slave/workspace/x_maven-plugin-tools_master-XKS4EHY3PSXHGP4DHIXUDAAM6TMAKT3YNFP2XDSSXFM24ZMKWIXQ/m/maven-plugin-plugin/target/invoker-reports/BUILD-mplugin-305_emptyMojoDependencies.xml, /home/jenkins/jenkins-slave/workspace/x_maven-plugin-tools_master-XKS4EHY3PSXHGP4DHIXUDAAM6TMAKT3YNFP2XDSSXFM24ZMKWIXQ/m/maven-plugin-plugin/target/invoker-reports/BUILD-mplugin-305_singleMojoDependencies.xml, /home/jenkins/jenkins-slave/workspace/x_maven-plugin-tools_master-XKS4EHY3PSXHGP4DHIXUDAAM6TMAKT3YNFP2XDSSXFM24ZMKWIXQ/m/maven-plugin-plugin/target/invoker-reports/BUILD-mplugin-319_report-since.xml, /home/jenkins/jenkins-slave/workspace/x_maven-plugin-tools_master-XKS4EHY3PSXHGP4DHIXUDAAM6TMAKT3YNFP2XDSSXFM24ZMKWIXQ/m/maven-plugin-plugin/target/invoker-reports/BUILD-mplugin-324_javadoc.xml, /home/jenkins/jenkins-slave/workspace/x_maven-plugin-tools_master-XKS4EHY3PSXHGP4DHIXUDAAM6TMAKT3YNFP2XDSSXFM24ZMKWIXQ/m/maven-plugin-plugin/target/invoker-reports/BUILD-packaging-jar.xml, /home/jenkins/jenkins-slave/workspace/x_maven-plugin-tools_master-XKS4EHY3PSXHGP4DHIXUDAAM6TMAKT3YNFP2XDSSXFM24ZMKWIXQ/m/maven-plugin-plugin/target/invoker-reports/BUILD-plugin-info-jdk-default-version.xml, /home/jenkins/jenkins-slave/workspace/x_maven-plugin-tools_master-XKS4EHY3PSXHGP4DHIXUDAAM6TMAKT3YNFP2XDSSXFM24ZMKWIXQ/m/maven-plugin-plugin/target/invoker-reports/BUILD-plugin-info-jdk.xml, /home/jenkins/jenkins-slave/workspace/x_maven-plugin-tools_master-XKS4EHY3PSXHGP4DHIXUDAAM6TMAKT3YNFP2XDSSXFM24ZMKWIXQ/m/maven-plugin-plugin/target/invoker-reports/BUILD-plugin-report-annotations.xml, /home/jenkins/jenkins-slave/workspace/x_maven-plugin-tools_master-XKS4EHY3PSXHGP4DHIXUDAAM6TMAKT3YNFP2XDSSXFM24ZMKWIXQ/m/maven-plugin-plugin/target/invoker-reports/BUILD-plugin-report.xml, /home/jenkins/jenkins-slave/workspace/x_maven-plugin-tools_master-XKS4EHY3PSXHGP4DHIXUDAAM6TMAKT3YNFP2XDSSXFM24ZMKWIXQ/m/maven-plugin-plugin/target/invoker-reports/BUILD-skip.xml, /home/jenkins/jenkins-slave/workspace/x_maven-plugin-tools_master-XKS4EHY3PSXHGP4DHIXUDAAM6TMAKT3YNFP2XDSSXFM24ZMKWIXQ/m/maven-plugin-plugin/target/invoker-reports/BUILD-source-encoding.xml]
[linux-jdk8] Found logs:[/home/jenkins/jenkins-slave/workspace/x_maven-plugin-tools_master-XKS4EHY3PSXHGP4DHIXUDAAM6TMAKT3YNFP2XDSSXFM24ZMKWIXQ/m/maven-plugin-plugin/target/it/annotation-with-inheritance-from-deps/build.log, /home/jenkins/jenkins-slave/workspace/x_maven-plugin-tools_master-XKS4EHY3PSXHGP4DHIXUDAAM6TMAKT3YNFP2XDSSXFM24ZMKWIXQ/m/maven-plugin-plugin/target/it/annotation-with-inheritance-reactor/build.log, /home/jenkins/jenkins-slave/workspace/x_maven-plugin-tools_master-XKS4EHY3PSXHGP4DHIXUDAAM6TMAKT3YNFP2XDSSXFM24ZMKWIXQ/m/maven-plugin-plugin/target/it/annotation-with-inheritance/build.log, /home/jenkins/jenkins-slave/workspace/x_maven-plugin-tools_master-XKS4EHY3PSXHGP4DHIXUDAAM6TMAKT3YNFP2XDSSXFM24ZMKWIXQ/m/maven-plugin-plugin/target/it/ant-basic/build.log, /home/jenkins/jenkins-slave/workspace/x_maven-plugin-tools_master-XKS4EHY3PSXHGP4DHIXUDAAM6TMAKT3YNFP2XDSSXFM24ZMKWIXQ/m/maven-plugin-plugin/target/it/ant-reference-parameter/build.log, /home/jenkins/jenkins-slave/workspace/x_maven-plugin-tools_master-XKS4EHY3PSXHGP4DHIXUDAAM6TMAKT3YNFP2XDSSXFM24ZMKWIXQ/m/maven-plugin-plugin/target/it/ant-simple-usage/build.log, /home/jenkins/jenkins-slave/workspace/x_maven-plugin-tools_master-XKS4EHY3PSXHGP4DHIXUDAAM6TMAKT3YNFP2XDSSXFM24ZMKWIXQ/m/maven-plugin-plugin/target/it/ant-since-maven-plugin/build.log, /home/jenkins/jenkins-slave/workspace/x_maven-plugin-tools_master-XKS4EHY3PSXHGP4DHIXUDAAM6TMAKT3YNFP2XDSSXFM24ZMKWIXQ/m/maven-plugin-plugin/target/it/asm-failure/build.log, /home/jenkins/jenkins-slave/workspace/x_maven-plugin-tools_master-XKS4EHY3PSXHGP4DHIXUDAAM6TMAKT3YNFP2XDSSXFM24ZMKWIXQ/m/maven-plugin-plugin/target/it/beanshell-simple/build.log, /home/jenkins/jenkins-slave/workspace/x_maven-plugin-tools_master-XKS4EHY3PSXHGP4DHIXUDAAM6TMAKT3YNFP2XDSSXFM24ZMKWIXQ/m/maven-plugin-plugin/target/it/fix-maven-since-3.x/build.log, /home/jenkins/jenkins-slave/workspace/x_maven-plugin-tools_master-XKS4EHY3PSXHGP4DHIXUDAAM6TMAKT3YNFP2XDSSXFM24ZMKWIXQ/m/maven-plugin-plugin/target/it/help-basic/build.log, /home/jenkins/jenkins-slave/workspace/x_maven-plugin-tools_master-XKS4EHY3PSXHGP4DHIXUDAAM6TMAKT3YNFP2XDSSXFM24ZMKWIXQ/m/maven-plugin-plugin/target/it/help-package/build.log, /home/jenkins/jenkins-slave/workspace/x_maven-plugin-tools_master-XKS4EHY3PSXHGP4DHIXUDAAM6TMAKT3YNFP2XDSSXFM24ZMKWIXQ/m/maven-plugin-plugin/target/it/ignore-plugin-class-realm/build.log, /home/jenkins/jenkins-slave/workspace/x_maven-plugin-tools_master-XKS4EHY3PSXHGP4DHIXUDAAM6TMAKT3YNFP2XDSSXFM24ZMKWIXQ/m/maven-plugin-plugin/target/it/java-basic-annotations-jdk8/build.log, /home/jenkins/jenkins-slave/workspace/x_maven-plugin-tools_master-XKS4EHY3PSXHGP4DHIXUDAAM6TMAKT3YNFP2XDSSXFM24ZMKWIXQ/m/maven-plugin-plugin/target/it/java-basic-annotations/build.log, /home/jenkins/jenkins-slave/workspace/x_maven-plugin-tools_master-XKS4EHY3PSXHGP4DHIXUDAAM6TMAKT3YNFP2XDSSXFM24ZMKWIXQ/m/maven-plugin-plugin/target/it/java-basic/build.log, /home/jenkins/jenkins-slave/workspace/x_maven-plugin-tools_master-XKS4EHY3PSXHGP4DHIXUDAAM6TMAKT3YNFP2XDSSXFM24ZMKWIXQ/m/maven-plugin-plugin/target/it/mplugin-187/build.log, /home/jenkins/jenkins-slave/workspace/x_maven-plugin-tools_master-XKS4EHY3PSXHGP4DHIXUDAAM6TMAKT3YNFP2XDSSXFM24ZMKWIXQ/m/maven-plugin-plugin/target/it/mplugin-191/build.log, /home/jenkins/jenkins-slave/workspace/x_maven-plugin-tools_master-XKS4EHY3PSXHGP4DHIXUDAAM6TMAKT3YNFP2XDSSXFM24ZMKWIXQ/m/maven-plugin-plugin/target/it/mplugin-223/build.log, /home/jenkins/jenkins-slave/workspace/x_maven-plugin-tools_master-XKS4EHY3PSXHGP4DHIXUDAAM6TMAKT3YNFP2XDSSXFM24ZMKWIXQ/m/maven-plugin-plugin/target/it/mplugin-272_java8/build.log, /home/jenkins/jenkins-slave/workspace/x_maven-plugin-tools_master-XKS4EHY3PSXHGP4DHIXUDAAM6TMAKT3YNFP2XDSSXFM24ZMKWIXQ/m/maven-plugin-plugin/target/it/mplugin-299_no-configuration/build.log, /home/jenkins/jenkins-slave/workspace/x_maven-plugin-tools_master-XKS4EHY3PSXHGP4DHIXUDAAM6TMAKT3YNFP2XDSSXFM24ZMKWIXQ/m/maven-plugin-plugin/target/it/mplugin-305_defaultMojoDependencies/build.log, /home/jenkins/jenkins-slave/workspace/x_maven-plugin-tools_master-XKS4EHY3PSXHGP4DHIXUDAAM6TMAKT3YNFP2XDSSXFM24ZMKWIXQ/m/maven-plugin-plugin/target/it/mplugin-305_emptyMojoDependencies/build.log, /home/jenkins/jenkins-slave/workspace/x_maven-plugin-tools_master-XKS4EHY3PSXHGP4DHIXUDAAM6TMAKT3YNFP2XDSSXFM24ZMKWIXQ/m/maven-plugin-plugin/target/it/mplugin-305_singleMojoDependencies/build.log, /home/jenkins/jenkins-slave/workspace/x_maven-plugin-tools_master-XKS4EHY3PSXHGP4DHIXUDAAM6TMAKT3YNFP2XDSSXFM24ZMKWIXQ/m/maven-plugin-plugin/target/it/mplugin-319_report-since/build.log, /home/jenkins/jenkins-slave/workspace/x_maven-plugin-tools_master-XKS4EHY3PSXHGP4DHIXUDAAM6TMAKT3YNFP2XDSSXFM24ZMKWIXQ/m/maven-plugin-plugin/target/it/mplugin-324_javadoc/build.log, /home/jenkins/jenkins-slave/workspace/x_maven-plugin-tools_master-XKS4EHY3PSXHGP4DHIXUDAAM6TMAKT3YNFP2XDSSXFM24ZMKWIXQ/m/maven-plugin-plugin/target/it/packaging-jar/build.log, /home/jenkins/jenkins-slave/workspace/x_maven-plugin-tools_master-XKS4EHY3PSXHGP4DHIXUDAAM6TMAKT3YNFP2XDSSXFM24ZMKWIXQ/m/maven-plugin-plugin/target/it/plugin-info-jdk-default-version/build.log, /home/jenkins/jenkins-slave/workspace/x_maven-plugin-tools_master-XKS4EHY3PSXHGP4DHIXUDAAM6TMAKT3YNFP2XDSSXFM24ZMKWIXQ/m/maven-plugin-plugin/target/it/plugin-info-jdk/build.log, /home/jenkins/jenkins-slave/workspace/x_maven-plugin-tools_master-XKS4EHY3PSXHGP4DHIXUDAAM6TMAKT3YNFP2XDSSXFM24ZMKWIXQ/m/maven-plugin-plugin/target/it/plugin-report-annotations/build.log, /home/jenkins/jenkins-slave/workspace/x_maven-plugin-tools_master-XKS4EHY3PSXHGP4DHIXUDAAM6TMAKT3YNFP2XDSSXFM24ZMKWIXQ/m/maven-plugin-plugin/target/it/plugin-report/build.log, /home/jenkins/jenkins-slave/workspace/x_maven-plugin-tools_master-XKS4EHY3PSXHGP4DHIXUDAAM6TMAKT3YNFP2XDSSXFM24ZMKWIXQ/m/maven-plugin-plugin/target/it/skip/build.log, /home/jenkins/jenkins-slave/workspace/x_maven-plugin-tools_master-XKS4EHY3PSXHGP4DHIXUDAAM6TMAKT3YNFP2XDSSXFM24ZMKWIXQ/m/maven-plugin-plugin/target/it/source-encoding/build.log]
[linux-jdk8] Finished parsing Maven Invoker results (found 33)
[linux-jdk8] [withMaven] junitPublisher - Archive test results for Maven artifact org.apache.maven.plugin-tools:maven-plugin-tools-api:3.6-SNAPSHOT generated by maven-surefire-plugin:test (default-test): m/maven-plugin-tools-api/target/surefire-reports/*.xml
[linux-jdk8] Recording test results
[linux-jdk8] [withMaven] junitPublisher - Archive test results for Maven artifact org.apache.maven.plugin-tools:maven-plugin-tools-generators:3.6-SNAPSHOT generated by maven-surefire-plugin:test (default-test): m/maven-plugin-tools-generators/target/surefire-reports/*.xml
[linux-jdk8] Recording test results
[linux-jdk8] [withMaven] junitPublisher - Archive test results for Maven artifact org.apache.maven.plugin-tools:maven-plugin-tools-java:3.6-SNAPSHOT generated by maven-surefire-plugin:test (default-test): m/maven-plugin-tools-java/target/surefire-reports/*.xml
[linux-jdk8] Recording test results
[linux-jdk8] [withMaven] junitPublisher - Archive test results for Maven artifact org.apache.maven.plugin-tools:maven-plugin-annotations:3.6-SNAPSHOT generated by maven-surefire-plugin:test (default-test): m/maven-plugin-annotations/target/surefire-reports/*.xml
[linux-jdk8] Recording test results
[linux-jdk8] None of the test reports contained any result
[linux-jdk8] [withMaven] junitPublisher - Archive test results for Maven artifact org.apache.maven.plugin-tools:maven-plugin-tools-annotations:3.6-SNAPSHOT generated by maven-surefire-plugin:test (default-test): m/maven-plugin-tools-annotations/target/surefire-reports/*.xml
[linux-jdk8] Recording test results
[linux-jdk8] [withMaven] junitPublisher - Archive test results for Maven artifact org.apache.maven.plugin-tools:maven-plugin-tools-javadoc:3.6-SNAPSHOT generated by maven-surefire-plugin:test (default-test): m/maven-plugin-tools-javadoc/target/surefire-reports/*.xml
[linux-jdk8] Recording test results
[linux-jdk8] None of the test reports contained any result
[linux-jdk8] [withMaven] junitPublisher - Archive test results for Maven artifact org.apache.maven.plugin-tools:maven-plugin-tools-model:3.6-SNAPSHOT generated by maven-surefire-plugin:test (default-test): m/maven-script/maven-plugin-tools-model/target/surefire-reports/*.xml
[linux-jdk8] Recording test results
[linux-jdk8] [withMaven] junitPublisher - Archive test results for Maven artifact org.apache.maven.plugin-tools:maven-plugin-tools-ant:3.6-SNAPSHOT generated by maven-surefire-plugin:test (default-test): m/maven-script/maven-plugin-tools-ant/target/surefire-reports/*.xml
[linux-jdk8] Recording test results
[linux-jdk8] [withMaven] junitPublisher - Archive test results for Maven artifact org.apache.maven.plugin-tools:maven-script-ant:3.6-SNAPSHOT generated by maven-surefire-plugin:test (default-test): m/maven-script/maven-script-ant/target/surefire-reports/*.xml
[linux-jdk8] Recording test results
[linux-jdk8] [withMaven] junitPublisher - Archive test results for Maven artifact org.apache.maven.plugin-tools:maven-plugin-tools-beanshell:3.6-SNAPSHOT generated by maven-surefire-plugin:test (default-test): m/maven-script/maven-plugin-tools-beanshell/target/surefire-reports/*.xml
[linux-jdk8] Recording test results
[linux-jdk8] None of the test reports contained any result
[linux-jdk8] [withMaven] junitPublisher - Archive test results for Maven artifact org.apache.maven.plugin-tools:maven-script-beanshell:3.6-SNAPSHOT generated by maven-surefire-plugin:test (default-test): m/maven-script/maven-script-beanshell/target/surefire-reports/*.xml
[linux-jdk8] Recording test results
[linux-jdk8] None of the test reports contained any result
[linux-jdk8] [withMaven] junitPublisher - Archive test results for Maven artifact org.apache.maven.plugins:maven-plugin-plugin:3.6-SNAPSHOT generated by maven-surefire-plugin:test (default-test): m/maven-plugin-plugin/target/surefire-reports/*.xml
[linux-jdk8] Recording test results
[linux-jdk8] None of the test reports contained any result
[Pipeline] [linux-jdk8] // withMaven
[Pipeline] [linux-jdk8] cleanWs
[linux-jdk8] [WS-CLEANUP] Deleting project workspace...[WS-CLEANUP] done
[Pipeline] [linux-jdk8] }
[Pipeline] [linux-jdk8] // stage
[Pipeline] [linux-jdk8] }
[Pipeline] [linux-jdk8] // node
[Pipeline] [linux-jdk8] }
[linux-jdk9] [INFO]           mplugin-299_no-configuration/pom.xml ............. SUCCESS (10.2 s)
[linux-jdk9] [INFO] Building: ant-reference-parameter/pom.xml
[linux-jdk9] [INFO]           ant-reference-parameter/pom.xml .................. SUCCESS (11.0 s)
[linux-jdk9] [INFO] Building: mplugin-305_emptyMojoDependencies/pom.xml
[linux-jdk9] [INFO] run post-build script verify.groovy
[linux-jdk9] [INFO]           mplugin-305_emptyMojoDependencies/pom.xml ........ SUCCESS (7.5 s)
[linux-jdk9] [INFO] Building: ignore-plugin-class-realm/pom.xml
[linux-jdk9] [INFO]           ignore-plugin-class-realm/pom.xml ................ SUCCESS (10.9 s)
[linux-jdk9] [INFO] Building: annotation-with-inheritance-from-deps/pom.xml
[linux-jdk9] [INFO] run post-build script verify.groovy
[linux-jdk9] [INFO]           annotation-with-inheritance-from-deps/pom.xml .... SUCCESS (19.9 s)
[linux-jdk9] [INFO] Building: plugin-info-jdk/pom.xml
[linux-jdk9] [INFO] run post-build script verify.groovy
[linux-jdk9] [INFO]           plugin-info-jdk/pom.xml .......................... SUCCESS (11.5 s)
[linux-jdk9] [INFO] Building: java-basic/pom.xml
[linux-jdk9] [INFO] run post-build script verify.groovy
[linux-jdk9] [INFO]           java-basic/pom.xml ............................... SUCCESS (10.7 s)
[linux-jdk9] [INFO] Building: help-package/pom.xml
[linux-jdk9] [INFO] run post-build script verify.bsh
[linux-jdk9] [INFO]           help-package/pom.xml ............................. SUCCESS (6.1 s)
[linux-jdk9] [INFO] Building: plugin-report-annotations/pom.xml
[linux-jdk9] [INFO] run post-build script verify.bsh
[linux-jdk9] [INFO]           plugin-report-annotations/pom.xml ................ SUCCESS (10.9 s)
[linux-jdk9] [INFO] Building: mplugin-272_java8/pom.xml
[linux-jdk9] [INFO]           mplugin-272_java8/pom.xml ........................ SUCCESS (9.2 s)
[linux-jdk9] [INFO] Building: mplugin-187/pom.xml
[linux-jdk9] [INFO]           mplugin-187/pom.xml .............................. SUCCESS (4.9 s)
[linux-jdk9] [INFO] Building: fix-maven-since-3.x/pom.xml
[linux-jdk9] [INFO] run post-build script verify.groovy
[linux-jdk9] [INFO]           fix-maven-since-3.x/pom.xml ...................... SUCCESS (16.7 s)
[linux-jdk9] [INFO] Building: ant-since-maven-plugin/pom.xml
[linux-jdk9] [INFO]           ant-since-maven-plugin/pom.xml ................... SUCCESS (5.3 s)
[linux-jdk9] [INFO] Building: source-encoding/pom.xml
[linux-jdk9] [INFO] run post-build script verify.groovy
[linux-jdk9] [INFO]           source-encoding/pom.xml .......................... SUCCESS (6.7 s)
[linux-jdk9] [INFO] Building: mplugin-319_report-since/pom.xml
[linux-jdk9] [INFO] run post-build script verify.groovy
[linux-jdk9] [INFO]           mplugin-319_report-since/pom.xml ................. SUCCESS (6.5 s)
[linux-jdk9] [INFO] -------------------------------------------------
[linux-jdk9] [INFO] Build Summary:
[linux-jdk9] [INFO]   Passed: 33, Failed: 0, Errors: 0, Skipped: 0
[linux-jdk9] [INFO] -------------------------------------------------
[linux-jdk9] [INFO]
[linux-jdk9] [INFO] --- maven-checkstyle-plugin:3.0.0:check (checkstyle-check) @ maven-plugin-plugin ---
[linux-jdk9] [INFO] ------------------------------------------------------------------------
[linux-jdk9] [INFO] Reactor Summary:
[linux-jdk9] [INFO]
[linux-jdk9] [INFO] Maven Plugin Tools 3.6-SNAPSHOT .................... SUCCESS [ 14.555 s]
[linux-jdk9] [INFO] Maven Plugin Tools Extractor API ................... SUCCESS [  8.415 s]
[linux-jdk9] [INFO] Maven Plugin Tools Generators ...................... SUCCESS [  6.181 s]
[linux-jdk9] [INFO] Maven Plugin Tool for Java with Javadoc Tags ....... SUCCESS [  4.845 s]
[linux-jdk9] [INFO] Maven Plugin Tools Java 5 Annotations .............. SUCCESS [  0.726 s]
[linux-jdk9] [INFO] Maven Plugin Tool for Java with Annotations ........ SUCCESS [  4.256 s]
[linux-jdk9] [INFO] Maven Plugin Tools Javadoc Taglets ................. SUCCESS [ 13.834 s]
[linux-jdk9] [INFO] Maven Script Mojo Support .......................... SUCCESS [  0.517 s]
[linux-jdk9] [INFO] Maven Plugin Metadata Model ........................ SUCCESS [  2.664 s]
[linux-jdk9] [INFO] Maven Plugin Tool for Ant .......................... SUCCESS [  2.063 s]
[linux-jdk9] [INFO] Maven Ant Mojo Support ............................. SUCCESS [  3.927 s]
[linux-jdk9] [INFO] Maven Plugin Tool for Beanshell .................... SUCCESS [  0.983 s]
[linux-jdk9] [INFO] Maven Beanshell Mojo Support ....................... SUCCESS [  0.610 s]
[linux-jdk9] [INFO] Maven Plugin Plugin 3.6-SNAPSHOT ................... SUCCESS [06:18 min]
[linux-jdk9] [INFO] ------------------------------------------------------------------------
[linux-jdk9] [INFO] BUILD SUCCESS
[linux-jdk9] [INFO] ------------------------------------------------------------------------
[linux-jdk9] [INFO] Total time: 07:22 min
[linux-jdk9] [INFO] Finished at: 2018-09-12T16:27:46Z
[linux-jdk9] [INFO] ------------------------------------------------------------------------
[linux-jdk9] [INFO] [jenkins-event-spy] Generated /home/jenkins/jenkins-slave/workspace/x_maven-plugin-tools_master-XKS4EHY3PSXHGP4DHIXUDAAM6TMAKT3YNFP2XDSSXFM24ZMKWIXQ@tmp/withMaven0b1b0534/maven-spy-20180912-162022-9056776650648733206303.log
[Pipeline] [linux-jdk9] }
[Pipeline] [linux-jdk9] // dir
[Pipeline] [linux-jdk9] }
[linux-jdk9] [withMaven] invokerPublisher - Archive invoker results for Maven artifact MavenArtifact{org.apache.maven.plugin-tools:maven-plugin-tools-javadoc::3.6-SNAPSHOT(version: 3.6-SNAPSHOT, snapshot:false) } generated by PluginInvocation{org.apache.maven.plugins:maven-invoker-plugin:3.0.1@run  integration-test}: m/maven-plugin-tools-javadoc/target/invoker-reports/*.xml
[linux-jdk9] performing MavenInvokerRecorder, reportsFilenamePattern:'**/m/maven-plugin-tools-javadoc/target/invoker-reports/BUILD*.xml', invokerBuildDir:'**/m/maven-plugin-tools-javadoc/target/it'
[linux-jdk9] Found reports:[/home/jenkins/jenkins-slave/workspace/x_maven-plugin-tools_master-XKS4EHY3PSXHGP4DHIXUDAAM6TMAKT3YNFP2XDSSXFM24ZMKWIXQ/m/maven-plugin-tools-javadoc/target/invoker-reports/BUILD-basic.xml]
[linux-jdk9] Found logs:[/home/jenkins/jenkins-slave/workspace/x_maven-plugin-tools_master-XKS4EHY3PSXHGP4DHIXUDAAM6TMAKT3YNFP2XDSSXFM24ZMKWIXQ/m/maven-plugin-tools-javadoc/target/it/basic/build.log]
[linux-jdk9] Finished parsing Maven Invoker results (found 1)
[linux-jdk9] [withMaven] invokerPublisher - Archive invoker results for Maven artifact MavenArtifact{org.apache.maven.plugins:maven-plugin-plugin::3.6-SNAPSHOT(version: 3.6-SNAPSHOT, snapshot:false) } generated by PluginInvocation{org.apache.maven.plugins:maven-invoker-plugin:3.0.1@run  integration-test}: m/maven-plugin-plugin/target/invoker-reports/*.xml
[linux-jdk9] performing MavenInvokerRecorder, reportsFilenamePattern:'**/m/maven-plugin-plugin/target/invoker-reports/BUILD*.xml', invokerBuildDir:'**/m/maven-plugin-plugin/target/it'
[linux-jdk9] Found reports:[/home/jenkins/jenkins-slave/workspace/x_maven-plugin-tools_master-XKS4EHY3PSXHGP4DHIXUDAAM6TMAKT3YNFP2XDSSXFM24ZMKWIXQ/m/maven-plugin-plugin/target/invoker-reports/BUILD-annotation-with-inheritance-from-deps.xml, /home/jenkins/jenkins-slave/workspace/x_maven-plugin-tools_master-XKS4EHY3PSXHGP4DHIXUDAAM6TMAKT3YNFP2XDSSXFM24ZMKWIXQ/m/maven-plugin-plugin/target/invoker-reports/BUILD-annotation-with-inheritance-reactor.xml, /home/jenkins/jenkins-slave/workspace/x_maven-plugin-tools_master-XKS4EHY3PSXHGP4DHIXUDAAM6TMAKT3YNFP2XDSSXFM24ZMKWIXQ/m/maven-plugin-plugin/target/invoker-reports/BUILD-annotation-with-inheritance.xml, /home/jenkins/jenkins-slave/workspace/x_maven-plugin-tools_master-XKS4EHY3PSXHGP4DHIXUDAAM6TMAKT3YNFP2XDSSXFM24ZMKWIXQ/m/maven-plugin-plugin/target/invoker-reports/BUILD-ant-basic.xml, /home/jenkins/jenkins-slave/workspace/x_maven-plugin-tools_master-XKS4EHY3PSXHGP4DHIXUDAAM6TMAKT3YNFP2XDSSXFM24ZMKWIXQ/m/maven-plugin-plugin/target/invoker-reports/BUILD-ant-reference-parameter.xml, /home/jenkins/jenkins-slave/workspace/x_maven-plugin-tools_master-XKS4EHY3PSXHGP4DHIXUDAAM6TMAKT3YNFP2XDSSXFM24ZMKWIXQ/m/maven-plugin-plugin/target/invoker-reports/BUILD-ant-simple-usage.xml, /home/jenkins/jenkins-slave/workspace/x_maven-plugin-tools_master-XKS4EHY3PSXHGP4DHIXUDAAM6TMAKT3YNFP2XDSSXFM24ZMKWIXQ/m/maven-plugin-plugin/target/invoker-reports/BUILD-ant-since-maven-plugin.xml, /home/jenkins/jenkins-slave/workspace/x_maven-plugin-tools_master-XKS4EHY3PSXHGP4DHIXUDAAM6TMAKT3YNFP2XDSSXFM24ZMKWIXQ/m/maven-plugin-plugin/target/invoker-reports/BUILD-asm-failure.xml, /home/jenkins/jenkins-slave/workspace/x_maven-plugin-tools_master-XKS4EHY3PSXHGP4DHIXUDAAM6TMAKT3YNFP2XDSSXFM24ZMKWIXQ/m/maven-plugin-plugin/target/invoker-reports/BUILD-beanshell-simple.xml, /home/jenkins/jenkins-slave/workspace/x_maven-plugin-tools_master-XKS4EHY3PSXHGP4DHIXUDAAM6TMAKT3YNFP2XDSSXFM24ZMKWIXQ/m/maven-plugin-plugin/target/invoker-reports/BUILD-fix-maven-since-3.x.xml, /home/jenkins/jenkins-slave/workspace/x_maven-plugin-tools_master-XKS4EHY3PSXHGP4DHIXUDAAM6TMAKT3YNFP2XDSSXFM24ZMKWIXQ/m/maven-plugin-plugin/target/invoker-reports/BUILD-help-basic.xml, /home/jenkins/jenkins-slave/workspace/x_maven-plugin-tools_master-XKS4EHY3PSXHGP4DHIXUDAAM6TMAKT3YNFP2XDSSXFM24ZMKWIXQ/m/maven-plugin-plugin/target/invoker-reports/BUILD-help-package.xml, /home/jenkins/jenkins-slave/workspace/x_maven-plugin-tools_master-XKS4EHY3PSXHGP4DHIXUDAAM6TMAKT3YNFP2XDSSXFM24ZMKWIXQ/m/maven-plugin-plugin/target/invoker-reports/BUILD-ignore-plugin-class-realm.xml, /home/jenkins/jenkins-slave/workspace/x_maven-plugin-tools_master-XKS4EHY3PSXHGP4DHIXUDAAM6TMAKT3YNFP2XDSSXFM24ZMKWIXQ/m/maven-plugin-plugin/target/invoker-reports/BUILD-java-basic-annotations-jdk8.xml, /home/jenkins/jenkins-slave/workspace/x_maven-plugin-tools_master-XKS4EHY3PSXHGP4DHIXUDAAM6TMAKT3YNFP2XDSSXFM24ZMKWIXQ/m/maven-plugin-plugin/target/invoker-reports/BUILD-java-basic-annotations.xml, /home/jenkins/jenkins-slave/workspace/x_maven-plugin-tools_master-XKS4EHY3PSXHGP4DHIXUDAAM6TMAKT3YNFP2XDSSXFM24ZMKWIXQ/m/maven-plugin-plugin/target/invoker-reports/BUILD-java-basic.xml, /home/jenkins/jenkins-slave/workspace/x_maven-plugin-tools_master-XKS4EHY3PSXHGP4DHIXUDAAM6TMAKT3YNFP2XDSSXFM24ZMKWIXQ/m/maven-plugin-plugin/target/invoker-reports/BUILD-mplugin-187.xml, /home/jenkins/jenkins-slave/workspace/x_maven-plugin-tools_master-XKS4EHY3PSXHGP4DHIXUDAAM6TMAKT3YNFP2XDSSXFM24ZMKWIXQ/m/maven-plugin-plugin/target/invoker-reports/BUILD-mplugin-191.xml, /home/jenkins/jenkins-slave/workspace/x_maven-plugin-tools_master-XKS4EHY3PSXHGP4DHIXUDAAM6TMAKT3YNFP2XDSSXFM24ZMKWIXQ/m/maven-plugin-plugin/target/invoker-reports/BUILD-mplugin-223.xml, /home/jenkins/jenkins-slave/workspace/x_maven-plugin-tools_master-XKS4EHY3PSXHGP4DHIXUDAAM6TMAKT3YNFP2XDSSXFM24ZMKWIXQ/m/maven-plugin-plugin/target/invoker-reports/BUILD-mplugin-272_java8.xml, /home/jenkins/jenkins-slave/workspace/x_maven-plugin-tools_master-XKS4EHY3PSXHGP4DHIXUDAAM6TMAKT3YNFP2XDSSXFM24ZMKWIXQ/m/maven-plugin-plugin/target/invoker-reports/BUILD-mplugin-299_no-configuration.xml, /home/jenkins/jenkins-slave/workspace/x_maven-plugin-tools_master-XKS4EHY3PSXHGP4DHIXUDAAM6TMAKT3YNFP2XDSSXFM24ZMKWIXQ/m/maven-plugin-plugin/target/invoker-reports/BUILD-mplugin-305_defaultMojoDependencies.xml, /home/jenkins/jenkins-slave/workspace/x_maven-plugin-tools_master-XKS4EHY3PSXHGP4DHIXUDAAM6TMAKT3YNFP2XDSSXFM24ZMKWIXQ/m/maven-plugin-plugin/target/invoker-reports/BUILD-mplugin-305_emptyMojoDependencies.xml, /home/jenkins/jenkins-slave/workspace/x_maven-plugin-tools_master-XKS4EHY3PSXHGP4DHIXUDAAM6TMAKT3YNFP2XDSSXFM24ZMKWIXQ/m/maven-plugin-plugin/target/invoker-reports/BUILD-mplugin-305_singleMojoDependencies.xml, /home/jenkins/jenkins-slave/workspace/x_maven-plugin-tools_master-XKS4EHY3PSXHGP4DHIXUDAAM6TMAKT3YNFP2XDSSXFM24ZMKWIXQ/m/maven-plugin-plugin/target/invoker-reports/BUILD-mplugin-319_report-since.xml, /home/jenkins/jenkins-slave/workspace/x_maven-plugin-tools_master-XKS4EHY3PSXHGP4DHIXUDAAM6TMAKT3YNFP2XDSSXFM24ZMKWIXQ/m/maven-plugin-plugin/target/invoker-reports/BUILD-mplugin-324_javadoc.xml, /home/jenkins/jenkins-slave/workspace/x_maven-plugin-tools_master-XKS4EHY3PSXHGP4DHIXUDAAM6TMAKT3YNFP2XDSSXFM24ZMKWIXQ/m/maven-plugin-plugin/target/invoker-reports/BUILD-packaging-jar.xml, /home/jenkins/jenkins-slave/workspace/x_maven-plugin-tools_master-XKS4EHY3PSXHGP4DHIXUDAAM6TMAKT3YNFP2XDSSXFM24ZMKWIXQ/m/maven-plugin-plugin/target/invoker-reports/BUILD-plugin-info-jdk-default-version.xml, /home/jenkins/jenkins-slave/workspace/x_maven-plugin-tools_master-XKS4EHY3PSXHGP4DHIXUDAAM6TMAKT3YNFP2XDSSXFM24ZMKWIXQ/m/maven-plugin-plugin/target/invoker-reports/BUILD-plugin-info-jdk.xml, /home/jenkins/jenkins-slave/workspace/x_maven-plugin-tools_master-XKS4EHY3PSXHGP4DHIXUDAAM6TMAKT3YNFP2XDSSXFM24ZMKWIXQ/m/maven-plugin-plugin/target/invoker-reports/BUILD-plugin-report-annotations.xml, /home/jenkins/jenkins-slave/workspace/x_maven-plugin-tools_master-XKS4EHY3PSXHGP4DHIXUDAAM6TMAKT3YNFP2XDSSXFM24ZMKWIXQ/m/maven-plugin-plugin/target/invoker-reports/BUILD-plugin-report.xml, /home/jenkins/jenkins-slave/workspace/x_maven-plugin-tools_master-XKS4EHY3PSXHGP4DHIXUDAAM6TMAKT3YNFP2XDSSXFM24ZMKWIXQ/m/maven-plugin-plugin/target/invoker-reports/BUILD-skip.xml, /home/jenkins/jenkins-slave/workspace/x_maven-plugin-tools_master-XKS4EHY3PSXHGP4DHIXUDAAM6TMAKT3YNFP2XDSSXFM24ZMKWIXQ/m/maven-plugin-plugin/target/invoker-reports/BUILD-source-encoding.xml]
[linux-jdk9] Found logs:[/home/jenkins/jenkins-slave/workspace/x_maven-plugin-tools_master-XKS4EHY3PSXHGP4DHIXUDAAM6TMAKT3YNFP2XDSSXFM24ZMKWIXQ/m/maven-plugin-plugin/target/it/annotation-with-inheritance-from-deps/build.log, /home/jenkins/jenkins-slave/workspace/x_maven-plugin-tools_master-XKS4EHY3PSXHGP4DHIXUDAAM6TMAKT3YNFP2XDSSXFM24ZMKWIXQ/m/maven-plugin-plugin/target/it/annotation-with-inheritance-reactor/build.log, /home/jenkins/jenkins-slave/workspace/x_maven-plugin-tools_master-XKS4EHY3PSXHGP4DHIXUDAAM6TMAKT3YNFP2XDSSXFM24ZMKWIXQ/m/maven-plugin-plugin/target/it/annotation-with-inheritance/build.log, /home/jenkins/jenkins-slave/workspace/x_maven-plugin-tools_master-XKS4EHY3PSXHGP4DHIXUDAAM6TMAKT3YNFP2XDSSXFM24ZMKWIXQ/m/maven-plugin-plugin/target/it/ant-basic/build.log, /home/jenkins/jenkins-slave/workspace/x_maven-plugin-tools_master-XKS4EHY3PSXHGP4DHIXUDAAM6TMAKT3YNFP2XDSSXFM24ZMKWIXQ/m/maven-plugin-plugin/target/it/ant-reference-parameter/build.log, /home/jenkins/jenkins-slave/workspace/x_maven-plugin-tools_master-XKS4EHY3PSXHGP4DHIXUDAAM6TMAKT3YNFP2XDSSXFM24ZMKWIXQ/m/maven-plugin-plugin/target/it/ant-simple-usage/build.log, /home/jenkins/jenkins-slave/workspace/x_maven-plugin-tools_master-XKS4EHY3PSXHGP4DHIXUDAAM6TMAKT3YNFP2XDSSXFM24ZMKWIXQ/m/maven-plugin-plugin/target/it/ant-since-maven-plugin/build.log, /home/jenkins/jenkins-slave/workspace/x_maven-plugin-tools_master-XKS4EHY3PSXHGP4DHIXUDAAM6TMAKT3YNFP2XDSSXFM24ZMKWIXQ/m/maven-plugin-plugin/target/it/asm-failure/build.log, /home/jenkins/jenkins-slave/workspace/x_maven-plugin-tools_master-XKS4EHY3PSXHGP4DHIXUDAAM6TMAKT3YNFP2XDSSXFM24ZMKWIXQ/m/maven-plugin-plugin/target/it/beanshell-simple/build.log, /home/jenkins/jenkins-slave/workspace/x_maven-plugin-tools_master-XKS4EHY3PSXHGP4DHIXUDAAM6TMAKT3YNFP2XDSSXFM24ZMKWIXQ/m/maven-plugin-plugin/target/it/fix-maven-since-3.x/build.log, /home/jenkins/jenkins-slave/workspace/x_maven-plugin-tools_master-XKS4EHY3PSXHGP4DHIXUDAAM6TMAKT3YNFP2XDSSXFM24ZMKWIXQ/m/maven-plugin-plugin/target/it/help-basic/build.log, /home/jenkins/jenkins-slave/workspace/x_maven-plugin-tools_master-XKS4EHY3PSXHGP4DHIXUDAAM6TMAKT3YNFP2XDSSXFM24ZMKWIXQ/m/maven-plugin-plugin/target/it/help-package/build.log, /home/jenkins/jenkins-slave/workspace/x_maven-plugin-tools_master-XKS4EHY3PSXHGP4DHIXUDAAM6TMAKT3YNFP2XDSSXFM24ZMKWIXQ/m/maven-plugin-plugin/target/it/ignore-plugin-class-realm/build.log, /home/jenkins/jenkins-slave/workspace/x_maven-plugin-tools_master-XKS4EHY3PSXHGP4DHIXUDAAM6TMAKT3YNFP2XDSSXFM24ZMKWIXQ/m/maven-plugin-plugin/target/it/java-basic-annotations-jdk8/build.log, /home/jenkins/jenkins-slave/workspace/x_maven-plugin-tools_master-XKS4EHY3PSXHGP4DHIXUDAAM6TMAKT3YNFP2XDSSXFM24ZMKWIXQ/m/maven-plugin-plugin/target/it/java-basic-annotations/build.log, /home/jenkins/jenkins-slave/workspace/x_maven-plugin-tools_master-XKS4EHY3PSXHGP4DHIXUDAAM6TMAKT3YNFP2XDSSXFM24ZMKWIXQ/m/maven-plugin-plugin/target/it/java-basic/build.log, /home/jenkins/jenkins-slave/workspace/x_maven-plugin-tools_master-XKS4EHY3PSXHGP4DHIXUDAAM6TMAKT3YNFP2XDSSXFM24ZMKWIXQ/m/maven-plugin-plugin/target/it/mplugin-187/build.log, /home/jenkins/jenkins-slave/workspace/x_maven-plugin-tools_master-XKS4EHY3PSXHGP4DHIXUDAAM6TMAKT3YNFP2XDSSXFM24ZMKWIXQ/m/maven-plugin-plugin/target/it/mplugin-191/build.log, /home/jenkins/jenkins-slave/workspace/x_maven-plugin-tools_master-XKS4EHY3PSXHGP4DHIXUDAAM6TMAKT3YNFP2XDSSXFM24ZMKWIXQ/m/maven-plugin-plugin/target/it/mplugin-223/build.log, /home/jenkins/jenkins-slave/workspace/x_maven-plugin-tools_master-XKS4EHY3PSXHGP4DHIXUDAAM6TMAKT3YNFP2XDSSXFM24ZMKWIXQ/m/maven-plugin-plugin/target/it/mplugin-272_java8/build.log, /home/jenkins/jenkins-slave/workspace/x_maven-plugin-tools_master-XKS4EHY3PSXHGP4DHIXUDAAM6TMAKT3YNFP2XDSSXFM24ZMKWIXQ/m/maven-plugin-plugin/target/it/mplugin-299_no-configuration/build.log, /home/jenkins/jenkins-slave/workspace/x_maven-plugin-tools_master-XKS4EHY3PSXHGP4DHIXUDAAM6TMAKT3YNFP2XDSSXFM24ZMKWIXQ/m/maven-plugin-plugin/target/it/mplugin-305_defaultMojoDependencies/build.log, /home/jenkins/jenkins-slave/workspace/x_maven-plugin-tools_master-XKS4EHY3PSXHGP4DHIXUDAAM6TMAKT3YNFP2XDSSXFM24ZMKWIXQ/m/maven-plugin-plugin/target/it/mplugin-305_emptyMojoDependencies/build.log, /home/jenkins/jenkins-slave/workspace/x_maven-plugin-tools_master-XKS4EHY3PSXHGP4DHIXUDAAM6TMAKT3YNFP2XDSSXFM24ZMKWIXQ/m/maven-plugin-plugin/target/it/mplugin-305_singleMojoDependencies/build.log, /home/jenkins/jenkins-slave/workspace/x_maven-plugin-tools_master-XKS4EHY3PSXHGP4DHIXUDAAM6TMAKT3YNFP2XDSSXFM24ZMKWIXQ/m/maven-plugin-plugin/target/it/mplugin-319_report-since/build.log, /home/jenkins/jenkins-slave/workspace/x_maven-plugin-tools_master-XKS4EHY3PSXHGP4DHIXUDAAM6TMAKT3YNFP2XDSSXFM24ZMKWIXQ/m/maven-plugin-plugin/target/it/mplugin-324_javadoc/build.log, /home/jenkins/jenkins-slave/workspace/x_maven-plugin-tools_master-XKS4EHY3PSXHGP4DHIXUDAAM6TMAKT3YNFP2XDSSXFM24ZMKWIXQ/m/maven-plugin-plugin/target/it/packaging-jar/build.log, /home/jenkins/jenkins-slave/workspace/x_maven-plugin-tools_master-XKS4EHY3PSXHGP4DHIXUDAAM6TMAKT3YNFP2XDSSXFM24ZMKWIXQ/m/maven-plugin-plugin/target/it/plugin-info-jdk-default-version/build.log, /home/jenkins/jenkins-slave/workspace/x_maven-plugin-tools_master-XKS4EHY3PSXHGP4DHIXUDAAM6TMAKT3YNFP2XDSSXFM24ZMKWIXQ/m/maven-plugin-plugin/target/it/plugin-info-jdk/build.log, /home/jenkins/jenkins-slave/workspace/x_maven-plugin-tools_master-XKS4EHY3PSXHGP4DHIXUDAAM6TMAKT3YNFP2XDSSXFM24ZMKWIXQ/m/maven-plugin-plugin/target/it/plugin-report-annotations/build.log, /home/jenkins/jenkins-slave/workspace/x_maven-plugin-tools_master-XKS4EHY3PSXHGP4DHIXUDAAM6TMAKT3YNFP2XDSSXFM24ZMKWIXQ/m/maven-plugin-plugin/target/it/plugin-report/build.log, /home/jenkins/jenkins-slave/workspace/x_maven-plugin-tools_master-XKS4EHY3PSXHGP4DHIXUDAAM6TMAKT3YNFP2XDSSXFM24ZMKWIXQ/m/maven-plugin-plugin/target/it/skip/build.log, /home/jenkins/jenkins-slave/workspace/x_maven-plugin-tools_master-XKS4EHY3PSXHGP4DHIXUDAAM6TMAKT3YNFP2XDSSXFM24ZMKWIXQ/m/maven-plugin-plugin/target/it/source-encoding/build.log]
[linux-jdk9] Finished parsing Maven Invoker results (found 33)
[linux-jdk9] [withMaven] junitPublisher - Archive test results for Maven artifact org.apache.maven.plugin-tools:maven-plugin-tools-api:3.6-SNAPSHOT generated by maven-surefire-plugin:test (default-test): m/maven-plugin-tools-api/target/surefire-reports/*.xml
[linux-jdk9] Recording test results
[linux-jdk9] [withMaven] junitPublisher - Archive test results for Maven artifact org.apache.maven.plugin-tools:maven-plugin-tools-generators:3.6-SNAPSHOT generated by maven-surefire-plugin:test (default-test): m/maven-plugin-tools-generators/target/surefire-reports/*.xml
[linux-jdk9] Recording test results
[linux-jdk9] [withMaven] junitPublisher - Archive test results for Maven artifact org.apache.maven.plugin-tools:maven-plugin-tools-java:3.6-SNAPSHOT generated by maven-surefire-plugin:test (default-test): m/maven-plugin-tools-java/target/surefire-reports/*.xml
[linux-jdk9] Recording test results
[linux-jdk9] [withMaven] junitPublisher - Archive test results for Maven artifact org.apache.maven.plugin-tools:maven-plugin-annotations:3.6-SNAPSHOT generated by maven-surefire-plugin:test (default-test): m/maven-plugin-annotations/target/surefire-reports/*.xml
[linux-jdk9] Recording test results
[linux-jdk9] None of the test reports contained any result
[linux-jdk9] [withMaven] junitPublisher - Archive test results for Maven artifact org.apache.maven.plugin-tools:maven-plugin-tools-annotations:3.6-SNAPSHOT generated by maven-surefire-plugin:test (default-test): m/maven-plugin-tools-annotations/target/surefire-reports/*.xml
[linux-jdk9] Recording test results
[linux-jdk9] [withMaven] junitPublisher - Archive test results for Maven artifact org.apache.maven.plugin-tools:maven-plugin-tools-javadoc:3.6-SNAPSHOT generated by maven-surefire-plugin:test (default-test): m/maven-plugin-tools-javadoc/target/surefire-reports/*.xml
[linux-jdk9] Recording test results
[linux-jdk9] None of the test reports contained any result
[linux-jdk9] [withMaven] junitPublisher - Archive test results for Maven artifact org.apache.maven.plugin-tools:maven-plugin-tools-model:3.6-SNAPSHOT generated by maven-surefire-plugin:test (default-test): m/maven-script/maven-plugin-tools-model/target/surefire-reports/*.xml
[linux-jdk9] Recording test results
[linux-jdk9] [withMaven] junitPublisher - Archive test results for Maven artifact org.apache.maven.plugin-tools:maven-plugin-tools-ant:3.6-SNAPSHOT generated by maven-surefire-plugin:test (default-test): m/maven-script/maven-plugin-tools-ant/target/surefire-reports/*.xml
[linux-jdk9] Recording test results
[linux-jdk9] [withMaven] junitPublisher - Archive test results for Maven artifact org.apache.maven.plugin-tools:maven-script-ant:3.6-SNAPSHOT generated by maven-surefire-plugin:test (default-test): m/maven-script/maven-script-ant/target/surefire-reports/*.xml
[linux-jdk9] Recording test results
[linux-jdk9] [withMaven] junitPublisher - Archive test results for Maven artifact org.apache.maven.plugin-tools:maven-plugin-tools-beanshell:3.6-SNAPSHOT generated by maven-surefire-plugin:test (default-test): m/maven-script/maven-plugin-tools-beanshell/target/surefire-reports/*.xml
[linux-jdk9] Recording test results
[linux-jdk9] None of the test reports contained any result
[linux-jdk9] [withMaven] junitPublisher - Archive test results for Maven artifact org.apache.maven.plugin-tools:maven-script-beanshell:3.6-SNAPSHOT generated by maven-surefire-plugin:test (default-test): m/maven-script/maven-script-beanshell/target/surefire-reports/*.xml
[linux-jdk9] Recording test results
[linux-jdk9] None of the test reports contained any result
[linux-jdk9] [withMaven] junitPublisher - Archive test results for Maven artifact org.apache.maven.plugins:maven-plugin-plugin:3.6-SNAPSHOT generated by maven-surefire-plugin:test (default-test): m/maven-plugin-plugin/target/surefire-reports/*.xml
[linux-jdk9] Recording test results
[linux-jdk9] None of the test reports contained any result
[Pipeline] [linux-jdk9] // withMaven
[Pipeline] [linux-jdk9] cleanWs
[linux-jdk9] [WS-CLEANUP] Deleting project workspace...[WS-CLEANUP] done
[Pipeline] [linux-jdk9] }
[Pipeline] [linux-jdk9] // stage
[Pipeline] [linux-jdk9] }
[Pipeline] [linux-jdk9] // node
[Pipeline] [linux-jdk9] }
[Pipeline] // parallel
[Pipeline] stage
[Pipeline] { (Notifications)
[Pipeline] echo
Build result: FAILURE
[Pipeline] jiraIssueSelector
[Pipeline] emailext
Reply | Threaded
Open this post in threaded view
|

Build failed in Jenkins: Maven TLP » maven-plugin-tools » master #43

Apache Jenkins Server-2
See https://builds.apache.org/job/maven-box/job/maven-plugin-tools/job/master/43/

No changes.

All tests passed

Build log:
[...truncated 2.95 MB...]
[Pipeline] [linux-jdk8] // node
[Pipeline] [linux-jdk8] }
[windows-jdk9] [INFO] run post-build script verify.groovy
[windows-jdk9] [INFO]           plugin-info-jdk\pom.xml .......................... SUCCESS (12.7 s)
[windows-jdk9] [INFO] Building: plugin-info-jdk-default-version\pom.xml
[windows-jdk9] [INFO] run post-build script verify.groovy
[windows-jdk9] [INFO]           plugin-info-jdk-default-version\pom.xml .......... SUCCESS (7.3 s)
[windows-jdk9] [INFO] Building: plugin-report\pom.xml
[windows-jdk8] [INFO] run post-build script verify.groovy
[windows-jdk8] [INFO]           java-basic-annotations\pom.xml ................... SUCCESS (19.5 s)
[windows-jdk8] [INFO] Building: java-basic-annotations-jdk8\pom.xml
[windows-jdk9] [INFO] run post-build script verify.bsh
[windows-jdk9] [INFO]           plugin-report\pom.xml ............................ SUCCESS (20.8 s)
[windows-jdk9] [INFO] Building: plugin-report-annotations\pom.xml
[windows-jdk8] [INFO] run post-build script verify.groovy
[windows-jdk8] [INFO]           java-basic-annotations-jdk8\pom.xml .............. SUCCESS (20.0 s)
[windows-jdk8] [INFO] Building: mplugin-187\pom.xml
[windows-jdk8] [INFO]           mplugin-187\pom.xml .............................. SUCCESS (5.6 s)
[windows-jdk8] [INFO] Building: mplugin-191\pom.xml
[windows-jdk9] [INFO] run post-build script verify.bsh
[windows-jdk9] [INFO]           plugin-report-annotations\pom.xml ................ SUCCESS (11.9 s)
[windows-jdk9] [INFO] Building: skip\pom.xml
[windows-jdk9] [INFO] run post-build script verify.groovy
[windows-jdk9] [INFO]           skip\pom.xml ..................................... SUCCESS (6.5 s)
[windows-jdk9] [INFO] Building: source-encoding\pom.xml
[windows-jdk8] [INFO] run post-build script verify.groovy
[windows-jdk8] [INFO]           mplugin-191\pom.xml .............................. SUCCESS (9.5 s)
[windows-jdk8] [INFO] Building: mplugin-223\pom.xml
[windows-jdk9] [INFO] run post-build script verify.groovy
[windows-jdk9] [INFO]           source-encoding\pom.xml .......................... SUCCESS (6.7 s)
[windows-jdk9] [INFO] -------------------------------------------------
[windows-jdk9] [INFO] Build Summary:
[windows-jdk9] [INFO]   Passed: 32, Failed: 1, Errors: 0, Skipped: 0
[windows-jdk9] [INFO] -------------------------------------------------
[windows-jdk9] [WARNING] The following builds failed:
[windows-jdk9] [WARNING] *  asm-failure\pom.xml
[windows-jdk9] [INFO] -------------------------------------------------
[windows-jdk9] [WARNING] Ignoring that 1 build failed.
[windows-jdk9] [INFO]
[windows-jdk9] [INFO] --- maven-checkstyle-plugin:3.0.0:check (checkstyle-check) @ maven-plugin-plugin ---
[windows-jdk9] [INFO] ------------------------------------------------------------------------
[windows-jdk9] [INFO] Reactor Summary:
[windows-jdk9] [INFO]
[windows-jdk9] [INFO] Maven Plugin Tools ................................. SUCCESS [ 14.385 s]
[windows-jdk9] [INFO] Maven Plugin Tools Extractor API ................... SUCCESS [ 10.078 s]
[windows-jdk9] [INFO] Maven Plugin Tools Generators ...................... SUCCESS [  5.276 s]
[windows-jdk9] [INFO] Maven Plugin Tool for Java with Javadoc Tags ....... SUCCESS [  5.059 s]
[windows-jdk9] [INFO] Maven Plugin Tools Java 5 Annotations .............. SUCCESS [  1.038 s]
[windows-jdk9] [INFO] Maven Plugin Tool for Java with Annotations ........ SUCCESS [  3.736 s]
[windows-jdk9] [INFO] Maven Plugin Tools Javadoc Taglets ................. SUCCESS [ 14.311 s]
[windows-jdk9] [INFO] Maven Script Mojo Support .......................... SUCCESS [  0.499 s]
[windows-jdk9] [INFO] Maven Plugin Metadata Model ........................ SUCCESS [  5.383 s]
[windows-jdk9] [INFO] Maven Plugin Tool for Ant .......................... SUCCESS [  1.994 s]
[windows-jdk9] [INFO] Maven Ant Mojo Support ............................. SUCCESS [  4.051 s]
[windows-jdk9] [INFO] Maven Plugin Tool for Beanshell .................... SUCCESS [  1.119 s]
[windows-jdk9] [INFO] Maven Beanshell Mojo Support ....................... SUCCESS [  0.775 s]
[windows-jdk9] [INFO] Maven Plugin Plugin ................................ SUCCESS [06:12 min]
[windows-jdk9] [INFO] ------------------------------------------------------------------------
[windows-jdk9] [INFO] BUILD SUCCESS
[windows-jdk9] [INFO] ------------------------------------------------------------------------
[windows-jdk9] [INFO] Total time: 07:21 min
[windows-jdk9] [INFO] Finished at: 2018-09-14T16:22:19Z
[windows-jdk9] [INFO] Final Memory: 62M/206M
[windows-jdk9] [INFO] ------------------------------------------------------------------------
[windows-jdk9] [INFO] [jenkins-event-spy] Generated F:\jenkins\jenkins-slave\workspace\x_maven-plugin-tools_master-XKS4EHY3PSXHGP4DHIXUDAAM6TMAKT3YNFP2XDSSXFM24ZMKWIXQ@2@tmp\withMavena178da6e\maven-spy-20180914-161457-302446152126654599996.log
[Pipeline] [windows-jdk9] }
[Pipeline] [windows-jdk9] // dir
[windows-jdk8] [INFO] run post-build script verify.groovy
[windows-jdk8] [INFO]           mplugin-223\pom.xml .............................. SUCCESS (8.8 s)
[windows-jdk8] [INFO] Building: mplugin-272_java8\pom.xml
[Pipeline] [windows-jdk9] }
[windows-jdk9] [withMaven] invokerPublisher - Archive invoker results for Maven artifact MavenArtifact{org.apache.maven.plugin-tools:maven-plugin-tools-javadoc::3.6-SNAPSHOT(version: 3.6-SNAPSHOT, snapshot:false) } generated by PluginInvocation{org.apache.maven.plugins:maven-invoker-plugin:3.0.1@run  integration-test}: m\maven-plugin-tools-javadoc\target\invoker-reports\*.xml
[windows-jdk9] performing MavenInvokerRecorder, reportsFilenamePattern:'**/m\maven-plugin-tools-javadoc\target\invoker-reports/BUILD*.xml', invokerBuildDir:'**/m\maven-plugin-tools-javadoc\target\it'
[windows-jdk9] Found reports:[f:\jenkins\jenkins-slave\workspace\x_maven-plugin-tools_master-XKS4EHY3PSXHGP4DHIXUDAAM6TMAKT3YNFP2XDSSXFM24ZMKWIXQ@2\m\maven-plugin-tools-javadoc\target\invoker-reports\BUILD-basic.xml]
[windows-jdk9] Found logs:[f:\jenkins\jenkins-slave\workspace\x_maven-plugin-tools_master-XKS4EHY3PSXHGP4DHIXUDAAM6TMAKT3YNFP2XDSSXFM24ZMKWIXQ@2\m\maven-plugin-tools-javadoc\target\it\basic\build.log]
[windows-jdk9] Finished parsing Maven Invoker results (found 1)
[windows-jdk9] [withMaven] invokerPublisher - Archive invoker results for Maven artifact MavenArtifact{org.apache.maven.plugins:maven-plugin-plugin::3.6-SNAPSHOT(version: 3.6-SNAPSHOT, snapshot:false) } generated by PluginInvocation{org.apache.maven.plugins:maven-invoker-plugin:3.0.1@run  integration-test}: m\maven-plugin-plugin\target\invoker-reports\*.xml
[windows-jdk9] performing MavenInvokerRecorder, reportsFilenamePattern:'**/m\maven-plugin-plugin\target\invoker-reports/BUILD*.xml', invokerBuildDir:'**/m\maven-plugin-plugin\target\it'
[windows-jdk9] Found reports:[f:\jenkins\jenkins-slave\workspace\x_maven-plugin-tools_master-XKS4EHY3PSXHGP4DHIXUDAAM6TMAKT3YNFP2XDSSXFM24ZMKWIXQ@2\m\maven-plugin-plugin\target\invoker-reports\BUILD-annotation-with-inheritance-from-deps.xml, f:\jenkins\jenkins-slave\workspace\x_maven-plugin-tools_master-XKS4EHY3PSXHGP4DHIXUDAAM6TMAKT3YNFP2XDSSXFM24ZMKWIXQ@2\m\maven-plugin-plugin\target\invoker-reports\BUILD-annotation-with-inheritance-reactor.xml, f:\jenkins\jenkins-slave\workspace\x_maven-plugin-tools_master-XKS4EHY3PSXHGP4DHIXUDAAM6TMAKT3YNFP2XDSSXFM24ZMKWIXQ@2\m\maven-plugin-plugin\target\invoker-reports\BUILD-annotation-with-inheritance.xml, f:\jenkins\jenkins-slave\workspace\x_maven-plugin-tools_master-XKS4EHY3PSXHGP4DHIXUDAAM6TMAKT3YNFP2XDSSXFM24ZMKWIXQ@2\m\maven-plugin-plugin\target\invoker-reports\BUILD-ant-basic.xml, f:\jenkins\jenkins-slave\workspace\x_maven-plugin-tools_master-XKS4EHY3PSXHGP4DHIXUDAAM6TMAKT3YNFP2XDSSXFM24ZMKWIXQ@2\m\maven-plugin-plugin\target\invoker-reports\BUILD-ant-reference-parameter.xml, f:\jenkins\jenkins-slave\workspace\x_maven-plugin-tools_master-XKS4EHY3PSXHGP4DHIXUDAAM6TMAKT3YNFP2XDSSXFM24ZMKWIXQ@2\m\maven-plugin-plugin\target\invoker-reports\BUILD-ant-simple-usage.xml, f:\jenkins\jenkins-slave\workspace\x_maven-plugin-tools_master-XKS4EHY3PSXHGP4DHIXUDAAM6TMAKT3YNFP2XDSSXFM24ZMKWIXQ@2\m\maven-plugin-plugin\target\invoker-reports\BUILD-ant-since-maven-plugin.xml, f:\jenkins\jenkins-slave\workspace\x_maven-plugin-tools_master-XKS4EHY3PSXHGP4DHIXUDAAM6TMAKT3YNFP2XDSSXFM24ZMKWIXQ@2\m\maven-plugin-plugin\target\invoker-reports\BUILD-asm-failure.xml, f:\jenkins\jenkins-slave\workspace\x_maven-plugin-tools_master-XKS4EHY3PSXHGP4DHIXUDAAM6TMAKT3YNFP2XDSSXFM24ZMKWIXQ@2\m\maven-plugin-plugin\target\invoker-reports\BUILD-beanshell-simple.xml, f:\jenkins\jenkins-slave\workspace\x_maven-plugin-tools_master-XKS4EHY3PSXHGP4DHIXUDAAM6TMAKT3YNFP2XDSSXFM24ZMKWIXQ@2\m\maven-plugin-plugin\target\invoker-reports\BUILD-fix-maven-since-3.x.xml, f:\jenkins\jenkins-slave\workspace\x_maven-plugin-tools_master-XKS4EHY3PSXHGP4DHIXUDAAM6TMAKT3YNFP2XDSSXFM24ZMKWIXQ@2\m\maven-plugin-plugin\target\invoker-reports\BUILD-help-basic.xml, f:\jenkins\jenkins-slave\workspace\x_maven-plugin-tools_master-XKS4EHY3PSXHGP4DHIXUDAAM6TMAKT3YNFP2XDSSXFM24ZMKWIXQ@2\m\maven-plugin-plugin\target\invoker-reports\BUILD-help-package.xml, f:\jenkins\jenkins-slave\workspace\x_maven-plugin-tools_master-XKS4EHY3PSXHGP4DHIXUDAAM6TMAKT3YNFP2XDSSXFM24ZMKWIXQ@2\m\maven-plugin-plugin\target\invoker-reports\BUILD-ignore-plugin-class-realm.xml, f:\jenkins\jenkins-slave\workspace\x_maven-plugin-tools_master-XKS4EHY3PSXHGP4DHIXUDAAM6TMAKT3YNFP2XDSSXFM24ZMKWIXQ@2\m\maven-plugin-plugin\target\invoker-reports\BUILD-java-basic-annotations-jdk8.xml, f:\jenkins\jenkins-slave\workspace\x_maven-plugin-tools_master-XKS4EHY3PSXHGP4DHIXUDAAM6TMAKT3YNFP2XDSSXFM24ZMKWIXQ@2\m\maven-plugin-plugin\target\invoker-reports\BUILD-java-basic-annotations.xml, f:\jenkins\jenkins-slave\workspace\x_maven-plugin-tools_master-XKS4EHY3PSXHGP4DHIXUDAAM6TMAKT3YNFP2XDSSXFM24ZMKWIXQ@2\m\maven-plugin-plugin\target\invoker-reports\BUILD-java-basic.xml, f:\jenkins\jenkins-slave\workspace\x_maven-plugin-tools_master-XKS4EHY3PSXHGP4DHIXUDAAM6TMAKT3YNFP2XDSSXFM24ZMKWIXQ@2\m\maven-plugin-plugin\target\invoker-reports\BUILD-mplugin-187.xml, f:\jenkins\jenkins-slave\workspace\x_maven-plugin-tools_master-XKS4EHY3PSXHGP4DHIXUDAAM6TMAKT3YNFP2XDSSXFM24ZMKWIXQ@2\m\maven-plugin-plugin\target\invoker-reports\BUILD-mplugin-191.xml, f:\jenkins\jenkins-slave\workspace\x_maven-plugin-tools_master-XKS4EHY3PSXHGP4DHIXUDAAM6TMAKT3YNFP2XDSSXFM24ZMKWIXQ@2\m\maven-plugin-plugin\target\invoker-reports\BUILD-mplugin-223.xml, f:\jenkins\jenkins-slave\workspace\x_maven-plugin-tools_master-XKS4EHY3PSXHGP4DHIXUDAAM6TMAKT3YNFP2XDSSXFM24ZMKWIXQ@2\m\maven-plugin-plugin\target\invoker-reports\BUILD-mplugin-272_java8.xml, f:\jenkins\jenkins-slave\workspace\x_maven-plugin-tools_master-XKS4EHY3PSXHGP4DHIXUDAAM6TMAKT3YNFP2XDSSXFM24ZMKWIXQ@2\m\maven-plugin-plugin\target\invoker-reports\BUILD-mplugin-299_no-configuration.xml, f:\jenkins\jenkins-slave\workspace\x_maven-plugin-tools_master-XKS4EHY3PSXHGP4DHIXUDAAM6TMAKT3YNFP2XDSSXFM24ZMKWIXQ@2\m\maven-plugin-plugin\target\invoker-reports\BUILD-mplugin-305_defaultMojoDependencies.xml, f:\jenkins\jenkins-slave\workspace\x_maven-plugin-tools_master-XKS4EHY3PSXHGP4DHIXUDAAM6TMAKT3YNFP2XDSSXFM24ZMKWIXQ@2\m\maven-plugin-plugin\target\invoker-reports\BUILD-mplugin-305_emptyMojoDependencies.xml, f:\jenkins\jenkins-slave\workspace\x_maven-plugin-tools_master-XKS4EHY3PSXHGP4DHIXUDAAM6TMAKT3YNFP2XDSSXFM24ZMKWIXQ@2\m\maven-plugin-plugin\target\invoker-reports\BUILD-mplugin-305_singleMojoDependencies.xml, f:\jenkins\jenkins-slave\workspace\x_maven-plugin-tools_master-XKS4EHY3PSXHGP4DHIXUDAAM6TMAKT3YNFP2XDSSXFM24ZMKWIXQ@2\m\maven-plugin-plugin\target\invoker-reports\BUILD-mplugin-319_report-since.xml, f:\jenkins\jenkins-slave\workspace\x_maven-plugin-tools_master-XKS4EHY3PSXHGP4DHIXUDAAM6TMAKT3YNFP2XDSSXFM24ZMKWIXQ@2\m\maven-plugin-plugin\target\invoker-reports\BUILD-mplugin-324_javadoc.xml, f:\jenkins\jenkins-slave\workspace\x_maven-plugin-tools_master-XKS4EHY3PSXHGP4DHIXUDAAM6TMAKT3YNFP2XDSSXFM24ZMKWIXQ@2\m\maven-plugin-plugin\target\invoker-reports\BUILD-packaging-jar.xml, f:\jenkins\jenkins-slave\workspace\x_maven-plugin-tools_master-XKS4EHY3PSXHGP4DHIXUDAAM6TMAKT3YNFP2XDSSXFM24ZMKWIXQ@2\m\maven-plugin-plugin\target\invoker-reports\BUILD-plugin-info-jdk-default-version.xml, f:\jenkins\jenkins-slave\workspace\x_maven-plugin-tools_master-XKS4EHY3PSXHGP4DHIXUDAAM6TMAKT3YNFP2XDSSXFM24ZMKWIXQ@2\m\maven-plugin-plugin\target\invoker-reports\BUILD-plugin-info-jdk.xml, f:\jenkins\jenkins-slave\workspace\x_maven-plugin-tools_master-XKS4EHY3PSXHGP4DHIXUDAAM6TMAKT3YNFP2XDSSXFM24ZMKWIXQ@2\m\maven-plugin-plugin\target\invoker-reports\BUILD-plugin-report-annotations.xml, f:\jenkins\jenkins-slave\workspace\x_maven-plugin-tools_master-XKS4EHY3PSXHGP4DHIXUDAAM6TMAKT3YNFP2XDSSXFM24ZMKWIXQ@2\m\maven-plugin-plugin\target\invoker-reports\BUILD-plugin-report.xml, f:\jenkins\jenkins-slave\workspace\x_maven-plugin-tools_master-XKS4EHY3PSXHGP4DHIXUDAAM6TMAKT3YNFP2XDSSXFM24ZMKWIXQ@2\m\maven-plugin-plugin\target\invoker-reports\BUILD-skip.xml, f:\jenkins\jenkins-slave\workspace\x_maven-plugin-tools_master-XKS4EHY3PSXHGP4DHIXUDAAM6TMAKT3YNFP2XDSSXFM24ZMKWIXQ@2\m\maven-plugin-plugin\target\invoker-reports\BUILD-source-encoding.xml]
[windows-jdk9] Found logs:[f:\jenkins\jenkins-slave\workspace\x_maven-plugin-tools_master-XKS4EHY3PSXHGP4DHIXUDAAM6TMAKT3YNFP2XDSSXFM24ZMKWIXQ@2\m\maven-plugin-plugin\target\it\annotation-with-inheritance-from-deps\build.log, f:\jenkins\jenkins-slave\workspace\x_maven-plugin-tools_master-XKS4EHY3PSXHGP4DHIXUDAAM6TMAKT3YNFP2XDSSXFM24ZMKWIXQ@2\m\maven-plugin-plugin\target\it\annotation-with-inheritance-reactor\build.log, f:\jenkins\jenkins-slave\workspace\x_maven-plugin-tools_master-XKS4EHY3PSXHGP4DHIXUDAAM6TMAKT3YNFP2XDSSXFM24ZMKWIXQ@2\m\maven-plugin-plugin\target\it\annotation-with-inheritance\build.log, f:\jenkins\jenkins-slave\workspace\x_maven-plugin-tools_master-XKS4EHY3PSXHGP4DHIXUDAAM6TMAKT3YNFP2XDSSXFM24ZMKWIXQ@2\m\maven-plugin-plugin\target\it\ant-basic\build.log, f:\jenkins\jenkins-slave\workspace\x_maven-plugin-tools_master-XKS4EHY3PSXHGP4DHIXUDAAM6TMAKT3YNFP2XDSSXFM24ZMKWIXQ@2\m\maven-plugin-plugin\target\it\ant-reference-parameter\build.log, f:\jenkins\jenkins-slave\workspace\x_maven-plugin-tools_master-XKS4EHY3PSXHGP4DHIXUDAAM6TMAKT3YNFP2XDSSXFM24ZMKWIXQ@2\m\maven-plugin-plugin\target\it\ant-simple-usage\build.log, f:\jenkins\jenkins-slave\workspace\x_maven-plugin-tools_master-XKS4EHY3PSXHGP4DHIXUDAAM6TMAKT3YNFP2XDSSXFM24ZMKWIXQ@2\m\maven-plugin-plugin\target\it\ant-since-maven-plugin\build.log, f:\jenkins\jenkins-slave\workspace\x_maven-plugin-tools_master-XKS4EHY3PSXHGP4DHIXUDAAM6TMAKT3YNFP2XDSSXFM24ZMKWIXQ@2\m\maven-plugin-plugin\target\it\asm-failure\build.log, f:\jenkins\jenkins-slave\workspace\x_maven-plugin-tools_master-XKS4EHY3PSXHGP4DHIXUDAAM6TMAKT3YNFP2XDSSXFM24ZMKWIXQ@2\m\maven-plugin-plugin\target\it\beanshell-simple\build.log, f:\jenkins\jenkins-slave\workspace\x_maven-plugin-tools_master-XKS4EHY3PSXHGP4DHIXUDAAM6TMAKT3YNFP2XDSSXFM24ZMKWIXQ@2\m\maven-plugin-plugin\target\it\fix-maven-since-3.x\build.log, f:\jenkins\jenkins-slave\workspace\x_maven-plugin-tools_master-XKS4EHY3PSXHGP4DHIXUDAAM6TMAKT3YNFP2XDSSXFM24ZMKWIXQ@2\m\maven-plugin-plugin\target\it\help-basic\build.log, f:\jenkins\jenkins-slave\workspace\x_maven-plugin-tools_master-XKS4EHY3PSXHGP4DHIXUDAAM6TMAKT3YNFP2XDSSXFM24ZMKWIXQ@2\m\maven-plugin-plugin\target\it\help-package\build.log, f:\jenkins\jenkins-slave\workspace\x_maven-plugin-tools_master-XKS4EHY3PSXHGP4DHIXUDAAM6TMAKT3YNFP2XDSSXFM24ZMKWIXQ@2\m\maven-plugin-plugin\target\it\ignore-plugin-class-realm\build.log, f:\jenkins\jenkins-slave\workspace\x_maven-plugin-tools_master-XKS4EHY3PSXHGP4DHIXUDAAM6TMAKT3YNFP2XDSSXFM24ZMKWIXQ@2\m\maven-plugin-plugin\target\it\java-basic-annotations-jdk8\build.log, f:\jenkins\jenkins-slave\workspace\x_maven-plugin-tools_master-XKS4EHY3PSXHGP4DHIXUDAAM6TMAKT3YNFP2XDSSXFM24ZMKWIXQ@2\m\maven-plugin-plugin\target\it\java-basic-annotations\build.log, f:\jenkins\jenkins-slave\workspace\x_maven-plugin-tools_master-XKS4EHY3PSXHGP4DHIXUDAAM6TMAKT3YNFP2XDSSXFM24ZMKWIXQ@2\m\maven-plugin-plugin\target\it\java-basic\build.log, f:\jenkins\jenkins-slave\workspace\x_maven-plugin-tools_master-XKS4EHY3PSXHGP4DHIXUDAAM6TMAKT3YNFP2XDSSXFM24ZMKWIXQ@2\m\maven-plugin-plugin\target\it\mplugin-187\build.log, f:\jenkins\jenkins-slave\workspace\x_maven-plugin-tools_master-XKS4EHY3PSXHGP4DHIXUDAAM6TMAKT3YNFP2XDSSXFM24ZMKWIXQ@2\m\maven-plugin-plugin\target\it\mplugin-191\build.log, f:\jenkins\jenkins-slave\workspace\x_maven-plugin-tools_master-XKS4EHY3PSXHGP4DHIXUDAAM6TMAKT3YNFP2XDSSXFM24ZMKWIXQ@2\m\maven-plugin-plugin\target\it\mplugin-223\build.log, f:\jenkins\jenkins-slave\workspace\x_maven-plugin-tools_master-XKS4EHY3PSXHGP4DHIXUDAAM6TMAKT3YNFP2XDSSXFM24ZMKWIXQ@2\m\maven-plugin-plugin\target\it\mplugin-272_java8\build.log, f:\jenkins\jenkins-slave\workspace\x_maven-plugin-tools_master-XKS4EHY3PSXHGP4DHIXUDAAM6TMAKT3YNFP2XDSSXFM24ZMKWIXQ@2\m\maven-plugin-plugin\target\it\mplugin-299_no-configuration\build.log, f:\jenkins\jenkins-slave\workspace\x_maven-plugin-tools_master-XKS4EHY3PSXHGP4DHIXUDAAM6TMAKT3YNFP2XDSSXFM24ZMKWIXQ@2\m\maven-plugin-plugin\target\it\mplugin-305_defaultMojoDependencies\build.log, f:\jenkins\jenkins-slave\workspace\x_maven-plugin-tools_master-XKS4EHY3PSXHGP4DHIXUDAAM6TMAKT3YNFP2XDSSXFM24ZMKWIXQ@2\m\maven-plugin-plugin\target\it\mplugin-305_emptyMojoDependencies\build.log, f:\jenkins\jenkins-slave\workspace\x_maven-plugin-tools_master-XKS4EHY3PSXHGP4DHIXUDAAM6TMAKT3YNFP2XDSSXFM24ZMKWIXQ@2\m\maven-plugin-plugin\target\it\mplugin-305_singleMojoDependencies\build.log, f:\jenkins\jenkins-slave\workspace\x_maven-plugin-tools_master-XKS4EHY3PSXHGP4DHIXUDAAM6TMAKT3YNFP2XDSSXFM24ZMKWIXQ@2\m\maven-plugin-plugin\target\it\mplugin-319_report-since\build.log, f:\jenkins\jenkins-slave\workspace\x_maven-plugin-tools_master-XKS4EHY3PSXHGP4DHIXUDAAM6TMAKT3YNFP2XDSSXFM24ZMKWIXQ@2\m\maven-plugin-plugin\target\it\mplugin-324_javadoc\build.log, f:\jenkins\jenkins-slave\workspace\x_maven-plugin-tools_master-XKS4EHY3PSXHGP4DHIXUDAAM6TMAKT3YNFP2XDSSXFM24ZMKWIXQ@2\m\maven-plugin-plugin\target\it\packaging-jar\build.log, f:\jenkins\jenkins-slave\workspace\x_maven-plugin-tools_master-XKS4EHY3PSXHGP4DHIXUDAAM6TMAKT3YNFP2XDSSXFM24ZMKWIXQ@2\m\maven-plugin-plugin\target\it\plugin-info-jdk-default-version\build.log, f:\jenkins\jenkins-slave\workspace\x_maven-plugin-tools_master-XKS4EHY3PSXHGP4DHIXUDAAM6TMAKT3YNFP2XDSSXFM24ZMKWIXQ@2\m\maven-plugin-plugin\target\it\plugin-info-jdk\build.log, f:\jenkins\jenkins-slave\workspace\x_maven-plugin-tools_master-XKS4EHY3PSXHGP4DHIXUDAAM6TMAKT3YNFP2XDSSXFM24ZMKWIXQ@2\m\maven-plugin-plugin\target\it\plugin-report-annotations\build.log, f:\jenkins\jenkins-slave\workspace\x_maven-plugin-tools_master-XKS4EHY3PSXHGP4DHIXUDAAM6TMAKT3YNFP2XDSSXFM24ZMKWIXQ@2\m\maven-plugin-plugin\target\it\plugin-report\build.log, f:\jenkins\jenkins-slave\workspace\x_maven-plugin-tools_master-XKS4EHY3PSXHGP4DHIXUDAAM6TMAKT3YNFP2XDSSXFM24ZMKWIXQ@2\m\maven-plugin-plugin\target\it\skip\build.log, f:\jenkins\jenkins-slave\workspace\x_maven-plugin-tools_master-XKS4EHY3PSXHGP4DHIXUDAAM6TMAKT3YNFP2XDSSXFM24ZMKWIXQ@2\m\maven-plugin-plugin\target\it\source-encoding\build.log]
[windows-jdk9] Finished parsing Maven Invoker results (found 33)
[windows-jdk9] [withMaven] junitPublisher - Archive test results for Maven artifact org.apache.maven.plugin-tools:maven-plugin-tools-api:3.6-SNAPSHOT generated by maven-surefire-plugin:test (default-test): m\maven-plugin-tools-api\target\surefire-reports\*.xml
[windows-jdk9] Recording test results
[windows-jdk9] [withMaven] junitPublisher - Archive test results for Maven artifact org.apache.maven.plugin-tools:maven-plugin-tools-generators:3.6-SNAPSHOT generated by maven-surefire-plugin:test (default-test): m\maven-plugin-tools-generators\target\surefire-reports\*.xml
[windows-jdk9] Recording test results
[windows-jdk9] [withMaven] junitPublisher - Archive test results for Maven artifact org.apache.maven.plugin-tools:maven-plugin-tools-java:3.6-SNAPSHOT generated by maven-surefire-plugin:test (default-test): m\maven-plugin-tools-java\target\surefire-reports\*.xml
[windows-jdk9] Recording test results
[windows-jdk9] [withMaven] junitPublisher - Archive test results for Maven artifact org.apache.maven.plugin-tools:maven-plugin-annotations:3.6-SNAPSHOT generated by maven-surefire-plugin:test (default-test): m\maven-plugin-annotations\target\surefire-reports\*.xml
[windows-jdk9] Recording test results
[windows-jdk9] None of the test reports contained any result
[windows-jdk9] [withMaven] junitPublisher - Archive test results for Maven artifact org.apache.maven.plugin-tools:maven-plugin-tools-annotations:3.6-SNAPSHOT generated by maven-surefire-plugin:test (default-test): m\maven-plugin-tools-annotations\target\surefire-reports\*.xml
[windows-jdk9] Recording test results
[windows-jdk9] [withMaven] junitPublisher - Archive test results for Maven artifact org.apache.maven.plugin-tools:maven-plugin-tools-javadoc:3.6-SNAPSHOT generated by maven-surefire-plugin:test (default-test): m\maven-plugin-tools-javadoc\target\surefire-reports\*.xml
[windows-jdk9] Recording test results
[windows-jdk9] None of the test reports contained any result
[windows-jdk9] [withMaven] junitPublisher - Archive test results for Maven artifact org.apache.maven.plugin-tools:maven-plugin-tools-model:3.6-SNAPSHOT generated by maven-surefire-plugin:test (default-test): m\maven-script\maven-plugin-tools-model\target\surefire-reports\*.xml
[windows-jdk9] Recording test results
[windows-jdk9] [withMaven] junitPublisher - Archive test results for Maven artifact org.apache.maven.plugin-tools:maven-plugin-tools-ant:3.6-SNAPSHOT generated by maven-surefire-plugin:test (default-test): m\maven-script\maven-plugin-tools-ant\target\surefire-reports\*.xml
[windows-jdk9] Recording test results
[windows-jdk9] [withMaven] junitPublisher - Archive test results for Maven artifact org.apache.maven.plugin-tools:maven-script-ant:3.6-SNAPSHOT generated by maven-surefire-plugin:test (default-test): m\maven-script\maven-script-ant\target\surefire-reports\*.xml
[windows-jdk9] Recording test results
[windows-jdk9] [withMaven] junitPublisher - Archive test results for Maven artifact org.apache.maven.plugin-tools:maven-plugin-tools-beanshell:3.6-SNAPSHOT generated by maven-surefire-plugin:test (default-test): m\maven-script\maven-plugin-tools-beanshell\target\surefire-reports\*.xml
[windows-jdk9] Recording test results
[windows-jdk9] None of the test reports contained any result
[windows-jdk9] [withMaven] junitPublisher - Archive test results for Maven artifact org.apache.maven.plugin-tools:maven-script-beanshell:3.6-SNAPSHOT generated by maven-surefire-plugin:test (default-test): m\maven-script\maven-script-beanshell\target\surefire-reports\*.xml
[windows-jdk9] Recording test results
[windows-jdk9] None of the test reports contained any result
[windows-jdk9] [withMaven] junitPublisher - Archive test results for Maven artifact org.apache.maven.plugins:maven-plugin-plugin:3.6-SNAPSHOT generated by maven-surefire-plugin:test (default-test): m\maven-plugin-plugin\target\surefire-reports\*.xml
[windows-jdk9] Recording test results
[windows-jdk9] None of the test reports contained any result
[Pipeline] [windows-jdk9] // withMaven
[Pipeline] [windows-jdk9] cleanWs
[windows-jdk9] [WS-CLEANUP] Deleting project workspace...[WS-CLEANUP] done
[Pipeline] [windows-jdk9] }
[Pipeline] [windows-jdk9] // stage
[Pipeline] [windows-jdk9] }
[Pipeline] [windows-jdk9] // node
[Pipeline] [windows-jdk9] }
[windows-jdk8] [INFO]           mplugin-272_java8\pom.xml ........................ SUCCESS (12.5 s)
[windows-jdk8] [INFO] Building: mplugin-299_no-configuration\pom.xml
[windows-jdk8] [INFO]           mplugin-299_no-configuration\pom.xml ............. SUCCESS (14.0 s)
[windows-jdk8] [INFO] Building: mplugin-305_defaultMojoDependencies\pom.xml
[windows-jdk8] [INFO] run post-build script verify.groovy
[windows-jdk8] [INFO]           mplugin-305_defaultMojoDependencies\pom.xml ...... SUCCESS (12.2 s)
[windows-jdk8] [INFO] Building: mplugin-305_emptyMojoDependencies\pom.xml
[windows-jdk8] [INFO] run post-build script verify.groovy
[windows-jdk8] [INFO]           mplugin-305_emptyMojoDependencies\pom.xml ........ SUCCESS (8.6 s)
[windows-jdk8] [INFO] Building: mplugin-305_singleMojoDependencies\pom.xml
[windows-jdk8] [INFO] run post-build script verify.groovy
[windows-jdk8] [INFO]           mplugin-305_singleMojoDependencies\pom.xml ....... SUCCESS (9.6 s)
[windows-jdk8] [INFO] Building: mplugin-319_report-since\pom.xml
[windows-jdk8] [INFO] run post-build script verify.groovy
[windows-jdk8] [INFO]           mplugin-319_report-since\pom.xml ................. SUCCESS (9.1 s)
[windows-jdk8] [INFO] Building: mplugin-324_javadoc\pom.xml
[windows-jdk8] [INFO]           mplugin-324_javadoc\pom.xml ...................... SUCCESS (22.2 s)
[windows-jdk8] [INFO] Building: packaging-jar\pom.xml
[windows-jdk8] [INFO] run post-build script verify.groovy
[windows-jdk8] [INFO]           packaging-jar\pom.xml ............................ SUCCESS (9.8 s)
[windows-jdk8] [INFO] Building: plugin-info-jdk\pom.xml
[windows-jdk8] [INFO] run post-build script verify.groovy
[windows-jdk8] [INFO]           plugin-info-jdk\pom.xml .......................... SUCCESS (21.1 s)
[windows-jdk8] [INFO] Building: plugin-info-jdk-default-version\pom.xml
[windows-jdk8] [INFO] run post-build script verify.groovy
[windows-jdk8] [INFO]           plugin-info-jdk-default-version\pom.xml .......... SUCCESS (8.8 s)
[windows-jdk8] [INFO] Building: plugin-report\pom.xml
[windows-jdk8] [INFO] run post-build script verify.bsh
[windows-jdk8] [INFO]           plugin-report\pom.xml ............................ SUCCESS (37.2 s)
[windows-jdk8] [INFO] Building: plugin-report-annotations\pom.xml
[windows-jdk8] [INFO] run post-build script verify.bsh
[windows-jdk8] [INFO]           plugin-report-annotations\pom.xml ................ SUCCESS (11.9 s)
[windows-jdk8] [INFO] Building: skip\pom.xml
[windows-jdk8] [INFO] run post-build script verify.groovy
[windows-jdk8] [INFO]           skip\pom.xml ..................................... SUCCESS (7.3 s)
[windows-jdk8] [INFO] Building: source-encoding\pom.xml
[windows-jdk8] [INFO] run post-build script verify.groovy
[windows-jdk8] [INFO]           source-encoding\pom.xml .......................... SUCCESS (6.7 s)
[windows-jdk8] [INFO] -------------------------------------------------
[windows-jdk8] [INFO] Build Summary:
[windows-jdk8] [INFO]   Passed: 32, Failed: 1, Errors: 0, Skipped: 0
[windows-jdk8] [INFO] -------------------------------------------------
[windows-jdk8] [WARNING] The following builds failed:
[windows-jdk8] [WARNING] *  asm-failure\pom.xml
[windows-jdk8] [INFO] -------------------------------------------------
[windows-jdk8] [WARNING] Ignoring that 1 build failed.
[windows-jdk8] [INFO]
[windows-jdk8] [INFO] --- maven-checkstyle-plugin:3.0.0:check (checkstyle-check) @ maven-plugin-plugin ---
[windows-jdk8] [INFO] ------------------------------------------------------------------------
[windows-jdk8] [INFO] Reactor Summary:
[windows-jdk8] [INFO]
[windows-jdk8] [INFO] Maven Plugin Tools ................................. SUCCESS [ 38.827 s]
[windows-jdk8] [INFO] Maven Plugin Tools Extractor API ................... SUCCESS [ 13.147 s]
[windows-jdk8] [INFO] Maven Plugin Tools Generators ...................... SUCCESS [  7.654 s]
[windows-jdk8] [INFO] Maven Plugin Tool for Java with Javadoc Tags ....... SUCCESS [  6.729 s]
[windows-jdk8] [INFO] Maven Plugin Tools Java 5 Annotations .............. SUCCESS [  1.258 s]
[windows-jdk8] [INFO] Maven Plugin Tool for Java with Annotations ........ SUCCESS [  6.074 s]
[windows-jdk8] [INFO] Maven Plugin Tools Javadoc Taglets ................. SUCCESS [ 26.547 s]
[windows-jdk8] [INFO] Maven Script Mojo Support .......................... SUCCESS [  0.849 s]
[windows-jdk8] [INFO] Maven Plugin Metadata Model ........................ SUCCESS [  7.309 s]
[windows-jdk8] [INFO] Maven Plugin Tool for Ant .......................... SUCCESS [  2.546 s]
[windows-jdk8] [INFO] Maven Ant Mojo Support ............................. SUCCESS [  4.718 s]
[windows-jdk8] [INFO] Maven Plugin Tool for Beanshell .................... SUCCESS [  1.264 s]
[windows-jdk8] [INFO] Maven Beanshell Mojo Support ....................... SUCCESS [  1.273 s]
[windows-jdk8] [INFO] Maven Plugin Plugin ................................ SUCCESS [08:38 min]
[windows-jdk8] [INFO] ------------------------------------------------------------------------
[windows-jdk8] [INFO] BUILD SUCCESS
[windows-jdk8] [INFO] ------------------------------------------------------------------------
[windows-jdk8] [INFO] Total time: 10:38 min
[windows-jdk8] [INFO] Finished at: 2018-09-14T09:25:33-07:00
[windows-jdk8] [INFO] Final Memory: 81M/944M
[windows-jdk8] [INFO] ------------------------------------------------------------------------
[windows-jdk8] [INFO] [jenkins-event-spy] Generated F:\jenkins\jenkins-slave\workspace\x_maven-plugin-tools_master-XKS4EHY3PSXHGP4DHIXUDAAM6TMAKT3YNFP2XDSSXFM24ZMKWIXQ@tmp\withMaven40056af2\maven-spy-20180914-091454-5637806723751999373506.log
[windows-jdk8] Picked up JAVA_TOOL_OPTIONS: -Dmaven.ext.class.path="f:\jenkins\jenkins-slave\workspace\x_maven-plugin-tools_master-XKS4EHY3PSXHGP4DHIXUDAAM6TMAKT3YNFP2XDSSXFM24ZMKWIXQ@tmp\withMaven40056af2\pipeline-maven-spy.jar" -Dorg.jenkinsci.plugins.pipeline.maven.reportsFolder="f:\jenkins\jenkins-slave\workspace\x_maven-plugin-tools_master-XKS4EHY3PSXHGP4DHIXUDAAM6TMAKT3YNFP2XDSSXFM24ZMKWIXQ@tmp\withMaven40056af2"
[Pipeline] [windows-jdk8] }
[Pipeline] [windows-jdk8] // dir
[Pipeline] [windows-jdk8] }
[windows-jdk8] [withMaven] invokerPublisher - Archive invoker results for Maven artifact MavenArtifact{org.apache.maven.plugin-tools:maven-plugin-tools-javadoc::3.6-SNAPSHOT(version: 3.6-SNAPSHOT, snapshot:false) } generated by PluginInvocation{org.apache.maven.plugins:maven-invoker-plugin:3.0.1@run  integration-test}: m\maven-plugin-tools-javadoc\target\invoker-reports\*.xml
[windows-jdk8] performing MavenInvokerRecorder, reportsFilenamePattern:'**/m\maven-plugin-tools-javadoc\target\invoker-reports/BUILD*.xml', invokerBuildDir:'**/m\maven-plugin-tools-javadoc\target\it'
[windows-jdk8] Found reports:[f:\jenkins\jenkins-slave\workspace\x_maven-plugin-tools_master-XKS4EHY3PSXHGP4DHIXUDAAM6TMAKT3YNFP2XDSSXFM24ZMKWIXQ\m\maven-plugin-tools-javadoc\target\invoker-reports\BUILD-basic.xml]
[windows-jdk8] Found logs:[f:\jenkins\jenkins-slave\workspace\x_maven-plugin-tools_master-XKS4EHY3PSXHGP4DHIXUDAAM6TMAKT3YNFP2XDSSXFM24ZMKWIXQ\m\maven-plugin-tools-javadoc\target\it\basic\build.log]
[windows-jdk8] Finished parsing Maven Invoker results (found 1)
[windows-jdk8] [withMaven] invokerPublisher - Archive invoker results for Maven artifact MavenArtifact{org.apache.maven.plugins:maven-plugin-plugin::3.6-SNAPSHOT(version: 3.6-SNAPSHOT, snapshot:false) } generated by PluginInvocation{org.apache.maven.plugins:maven-invoker-plugin:3.0.1@run  integration-test}: m\maven-plugin-plugin\target\invoker-reports\*.xml
[windows-jdk8] performing MavenInvokerRecorder, reportsFilenamePattern:'**/m\maven-plugin-plugin\target\invoker-reports/BUILD*.xml', invokerBuildDir:'**/m\maven-plugin-plugin\target\it'
[windows-jdk8] Found reports:[f:\jenkins\jenkins-slave\workspace\x_maven-plugin-tools_master-XKS4EHY3PSXHGP4DHIXUDAAM6TMAKT3YNFP2XDSSXFM24ZMKWIXQ\m\maven-plugin-plugin\target\invoker-reports\BUILD-annotation-with-inheritance-from-deps.xml, f:\jenkins\jenkins-slave\workspace\x_maven-plugin-tools_master-XKS4EHY3PSXHGP4DHIXUDAAM6TMAKT3YNFP2XDSSXFM24ZMKWIXQ\m\maven-plugin-plugin\target\invoker-reports\BUILD-annotation-with-inheritance-reactor.xml, f:\jenkins\jenkins-slave\workspace\x_maven-plugin-tools_master-XKS4EHY3PSXHGP4DHIXUDAAM6TMAKT3YNFP2XDSSXFM24ZMKWIXQ\m\maven-plugin-plugin\target\invoker-reports\BUILD-annotation-with-inheritance.xml, f:\jenkins\jenkins-slave\workspace\x_maven-plugin-tools_master-XKS4EHY3PSXHGP4DHIXUDAAM6TMAKT3YNFP2XDSSXFM24ZMKWIXQ\m\maven-plugin-plugin\target\invoker-reports\BUILD-ant-basic.xml, f:\jenkins\jenkins-slave\workspace\x_maven-plugin-tools_master-XKS4EHY3PSXHGP4DHIXUDAAM6TMAKT3YNFP2XDSSXFM24ZMKWIXQ\m\maven-plugin-plugin\target\invoker-reports\BUILD-ant-reference-parameter.xml, f:\jenkins\jenkins-slave\workspace\x_maven-plugin-tools_master-XKS4EHY3PSXHGP4DHIXUDAAM6TMAKT3YNFP2XDSSXFM24ZMKWIXQ\m\maven-plugin-plugin\target\invoker-reports\BUILD-ant-simple-usage.xml, f:\jenkins\jenkins-slave\workspace\x_maven-plugin-tools_master-XKS4EHY3PSXHGP4DHIXUDAAM6TMAKT3YNFP2XDSSXFM24ZMKWIXQ\m\maven-plugin-plugin\target\invoker-reports\BUILD-ant-since-maven-plugin.xml, f:\jenkins\jenkins-slave\workspace\x_maven-plugin-tools_master-XKS4EHY3PSXHGP4DHIXUDAAM6TMAKT3YNFP2XDSSXFM24ZMKWIXQ\m\maven-plugin-plugin\target\invoker-reports\BUILD-asm-failure.xml, f:\jenkins\jenkins-slave\workspace\x_maven-plugin-tools_master-XKS4EHY3PSXHGP4DHIXUDAAM6TMAKT3YNFP2XDSSXFM24ZMKWIXQ\m\maven-plugin-plugin\target\invoker-reports\BUILD-beanshell-simple.xml, f:\jenkins\jenkins-slave\workspace\x_maven-plugin-tools_master-XKS4EHY3PSXHGP4DHIXUDAAM6TMAKT3YNFP2XDSSXFM24ZMKWIXQ\m\maven-plugin-plugin\target\invoker-reports\BUILD-fix-maven-since-3.x.xml, f:\jenkins\jenkins-slave\workspace\x_maven-plugin-tools_master-XKS4EHY3PSXHGP4DHIXUDAAM6TMAKT3YNFP2XDSSXFM24ZMKWIXQ\m\maven-plugin-plugin\target\invoker-reports\BUILD-help-basic.xml, f:\jenkins\jenkins-slave\workspace\x_maven-plugin-tools_master-XKS4EHY3PSXHGP4DHIXUDAAM6TMAKT3YNFP2XDSSXFM24ZMKWIXQ\m\maven-plugin-plugin\target\invoker-reports\BUILD-help-package.xml, f:\jenkins\jenkins-slave\workspace\x_maven-plugin-tools_master-XKS4EHY3PSXHGP4DHIXUDAAM6TMAKT3YNFP2XDSSXFM24ZMKWIXQ\m\maven-plugin-plugin\target\invoker-reports\BUILD-ignore-plugin-class-realm.xml, f:\jenkins\jenkins-slave\workspace\x_maven-plugin-tools_master-XKS4EHY3PSXHGP4DHIXUDAAM6TMAKT3YNFP2XDSSXFM24ZMKWIXQ\m\maven-plugin-plugin\target\invoker-reports\BUILD-java-basic-annotations-jdk8.xml, f:\jenkins\jenkins-slave\workspace\x_maven-plugin-tools_master-XKS4EHY3PSXHGP4DHIXUDAAM6TMAKT3YNFP2XDSSXFM24ZMKWIXQ\m\maven-plugin-plugin\target\invoker-reports\BUILD-java-basic-annotations.xml, f:\jenkins\jenkins-slave\workspace\x_maven-plugin-tools_master-XKS4EHY3PSXHGP4DHIXUDAAM6TMAKT3YNFP2XDSSXFM24ZMKWIXQ\m\maven-plugin-plugin\target\invoker-reports\BUILD-java-basic.xml, f:\jenkins\jenkins-slave\workspace\x_maven-plugin-tools_master-XKS4EHY3PSXHGP4DHIXUDAAM6TMAKT3YNFP2XDSSXFM24ZMKWIXQ\m\maven-plugin-plugin\target\invoker-reports\BUILD-mplugin-187.xml, f:\jenkins\jenkins-slave\workspace\x_maven-plugin-tools_master-XKS4EHY3PSXHGP4DHIXUDAAM6TMAKT3YNFP2XDSSXFM24ZMKWIXQ\m\maven-plugin-plugin\target\invoker-reports\BUILD-mplugin-191.xml, f:\jenkins\jenkins-slave\workspace\x_maven-plugin-tools_master-XKS4EHY3PSXHGP4DHIXUDAAM6TMAKT3YNFP2XDSSXFM24ZMKWIXQ\m\maven-plugin-plugin\target\invoker-reports\BUILD-mplugin-223.xml, f:\jenkins\jenkins-slave\workspace\x_maven-plugin-tools_master-XKS4EHY3PSXHGP4DHIXUDAAM6TMAKT3YNFP2XDSSXFM24ZMKWIXQ\m\maven-plugin-plugin\target\invoker-reports\BUILD-mplugin-272_java8.xml, f:\jenkins\jenkins-slave\workspace\x_maven-plugin-tools_master-XKS4EHY3PSXHGP4DHIXUDAAM6TMAKT3YNFP2XDSSXFM24ZMKWIXQ\m\maven-plugin-plugin\target\invoker-reports\BUILD-mplugin-299_no-configuration.xml, f:\jenkins\jenkins-slave\workspace\x_maven-plugin-tools_master-XKS4EHY3PSXHGP4DHIXUDAAM6TMAKT3YNFP2XDSSXFM24ZMKWIXQ\m\maven-plugin-plugin\target\invoker-reports\BUILD-mplugin-305_defaultMojoDependencies.xml, f:\jenkins\jenkins-slave\workspace\x_maven-plugin-tools_master-XKS4EHY3PSXHGP4DHIXUDAAM6TMAKT3YNFP2XDSSXFM24ZMKWIXQ\m\maven-plugin-plugin\target\invoker-reports\BUILD-mplugin-305_emptyMojoDependencies.xml, f:\jenkins\jenkins-slave\workspace\x_maven-plugin-tools_master-XKS4EHY3PSXHGP4DHIXUDAAM6TMAKT3YNFP2XDSSXFM24ZMKWIXQ\m\maven-plugin-plugin\target\invoker-reports\BUILD-mplugin-305_singleMojoDependencies.xml, f:\jenkins\jenkins-slave\workspace\x_maven-plugin-tools_master-XKS4EHY3PSXHGP4DHIXUDAAM6TMAKT3YNFP2XDSSXFM24ZMKWIXQ\m\maven-plugin-plugin\target\invoker-reports\BUILD-mplugin-319_report-since.xml, f:\jenkins\jenkins-slave\workspace\x_maven-plugin-tools_master-XKS4EHY3PSXHGP4DHIXUDAAM6TMAKT3YNFP2XDSSXFM24ZMKWIXQ\m\maven-plugin-plugin\target\invoker-reports\BUILD-mplugin-324_javadoc.xml, f:\jenkins\jenkins-slave\workspace\x_maven-plugin-tools_master-XKS4EHY3PSXHGP4DHIXUDAAM6TMAKT3YNFP2XDSSXFM24ZMKWIXQ\m\maven-plugin-plugin\target\invoker-reports\BUILD-packaging-jar.xml, f:\jenkins\jenkins-slave\workspace\x_maven-plugin-tools_master-XKS4EHY3PSXHGP4DHIXUDAAM6TMAKT3YNFP2XDSSXFM24ZMKWIXQ\m\maven-plugin-plugin\target\invoker-reports\BUILD-plugin-info-jdk-default-version.xml, f:\jenkins\jenkins-slave\workspace\x_maven-plugin-tools_master-XKS4EHY3PSXHGP4DHIXUDAAM6TMAKT3YNFP2XDSSXFM24ZMKWIXQ\m\maven-plugin-plugin\target\invoker-reports\BUILD-plugin-info-jdk.xml, f:\jenkins\jenkins-slave\workspace\x_maven-plugin-tools_master-XKS4EHY3PSXHGP4DHIXUDAAM6TMAKT3YNFP2XDSSXFM24ZMKWIXQ\m\maven-plugin-plugin\target\invoker-reports\BUILD-plugin-report-annotations.xml, f:\jenkins\jenkins-slave\workspace\x_maven-plugin-tools_master-XKS4EHY3PSXHGP4DHIXUDAAM6TMAKT3YNFP2XDSSXFM24ZMKWIXQ\m\maven-plugin-plugin\target\invoker-reports\BUILD-plugin-report.xml, f:\jenkins\jenkins-slave\workspace\x_maven-plugin-tools_master-XKS4EHY3PSXHGP4DHIXUDAAM6TMAKT3YNFP2XDSSXFM24ZMKWIXQ\m\maven-plugin-plugin\target\invoker-reports\BUILD-skip.xml, f:\jenkins\jenkins-slave\workspace\x_maven-plugin-tools_master-XKS4EHY3PSXHGP4DHIXUDAAM6TMAKT3YNFP2XDSSXFM24ZMKWIXQ\m\maven-plugin-plugin\target\invoker-reports\BUILD-source-encoding.xml]
[windows-jdk8] Found logs:[f:\jenkins\jenkins-slave\workspace\x_maven-plugin-tools_master-XKS4EHY3PSXHGP4DHIXUDAAM6TMAKT3YNFP2XDSSXFM24ZMKWIXQ\m\maven-plugin-plugin\target\it\annotation-with-inheritance-from-deps\build.log, f:\jenkins\jenkins-slave\workspace\x_maven-plugin-tools_master-XKS4EHY3PSXHGP4DHIXUDAAM6TMAKT3YNFP2XDSSXFM24ZMKWIXQ\m\maven-plugin-plugin\target\it\annotation-with-inheritance-reactor\build.log, f:\jenkins\jenkins-slave\workspace\x_maven-plugin-tools_master-XKS4EHY3PSXHGP4DHIXUDAAM6TMAKT3YNFP2XDSSXFM24ZMKWIXQ\m\maven-plugin-plugin\target\it\annotation-with-inheritance\build.log, f:\jenkins\jenkins-slave\workspace\x_maven-plugin-tools_master-XKS4EHY3PSXHGP4DHIXUDAAM6TMAKT3YNFP2XDSSXFM24ZMKWIXQ\m\maven-plugin-plugin\target\it\ant-basic\build.log, f:\jenkins\jenkins-slave\workspace\x_maven-plugin-tools_master-XKS4EHY3PSXHGP4DHIXUDAAM6TMAKT3YNFP2XDSSXFM24ZMKWIXQ\m\maven-plugin-plugin\target\it\ant-reference-parameter\build.log, f:\jenkins\jenkins-slave\workspace\x_maven-plugin-tools_master-XKS4EHY3PSXHGP4DHIXUDAAM6TMAKT3YNFP2XDSSXFM24ZMKWIXQ\m\maven-plugin-plugin\target\it\ant-simple-usage\build.log, f:\jenkins\jenkins-slave\workspace\x_maven-plugin-tools_master-XKS4EHY3PSXHGP4DHIXUDAAM6TMAKT3YNFP2XDSSXFM24ZMKWIXQ\m\maven-plugin-plugin\target\it\ant-since-maven-plugin\build.log, f:\jenkins\jenkins-slave\workspace\x_maven-plugin-tools_master-XKS4EHY3PSXHGP4DHIXUDAAM6TMAKT3YNFP2XDSSXFM24ZMKWIXQ\m\maven-plugin-plugin\target\it\asm-failure\build.log, f:\jenkins\jenkins-slave\workspace\x_maven-plugin-tools_master-XKS4EHY3PSXHGP4DHIXUDAAM6TMAKT3YNFP2XDSSXFM24ZMKWIXQ\m\maven-plugin-plugin\target\it\beanshell-simple\build.log, f:\jenkins\jenkins-slave\workspace\x_maven-plugin-tools_master-XKS4EHY3PSXHGP4DHIXUDAAM6TMAKT3YNFP2XDSSXFM24ZMKWIXQ\m\maven-plugin-plugin\target\it\fix-maven-since-3.x\build.log, f:\jenkins\jenkins-slave\workspace\x_maven-plugin-tools_master-XKS4EHY3PSXHGP4DHIXUDAAM6TMAKT3YNFP2XDSSXFM24ZMKWIXQ\m\maven-plugin-plugin\target\it\help-basic\build.log, f:\jenkins\jenkins-slave\workspace\x_maven-plugin-tools_master-XKS4EHY3PSXHGP4DHIXUDAAM6TMAKT3YNFP2XDSSXFM24ZMKWIXQ\m\maven-plugin-plugin\target\it\help-package\build.log, f:\jenkins\jenkins-slave\workspace\x_maven-plugin-tools_master-XKS4EHY3PSXHGP4DHIXUDAAM6TMAKT3YNFP2XDSSXFM24ZMKWIXQ\m\maven-plugin-plugin\target\it\ignore-plugin-class-realm\build.log, f:\jenkins\jenkins-slave\workspace\x_maven-plugin-tools_master-XKS4EHY3PSXHGP4DHIXUDAAM6TMAKT3YNFP2XDSSXFM24ZMKWIXQ\m\maven-plugin-plugin\target\it\java-basic-annotations-jdk8\build.log, f:\jenkins\jenkins-slave\workspace\x_maven-plugin-tools_master-XKS4EHY3PSXHGP4DHIXUDAAM6TMAKT3YNFP2XDSSXFM24ZMKWIXQ\m\maven-plugin-plugin\target\it\java-basic-annotations\build.log, f:\jenkins\jenkins-slave\workspace\x_maven-plugin-tools_master-XKS4EHY3PSXHGP4DHIXUDAAM6TMAKT3YNFP2XDSSXFM24ZMKWIXQ\m\maven-plugin-plugin\target\it\java-basic\build.log, f:\jenkins\jenkins-slave\workspace\x_maven-plugin-tools_master-XKS4EHY3PSXHGP4DHIXUDAAM6TMAKT3YNFP2XDSSXFM24ZMKWIXQ\m\maven-plugin-plugin\target\it\mplugin-187\build.log, f:\jenkins\jenkins-slave\workspace\x_maven-plugin-tools_master-XKS4EHY3PSXHGP4DHIXUDAAM6TMAKT3YNFP2XDSSXFM24ZMKWIXQ\m\maven-plugin-plugin\target\it\mplugin-191\build.log, f:\jenkins\jenkins-slave\workspace\x_maven-plugin-tools_master-XKS4EHY3PSXHGP4DHIXUDAAM6TMAKT3YNFP2XDSSXFM24ZMKWIXQ\m\maven-plugin-plugin\target\it\mplugin-223\build.log, f:\jenkins\jenkins-slave\workspace\x_maven-plugin-tools_master-XKS4EHY3PSXHGP4DHIXUDAAM6TMAKT3YNFP2XDSSXFM24ZMKWIXQ\m\maven-plugin-plugin\target\it\mplugin-272_java8\build.log, f:\jenkins\jenkins-slave\workspace\x_maven-plugin-tools_master-XKS4EHY3PSXHGP4DHIXUDAAM6TMAKT3YNFP2XDSSXFM24ZMKWIXQ\m\maven-plugin-plugin\target\it\mplugin-299_no-configuration\build.log, f:\jenkins\jenkins-slave\workspace\x_maven-plugin-tools_master-XKS4EHY3PSXHGP4DHIXUDAAM6TMAKT3YNFP2XDSSXFM24ZMKWIXQ\m\maven-plugin-plugin\target\it\mplugin-305_defaultMojoDependencies\build.log, f:\jenkins\jenkins-slave\workspace\x_maven-plugin-tools_master-XKS4EHY3PSXHGP4DHIXUDAAM6TMAKT3YNFP2XDSSXFM24ZMKWIXQ\m\maven-plugin-plugin\target\it\mplugin-305_emptyMojoDependencies\build.log, f:\jenkins\jenkins-slave\workspace\x_maven-plugin-tools_master-XKS4EHY3PSXHGP4DHIXUDAAM6TMAKT3YNFP2XDSSXFM24ZMKWIXQ\m\maven-plugin-plugin\target\it\mplugin-305_singleMojoDependencies\build.log, f:\jenkins\jenkins-slave\workspace\x_maven-plugin-tools_master-XKS4EHY3PSXHGP4DHIXUDAAM6TMAKT3YNFP2XDSSXFM24ZMKWIXQ\m\maven-plugin-plugin\target\it\mplugin-319_report-since\build.log, f:\jenkins\jenkins-slave\workspace\x_maven-plugin-tools_master-XKS4EHY3PSXHGP4DHIXUDAAM6TMAKT3YNFP2XDSSXFM24ZMKWIXQ\m\maven-plugin-plugin\target\it\mplugin-324_javadoc\build.log, f:\jenkins\jenkins-slave\workspace\x_maven-plugin-tools_master-XKS4EHY3PSXHGP4DHIXUDAAM6TMAKT3YNFP2XDSSXFM24ZMKWIXQ\m\maven-plugin-plugin\target\it\packaging-jar\build.log, f:\jenkins\jenkins-slave\workspace\x_maven-plugin-tools_master-XKS4EHY3PSXHGP4DHIXUDAAM6TMAKT3YNFP2XDSSXFM24ZMKWIXQ\m\maven-plugin-plugin\target\it\plugin-info-jdk-default-version\build.log, f:\jenkins\jenkins-slave\workspace\x_maven-plugin-tools_master-XKS4EHY3PSXHGP4DHIXUDAAM6TMAKT3YNFP2XDSSXFM24ZMKWIXQ\m\maven-plugin-plugin\target\it\plugin-info-jdk\build.log, f:\jenkins\jenkins-slave\workspace\x_maven-plugin-tools_master-XKS4EHY3PSXHGP4DHIXUDAAM6TMAKT3YNFP2XDSSXFM24ZMKWIXQ\m\maven-plugin-plugin\target\it\plugin-report-annotations\build.log, f:\jenkins\jenkins-slave\workspace\x_maven-plugin-tools_master-XKS4EHY3PSXHGP4DHIXUDAAM6TMAKT3YNFP2XDSSXFM24ZMKWIXQ\m\maven-plugin-plugin\target\it\plugin-report\build.log, f:\jenkins\jenkins-slave\workspace\x_maven-plugin-tools_master-XKS4EHY3PSXHGP4DHIXUDAAM6TMAKT3YNFP2XDSSXFM24ZMKWIXQ\m\maven-plugin-plugin\target\it\skip\build.log, f:\jenkins\jenkins-slave\workspace\x_maven-plugin-tools_master-XKS4EHY3PSXHGP4DHIXUDAAM6TMAKT3YNFP2XDSSXFM24ZMKWIXQ\m\maven-plugin-plugin\target\it\source-encoding\build.log]
[windows-jdk8] Finished parsing Maven Invoker results (found 33)
[windows-jdk8] [withMaven] junitPublisher - Archive test results for Maven artifact org.apache.maven.plugin-tools:maven-plugin-tools-api:3.6-SNAPSHOT generated by maven-surefire-plugin:test (default-test): m\maven-plugin-tools-api\target\surefire-reports\*.xml
[windows-jdk8] Recording test results
[windows-jdk8] [withMaven] junitPublisher - Archive test results for Maven artifact org.apache.maven.plugin-tools:maven-plugin-tools-generators:3.6-SNAPSHOT generated by maven-surefire-plugin:test (default-test): m\maven-plugin-tools-generators\target\surefire-reports\*.xml
[windows-jdk8] Recording test results
[windows-jdk8] [withMaven] junitPublisher - Archive test results for Maven artifact org.apache.maven.plugin-tools:maven-plugin-tools-java:3.6-SNAPSHOT generated by maven-surefire-plugin:test (default-test): m\maven-plugin-tools-java\target\surefire-reports\*.xml
[windows-jdk8] Recording test results
[windows-jdk8] [withMaven] junitPublisher - Archive test results for Maven artifact org.apache.maven.plugin-tools:maven-plugin-annotations:3.6-SNAPSHOT generated by maven-surefire-plugin:test (default-test): m\maven-plugin-annotations\target\surefire-reports\*.xml
[windows-jdk8] Recording test results
[windows-jdk8] None of the test reports contained any result
[windows-jdk8] [withMaven] junitPublisher - Archive test results for Maven artifact org.apache.maven.plugin-tools:maven-plugin-tools-annotations:3.6-SNAPSHOT generated by maven-surefire-plugin:test (default-test): m\maven-plugin-tools-annotations\target\surefire-reports\*.xml
[windows-jdk8] Recording test results
[windows-jdk8] [withMaven] junitPublisher - Archive test results for Maven artifact org.apache.maven.plugin-tools:maven-plugin-tools-javadoc:3.6-SNAPSHOT generated by maven-surefire-plugin:test (default-test): m\maven-plugin-tools-javadoc\target\surefire-reports\*.xml
[windows-jdk8] Recording test results
[windows-jdk8] None of the test reports contained any result
[windows-jdk8] [withMaven] junitPublisher - Archive test results for Maven artifact org.apache.maven.plugin-tools:maven-plugin-tools-model:3.6-SNAPSHOT generated by maven-surefire-plugin:test (default-test): m\maven-script\maven-plugin-tools-model\target\surefire-reports\*.xml
[windows-jdk8] Recording test results
[windows-jdk8] [withMaven] junitPublisher - Archive test results for Maven artifact org.apache.maven.plugin-tools:maven-plugin-tools-ant:3.6-SNAPSHOT generated by maven-surefire-plugin:test (default-test): m\maven-script\maven-plugin-tools-ant\target\surefire-reports\*.xml
[windows-jdk8] Recording test results
[windows-jdk8] [withMaven] junitPublisher - Archive test results for Maven artifact org.apache.maven.plugin-tools:maven-script-ant:3.6-SNAPSHOT generated by maven-surefire-plugin:test (default-test): m\maven-script\maven-script-ant\target\surefire-reports\*.xml
[windows-jdk8] Recording test results
[windows-jdk8] [withMaven] junitPublisher - Archive test results for Maven artifact org.apache.maven.plugin-tools:maven-plugin-tools-beanshell:3.6-SNAPSHOT generated by maven-surefire-plugin:test (default-test): m\maven-script\maven-plugin-tools-beanshell\target\surefire-reports\*.xml
[windows-jdk8] Recording test results
[windows-jdk8] None of the test reports contained any result
[windows-jdk8] [withMaven] junitPublisher - Archive test results for Maven artifact org.apache.maven.plugin-tools:maven-script-beanshell:3.6-SNAPSHOT generated by maven-surefire-plugin:test (default-test): m\maven-script\maven-script-beanshell\target\surefire-reports\*.xml
[windows-jdk8] Recording test results
[windows-jdk8] None of the test reports contained any result
[windows-jdk8] [withMaven] junitPublisher - Archive test results for Maven artifact org.apache.maven.plugins:maven-plugin-plugin:3.6-SNAPSHOT generated by maven-surefire-plugin:test (default-test): m\maven-plugin-plugin\target\surefire-reports\*.xml
[windows-jdk8] Recording test results
[windows-jdk8] None of the test reports contained any result
[Pipeline] [windows-jdk8] // withMaven
[Pipeline] [windows-jdk8] cleanWs
[windows-jdk8] [WS-CLEANUP] Deleting project workspace...[WS-CLEANUP] done
[Pipeline] [windows-jdk8] }
[Pipeline] [windows-jdk8] // stage
[Pipeline] [windows-jdk8] }
[Pipeline] [windows-jdk8] // node
[Pipeline] [windows-jdk8] }
[Pipeline] // parallel
[Pipeline] stage
[Pipeline] { (Notifications)
[Pipeline] echo
Build result: FAILURE
[Pipeline] jiraIssueSelector
[Pipeline] emailext