Build failed in Jenkins: Maven TLP » maven-plugin-tools » MPLUGIN-336 #4

classic Classic list List threaded Threaded
4 messages Options
Reply | Threaded
Open this post in threaded view
|

Build failed in Jenkins: Maven TLP » maven-plugin-tools » MPLUGIN-336 #4

Apache Jenkins Server-2
See https://builds.apache.org/job/maven-box/job/maven-plugin-tools/job/MPLUGIN-336/4/

No changes.

All tests passed

Build log:
[...truncated 3.83 MB...]
[windows-jdk9] [INFO] Maven Plugin Tool for Ant .......................... SUCCESS [  3.815 s]
[windows-jdk9] [INFO] Maven Ant Mojo Support ............................. SUCCESS [  7.669 s]
[windows-jdk9] [INFO] Maven Plugin Tool for Beanshell .................... SUCCESS [  2.070 s]
[windows-jdk9] [INFO] Maven Beanshell Mojo Support ....................... SUCCESS [  2.250 s]
[windows-jdk9] [INFO] Maven Plugin Plugin ................................ SUCCESS [12:09 min]
[windows-jdk9] [INFO] ------------------------------------------------------------------------
[windows-jdk9] [INFO] BUILD SUCCESS
[windows-jdk9] [INFO] ------------------------------------------------------------------------
[windows-jdk9] [INFO] Total time: 14:11 min
[windows-jdk9] [INFO] Finished at: 2018-09-12T16:28:35Z
[windows-jdk9] [INFO] Final Memory: 58M/194M
[windows-jdk9] [INFO] ------------------------------------------------------------------------
[windows-jdk9] [INFO] [jenkins-event-spy] Generated F:\jenkins\jenkins-slave\workspace\en-plugin-tools_MPLUGIN-336-OX2XMFOVDYU6CHOQOCEAQPI7JEFEG4IM2KWEE3CCBTWR4DJXZKUQ@2@tmp\withMaven92c13bf8\maven-spy-20180912-161423-2213738806530520669064.log
[Pipeline] [windows-jdk9] }
[Pipeline] [windows-jdk9] // dir
[Pipeline] [windows-jdk9] }
[windows-jdk9] [withMaven] invokerPublisher - Archive invoker results for Maven artifact MavenArtifact{org.apache.maven.plugin-tools:maven-plugin-tools-javadoc::3.6-SNAPSHOT(version: 3.6-SNAPSHOT, snapshot:false) } generated by PluginInvocation{org.apache.maven.plugins:maven-invoker-plugin:3.0.1@run  integration-test}: m\maven-plugin-tools-javadoc\target\invoker-reports\*.xml
[windows-jdk9] performing MavenInvokerRecorder, reportsFilenamePattern:'**/m\maven-plugin-tools-javadoc\target\invoker-reports/BUILD*.xml', invokerBuildDir:'**/m\maven-plugin-tools-javadoc\target\it'
[windows-jdk9] Found reports:[f:\jenkins\jenkins-slave\workspace\en-plugin-tools_MPLUGIN-336-OX2XMFOVDYU6CHOQOCEAQPI7JEFEG4IM2KWEE3CCBTWR4DJXZKUQ@2\m\maven-plugin-tools-javadoc\target\invoker-reports\BUILD-basic.xml]
[windows-jdk9] Found logs:[f:\jenkins\jenkins-slave\workspace\en-plugin-tools_MPLUGIN-336-OX2XMFOVDYU6CHOQOCEAQPI7JEFEG4IM2KWEE3CCBTWR4DJXZKUQ@2\m\maven-plugin-tools-javadoc\target\it\basic\build.log]
[windows-jdk9] Finished parsing Maven Invoker results (found 1)
[windows-jdk9] [withMaven] invokerPublisher - Archive invoker results for Maven artifact MavenArtifact{org.apache.maven.plugins:maven-plugin-plugin::3.6-SNAPSHOT(version: 3.6-SNAPSHOT, snapshot:false) } generated by PluginInvocation{org.apache.maven.plugins:maven-invoker-plugin:3.0.1@run  integration-test}: m\maven-plugin-plugin\target\invoker-reports\*.xml
[windows-jdk9] performing MavenInvokerRecorder, reportsFilenamePattern:'**/m\maven-plugin-plugin\target\invoker-reports/BUILD*.xml', invokerBuildDir:'**/m\maven-plugin-plugin\target\it'
[windows-jdk9] Found reports:[f:\jenkins\jenkins-slave\workspace\en-plugin-tools_MPLUGIN-336-OX2XMFOVDYU6CHOQOCEAQPI7JEFEG4IM2KWEE3CCBTWR4DJXZKUQ@2\m\maven-plugin-plugin\target\invoker-reports\BUILD-annotation-with-inheritance-from-deps.xml, f:\jenkins\jenkins-slave\workspace\en-plugin-tools_MPLUGIN-336-OX2XMFOVDYU6CHOQOCEAQPI7JEFEG4IM2KWEE3CCBTWR4DJXZKUQ@2\m\maven-plugin-plugin\target\invoker-reports\BUILD-annotation-with-inheritance-reactor.xml, f:\jenkins\jenkins-slave\workspace\en-plugin-tools_MPLUGIN-336-OX2XMFOVDYU6CHOQOCEAQPI7JEFEG4IM2KWEE3CCBTWR4DJXZKUQ@2\m\maven-plugin-plugin\target\invoker-reports\BUILD-annotation-with-inheritance.xml, f:\jenkins\jenkins-slave\workspace\en-plugin-tools_MPLUGIN-336-OX2XMFOVDYU6CHOQOCEAQPI7JEFEG4IM2KWEE3CCBTWR4DJXZKUQ@2\m\maven-plugin-plugin\target\invoker-reports\BUILD-ant-basic.xml, f:\jenkins\jenkins-slave\workspace\en-plugin-tools_MPLUGIN-336-OX2XMFOVDYU6CHOQOCEAQPI7JEFEG4IM2KWEE3CCBTWR4DJXZKUQ@2\m\maven-plugin-plugin\target\invoker-reports\BUILD-ant-reference-parameter.xml, f:\jenkins\jenkins-slave\workspace\en-plugin-tools_MPLUGIN-336-OX2XMFOVDYU6CHOQOCEAQPI7JEFEG4IM2KWEE3CCBTWR4DJXZKUQ@2\m\maven-plugin-plugin\target\invoker-reports\BUILD-ant-simple-usage.xml, f:\jenkins\jenkins-slave\workspace\en-plugin-tools_MPLUGIN-336-OX2XMFOVDYU6CHOQOCEAQPI7JEFEG4IM2KWEE3CCBTWR4DJXZKUQ@2\m\maven-plugin-plugin\target\invoker-reports\BUILD-ant-since-maven-plugin.xml, f:\jenkins\jenkins-slave\workspace\en-plugin-tools_MPLUGIN-336-OX2XMFOVDYU6CHOQOCEAQPI7JEFEG4IM2KWEE3CCBTWR4DJXZKUQ@2\m\maven-plugin-plugin\target\invoker-reports\BUILD-asm-failure.xml, f:\jenkins\jenkins-slave\workspace\en-plugin-tools_MPLUGIN-336-OX2XMFOVDYU6CHOQOCEAQPI7JEFEG4IM2KWEE3CCBTWR4DJXZKUQ@2\m\maven-plugin-plugin\target\invoker-reports\BUILD-beanshell-simple.xml, f:\jenkins\jenkins-slave\workspace\en-plugin-tools_MPLUGIN-336-OX2XMFOVDYU6CHOQOCEAQPI7JEFEG4IM2KWEE3CCBTWR4DJXZKUQ@2\m\maven-plugin-plugin\target\invoker-reports\BUILD-fix-maven-since-3.x.xml, f:\jenkins\jenkins-slave\workspace\en-plugin-tools_MPLUGIN-336-OX2XMFOVDYU6CHOQOCEAQPI7JEFEG4IM2KWEE3CCBTWR4DJXZKUQ@2\m\maven-plugin-plugin\target\invoker-reports\BUILD-help-basic.xml, f:\jenkins\jenkins-slave\workspace\en-plugin-tools_MPLUGIN-336-OX2XMFOVDYU6CHOQOCEAQPI7JEFEG4IM2KWEE3CCBTWR4DJXZKUQ@2\m\maven-plugin-plugin\target\invoker-reports\BUILD-help-package.xml, f:\jenkins\jenkins-slave\workspace\en-plugin-tools_MPLUGIN-336-OX2XMFOVDYU6CHOQOCEAQPI7JEFEG4IM2KWEE3CCBTWR4DJXZKUQ@2\m\maven-plugin-plugin\target\invoker-reports\BUILD-ignore-plugin-class-realm.xml, f:\jenkins\jenkins-slave\workspace\en-plugin-tools_MPLUGIN-336-OX2XMFOVDYU6CHOQOCEAQPI7JEFEG4IM2KWEE3CCBTWR4DJXZKUQ@2\m\maven-plugin-plugin\target\invoker-reports\BUILD-java-basic-annotations-jdk8.xml, f:\jenkins\jenkins-slave\workspace\en-plugin-tools_MPLUGIN-336-OX2XMFOVDYU6CHOQOCEAQPI7JEFEG4IM2KWEE3CCBTWR4DJXZKUQ@2\m\maven-plugin-plugin\target\invoker-reports\BUILD-java-basic-annotations.xml, f:\jenkins\jenkins-slave\workspace\en-plugin-tools_MPLUGIN-336-OX2XMFOVDYU6CHOQOCEAQPI7JEFEG4IM2KWEE3CCBTWR4DJXZKUQ@2\m\maven-plugin-plugin\target\invoker-reports\BUILD-java-basic.xml, f:\jenkins\jenkins-slave\workspace\en-plugin-tools_MPLUGIN-336-OX2XMFOVDYU6CHOQOCEAQPI7JEFEG4IM2KWEE3CCBTWR4DJXZKUQ@2\m\maven-plugin-plugin\target\invoker-reports\BUILD-mplugin-187.xml, f:\jenkins\jenkins-slave\workspace\en-plugin-tools_MPLUGIN-336-OX2XMFOVDYU6CHOQOCEAQPI7JEFEG4IM2KWEE3CCBTWR4DJXZKUQ@2\m\maven-plugin-plugin\target\invoker-reports\BUILD-mplugin-191.xml, f:\jenkins\jenkins-slave\workspace\en-plugin-tools_MPLUGIN-336-OX2XMFOVDYU6CHOQOCEAQPI7JEFEG4IM2KWEE3CCBTWR4DJXZKUQ@2\m\maven-plugin-plugin\target\invoker-reports\BUILD-mplugin-223.xml, f:\jenkins\jenkins-slave\workspace\en-plugin-tools_MPLUGIN-336-OX2XMFOVDYU6CHOQOCEAQPI7JEFEG4IM2KWEE3CCBTWR4DJXZKUQ@2\m\maven-plugin-plugin\target\invoker-reports\BUILD-mplugin-272_java8.xml, f:\jenkins\jenkins-slave\workspace\en-plugin-tools_MPLUGIN-336-OX2XMFOVDYU6CHOQOCEAQPI7JEFEG4IM2KWEE3CCBTWR4DJXZKUQ@2\m\maven-plugin-plugin\target\invoker-reports\BUILD-mplugin-299_no-configuration.xml, f:\jenkins\jenkins-slave\workspace\en-plugin-tools_MPLUGIN-336-OX2XMFOVDYU6CHOQOCEAQPI7JEFEG4IM2KWEE3CCBTWR4DJXZKUQ@2\m\maven-plugin-plugin\target\invoker-reports\BUILD-mplugin-305_defaultMojoDependencies.xml, f:\jenkins\jenkins-slave\workspace\en-plugin-tools_MPLUGIN-336-OX2XMFOVDYU6CHOQOCEAQPI7JEFEG4IM2KWEE3CCBTWR4DJXZKUQ@2\m\maven-plugin-plugin\target\invoker-reports\BUILD-mplugin-305_emptyMojoDependencies.xml, f:\jenkins\jenkins-slave\workspace\en-plugin-tools_MPLUGIN-336-OX2XMFOVDYU6CHOQOCEAQPI7JEFEG4IM2KWEE3CCBTWR4DJXZKUQ@2\m\maven-plugin-plugin\target\invoker-reports\BUILD-mplugin-305_singleMojoDependencies.xml, f:\jenkins\jenkins-slave\workspace\en-plugin-tools_MPLUGIN-336-OX2XMFOVDYU6CHOQOCEAQPI7JEFEG4IM2KWEE3CCBTWR4DJXZKUQ@2\m\maven-plugin-plugin\target\invoker-reports\BUILD-mplugin-319_report-since.xml, f:\jenkins\jenkins-slave\workspace\en-plugin-tools_MPLUGIN-336-OX2XMFOVDYU6CHOQOCEAQPI7JEFEG4IM2KWEE3CCBTWR4DJXZKUQ@2\m\maven-plugin-plugin\target\invoker-reports\BUILD-mplugin-324_javadoc.xml, f:\jenkins\jenkins-slave\workspace\en-plugin-tools_MPLUGIN-336-OX2XMFOVDYU6CHOQOCEAQPI7JEFEG4IM2KWEE3CCBTWR4DJXZKUQ@2\m\maven-plugin-plugin\target\invoker-reports\BUILD-packaging-jar.xml, f:\jenkins\jenkins-slave\workspace\en-plugin-tools_MPLUGIN-336-OX2XMFOVDYU6CHOQOCEAQPI7JEFEG4IM2KWEE3CCBTWR4DJXZKUQ@2\m\maven-plugin-plugin\target\invoker-reports\BUILD-plugin-info-jdk-default-version.xml, f:\jenkins\jenkins-slave\workspace\en-plugin-tools_MPLUGIN-336-OX2XMFOVDYU6CHOQOCEAQPI7JEFEG4IM2KWEE3CCBTWR4DJXZKUQ@2\m\maven-plugin-plugin\target\invoker-reports\BUILD-plugin-info-jdk.xml, f:\jenkins\jenkins-slave\workspace\en-plugin-tools_MPLUGIN-336-OX2XMFOVDYU6CHOQOCEAQPI7JEFEG4IM2KWEE3CCBTWR4DJXZKUQ@2\m\maven-plugin-plugin\target\invoker-reports\BUILD-plugin-report-annotations.xml, f:\jenkins\jenkins-slave\workspace\en-plugin-tools_MPLUGIN-336-OX2XMFOVDYU6CHOQOCEAQPI7JEFEG4IM2KWEE3CCBTWR4DJXZKUQ@2\m\maven-plugin-plugin\target\invoker-reports\BUILD-plugin-report.xml, f:\jenkins\jenkins-slave\workspace\en-plugin-tools_MPLUGIN-336-OX2XMFOVDYU6CHOQOCEAQPI7JEFEG4IM2KWEE3CCBTWR4DJXZKUQ@2\m\maven-plugin-plugin\target\invoker-reports\BUILD-skip.xml, f:\jenkins\jenkins-slave\workspace\en-plugin-tools_MPLUGIN-336-OX2XMFOVDYU6CHOQOCEAQPI7JEFEG4IM2KWEE3CCBTWR4DJXZKUQ@2\m\maven-plugin-plugin\target\invoker-reports\BUILD-source-encoding.xml]
[windows-jdk9] Found logs:[f:\jenkins\jenkins-slave\workspace\en-plugin-tools_MPLUGIN-336-OX2XMFOVDYU6CHOQOCEAQPI7JEFEG4IM2KWEE3CCBTWR4DJXZKUQ@2\m\maven-plugin-plugin\target\it\annotation-with-inheritance-from-deps\build.log, f:\jenkins\jenkins-slave\workspace\en-plugin-tools_MPLUGIN-336-OX2XMFOVDYU6CHOQOCEAQPI7JEFEG4IM2KWEE3CCBTWR4DJXZKUQ@2\m\maven-plugin-plugin\target\it\annotation-with-inheritance-reactor\build.log, f:\jenkins\jenkins-slave\workspace\en-plugin-tools_MPLUGIN-336-OX2XMFOVDYU6CHOQOCEAQPI7JEFEG4IM2KWEE3CCBTWR4DJXZKUQ@2\m\maven-plugin-plugin\target\it\annotation-with-inheritance\build.log, f:\jenkins\jenkins-slave\workspace\en-plugin-tools_MPLUGIN-336-OX2XMFOVDYU6CHOQOCEAQPI7JEFEG4IM2KWEE3CCBTWR4DJXZKUQ@2\m\maven-plugin-plugin\target\it\ant-basic\build.log, f:\jenkins\jenkins-slave\workspace\en-plugin-tools_MPLUGIN-336-OX2XMFOVDYU6CHOQOCEAQPI7JEFEG4IM2KWEE3CCBTWR4DJXZKUQ@2\m\maven-plugin-plugin\target\it\ant-reference-parameter\build.log, f:\jenkins\jenkins-slave\workspace\en-plugin-tools_MPLUGIN-336-OX2XMFOVDYU6CHOQOCEAQPI7JEFEG4IM2KWEE3CCBTWR4DJXZKUQ@2\m\maven-plugin-plugin\target\it\ant-simple-usage\build.log, f:\jenkins\jenkins-slave\workspace\en-plugin-tools_MPLUGIN-336-OX2XMFOVDYU6CHOQOCEAQPI7JEFEG4IM2KWEE3CCBTWR4DJXZKUQ@2\m\maven-plugin-plugin\target\it\ant-since-maven-plugin\build.log, f:\jenkins\jenkins-slave\workspace\en-plugin-tools_MPLUGIN-336-OX2XMFOVDYU6CHOQOCEAQPI7JEFEG4IM2KWEE3CCBTWR4DJXZKUQ@2\m\maven-plugin-plugin\target\it\asm-failure\build.log, f:\jenkins\jenkins-slave\workspace\en-plugin-tools_MPLUGIN-336-OX2XMFOVDYU6CHOQOCEAQPI7JEFEG4IM2KWEE3CCBTWR4DJXZKUQ@2\m\maven-plugin-plugin\target\it\beanshell-simple\build.log, f:\jenkins\jenkins-slave\workspace\en-plugin-tools_MPLUGIN-336-OX2XMFOVDYU6CHOQOCEAQPI7JEFEG4IM2KWEE3CCBTWR4DJXZKUQ@2\m\maven-plugin-plugin\target\it\fix-maven-since-3.x\build.log, f:\jenkins\jenkins-slave\workspace\en-plugin-tools_MPLUGIN-336-OX2XMFOVDYU6CHOQOCEAQPI7JEFEG4IM2KWEE3CCBTWR4DJXZKUQ@2\m\maven-plugin-plugin\target\it\help-basic\build.log, f:\jenkins\jenkins-slave\workspace\en-plugin-tools_MPLUGIN-336-OX2XMFOVDYU6CHOQOCEAQPI7JEFEG4IM2KWEE3CCBTWR4DJXZKUQ@2\m\maven-plugin-plugin\target\it\help-package\build.log, f:\jenkins\jenkins-slave\workspace\en-plugin-tools_MPLUGIN-336-OX2XMFOVDYU6CHOQOCEAQPI7JEFEG4IM2KWEE3CCBTWR4DJXZKUQ@2\m\maven-plugin-plugin\target\it\ignore-plugin-class-realm\build.log, f:\jenkins\jenkins-slave\workspace\en-plugin-tools_MPLUGIN-336-OX2XMFOVDYU6CHOQOCEAQPI7JEFEG4IM2KWEE3CCBTWR4DJXZKUQ@2\m\maven-plugin-plugin\target\it\java-basic-annotations-jdk8\build.log, f:\jenkins\jenkins-slave\workspace\en-plugin-tools_MPLUGIN-336-OX2XMFOVDYU6CHOQOCEAQPI7JEFEG4IM2KWEE3CCBTWR4DJXZKUQ@2\m\maven-plugin-plugin\target\it\java-basic-annotations\build.log, f:\jenkins\jenkins-slave\workspace\en-plugin-tools_MPLUGIN-336-OX2XMFOVDYU6CHOQOCEAQPI7JEFEG4IM2KWEE3CCBTWR4DJXZKUQ@2\m\maven-plugin-plugin\target\it\java-basic\build.log, f:\jenkins\jenkins-slave\workspace\en-plugin-tools_MPLUGIN-336-OX2XMFOVDYU6CHOQOCEAQPI7JEFEG4IM2KWEE3CCBTWR4DJXZKUQ@2\m\maven-plugin-plugin\target\it\mplugin-187\build.log, f:\jenkins\jenkins-slave\workspace\en-plugin-tools_MPLUGIN-336-OX2XMFOVDYU6CHOQOCEAQPI7JEFEG4IM2KWEE3CCBTWR4DJXZKUQ@2\m\maven-plugin-plugin\target\it\mplugin-191\build.log, f:\jenkins\jenkins-slave\workspace\en-plugin-tools_MPLUGIN-336-OX2XMFOVDYU6CHOQOCEAQPI7JEFEG4IM2KWEE3CCBTWR4DJXZKUQ@2\m\maven-plugin-plugin\target\it\mplugin-223\build.log, f:\jenkins\jenkins-slave\workspace\en-plugin-tools_MPLUGIN-336-OX2XMFOVDYU6CHOQOCEAQPI7JEFEG4IM2KWEE3CCBTWR4DJXZKUQ@2\m\maven-plugin-plugin\target\it\mplugin-272_java8\build.log, f:\jenkins\jenkins-slave\workspace\en-plugin-tools_MPLUGIN-336-OX2XMFOVDYU6CHOQOCEAQPI7JEFEG4IM2KWEE3CCBTWR4DJXZKUQ@2\m\maven-plugin-plugin\target\it\mplugin-299_no-configuration\build.log, f:\jenkins\jenkins-slave\workspace\en-plugin-tools_MPLUGIN-336-OX2XMFOVDYU6CHOQOCEAQPI7JEFEG4IM2KWEE3CCBTWR4DJXZKUQ@2\m\maven-plugin-plugin\target\it\mplugin-305_defaultMojoDependencies\build.log, f:\jenkins\jenkins-slave\workspace\en-plugin-tools_MPLUGIN-336-OX2XMFOVDYU6CHOQOCEAQPI7JEFEG4IM2KWEE3CCBTWR4DJXZKUQ@2\m\maven-plugin-plugin\target\it\mplugin-305_emptyMojoDependencies\build.log, f:\jenkins\jenkins-slave\workspace\en-plugin-tools_MPLUGIN-336-OX2XMFOVDYU6CHOQOCEAQPI7JEFEG4IM2KWEE3CCBTWR4DJXZKUQ@2\m\maven-plugin-plugin\target\it\mplugin-305_singleMojoDependencies\build.log, f:\jenkins\jenkins-slave\workspace\en-plugin-tools_MPLUGIN-336-OX2XMFOVDYU6CHOQOCEAQPI7JEFEG4IM2KWEE3CCBTWR4DJXZKUQ@2\m\maven-plugin-plugin\target\it\mplugin-319_report-since\build.log, f:\jenkins\jenkins-slave\workspace\en-plugin-tools_MPLUGIN-336-OX2XMFOVDYU6CHOQOCEAQPI7JEFEG4IM2KWEE3CCBTWR4DJXZKUQ@2\m\maven-plugin-plugin\target\it\mplugin-324_javadoc\build.log, f:\jenkins\jenkins-slave\workspace\en-plugin-tools_MPLUGIN-336-OX2XMFOVDYU6CHOQOCEAQPI7JEFEG4IM2KWEE3CCBTWR4DJXZKUQ@2\m\maven-plugin-plugin\target\it\packaging-jar\build.log, f:\jenkins\jenkins-slave\workspace\en-plugin-tools_MPLUGIN-336-OX2XMFOVDYU6CHOQOCEAQPI7JEFEG4IM2KWEE3CCBTWR4DJXZKUQ@2\m\maven-plugin-plugin\target\it\plugin-info-jdk-default-version\build.log, f:\jenkins\jenkins-slave\workspace\en-plugin-tools_MPLUGIN-336-OX2XMFOVDYU6CHOQOCEAQPI7JEFEG4IM2KWEE3CCBTWR4DJXZKUQ@2\m\maven-plugin-plugin\target\it\plugin-info-jdk\build.log, f:\jenkins\jenkins-slave\workspace\en-plugin-tools_MPLUGIN-336-OX2XMFOVDYU6CHOQOCEAQPI7JEFEG4IM2KWEE3CCBTWR4DJXZKUQ@2\m\maven-plugin-plugin\target\it\plugin-report-annotations\build.log, f:\jenkins\jenkins-slave\workspace\en-plugin-tools_MPLUGIN-336-OX2XMFOVDYU6CHOQOCEAQPI7JEFEG4IM2KWEE3CCBTWR4DJXZKUQ@2\m\maven-plugin-plugin\target\it\plugin-report\build.log, f:\jenkins\jenkins-slave\workspace\en-plugin-tools_MPLUGIN-336-OX2XMFOVDYU6CHOQOCEAQPI7JEFEG4IM2KWEE3CCBTWR4DJXZKUQ@2\m\maven-plugin-plugin\target\it\skip\build.log, f:\jenkins\jenkins-slave\workspace\en-plugin-tools_MPLUGIN-336-OX2XMFOVDYU6CHOQOCEAQPI7JEFEG4IM2KWEE3CCBTWR4DJXZKUQ@2\m\maven-plugin-plugin\target\it\source-encoding\build.log]
[windows-jdk9] Finished parsing Maven Invoker results (found 33)
[windows-jdk9] [withMaven] junitPublisher - Archive test results for Maven artifact org.apache.maven.plugin-tools:maven-plugin-tools-api:3.6-SNAPSHOT generated by maven-surefire-plugin:test (default-test): m\maven-plugin-tools-api\target\surefire-reports\*.xml
[windows-jdk9] Recording test results
[windows-jdk9] [withMaven] junitPublisher - Archive test results for Maven artifact org.apache.maven.plugin-tools:maven-plugin-tools-generators:3.6-SNAPSHOT generated by maven-surefire-plugin:test (default-test): m\maven-plugin-tools-generators\target\surefire-reports\*.xml
[windows-jdk9] Recording test results
[windows-jdk9] [withMaven] junitPublisher - Archive test results for Maven artifact org.apache.maven.plugin-tools:maven-plugin-tools-java:3.6-SNAPSHOT generated by maven-surefire-plugin:test (default-test): m\maven-plugin-tools-java\target\surefire-reports\*.xml
[windows-jdk9] Recording test results
[windows-jdk9] [withMaven] junitPublisher - Archive test results for Maven artifact org.apache.maven.plugin-tools:maven-plugin-annotations:3.6-SNAPSHOT generated by maven-surefire-plugin:test (default-test): m\maven-plugin-annotations\target\surefire-reports\*.xml
[windows-jdk9] Recording test results
[windows-jdk9] None of the test reports contained any result
[windows-jdk9] [withMaven] junitPublisher - Archive test results for Maven artifact org.apache.maven.plugin-tools:maven-plugin-tools-annotations:3.6-SNAPSHOT generated by maven-surefire-plugin:test (default-test): m\maven-plugin-tools-annotations\target\surefire-reports\*.xml
[windows-jdk9] Recording test results
[windows-jdk9] [withMaven] junitPublisher - Archive test results for Maven artifact org.apache.maven.plugin-tools:maven-plugin-tools-javadoc:3.6-SNAPSHOT generated by maven-surefire-plugin:test (default-test): m\maven-plugin-tools-javadoc\target\surefire-reports\*.xml
[windows-jdk9] Recording test results
[windows-jdk9] None of the test reports contained any result
[windows-jdk9] [withMaven] junitPublisher - Archive test results for Maven artifact org.apache.maven.plugin-tools:maven-plugin-tools-model:3.6-SNAPSHOT generated by maven-surefire-plugin:test (default-test): m\maven-script\maven-plugin-tools-model\target\surefire-reports\*.xml
[windows-jdk9] Recording test results
[windows-jdk9] [withMaven] junitPublisher - Archive test results for Maven artifact org.apache.maven.plugin-tools:maven-plugin-tools-ant:3.6-SNAPSHOT generated by maven-surefire-plugin:test (default-test): m\maven-script\maven-plugin-tools-ant\target\surefire-reports\*.xml
[windows-jdk9] Recording test results
[windows-jdk9] [withMaven] junitPublisher - Archive test results for Maven artifact org.apache.maven.plugin-tools:maven-script-ant:3.6-SNAPSHOT generated by maven-surefire-plugin:test (default-test): m\maven-script\maven-script-ant\target\surefire-reports\*.xml
[windows-jdk9] Recording test results
[windows-jdk9] [withMaven] junitPublisher - Archive test results for Maven artifact org.apache.maven.plugin-tools:maven-plugin-tools-beanshell:3.6-SNAPSHOT generated by maven-surefire-plugin:test (default-test): m\maven-script\maven-plugin-tools-beanshell\target\surefire-reports\*.xml
[windows-jdk9] Recording test results
[windows-jdk9] None of the test reports contained any result
[windows-jdk9] [withMaven] junitPublisher - Archive test results for Maven artifact org.apache.maven.plugin-tools:maven-script-beanshell:3.6-SNAPSHOT generated by maven-surefire-plugin:test (default-test): m\maven-script\maven-script-beanshell\target\surefire-reports\*.xml
[windows-jdk9] Recording test results
[windows-jdk9] None of the test reports contained any result
[windows-jdk9] [withMaven] junitPublisher - Archive test results for Maven artifact org.apache.maven.plugins:maven-plugin-plugin:3.6-SNAPSHOT generated by maven-surefire-plugin:test (default-test): m\maven-plugin-plugin\target\surefire-reports\*.xml
[windows-jdk9] Recording test results
[windows-jdk9] None of the test reports contained any result
[Pipeline] [windows-jdk9] // withMaven
[Pipeline] [windows-jdk9] cleanWs
[windows-jdk9] [WS-CLEANUP] Deleting project workspace...[WS-CLEANUP] done
[Pipeline] [windows-jdk9] }
[Pipeline] [windows-jdk9] // stage
[Pipeline] [windows-jdk9] }
[Pipeline] [windows-jdk9] // node
[Pipeline] [windows-jdk9] }
[linux-jdk9] [INFO] run post-build script verify.groovy
[linux-jdk9] [INFO]           annotation-with-inheritance/pom.xml .............. SUCCESS (18.6 s)
[linux-jdk9] [INFO] -------------------------------------------------
[linux-jdk9] [INFO] Build Summary:
[linux-jdk9] [INFO]   Passed: 33, Failed: 0, Errors: 0, Skipped: 0
[linux-jdk9] [INFO] -------------------------------------------------
[linux-jdk9] [INFO]
[linux-jdk9] [INFO] --- maven-checkstyle-plugin:3.0.0:check (checkstyle-check) @ maven-plugin-plugin ---
[linux-jdk9] [INFO] ------------------------------------------------------------------------
[linux-jdk9] [INFO] Reactor Summary:
[linux-jdk9] [INFO]
[linux-jdk9] [INFO] Maven Plugin Tools 3.6-SNAPSHOT .................... SUCCESS [ 28.789 s]
[linux-jdk9] [INFO] Maven Plugin Tools Extractor API ................... SUCCESS [ 17.574 s]
[linux-jdk9] [INFO] Maven Plugin Tools Generators ...................... SUCCESS [ 13.043 s]
[linux-jdk9] [INFO] Maven Plugin Tool for Java with Javadoc Tags ....... SUCCESS [ 10.428 s]
[linux-jdk9] [INFO] Maven Plugin Tools Java 5 Annotations .............. SUCCESS [  1.405 s]
[linux-jdk9] [INFO] Maven Plugin Tool for Java with Annotations ........ SUCCESS [  9.097 s]
[linux-jdk9] [INFO] Maven Plugin Tools Javadoc Taglets ................. SUCCESS [ 33.738 s]
[linux-jdk9] [INFO] Maven Script Mojo Support .......................... SUCCESS [  0.710 s]
[linux-jdk9] [INFO] Maven Plugin Metadata Model ........................ SUCCESS [  4.683 s]
[linux-jdk9] [INFO] Maven Plugin Tool for Ant .......................... SUCCESS [  3.362 s]
[linux-jdk9] [INFO] Maven Ant Mojo Support ............................. SUCCESS [  6.834 s]
[linux-jdk9] [INFO] Maven Plugin Tool for Beanshell .................... SUCCESS [  1.239 s]
[linux-jdk9] [INFO] Maven Beanshell Mojo Support ....................... SUCCESS [  1.126 s]
[linux-jdk9] [INFO] Maven Plugin Plugin 3.6-SNAPSHOT ................... SUCCESS [06:13 min]
[linux-jdk9] [INFO] ------------------------------------------------------------------------
[linux-jdk9] [INFO] BUILD SUCCESS
[linux-jdk9] [INFO] ------------------------------------------------------------------------
[linux-jdk9] [INFO] Total time: 08:29 min
[linux-jdk9] [INFO] Finished at: 2018-09-12T16:28:42Z
[linux-jdk9] [INFO] ------------------------------------------------------------------------
[linux-jdk9] [INFO] [jenkins-event-spy] Generated /home/jenkins/jenkins-slave/workspace/en-plugin-tools_MPLUGIN-336-OX2XMFOVDYU6CHOQOCEAQPI7JEFEG4IM2KWEE3CCBTWR4DJXZKUQ@tmp/withMavenba33ced3/maven-spy-20180912-162012-8035083700901871003094.log
[Pipeline] [linux-jdk9] }
[Pipeline] [linux-jdk9] // dir
[windows-jdk8] [INFO] run post-build script verify.bsh
[windows-jdk8] [INFO]           plugin-report\pom.xml ............................ SUCCESS (32.7 s)
[windows-jdk8] [INFO] Building: plugin-report-annotations\pom.xml
[windows-jdk8] [INFO] run post-build script verify.bsh
[windows-jdk8] [INFO]           plugin-report-annotations\pom.xml ................ SUCCESS (15.8 s)
[windows-jdk8] [INFO] Building: skip\pom.xml
[Pipeline] [linux-jdk9] }
[linux-jdk9] [withMaven] invokerPublisher - Archive invoker results for Maven artifact MavenArtifact{org.apache.maven.plugin-tools:maven-plugin-tools-javadoc::3.6-SNAPSHOT(version: 3.6-SNAPSHOT, snapshot:false) } generated by PluginInvocation{org.apache.maven.plugins:maven-invoker-plugin:3.0.1@run  integration-test}: m/maven-plugin-tools-javadoc/target/invoker-reports/*.xml
[linux-jdk9] performing MavenInvokerRecorder, reportsFilenamePattern:'**/m/maven-plugin-tools-javadoc/target/invoker-reports/BUILD*.xml', invokerBuildDir:'**/m/maven-plugin-tools-javadoc/target/it'
[linux-jdk9] Found reports:[/home/jenkins/jenkins-slave/workspace/en-plugin-tools_MPLUGIN-336-OX2XMFOVDYU6CHOQOCEAQPI7JEFEG4IM2KWEE3CCBTWR4DJXZKUQ/m/maven-plugin-tools-javadoc/target/invoker-reports/BUILD-basic.xml]
[linux-jdk9] Found logs:[/home/jenkins/jenkins-slave/workspace/en-plugin-tools_MPLUGIN-336-OX2XMFOVDYU6CHOQOCEAQPI7JEFEG4IM2KWEE3CCBTWR4DJXZKUQ/m/maven-plugin-tools-javadoc/target/it/basic/build.log]
[linux-jdk9] Finished parsing Maven Invoker results (found 1)
[linux-jdk9] [withMaven] invokerPublisher - Archive invoker results for Maven artifact MavenArtifact{org.apache.maven.plugins:maven-plugin-plugin::3.6-SNAPSHOT(version: 3.6-SNAPSHOT, snapshot:false) } generated by PluginInvocation{org.apache.maven.plugins:maven-invoker-plugin:3.0.1@run  integration-test}: m/maven-plugin-plugin/target/invoker-reports/*.xml
[linux-jdk9] performing MavenInvokerRecorder, reportsFilenamePattern:'**/m/maven-plugin-plugin/target/invoker-reports/BUILD*.xml', invokerBuildDir:'**/m/maven-plugin-plugin/target/it'
[linux-jdk9] Found reports:[/home/jenkins/jenkins-slave/workspace/en-plugin-tools_MPLUGIN-336-OX2XMFOVDYU6CHOQOCEAQPI7JEFEG4IM2KWEE3CCBTWR4DJXZKUQ/m/maven-plugin-plugin/target/invoker-reports/BUILD-annotation-with-inheritance-from-deps.xml, /home/jenkins/jenkins-slave/workspace/en-plugin-tools_MPLUGIN-336-OX2XMFOVDYU6CHOQOCEAQPI7JEFEG4IM2KWEE3CCBTWR4DJXZKUQ/m/maven-plugin-plugin/target/invoker-reports/BUILD-annotation-with-inheritance-reactor.xml, /home/jenkins/jenkins-slave/workspace/en-plugin-tools_MPLUGIN-336-OX2XMFOVDYU6CHOQOCEAQPI7JEFEG4IM2KWEE3CCBTWR4DJXZKUQ/m/maven-plugin-plugin/target/invoker-reports/BUILD-annotation-with-inheritance.xml, /home/jenkins/jenkins-slave/workspace/en-plugin-tools_MPLUGIN-336-OX2XMFOVDYU6CHOQOCEAQPI7JEFEG4IM2KWEE3CCBTWR4DJXZKUQ/m/maven-plugin-plugin/target/invoker-reports/BUILD-ant-basic.xml, /home/jenkins/jenkins-slave/workspace/en-plugin-tools_MPLUGIN-336-OX2XMFOVDYU6CHOQOCEAQPI7JEFEG4IM2KWEE3CCBTWR4DJXZKUQ/m/maven-plugin-plugin/target/invoker-reports/BUILD-ant-reference-parameter.xml, /home/jenkins/jenkins-slave/workspace/en-plugin-tools_MPLUGIN-336-OX2XMFOVDYU6CHOQOCEAQPI7JEFEG4IM2KWEE3CCBTWR4DJXZKUQ/m/maven-plugin-plugin/target/invoker-reports/BUILD-ant-simple-usage.xml, /home/jenkins/jenkins-slave/workspace/en-plugin-tools_MPLUGIN-336-OX2XMFOVDYU6CHOQOCEAQPI7JEFEG4IM2KWEE3CCBTWR4DJXZKUQ/m/maven-plugin-plugin/target/invoker-reports/BUILD-ant-since-maven-plugin.xml, /home/jenkins/jenkins-slave/workspace/en-plugin-tools_MPLUGIN-336-OX2XMFOVDYU6CHOQOCEAQPI7JEFEG4IM2KWEE3CCBTWR4DJXZKUQ/m/maven-plugin-plugin/target/invoker-reports/BUILD-asm-failure.xml, /home/jenkins/jenkins-slave/workspace/en-plugin-tools_MPLUGIN-336-OX2XMFOVDYU6CHOQOCEAQPI7JEFEG4IM2KWEE3CCBTWR4DJXZKUQ/m/maven-plugin-plugin/target/invoker-reports/BUILD-beanshell-simple.xml, /home/jenkins/jenkins-slave/workspace/en-plugin-tools_MPLUGIN-336-OX2XMFOVDYU6CHOQOCEAQPI7JEFEG4IM2KWEE3CCBTWR4DJXZKUQ/m/maven-plugin-plugin/target/invoker-reports/BUILD-fix-maven-since-3.x.xml, /home/jenkins/jenkins-slave/workspace/en-plugin-tools_MPLUGIN-336-OX2XMFOVDYU6CHOQOCEAQPI7JEFEG4IM2KWEE3CCBTWR4DJXZKUQ/m/maven-plugin-plugin/target/invoker-reports/BUILD-help-basic.xml, /home/jenkins/jenkins-slave/workspace/en-plugin-tools_MPLUGIN-336-OX2XMFOVDYU6CHOQOCEAQPI7JEFEG4IM2KWEE3CCBTWR4DJXZKUQ/m/maven-plugin-plugin/target/invoker-reports/BUILD-help-package.xml, /home/jenkins/jenkins-slave/workspace/en-plugin-tools_MPLUGIN-336-OX2XMFOVDYU6CHOQOCEAQPI7JEFEG4IM2KWEE3CCBTWR4DJXZKUQ/m/maven-plugin-plugin/target/invoker-reports/BUILD-ignore-plugin-class-realm.xml, /home/jenkins/jenkins-slave/workspace/en-plugin-tools_MPLUGIN-336-OX2XMFOVDYU6CHOQOCEAQPI7JEFEG4IM2KWEE3CCBTWR4DJXZKUQ/m/maven-plugin-plugin/target/invoker-reports/BUILD-java-basic-annotations-jdk8.xml, /home/jenkins/jenkins-slave/workspace/en-plugin-tools_MPLUGIN-336-OX2XMFOVDYU6CHOQOCEAQPI7JEFEG4IM2KWEE3CCBTWR4DJXZKUQ/m/maven-plugin-plugin/target/invoker-reports/BUILD-java-basic-annotations.xml, /home/jenkins/jenkins-slave/workspace/en-plugin-tools_MPLUGIN-336-OX2XMFOVDYU6CHOQOCEAQPI7JEFEG4IM2KWEE3CCBTWR4DJXZKUQ/m/maven-plugin-plugin/target/invoker-reports/BUILD-java-basic.xml, /home/jenkins/jenkins-slave/workspace/en-plugin-tools_MPLUGIN-336-OX2XMFOVDYU6CHOQOCEAQPI7JEFEG4IM2KWEE3CCBTWR4DJXZKUQ/m/maven-plugin-plugin/target/invoker-reports/BUILD-mplugin-187.xml, /home/jenkins/jenkins-slave/workspace/en-plugin-tools_MPLUGIN-336-OX2XMFOVDYU6CHOQOCEAQPI7JEFEG4IM2KWEE3CCBTWR4DJXZKUQ/m/maven-plugin-plugin/target/invoker-reports/BUILD-mplugin-191.xml, /home/jenkins/jenkins-slave/workspace/en-plugin-tools_MPLUGIN-336-OX2XMFOVDYU6CHOQOCEAQPI7JEFEG4IM2KWEE3CCBTWR4DJXZKUQ/m/maven-plugin-plugin/target/invoker-reports/BUILD-mplugin-223.xml, /home/jenkins/jenkins-slave/workspace/en-plugin-tools_MPLUGIN-336-OX2XMFOVDYU6CHOQOCEAQPI7JEFEG4IM2KWEE3CCBTWR4DJXZKUQ/m/maven-plugin-plugin/target/invoker-reports/BUILD-mplugin-272_java8.xml, /home/jenkins/jenkins-slave/workspace/en-plugin-tools_MPLUGIN-336-OX2XMFOVDYU6CHOQOCEAQPI7JEFEG4IM2KWEE3CCBTWR4DJXZKUQ/m/maven-plugin-plugin/target/invoker-reports/BUILD-mplugin-299_no-configuration.xml, /home/jenkins/jenkins-slave/workspace/en-plugin-tools_MPLUGIN-336-OX2XMFOVDYU6CHOQOCEAQPI7JEFEG4IM2KWEE3CCBTWR4DJXZKUQ/m/maven-plugin-plugin/target/invoker-reports/BUILD-mplugin-305_defaultMojoDependencies.xml, /home/jenkins/jenkins-slave/workspace/en-plugin-tools_MPLUGIN-336-OX2XMFOVDYU6CHOQOCEAQPI7JEFEG4IM2KWEE3CCBTWR4DJXZKUQ/m/maven-plugin-plugin/target/invoker-reports/BUILD-mplugin-305_emptyMojoDependencies.xml, /home/jenkins/jenkins-slave/workspace/en-plugin-tools_MPLUGIN-336-OX2XMFOVDYU6CHOQOCEAQPI7JEFEG4IM2KWEE3CCBTWR4DJXZKUQ/m/maven-plugin-plugin/target/invoker-reports/BUILD-mplugin-305_singleMojoDependencies.xml, /home/jenkins/jenkins-slave/workspace/en-plugin-tools_MPLUGIN-336-OX2XMFOVDYU6CHOQOCEAQPI7JEFEG4IM2KWEE3CCBTWR4DJXZKUQ/m/maven-plugin-plugin/target/invoker-reports/BUILD-mplugin-319_report-since.xml, /home/jenkins/jenkins-slave/workspace/en-plugin-tools_MPLUGIN-336-OX2XMFOVDYU6CHOQOCEAQPI7JEFEG4IM2KWEE3CCBTWR4DJXZKUQ/m/maven-plugin-plugin/target/invoker-reports/BUILD-mplugin-324_javadoc.xml, /home/jenkins/jenkins-slave/workspace/en-plugin-tools_MPLUGIN-336-OX2XMFOVDYU6CHOQOCEAQPI7JEFEG4IM2KWEE3CCBTWR4DJXZKUQ/m/maven-plugin-plugin/target/invoker-reports/BUILD-packaging-jar.xml, /home/jenkins/jenkins-slave/workspace/en-plugin-tools_MPLUGIN-336-OX2XMFOVDYU6CHOQOCEAQPI7JEFEG4IM2KWEE3CCBTWR4DJXZKUQ/m/maven-plugin-plugin/target/invoker-reports/BUILD-plugin-info-jdk-default-version.xml, /home/jenkins/jenkins-slave/workspace/en-plugin-tools_MPLUGIN-336-OX2XMFOVDYU6CHOQOCEAQPI7JEFEG4IM2KWEE3CCBTWR4DJXZKUQ/m/maven-plugin-plugin/target/invoker-reports/BUILD-plugin-info-jdk.xml, /home/jenkins/jenkins-slave/workspace/en-plugin-tools_MPLUGIN-336-OX2XMFOVDYU6CHOQOCEAQPI7JEFEG4IM2KWEE3CCBTWR4DJXZKUQ/m/maven-plugin-plugin/target/invoker-reports/BUILD-plugin-report-annotations.xml, /home/jenkins/jenkins-slave/workspace/en-plugin-tools_MPLUGIN-336-OX2XMFOVDYU6CHOQOCEAQPI7JEFEG4IM2KWEE3CCBTWR4DJXZKUQ/m/maven-plugin-plugin/target/invoker-reports/BUILD-plugin-report.xml, /home/jenkins/jenkins-slave/workspace/en-plugin-tools_MPLUGIN-336-OX2XMFOVDYU6CHOQOCEAQPI7JEFEG4IM2KWEE3CCBTWR4DJXZKUQ/m/maven-plugin-plugin/target/invoker-reports/BUILD-skip.xml, /home/jenkins/jenkins-slave/workspace/en-plugin-tools_MPLUGIN-336-OX2XMFOVDYU6CHOQOCEAQPI7JEFEG4IM2KWEE3CCBTWR4DJXZKUQ/m/maven-plugin-plugin/target/invoker-reports/BUILD-source-encoding.xml]
[linux-jdk9] Found logs:[/home/jenkins/jenkins-slave/workspace/en-plugin-tools_MPLUGIN-336-OX2XMFOVDYU6CHOQOCEAQPI7JEFEG4IM2KWEE3CCBTWR4DJXZKUQ/m/maven-plugin-plugin/target/it/annotation-with-inheritance-from-deps/build.log, /home/jenkins/jenkins-slave/workspace/en-plugin-tools_MPLUGIN-336-OX2XMFOVDYU6CHOQOCEAQPI7JEFEG4IM2KWEE3CCBTWR4DJXZKUQ/m/maven-plugin-plugin/target/it/annotation-with-inheritance-reactor/build.log, /home/jenkins/jenkins-slave/workspace/en-plugin-tools_MPLUGIN-336-OX2XMFOVDYU6CHOQOCEAQPI7JEFEG4IM2KWEE3CCBTWR4DJXZKUQ/m/maven-plugin-plugin/target/it/annotation-with-inheritance/build.log, /home/jenkins/jenkins-slave/workspace/en-plugin-tools_MPLUGIN-336-OX2XMFOVDYU6CHOQOCEAQPI7JEFEG4IM2KWEE3CCBTWR4DJXZKUQ/m/maven-plugin-plugin/target/it/ant-basic/build.log, /home/jenkins/jenkins-slave/workspace/en-plugin-tools_MPLUGIN-336-OX2XMFOVDYU6CHOQOCEAQPI7JEFEG4IM2KWEE3CCBTWR4DJXZKUQ/m/maven-plugin-plugin/target/it/ant-reference-parameter/build.log, /home/jenkins/jenkins-slave/workspace/en-plugin-tools_MPLUGIN-336-OX2XMFOVDYU6CHOQOCEAQPI7JEFEG4IM2KWEE3CCBTWR4DJXZKUQ/m/maven-plugin-plugin/target/it/ant-simple-usage/build.log, /home/jenkins/jenkins-slave/workspace/en-plugin-tools_MPLUGIN-336-OX2XMFOVDYU6CHOQOCEAQPI7JEFEG4IM2KWEE3CCBTWR4DJXZKUQ/m/maven-plugin-plugin/target/it/ant-since-maven-plugin/build.log, /home/jenkins/jenkins-slave/workspace/en-plugin-tools_MPLUGIN-336-OX2XMFOVDYU6CHOQOCEAQPI7JEFEG4IM2KWEE3CCBTWR4DJXZKUQ/m/maven-plugin-plugin/target/it/asm-failure/build.log, /home/jenkins/jenkins-slave/workspace/en-plugin-tools_MPLUGIN-336-OX2XMFOVDYU6CHOQOCEAQPI7JEFEG4IM2KWEE3CCBTWR4DJXZKUQ/m/maven-plugin-plugin/target/it/beanshell-simple/build.log, /home/jenkins/jenkins-slave/workspace/en-plugin-tools_MPLUGIN-336-OX2XMFOVDYU6CHOQOCEAQPI7JEFEG4IM2KWEE3CCBTWR4DJXZKUQ/m/maven-plugin-plugin/target/it/fix-maven-since-3.x/build.log, /home/jenkins/jenkins-slave/workspace/en-plugin-tools_MPLUGIN-336-OX2XMFOVDYU6CHOQOCEAQPI7JEFEG4IM2KWEE3CCBTWR4DJXZKUQ/m/maven-plugin-plugin/target/it/help-basic/build.log, /home/jenkins/jenkins-slave/workspace/en-plugin-tools_MPLUGIN-336-OX2XMFOVDYU6CHOQOCEAQPI7JEFEG4IM2KWEE3CCBTWR4DJXZKUQ/m/maven-plugin-plugin/target/it/help-package/build.log, /home/jenkins/jenkins-slave/workspace/en-plugin-tools_MPLUGIN-336-OX2XMFOVDYU6CHOQOCEAQPI7JEFEG4IM2KWEE3CCBTWR4DJXZKUQ/m/maven-plugin-plugin/target/it/ignore-plugin-class-realm/build.log, /home/jenkins/jenkins-slave/workspace/en-plugin-tools_MPLUGIN-336-OX2XMFOVDYU6CHOQOCEAQPI7JEFEG4IM2KWEE3CCBTWR4DJXZKUQ/m/maven-plugin-plugin/target/it/java-basic-annotations-jdk8/build.log, /home/jenkins/jenkins-slave/workspace/en-plugin-tools_MPLUGIN-336-OX2XMFOVDYU6CHOQOCEAQPI7JEFEG4IM2KWEE3CCBTWR4DJXZKUQ/m/maven-plugin-plugin/target/it/java-basic-annotations/build.log, /home/jenkins/jenkins-slave/workspace/en-plugin-tools_MPLUGIN-336-OX2XMFOVDYU6CHOQOCEAQPI7JEFEG4IM2KWEE3CCBTWR4DJXZKUQ/m/maven-plugin-plugin/target/it/java-basic/build.log, /home/jenkins/jenkins-slave/workspace/en-plugin-tools_MPLUGIN-336-OX2XMFOVDYU6CHOQOCEAQPI7JEFEG4IM2KWEE3CCBTWR4DJXZKUQ/m/maven-plugin-plugin/target/it/mplugin-187/build.log, /home/jenkins/jenkins-slave/workspace/en-plugin-tools_MPLUGIN-336-OX2XMFOVDYU6CHOQOCEAQPI7JEFEG4IM2KWEE3CCBTWR4DJXZKUQ/m/maven-plugin-plugin/target/it/mplugin-191/build.log, /home/jenkins/jenkins-slave/workspace/en-plugin-tools_MPLUGIN-336-OX2XMFOVDYU6CHOQOCEAQPI7JEFEG4IM2KWEE3CCBTWR4DJXZKUQ/m/maven-plugin-plugin/target/it/mplugin-223/build.log, /home/jenkins/jenkins-slave/workspace/en-plugin-tools_MPLUGIN-336-OX2XMFOVDYU6CHOQOCEAQPI7JEFEG4IM2KWEE3CCBTWR4DJXZKUQ/m/maven-plugin-plugin/target/it/mplugin-272_java8/build.log, /home/jenkins/jenkins-slave/workspace/en-plugin-tools_MPLUGIN-336-OX2XMFOVDYU6CHOQOCEAQPI7JEFEG4IM2KWEE3CCBTWR4DJXZKUQ/m/maven-plugin-plugin/target/it/mplugin-299_no-configuration/build.log, /home/jenkins/jenkins-slave/workspace/en-plugin-tools_MPLUGIN-336-OX2XMFOVDYU6CHOQOCEAQPI7JEFEG4IM2KWEE3CCBTWR4DJXZKUQ/m/maven-plugin-plugin/target/it/mplugin-305_defaultMojoDependencies/build.log, /home/jenkins/jenkins-slave/workspace/en-plugin-tools_MPLUGIN-336-OX2XMFOVDYU6CHOQOCEAQPI7JEFEG4IM2KWEE3CCBTWR4DJXZKUQ/m/maven-plugin-plugin/target/it/mplugin-305_emptyMojoDependencies/build.log, /home/jenkins/jenkins-slave/workspace/en-plugin-tools_MPLUGIN-336-OX2XMFOVDYU6CHOQOCEAQPI7JEFEG4IM2KWEE3CCBTWR4DJXZKUQ/m/maven-plugin-plugin/target/it/mplugin-305_singleMojoDependencies/build.log, /home/jenkins/jenkins-slave/workspace/en-plugin-tools_MPLUGIN-336-OX2XMFOVDYU6CHOQOCEAQPI7JEFEG4IM2KWEE3CCBTWR4DJXZKUQ/m/maven-plugin-plugin/target/it/mplugin-319_report-since/build.log, /home/jenkins/jenkins-slave/workspace/en-plugin-tools_MPLUGIN-336-OX2XMFOVDYU6CHOQOCEAQPI7JEFEG4IM2KWEE3CCBTWR4DJXZKUQ/m/maven-plugin-plugin/target/it/mplugin-324_javadoc/build.log, /home/jenkins/jenkins-slave/workspace/en-plugin-tools_MPLUGIN-336-OX2XMFOVDYU6CHOQOCEAQPI7JEFEG4IM2KWEE3CCBTWR4DJXZKUQ/m/maven-plugin-plugin/target/it/packaging-jar/build.log, /home/jenkins/jenkins-slave/workspace/en-plugin-tools_MPLUGIN-336-OX2XMFOVDYU6CHOQOCEAQPI7JEFEG4IM2KWEE3CCBTWR4DJXZKUQ/m/maven-plugin-plugin/target/it/plugin-info-jdk-default-version/build.log, /home/jenkins/jenkins-slave/workspace/en-plugin-tools_MPLUGIN-336-OX2XMFOVDYU6CHOQOCEAQPI7JEFEG4IM2KWEE3CCBTWR4DJXZKUQ/m/maven-plugin-plugin/target/it/plugin-info-jdk/build.log, /home/jenkins/jenkins-slave/workspace/en-plugin-tools_MPLUGIN-336-OX2XMFOVDYU6CHOQOCEAQPI7JEFEG4IM2KWEE3CCBTWR4DJXZKUQ/m/maven-plugin-plugin/target/it/plugin-report-annotations/build.log, /home/jenkins/jenkins-slave/workspace/en-plugin-tools_MPLUGIN-336-OX2XMFOVDYU6CHOQOCEAQPI7JEFEG4IM2KWEE3CCBTWR4DJXZKUQ/m/maven-plugin-plugin/target/it/plugin-report/build.log, /home/jenkins/jenkins-slave/workspace/en-plugin-tools_MPLUGIN-336-OX2XMFOVDYU6CHOQOCEAQPI7JEFEG4IM2KWEE3CCBTWR4DJXZKUQ/m/maven-plugin-plugin/target/it/skip/build.log, /home/jenkins/jenkins-slave/workspace/en-plugin-tools_MPLUGIN-336-OX2XMFOVDYU6CHOQOCEAQPI7JEFEG4IM2KWEE3CCBTWR4DJXZKUQ/m/maven-plugin-plugin/target/it/source-encoding/build.log]
[linux-jdk9] Finished parsing Maven Invoker results (found 33)
[linux-jdk9] [withMaven] junitPublisher - Archive test results for Maven artifact org.apache.maven.plugin-tools:maven-plugin-tools-api:3.6-SNAPSHOT generated by maven-surefire-plugin:test (default-test): m/maven-plugin-tools-api/target/surefire-reports/*.xml
[linux-jdk9] Recording test results
[linux-jdk9] [withMaven] junitPublisher - Archive test results for Maven artifact org.apache.maven.plugin-tools:maven-plugin-tools-generators:3.6-SNAPSHOT generated by maven-surefire-plugin:test (default-test): m/maven-plugin-tools-generators/target/surefire-reports/*.xml
[linux-jdk9] Recording test results
[linux-jdk9] [withMaven] junitPublisher - Archive test results for Maven artifact org.apache.maven.plugin-tools:maven-plugin-tools-java:3.6-SNAPSHOT generated by maven-surefire-plugin:test (default-test): m/maven-plugin-tools-java/target/surefire-reports/*.xml
[linux-jdk9] Recording test results
[linux-jdk9] [withMaven] junitPublisher - Archive test results for Maven artifact org.apache.maven.plugin-tools:maven-plugin-annotations:3.6-SNAPSHOT generated by maven-surefire-plugin:test (default-test): m/maven-plugin-annotations/target/surefire-reports/*.xml
[linux-jdk9] Recording test results
[linux-jdk9] None of the test reports contained any result
[linux-jdk9] [withMaven] junitPublisher - Archive test results for Maven artifact org.apache.maven.plugin-tools:maven-plugin-tools-annotations:3.6-SNAPSHOT generated by maven-surefire-plugin:test (default-test): m/maven-plugin-tools-annotations/target/surefire-reports/*.xml
[linux-jdk9] Recording test results
[linux-jdk9] [withMaven] junitPublisher - Archive test results for Maven artifact org.apache.maven.plugin-tools:maven-plugin-tools-javadoc:3.6-SNAPSHOT generated by maven-surefire-plugin:test (default-test): m/maven-plugin-tools-javadoc/target/surefire-reports/*.xml
[linux-jdk9] Recording test results
[linux-jdk9] None of the test reports contained any result
[linux-jdk9] [withMaven] junitPublisher - Archive test results for Maven artifact org.apache.maven.plugin-tools:maven-plugin-tools-model:3.6-SNAPSHOT generated by maven-surefire-plugin:test (default-test): m/maven-script/maven-plugin-tools-model/target/surefire-reports/*.xml
[linux-jdk9] Recording test results
[linux-jdk9] [withMaven] junitPublisher - Archive test results for Maven artifact org.apache.maven.plugin-tools:maven-plugin-tools-ant:3.6-SNAPSHOT generated by maven-surefire-plugin:test (default-test): m/maven-script/maven-plugin-tools-ant/target/surefire-reports/*.xml
[linux-jdk9] Recording test results
[linux-jdk9] [withMaven] junitPublisher - Archive test results for Maven artifact org.apache.maven.plugin-tools:maven-script-ant:3.6-SNAPSHOT generated by maven-surefire-plugin:test (default-test): m/maven-script/maven-script-ant/target/surefire-reports/*.xml
[linux-jdk9] Recording test results
[linux-jdk9] [withMaven] junitPublisher - Archive test results for Maven artifact org.apache.maven.plugin-tools:maven-plugin-tools-beanshell:3.6-SNAPSHOT generated by maven-surefire-plugin:test (default-test): m/maven-script/maven-plugin-tools-beanshell/target/surefire-reports/*.xml
[linux-jdk9] Recording test results
[linux-jdk9] None of the test reports contained any result
[linux-jdk9] [withMaven] junitPublisher - Archive test results for Maven artifact org.apache.maven.plugin-tools:maven-script-beanshell:3.6-SNAPSHOT generated by maven-surefire-plugin:test (default-test): m/maven-script/maven-script-beanshell/target/surefire-reports/*.xml
[linux-jdk9] Recording test results
[linux-jdk9] None of the test reports contained any result
[linux-jdk9] [withMaven] junitPublisher - Archive test results for Maven artifact org.apache.maven.plugins:maven-plugin-plugin:3.6-SNAPSHOT generated by maven-surefire-plugin:test (default-test): m/maven-plugin-plugin/target/surefire-reports/*.xml
[linux-jdk9] Recording test results
[linux-jdk9] None of the test reports contained any result
[Pipeline] [linux-jdk9] // withMaven
[Pipeline] [linux-jdk9] cleanWs
[linux-jdk9] [WS-CLEANUP] Deleting project workspace...[WS-CLEANUP] done
[Pipeline] [linux-jdk9] }
[Pipeline] [linux-jdk9] // stage
[Pipeline] [linux-jdk9] }
[Pipeline] [linux-jdk9] // node
[Pipeline] [linux-jdk9] }
[windows-jdk8] [INFO] run post-build script verify.groovy
[windows-jdk8] [INFO]           skip\pom.xml ..................................... SUCCESS (8.9 s)
[windows-jdk8] [INFO] Building: source-encoding\pom.xml
[windows-jdk8] [INFO] run post-build script verify.groovy
[windows-jdk8] [INFO]           source-encoding\pom.xml .......................... SUCCESS (9.7 s)
[windows-jdk8] [INFO] -------------------------------------------------
[windows-jdk8] [INFO] Build Summary:
[windows-jdk8] [INFO]   Passed: 32, Failed: 1, Errors: 0, Skipped: 0
[windows-jdk8] [INFO] -------------------------------------------------
[windows-jdk8] [WARNING] The following builds failed:
[windows-jdk8] [WARNING] *  asm-failure\pom.xml
[windows-jdk8] [INFO] -------------------------------------------------
[windows-jdk8] [WARNING] Ignoring that 1 build failed.
[windows-jdk8] [INFO]
[windows-jdk8] [INFO] --- maven-checkstyle-plugin:3.0.0:check (checkstyle-check) @ maven-plugin-plugin ---
[windows-jdk8] [INFO] ------------------------------------------------------------------------
[windows-jdk8] [INFO] Reactor Summary:
[windows-jdk8] [INFO]
[windows-jdk8] [INFO] Maven Plugin Tools ................................. SUCCESS [ 26.376 s]
[windows-jdk8] [INFO] Maven Plugin Tools Extractor API ................... SUCCESS [ 15.609 s]
[windows-jdk8] [INFO] Maven Plugin Tools Generators ...................... SUCCESS [ 11.791 s]
[windows-jdk8] [INFO] Maven Plugin Tool for Java with Javadoc Tags ....... SUCCESS [  7.661 s]
[windows-jdk8] [INFO] Maven Plugin Tools Java 5 Annotations .............. SUCCESS [  1.913 s]
[windows-jdk8] [INFO] Maven Plugin Tool for Java with Annotations ........ SUCCESS [  6.588 s]
[windows-jdk8] [INFO] Maven Plugin Tools Javadoc Taglets ................. SUCCESS [ 25.401 s]
[windows-jdk8] [INFO] Maven Script Mojo Support .......................... SUCCESS [  1.201 s]
[windows-jdk8] [INFO] Maven Plugin Metadata Model ........................ SUCCESS [  5.204 s]
[windows-jdk8] [INFO] Maven Plugin Tool for Ant .......................... SUCCESS [  3.726 s]
[windows-jdk8] [INFO] Maven Ant Mojo Support ............................. SUCCESS [  7.426 s]
[windows-jdk8] [INFO] Maven Plugin Tool for Beanshell .................... SUCCESS [  2.625 s]
[windows-jdk8] [INFO] Maven Beanshell Mojo Support ....................... SUCCESS [  2.847 s]
[windows-jdk8] [INFO] Maven Plugin Plugin ................................ SUCCESS [13:11 min]
[windows-jdk8] [INFO] ------------------------------------------------------------------------
[windows-jdk8] [INFO] BUILD SUCCESS
[windows-jdk8] [INFO] ------------------------------------------------------------------------
[windows-jdk8] [INFO] Total time: 15:12 min
[windows-jdk8] [INFO] Finished at: 2018-09-12T16:29:30Z
[windows-jdk8] [INFO] Final Memory: 82M/955M
[windows-jdk8] [INFO] ------------------------------------------------------------------------
[windows-jdk8] [INFO] [jenkins-event-spy] Generated F:\jenkins\jenkins-slave\workspace\en-plugin-tools_MPLUGIN-336-OX2XMFOVDYU6CHOQOCEAQPI7JEFEG4IM2KWEE3CCBTWR4DJXZKUQ@tmp\withMaven9ac9ae79\maven-spy-20180912-161417-2647294086789001865593.log
[windows-jdk8] Picked up JAVA_TOOL_OPTIONS: -Dmaven.ext.class.path="f:\jenkins\jenkins-slave\workspace\en-plugin-tools_MPLUGIN-336-OX2XMFOVDYU6CHOQOCEAQPI7JEFEG4IM2KWEE3CCBTWR4DJXZKUQ@tmp\withMaven9ac9ae79\pipeline-maven-spy.jar" -Dorg.jenkinsci.plugins.pipeline.maven.reportsFolder="f:\jenkins\jenkins-slave\workspace\en-plugin-tools_MPLUGIN-336-OX2XMFOVDYU6CHOQOCEAQPI7JEFEG4IM2KWEE3CCBTWR4DJXZKUQ@tmp\withMaven9ac9ae79"
[Pipeline] [windows-jdk8] }
[Pipeline] [windows-jdk8] // dir
[Pipeline] [windows-jdk8] }
[windows-jdk8] [withMaven] invokerPublisher - Archive invoker results for Maven artifact MavenArtifact{org.apache.maven.plugin-tools:maven-plugin-tools-javadoc::3.6-SNAPSHOT(version: 3.6-SNAPSHOT, snapshot:false) } generated by PluginInvocation{org.apache.maven.plugins:maven-invoker-plugin:3.0.1@run  integration-test}: m\maven-plugin-tools-javadoc\target\invoker-reports\*.xml
[windows-jdk8] performing MavenInvokerRecorder, reportsFilenamePattern:'**/m\maven-plugin-tools-javadoc\target\invoker-reports/BUILD*.xml', invokerBuildDir:'**/m\maven-plugin-tools-javadoc\target\it'
[windows-jdk8] Found reports:[f:\jenkins\jenkins-slave\workspace\en-plugin-tools_MPLUGIN-336-OX2XMFOVDYU6CHOQOCEAQPI7JEFEG4IM2KWEE3CCBTWR4DJXZKUQ\m\maven-plugin-tools-javadoc\target\invoker-reports\BUILD-basic.xml]
[windows-jdk8] Found logs:[f:\jenkins\jenkins-slave\workspace\en-plugin-tools_MPLUGIN-336-OX2XMFOVDYU6CHOQOCEAQPI7JEFEG4IM2KWEE3CCBTWR4DJXZKUQ\m\maven-plugin-tools-javadoc\target\it\basic\build.log]
[windows-jdk8] Finished parsing Maven Invoker results (found 1)
[windows-jdk8] [withMaven] invokerPublisher - Archive invoker results for Maven artifact MavenArtifact{org.apache.maven.plugins:maven-plugin-plugin::3.6-SNAPSHOT(version: 3.6-SNAPSHOT, snapshot:false) } generated by PluginInvocation{org.apache.maven.plugins:maven-invoker-plugin:3.0.1@run  integration-test}: m\maven-plugin-plugin\target\invoker-reports\*.xml
[windows-jdk8] performing MavenInvokerRecorder, reportsFilenamePattern:'**/m\maven-plugin-plugin\target\invoker-reports/BUILD*.xml', invokerBuildDir:'**/m\maven-plugin-plugin\target\it'
[windows-jdk8] Found reports:[f:\jenkins\jenkins-slave\workspace\en-plugin-tools_MPLUGIN-336-OX2XMFOVDYU6CHOQOCEAQPI7JEFEG4IM2KWEE3CCBTWR4DJXZKUQ\m\maven-plugin-plugin\target\invoker-reports\BUILD-annotation-with-inheritance-from-deps.xml, f:\jenkins\jenkins-slave\workspace\en-plugin-tools_MPLUGIN-336-OX2XMFOVDYU6CHOQOCEAQPI7JEFEG4IM2KWEE3CCBTWR4DJXZKUQ\m\maven-plugin-plugin\target\invoker-reports\BUILD-annotation-with-inheritance-reactor.xml, f:\jenkins\jenkins-slave\workspace\en-plugin-tools_MPLUGIN-336-OX2XMFOVDYU6CHOQOCEAQPI7JEFEG4IM2KWEE3CCBTWR4DJXZKUQ\m\maven-plugin-plugin\target\invoker-reports\BUILD-annotation-with-inheritance.xml, f:\jenkins\jenkins-slave\workspace\en-plugin-tools_MPLUGIN-336-OX2XMFOVDYU6CHOQOCEAQPI7JEFEG4IM2KWEE3CCBTWR4DJXZKUQ\m\maven-plugin-plugin\target\invoker-reports\BUILD-ant-basic.xml, f:\jenkins\jenkins-slave\workspace\en-plugin-tools_MPLUGIN-336-OX2XMFOVDYU6CHOQOCEAQPI7JEFEG4IM2KWEE3CCBTWR4DJXZKUQ\m\maven-plugin-plugin\target\invoker-reports\BUILD-ant-reference-parameter.xml, f:\jenkins\jenkins-slave\workspace\en-plugin-tools_MPLUGIN-336-OX2XMFOVDYU6CHOQOCEAQPI7JEFEG4IM2KWEE3CCBTWR4DJXZKUQ\m\maven-plugin-plugin\target\invoker-reports\BUILD-ant-simple-usage.xml, f:\jenkins\jenkins-slave\workspace\en-plugin-tools_MPLUGIN-336-OX2XMFOVDYU6CHOQOCEAQPI7JEFEG4IM2KWEE3CCBTWR4DJXZKUQ\m\maven-plugin-plugin\target\invoker-reports\BUILD-ant-since-maven-plugin.xml, f:\jenkins\jenkins-slave\workspace\en-plugin-tools_MPLUGIN-336-OX2XMFOVDYU6CHOQOCEAQPI7JEFEG4IM2KWEE3CCBTWR4DJXZKUQ\m\maven-plugin-plugin\target\invoker-reports\BUILD-asm-failure.xml, f:\jenkins\jenkins-slave\workspace\en-plugin-tools_MPLUGIN-336-OX2XMFOVDYU6CHOQOCEAQPI7JEFEG4IM2KWEE3CCBTWR4DJXZKUQ\m\maven-plugin-plugin\target\invoker-reports\BUILD-beanshell-simple.xml, f:\jenkins\jenkins-slave\workspace\en-plugin-tools_MPLUGIN-336-OX2XMFOVDYU6CHOQOCEAQPI7JEFEG4IM2KWEE3CCBTWR4DJXZKUQ\m\maven-plugin-plugin\target\invoker-reports\BUILD-fix-maven-since-3.x.xml, f:\jenkins\jenkins-slave\workspace\en-plugin-tools_MPLUGIN-336-OX2XMFOVDYU6CHOQOCEAQPI7JEFEG4IM2KWEE3CCBTWR4DJXZKUQ\m\maven-plugin-plugin\target\invoker-reports\BUILD-help-basic.xml, f:\jenkins\jenkins-slave\workspace\en-plugin-tools_MPLUGIN-336-OX2XMFOVDYU6CHOQOCEAQPI7JEFEG4IM2KWEE3CCBTWR4DJXZKUQ\m\maven-plugin-plugin\target\invoker-reports\BUILD-help-package.xml, f:\jenkins\jenkins-slave\workspace\en-plugin-tools_MPLUGIN-336-OX2XMFOVDYU6CHOQOCEAQPI7JEFEG4IM2KWEE3CCBTWR4DJXZKUQ\m\maven-plugin-plugin\target\invoker-reports\BUILD-ignore-plugin-class-realm.xml, f:\jenkins\jenkins-slave\workspace\en-plugin-tools_MPLUGIN-336-OX2XMFOVDYU6CHOQOCEAQPI7JEFEG4IM2KWEE3CCBTWR4DJXZKUQ\m\maven-plugin-plugin\target\invoker-reports\BUILD-java-basic-annotations-jdk8.xml, f:\jenkins\jenkins-slave\workspace\en-plugin-tools_MPLUGIN-336-OX2XMFOVDYU6CHOQOCEAQPI7JEFEG4IM2KWEE3CCBTWR4DJXZKUQ\m\maven-plugin-plugin\target\invoker-reports\BUILD-java-basic-annotations.xml, f:\jenkins\jenkins-slave\workspace\en-plugin-tools_MPLUGIN-336-OX2XMFOVDYU6CHOQOCEAQPI7JEFEG4IM2KWEE3CCBTWR4DJXZKUQ\m\maven-plugin-plugin\target\invoker-reports\BUILD-java-basic.xml, f:\jenkins\jenkins-slave\workspace\en-plugin-tools_MPLUGIN-336-OX2XMFOVDYU6CHOQOCEAQPI7JEFEG4IM2KWEE3CCBTWR4DJXZKUQ\m\maven-plugin-plugin\target\invoker-reports\BUILD-mplugin-187.xml, f:\jenkins\jenkins-slave\workspace\en-plugin-tools_MPLUGIN-336-OX2XMFOVDYU6CHOQOCEAQPI7JEFEG4IM2KWEE3CCBTWR4DJXZKUQ\m\maven-plugin-plugin\target\invoker-reports\BUILD-mplugin-191.xml, f:\jenkins\jenkins-slave\workspace\en-plugin-tools_MPLUGIN-336-OX2XMFOVDYU6CHOQOCEAQPI7JEFEG4IM2KWEE3CCBTWR4DJXZKUQ\m\maven-plugin-plugin\target\invoker-reports\BUILD-mplugin-223.xml, f:\jenkins\jenkins-slave\workspace\en-plugin-tools_MPLUGIN-336-OX2XMFOVDYU6CHOQOCEAQPI7JEFEG4IM2KWEE3CCBTWR4DJXZKUQ\m\maven-plugin-plugin\target\invoker-reports\BUILD-mplugin-272_java8.xml, f:\jenkins\jenkins-slave\workspace\en-plugin-tools_MPLUGIN-336-OX2XMFOVDYU6CHOQOCEAQPI7JEFEG4IM2KWEE3CCBTWR4DJXZKUQ\m\maven-plugin-plugin\target\invoker-reports\BUILD-mplugin-299_no-configuration.xml, f:\jenkins\jenkins-slave\workspace\en-plugin-tools_MPLUGIN-336-OX2XMFOVDYU6CHOQOCEAQPI7JEFEG4IM2KWEE3CCBTWR4DJXZKUQ\m\maven-plugin-plugin\target\invoker-reports\BUILD-mplugin-305_defaultMojoDependencies.xml, f:\jenkins\jenkins-slave\workspace\en-plugin-tools_MPLUGIN-336-OX2XMFOVDYU6CHOQOCEAQPI7JEFEG4IM2KWEE3CCBTWR4DJXZKUQ\m\maven-plugin-plugin\target\invoker-reports\BUILD-mplugin-305_emptyMojoDependencies.xml, f:\jenkins\jenkins-slave\workspace\en-plugin-tools_MPLUGIN-336-OX2XMFOVDYU6CHOQOCEAQPI7JEFEG4IM2KWEE3CCBTWR4DJXZKUQ\m\maven-plugin-plugin\target\invoker-reports\BUILD-mplugin-305_singleMojoDependencies.xml, f:\jenkins\jenkins-slave\workspace\en-plugin-tools_MPLUGIN-336-OX2XMFOVDYU6CHOQOCEAQPI7JEFEG4IM2KWEE3CCBTWR4DJXZKUQ\m\maven-plugin-plugin\target\invoker-reports\BUILD-mplugin-319_report-since.xml, f:\jenkins\jenkins-slave\workspace\en-plugin-tools_MPLUGIN-336-OX2XMFOVDYU6CHOQOCEAQPI7JEFEG4IM2KWEE3CCBTWR4DJXZKUQ\m\maven-plugin-plugin\target\invoker-reports\BUILD-mplugin-324_javadoc.xml, f:\jenkins\jenkins-slave\workspace\en-plugin-tools_MPLUGIN-336-OX2XMFOVDYU6CHOQOCEAQPI7JEFEG4IM2KWEE3CCBTWR4DJXZKUQ\m\maven-plugin-plugin\target\invoker-reports\BUILD-packaging-jar.xml, f:\jenkins\jenkins-slave\workspace\en-plugin-tools_MPLUGIN-336-OX2XMFOVDYU6CHOQOCEAQPI7JEFEG4IM2KWEE3CCBTWR4DJXZKUQ\m\maven-plugin-plugin\target\invoker-reports\BUILD-plugin-info-jdk-default-version.xml, f:\jenkins\jenkins-slave\workspace\en-plugin-tools_MPLUGIN-336-OX2XMFOVDYU6CHOQOCEAQPI7JEFEG4IM2KWEE3CCBTWR4DJXZKUQ\m\maven-plugin-plugin\target\invoker-reports\BUILD-plugin-info-jdk.xml, f:\jenkins\jenkins-slave\workspace\en-plugin-tools_MPLUGIN-336-OX2XMFOVDYU6CHOQOCEAQPI7JEFEG4IM2KWEE3CCBTWR4DJXZKUQ\m\maven-plugin-plugin\target\invoker-reports\BUILD-plugin-report-annotations.xml, f:\jenkins\jenkins-slave\workspace\en-plugin-tools_MPLUGIN-336-OX2XMFOVDYU6CHOQOCEAQPI7JEFEG4IM2KWEE3CCBTWR4DJXZKUQ\m\maven-plugin-plugin\target\invoker-reports\BUILD-plugin-report.xml, f:\jenkins\jenkins-slave\workspace\en-plugin-tools_MPLUGIN-336-OX2XMFOVDYU6CHOQOCEAQPI7JEFEG4IM2KWEE3CCBTWR4DJXZKUQ\m\maven-plugin-plugin\target\invoker-reports\BUILD-skip.xml, f:\jenkins\jenkins-slave\workspace\en-plugin-tools_MPLUGIN-336-OX2XMFOVDYU6CHOQOCEAQPI7JEFEG4IM2KWEE3CCBTWR4DJXZKUQ\m\maven-plugin-plugin\target\invoker-reports\BUILD-source-encoding.xml]
[windows-jdk8] Found logs:[f:\jenkins\jenkins-slave\workspace\en-plugin-tools_MPLUGIN-336-OX2XMFOVDYU6CHOQOCEAQPI7JEFEG4IM2KWEE3CCBTWR4DJXZKUQ\m\maven-plugin-plugin\target\it\annotation-with-inheritance-from-deps\build.log, f:\jenkins\jenkins-slave\workspace\en-plugin-tools_MPLUGIN-336-OX2XMFOVDYU6CHOQOCEAQPI7JEFEG4IM2KWEE3CCBTWR4DJXZKUQ\m\maven-plugin-plugin\target\it\annotation-with-inheritance-reactor\build.log, f:\jenkins\jenkins-slave\workspace\en-plugin-tools_MPLUGIN-336-OX2XMFOVDYU6CHOQOCEAQPI7JEFEG4IM2KWEE3CCBTWR4DJXZKUQ\m\maven-plugin-plugin\target\it\annotation-with-inheritance\build.log, f:\jenkins\jenkins-slave\workspace\en-plugin-tools_MPLUGIN-336-OX2XMFOVDYU6CHOQOCEAQPI7JEFEG4IM2KWEE3CCBTWR4DJXZKUQ\m\maven-plugin-plugin\target\it\ant-basic\build.log, f:\jenkins\jenkins-slave\workspace\en-plugin-tools_MPLUGIN-336-OX2XMFOVDYU6CHOQOCEAQPI7JEFEG4IM2KWEE3CCBTWR4DJXZKUQ\m\maven-plugin-plugin\target\it\ant-reference-parameter\build.log, f:\jenkins\jenkins-slave\workspace\en-plugin-tools_MPLUGIN-336-OX2XMFOVDYU6CHOQOCEAQPI7JEFEG4IM2KWEE3CCBTWR4DJXZKUQ\m\maven-plugin-plugin\target\it\ant-simple-usage\build.log, f:\jenkins\jenkins-slave\workspace\en-plugin-tools_MPLUGIN-336-OX2XMFOVDYU6CHOQOCEAQPI7JEFEG4IM2KWEE3CCBTWR4DJXZKUQ\m\maven-plugin-plugin\target\it\ant-since-maven-plugin\build.log, f:\jenkins\jenkins-slave\workspace\en-plugin-tools_MPLUGIN-336-OX2XMFOVDYU6CHOQOCEAQPI7JEFEG4IM2KWEE3CCBTWR4DJXZKUQ\m\maven-plugin-plugin\target\it\asm-failure\build.log, f:\jenkins\jenkins-slave\workspace\en-plugin-tools_MPLUGIN-336-OX2XMFOVDYU6CHOQOCEAQPI7JEFEG4IM2KWEE3CCBTWR4DJXZKUQ\m\maven-plugin-plugin\target\it\beanshell-simple\build.log, f:\jenkins\jenkins-slave\workspace\en-plugin-tools_MPLUGIN-336-OX2XMFOVDYU6CHOQOCEAQPI7JEFEG4IM2KWEE3CCBTWR4DJXZKUQ\m\maven-plugin-plugin\target\it\fix-maven-since-3.x\build.log, f:\jenkins\jenkins-slave\workspace\en-plugin-tools_MPLUGIN-336-OX2XMFOVDYU6CHOQOCEAQPI7JEFEG4IM2KWEE3CCBTWR4DJXZKUQ\m\maven-plugin-plugin\target\it\help-basic\build.log, f:\jenkins\jenkins-slave\workspace\en-plugin-tools_MPLUGIN-336-OX2XMFOVDYU6CHOQOCEAQPI7JEFEG4IM2KWEE3CCBTWR4DJXZKUQ\m\maven-plugin-plugin\target\it\help-package\build.log, f:\jenkins\jenkins-slave\workspace\en-plugin-tools_MPLUGIN-336-OX2XMFOVDYU6CHOQOCEAQPI7JEFEG4IM2KWEE3CCBTWR4DJXZKUQ\m\maven-plugin-plugin\target\it\ignore-plugin-class-realm\build.log, f:\jenkins\jenkins-slave\workspace\en-plugin-tools_MPLUGIN-336-OX2XMFOVDYU6CHOQOCEAQPI7JEFEG4IM2KWEE3CCBTWR4DJXZKUQ\m\maven-plugin-plugin\target\it\java-basic-annotations-jdk8\build.log, f:\jenkins\jenkins-slave\workspace\en-plugin-tools_MPLUGIN-336-OX2XMFOVDYU6CHOQOCEAQPI7JEFEG4IM2KWEE3CCBTWR4DJXZKUQ\m\maven-plugin-plugin\target\it\java-basic-annotations\build.log, f:\jenkins\jenkins-slave\workspace\en-plugin-tools_MPLUGIN-336-OX2XMFOVDYU6CHOQOCEAQPI7JEFEG4IM2KWEE3CCBTWR4DJXZKUQ\m\maven-plugin-plugin\target\it\java-basic\build.log, f:\jenkins\jenkins-slave\workspace\en-plugin-tools_MPLUGIN-336-OX2XMFOVDYU6CHOQOCEAQPI7JEFEG4IM2KWEE3CCBTWR4DJXZKUQ\m\maven-plugin-plugin\target\it\mplugin-187\build.log, f:\jenkins\jenkins-slave\workspace\en-plugin-tools_MPLUGIN-336-OX2XMFOVDYU6CHOQOCEAQPI7JEFEG4IM2KWEE3CCBTWR4DJXZKUQ\m\maven-plugin-plugin\target\it\mplugin-191\build.log, f:\jenkins\jenkins-slave\workspace\en-plugin-tools_MPLUGIN-336-OX2XMFOVDYU6CHOQOCEAQPI7JEFEG4IM2KWEE3CCBTWR4DJXZKUQ\m\maven-plugin-plugin\target\it\mplugin-223\build.log, f:\jenkins\jenkins-slave\workspace\en-plugin-tools_MPLUGIN-336-OX2XMFOVDYU6CHOQOCEAQPI7JEFEG4IM2KWEE3CCBTWR4DJXZKUQ\m\maven-plugin-plugin\target\it\mplugin-272_java8\build.log, f:\jenkins\jenkins-slave\workspace\en-plugin-tools_MPLUGIN-336-OX2XMFOVDYU6CHOQOCEAQPI7JEFEG4IM2KWEE3CCBTWR4DJXZKUQ\m\maven-plugin-plugin\target\it\mplugin-299_no-configuration\build.log, f:\jenkins\jenkins-slave\workspace\en-plugin-tools_MPLUGIN-336-OX2XMFOVDYU6CHOQOCEAQPI7JEFEG4IM2KWEE3CCBTWR4DJXZKUQ\m\maven-plugin-plugin\target\it\mplugin-305_defaultMojoDependencies\build.log, f:\jenkins\jenkins-slave\workspace\en-plugin-tools_MPLUGIN-336-OX2XMFOVDYU6CHOQOCEAQPI7JEFEG4IM2KWEE3CCBTWR4DJXZKUQ\m\maven-plugin-plugin\target\it\mplugin-305_emptyMojoDependencies\build.log, f:\jenkins\jenkins-slave\workspace\en-plugin-tools_MPLUGIN-336-OX2XMFOVDYU6CHOQOCEAQPI7JEFEG4IM2KWEE3CCBTWR4DJXZKUQ\m\maven-plugin-plugin\target\it\mplugin-305_singleMojoDependencies\build.log, f:\jenkins\jenkins-slave\workspace\en-plugin-tools_MPLUGIN-336-OX2XMFOVDYU6CHOQOCEAQPI7JEFEG4IM2KWEE3CCBTWR4DJXZKUQ\m\maven-plugin-plugin\target\it\mplugin-319_report-since\build.log, f:\jenkins\jenkins-slave\workspace\en-plugin-tools_MPLUGIN-336-OX2XMFOVDYU6CHOQOCEAQPI7JEFEG4IM2KWEE3CCBTWR4DJXZKUQ\m\maven-plugin-plugin\target\it\mplugin-324_javadoc\build.log, f:\jenkins\jenkins-slave\workspace\en-plugin-tools_MPLUGIN-336-OX2XMFOVDYU6CHOQOCEAQPI7JEFEG4IM2KWEE3CCBTWR4DJXZKUQ\m\maven-plugin-plugin\target\it\packaging-jar\build.log, f:\jenkins\jenkins-slave\workspace\en-plugin-tools_MPLUGIN-336-OX2XMFOVDYU6CHOQOCEAQPI7JEFEG4IM2KWEE3CCBTWR4DJXZKUQ\m\maven-plugin-plugin\target\it\plugin-info-jdk-default-version\build.log, f:\jenkins\jenkins-slave\workspace\en-plugin-tools_MPLUGIN-336-OX2XMFOVDYU6CHOQOCEAQPI7JEFEG4IM2KWEE3CCBTWR4DJXZKUQ\m\maven-plugin-plugin\target\it\plugin-info-jdk\build.log, f:\jenkins\jenkins-slave\workspace\en-plugin-tools_MPLUGIN-336-OX2XMFOVDYU6CHOQOCEAQPI7JEFEG4IM2KWEE3CCBTWR4DJXZKUQ\m\maven-plugin-plugin\target\it\plugin-report-annotations\build.log, f:\jenkins\jenkins-slave\workspace\en-plugin-tools_MPLUGIN-336-OX2XMFOVDYU6CHOQOCEAQPI7JEFEG4IM2KWEE3CCBTWR4DJXZKUQ\m\maven-plugin-plugin\target\it\plugin-report\build.log, f:\jenkins\jenkins-slave\workspace\en-plugin-tools_MPLUGIN-336-OX2XMFOVDYU6CHOQOCEAQPI7JEFEG4IM2KWEE3CCBTWR4DJXZKUQ\m\maven-plugin-plugin\target\it\skip\build.log, f:\jenkins\jenkins-slave\workspace\en-plugin-tools_MPLUGIN-336-OX2XMFOVDYU6CHOQOCEAQPI7JEFEG4IM2KWEE3CCBTWR4DJXZKUQ\m\maven-plugin-plugin\target\it\source-encoding\build.log]
[windows-jdk8] Finished parsing Maven Invoker results (found 33)
[windows-jdk8] [withMaven] junitPublisher - Archive test results for Maven artifact org.apache.maven.plugin-tools:maven-plugin-tools-api:3.6-SNAPSHOT generated by maven-surefire-plugin:test (default-test): m\maven-plugin-tools-api\target\surefire-reports\*.xml
[windows-jdk8] Recording test results
[windows-jdk8] [withMaven] junitPublisher - Archive test results for Maven artifact org.apache.maven.plugin-tools:maven-plugin-tools-generators:3.6-SNAPSHOT generated by maven-surefire-plugin:test (default-test): m\maven-plugin-tools-generators\target\surefire-reports\*.xml
[windows-jdk8] Recording test results
[windows-jdk8] [withMaven] junitPublisher - Archive test results for Maven artifact org.apache.maven.plugin-tools:maven-plugin-tools-java:3.6-SNAPSHOT generated by maven-surefire-plugin:test (default-test): m\maven-plugin-tools-java\target\surefire-reports\*.xml
[windows-jdk8] Recording test results
[windows-jdk8] [withMaven] junitPublisher - Archive test results for Maven artifact org.apache.maven.plugin-tools:maven-plugin-annotations:3.6-SNAPSHOT generated by maven-surefire-plugin:test (default-test): m\maven-plugin-annotations\target\surefire-reports\*.xml
[windows-jdk8] Recording test results
[windows-jdk8] None of the test reports contained any result
[windows-jdk8] [withMaven] junitPublisher - Archive test results for Maven artifact org.apache.maven.plugin-tools:maven-plugin-tools-annotations:3.6-SNAPSHOT generated by maven-surefire-plugin:test (default-test): m\maven-plugin-tools-annotations\target\surefire-reports\*.xml
[windows-jdk8] Recording test results
[windows-jdk8] [withMaven] junitPublisher - Archive test results for Maven artifact org.apache.maven.plugin-tools:maven-plugin-tools-javadoc:3.6-SNAPSHOT generated by maven-surefire-plugin:test (default-test): m\maven-plugin-tools-javadoc\target\surefire-reports\*.xml
[windows-jdk8] Recording test results
[windows-jdk8] None of the test reports contained any result
[windows-jdk8] [withMaven] junitPublisher - Archive test results for Maven artifact org.apache.maven.plugin-tools:maven-plugin-tools-model:3.6-SNAPSHOT generated by maven-surefire-plugin:test (default-test): m\maven-script\maven-plugin-tools-model\target\surefire-reports\*.xml
[windows-jdk8] Recording test results
[windows-jdk8] [withMaven] junitPublisher - Archive test results for Maven artifact org.apache.maven.plugin-tools:maven-plugin-tools-ant:3.6-SNAPSHOT generated by maven-surefire-plugin:test (default-test): m\maven-script\maven-plugin-tools-ant\target\surefire-reports\*.xml
[windows-jdk8] Recording test results
[windows-jdk8] [withMaven] junitPublisher - Archive test results for Maven artifact org.apache.maven.plugin-tools:maven-script-ant:3.6-SNAPSHOT generated by maven-surefire-plugin:test (default-test): m\maven-script\maven-script-ant\target\surefire-reports\*.xml
[windows-jdk8] Recording test results
[windows-jdk8] [withMaven] junitPublisher - Archive test results for Maven artifact org.apache.maven.plugin-tools:maven-plugin-tools-beanshell:3.6-SNAPSHOT generated by maven-surefire-plugin:test (default-test): m\maven-script\maven-plugin-tools-beanshell\target\surefire-reports\*.xml
[windows-jdk8] Recording test results
[windows-jdk8] None of the test reports contained any result
[windows-jdk8] [withMaven] junitPublisher - Archive test results for Maven artifact org.apache.maven.plugin-tools:maven-script-beanshell:3.6-SNAPSHOT generated by maven-surefire-plugin:test (default-test): m\maven-script\maven-script-beanshell\target\surefire-reports\*.xml
[windows-jdk8] Recording test results
[windows-jdk8] None of the test reports contained any result
[windows-jdk8] [withMaven] junitPublisher - Archive test results for Maven artifact org.apache.maven.plugins:maven-plugin-plugin:3.6-SNAPSHOT generated by maven-surefire-plugin:test (default-test): m\maven-plugin-plugin\target\surefire-reports\*.xml
[windows-jdk8] Recording test results
[windows-jdk8] None of the test reports contained any result
[Pipeline] [windows-jdk8] // withMaven
[Pipeline] [windows-jdk8] cleanWs
[windows-jdk8] [WS-CLEANUP] Deleting project workspace...[WS-CLEANUP] done
[Pipeline] [windows-jdk8] }
[Pipeline] [windows-jdk8] // stage
[Pipeline] [windows-jdk8] }
[Pipeline] [windows-jdk8] // node
[Pipeline] [windows-jdk8] }
[Pipeline] // parallel
[Pipeline] stage
[Pipeline] { (Notifications)
[Pipeline] echo
Build result: FAILURE
[Pipeline] jiraIssueSelector
[Pipeline] emailext
Reply | Threaded
Open this post in threaded view
|

Build failed in Jenkins: Maven TLP » maven-plugin-tools » MPLUGIN-336 #5

Apache Jenkins Server-2
See https://builds.apache.org/job/maven-box/job/maven-plugin-tools/job/MPLUGIN-336/5/

No changes.

All tests passed

Build log:
[...truncated 3.86 MB...]
[windows-jdk9] [withMaven] junitPublisher - Archive test results for Maven artifact org.apache.maven.plugin-tools:maven-plugin-tools-model:3.6-SNAPSHOT generated by maven-surefire-plugin:test (default-test): m\maven-script\maven-plugin-tools-model\target\surefire-reports\*.xml
[windows-jdk9] Recording test results
[windows-jdk9] [withMaven] junitPublisher - Archive test results for Maven artifact org.apache.maven.plugin-tools:maven-plugin-tools-ant:3.6-SNAPSHOT generated by maven-surefire-plugin:test (default-test): m\maven-script\maven-plugin-tools-ant\target\surefire-reports\*.xml
[windows-jdk9] Recording test results
[windows-jdk9] [withMaven] junitPublisher - Archive test results for Maven artifact org.apache.maven.plugin-tools:maven-script-ant:3.6-SNAPSHOT generated by maven-surefire-plugin:test (default-test): m\maven-script\maven-script-ant\target\surefire-reports\*.xml
[windows-jdk9] Recording test results
[windows-jdk9] [withMaven] junitPublisher - Archive test results for Maven artifact org.apache.maven.plugin-tools:maven-plugin-tools-beanshell:3.6-SNAPSHOT generated by maven-surefire-plugin:test (default-test): m\maven-script\maven-plugin-tools-beanshell\target\surefire-reports\*.xml
[windows-jdk9] Recording test results
[windows-jdk9] None of the test reports contained any result
[windows-jdk9] [withMaven] junitPublisher - Archive test results for Maven artifact org.apache.maven.plugin-tools:maven-script-beanshell:3.6-SNAPSHOT generated by maven-surefire-plugin:test (default-test): m\maven-script\maven-script-beanshell\target\surefire-reports\*.xml
[windows-jdk9] Recording test results
[windows-jdk9] None of the test reports contained any result
[windows-jdk9] [withMaven] junitPublisher - Archive test results for Maven artifact org.apache.maven.plugins:maven-plugin-plugin:3.6-SNAPSHOT generated by maven-surefire-plugin:test (default-test): m\maven-plugin-plugin\target\surefire-reports\*.xml
[windows-jdk9] Recording test results
[windows-jdk9] None of the test reports contained any result
[Pipeline] [windows-jdk9] // withMaven
[Pipeline] [windows-jdk9] cleanWs
[windows-jdk9] [WS-CLEANUP] Deleting project workspace...[WS-CLEANUP] done
[Pipeline] [windows-jdk9] }
[Pipeline] [windows-jdk9] // stage
[Pipeline] [windows-jdk9] }
[Pipeline] [windows-jdk9] // node
[Pipeline] [windows-jdk9] }
[windows-jdk8] [INFO] run post-build script verify.groovy
[windows-jdk8] [INFO]           mplugin-319_report-since\pom.xml ................. SUCCESS (13.4 s)
[windows-jdk8] [INFO] Building: mplugin-324_javadoc\pom.xml
[windows-jdk7] [INFO]           mplugin-324_javadoc\pom.xml ...................... SUCCESS (24.3 s)
[windows-jdk7] [INFO] Building: packaging-jar\pom.xml
[windows-jdk7] [INFO] run post-build script verify.groovy
[windows-jdk7] [INFO]           packaging-jar\pom.xml ............................ SUCCESS (14.9 s)
[windows-jdk7] [INFO] Building: plugin-info-jdk\pom.xml
[windows-jdk8] [INFO]           mplugin-324_javadoc\pom.xml ...................... SUCCESS (22.6 s)
[windows-jdk8] [INFO] Building: packaging-jar\pom.xml
[windows-jdk8] [INFO] run post-build script verify.groovy
[windows-jdk8] [INFO]           packaging-jar\pom.xml ............................ SUCCESS (12.0 s)
[windows-jdk8] [INFO] Building: plugin-info-jdk\pom.xml
[windows-jdk7] [INFO] run post-build script verify.groovy
[windows-jdk7] [INFO]           plugin-info-jdk\pom.xml .......................... SUCCESS (26.9 s)
[windows-jdk7] [INFO] Building: plugin-info-jdk-default-version\pom.xml
[windows-jdk7] [INFO] run post-build script verify.groovy
[windows-jdk7] [INFO]           plugin-info-jdk-default-version\pom.xml .......... SUCCESS (11.8 s)
[windows-jdk7] [INFO] Building: plugin-report\pom.xml
[windows-jdk8] [INFO] run post-build script verify.groovy
[windows-jdk8] [INFO]           plugin-info-jdk\pom.xml .......................... SUCCESS (25.9 s)
[windows-jdk8] [INFO] Building: plugin-info-jdk-default-version\pom.xml
[windows-jdk8] [INFO] run post-build script verify.groovy
[windows-jdk8] [INFO]           plugin-info-jdk-default-version\pom.xml .......... SUCCESS (10.5 s)
[windows-jdk8] [INFO] Building: plugin-report\pom.xml
[windows-jdk7] [INFO] run post-build script verify.bsh
[windows-jdk7] [INFO]           plugin-report\pom.xml ............................ SUCCESS (44.5 s)
[windows-jdk7] [INFO] Building: plugin-report-annotations\pom.xml
[windows-jdk8] [INFO] run post-build script verify.bsh
[windows-jdk8] [INFO]           plugin-report\pom.xml ............................ SUCCESS (36.7 s)
[windows-jdk8] [INFO] Building: plugin-report-annotations\pom.xml
[windows-jdk7] [INFO] run post-build script verify.bsh
[windows-jdk7] [INFO]           plugin-report-annotations\pom.xml ................ SUCCESS (18.9 s)
[windows-jdk7] [INFO] Building: skip\pom.xml
[windows-jdk8] [INFO] run post-build script verify.bsh
[windows-jdk8] [INFO]           plugin-report-annotations\pom.xml ................ SUCCESS (17.5 s)
[windows-jdk8] [INFO] Building: skip\pom.xml
[windows-jdk7] [INFO] run post-build script verify.groovy
[windows-jdk7] [INFO]           skip\pom.xml ..................................... SUCCESS (10.9 s)
[windows-jdk7] [INFO] Building: source-encoding\pom.xml
[windows-jdk8] [INFO] run post-build script verify.groovy
[windows-jdk8] [INFO]           skip\pom.xml ..................................... SUCCESS (10.1 s)
[windows-jdk8] [INFO] Building: source-encoding\pom.xml
[windows-jdk7] [INFO] run post-build script verify.groovy
[windows-jdk7] [INFO]           source-encoding\pom.xml .......................... SUCCESS (11.4 s)
[windows-jdk7] [INFO] -------------------------------------------------
[windows-jdk7] [INFO] Build Summary:
[windows-jdk7] [INFO]   Passed: 30, Failed: 1, Errors: 0, Skipped: 2
[windows-jdk7] [INFO] -------------------------------------------------
[windows-jdk7] [WARNING] The following builds failed:
[windows-jdk7] [WARNING] *  asm-failure\pom.xml
[windows-jdk7] [INFO] -------------------------------------------------
[windows-jdk7] [WARNING] Ignoring that 1 build failed.
[windows-jdk7] [INFO]
[windows-jdk7] [INFO] --- maven-checkstyle-plugin:3.0.0:check (checkstyle-check) @ maven-plugin-plugin ---
[windows-jdk7] [INFO] ------------------------------------------------------------------------
[windows-jdk7] [INFO] Reactor Summary:
[windows-jdk7] [INFO]
[windows-jdk7] [INFO] Maven Plugin Tools ................................. SUCCESS [ 44.675 s]
[windows-jdk7] [INFO] Maven Plugin Tools Extractor API ................... SUCCESS [ 19.862 s]
[windows-jdk7] [INFO] Maven Plugin Tools Generators ...................... SUCCESS [ 10.546 s]
[windows-jdk7] [INFO] Maven Plugin Tool for Java with Javadoc Tags ....... SUCCESS [  9.667 s]
[windows-jdk7] [INFO] Maven Plugin Tools Java 5 Annotations .............. SUCCESS [  1.822 s]
[windows-jdk7] [INFO] Maven Plugin Tool for Java with Annotations ........ SUCCESS [  8.272 s]
[windows-jdk7] [INFO] Maven Plugin Tools Javadoc Taglets ................. SUCCESS [ 16.356 s]
[windows-jdk7] [INFO] Maven Script Mojo Support .......................... SUCCESS [  1.288 s]
[windows-jdk7] [INFO] Maven Plugin Metadata Model ........................ SUCCESS [  6.728 s]
[windows-jdk7] [INFO] Maven Plugin Tool for Ant .......................... SUCCESS [  3.879 s]
[windows-jdk7] [INFO] Maven Ant Mojo Support ............................. SUCCESS [  7.410 s]
[windows-jdk7] [INFO] Maven Plugin Tool for Beanshell .................... SUCCESS [  2.493 s]
[windows-jdk7] [INFO] Maven Beanshell Mojo Support ....................... SUCCESS [  2.117 s]
[windows-jdk7] [INFO] Maven Plugin Plugin ................................ SUCCESS [10:42 min]
[windows-jdk7] [INFO] ------------------------------------------------------------------------
[windows-jdk7] [INFO] BUILD SUCCESS
[windows-jdk7] [INFO] ------------------------------------------------------------------------
[windows-jdk7] [INFO] Total time: 13:00 min
[windows-jdk7] [INFO] Finished at: 2018-09-14T09:27:37-07:00
[windows-jdk7] [INFO] Final Memory: 71M/822M
[windows-jdk7] [INFO] ------------------------------------------------------------------------
[windows-jdk7] [INFO] [jenkins-event-spy] Generated F:\jenkins\jenkins-slave\workspace\en-plugin-tools_MPLUGIN-336-OX2XMFOVDYU6CHOQOCEAQPI7JEFEG4IM2KWEE3CCBTWR4DJXZKUQ@tmp\withMaven72b503ea\maven-spy-20180914-091437-386451996185698837629.log
[windows-jdk7] Picked up JAVA_TOOL_OPTIONS: -Dmaven.ext.class.path="f:\jenkins\jenkins-slave\workspace\en-plugin-tools_MPLUGIN-336-OX2XMFOVDYU6CHOQOCEAQPI7JEFEG4IM2KWEE3CCBTWR4DJXZKUQ@tmp\withMaven72b503ea\pipeline-maven-spy.jar" -Dorg.jenkinsci.plugins.pipeline.maven.reportsFolder="f:\jenkins\jenkins-slave\workspace\en-plugin-tools_MPLUGIN-336-OX2XMFOVDYU6CHOQOCEAQPI7JEFEG4IM2KWEE3CCBTWR4DJXZKUQ@tmp\withMaven72b503ea"
[Pipeline] [windows-jdk7] }
[Pipeline] [windows-jdk7] // dir
[windows-jdk8] [INFO] run post-build script verify.groovy
[windows-jdk8] [INFO]           source-encoding\pom.xml .......................... SUCCESS (10.9 s)
[windows-jdk8] [INFO] -------------------------------------------------
[windows-jdk8] [INFO] Build Summary:
[windows-jdk8] [INFO]   Passed: 32, Failed: 1, Errors: 0, Skipped: 0
[windows-jdk8] [INFO] -------------------------------------------------
[windows-jdk8] [WARNING] The following builds failed:
[windows-jdk8] [WARNING] *  asm-failure\pom.xml
[windows-jdk8] [INFO] -------------------------------------------------
[windows-jdk8] [WARNING] Ignoring that 1 build failed.
[windows-jdk8] [INFO]
[windows-jdk8] [INFO] --- maven-checkstyle-plugin:3.0.0:check (checkstyle-check) @ maven-plugin-plugin ---
[windows-jdk8] [INFO] ------------------------------------------------------------------------
[windows-jdk8] [INFO] Reactor Summary:
[windows-jdk8] [INFO]
[windows-jdk8] [INFO] Maven Plugin Tools ................................. SUCCESS [ 41.620 s]
[windows-jdk8] [INFO] Maven Plugin Tools Extractor API ................... SUCCESS [ 16.826 s]
[windows-jdk8] [INFO] Maven Plugin Tools Generators ...................... SUCCESS [  9.897 s]
[windows-jdk8] [INFO] Maven Plugin Tool for Java with Javadoc Tags ....... SUCCESS [  8.334 s]
[windows-jdk8] [INFO] Maven Plugin Tools Java 5 Annotations .............. SUCCESS [  1.616 s]
[windows-jdk8] [INFO] Maven Plugin Tool for Java with Annotations ........ SUCCESS [  7.701 s]
[windows-jdk8] [INFO] Maven Plugin Tools Javadoc Taglets ................. SUCCESS [ 32.919 s]
[windows-jdk8] [INFO] Maven Script Mojo Support .......................... SUCCESS [  1.202 s]
[windows-jdk8] [INFO] Maven Plugin Metadata Model ........................ SUCCESS [  7.239 s]
[windows-jdk8] [INFO] Maven Plugin Tool for Ant .......................... SUCCESS [  3.683 s]
[windows-jdk8] [INFO] Maven Ant Mojo Support ............................. SUCCESS [  7.253 s]
[windows-jdk8] [INFO] Maven Plugin Tool for Beanshell .................... SUCCESS [  1.769 s]
[windows-jdk8] [INFO] Maven Beanshell Mojo Support ....................... SUCCESS [  1.401 s]
[windows-jdk8] [INFO] Maven Plugin Plugin ................................ SUCCESS [10:30 min]
[windows-jdk8] [INFO] ------------------------------------------------------------------------
[windows-jdk8] [INFO] BUILD SUCCESS
[windows-jdk8] [INFO] ------------------------------------------------------------------------
[windows-jdk8] [INFO] Total time: 12:53 min
[windows-jdk8] [INFO] Finished at: 2018-09-14T09:27:39-07:00
[windows-jdk8] [INFO] Final Memory: 82M/1171M
[windows-jdk8] [INFO] ------------------------------------------------------------------------
[windows-jdk8] [INFO] [jenkins-event-spy] Generated F:\jenkins\jenkins-slave\workspace\en-plugin-tools_MPLUGIN-336-OX2XMFOVDYU6CHOQOCEAQPI7JEFEG4IM2KWEE3CCBTWR4DJXZKUQ@2@tmp\withMavenb9b18523\maven-spy-20180914-091445-5955049609364153935385.log
[windows-jdk8] Picked up JAVA_TOOL_OPTIONS: -Dmaven.ext.class.path="f:\jenkins\jenkins-slave\workspace\en-plugin-tools_MPLUGIN-336-OX2XMFOVDYU6CHOQOCEAQPI7JEFEG4IM2KWEE3CCBTWR4DJXZKUQ@2@tmp\withMavenb9b18523\pipeline-maven-spy.jar" -Dorg.jenkinsci.plugins.pipeline.maven.reportsFolder="f:\jenkins\jenkins-slave\workspace\en-plugin-tools_MPLUGIN-336-OX2XMFOVDYU6CHOQOCEAQPI7JEFEG4IM2KWEE3CCBTWR4DJXZKUQ@2@tmp\withMavenb9b18523"
[Pipeline] [windows-jdk7] }
[windows-jdk7] [withMaven] invokerPublisher - Archive invoker results for Maven artifact MavenArtifact{org.apache.maven.plugin-tools:maven-plugin-tools-javadoc::3.6-SNAPSHOT(version: 3.6-SNAPSHOT, snapshot:false) } generated by PluginInvocation{org.apache.maven.plugins:maven-invoker-plugin:3.0.1@run  integration-test}: m\maven-plugin-tools-javadoc\target\invoker-reports\*.xml
[windows-jdk7] performing MavenInvokerRecorder, reportsFilenamePattern:'**/m\maven-plugin-tools-javadoc\target\invoker-reports/BUILD*.xml', invokerBuildDir:'**/m\maven-plugin-tools-javadoc\target\it'
[windows-jdk7] Found reports:[f:\jenkins\jenkins-slave\workspace\en-plugin-tools_MPLUGIN-336-OX2XMFOVDYU6CHOQOCEAQPI7JEFEG4IM2KWEE3CCBTWR4DJXZKUQ\m\maven-plugin-tools-javadoc\target\invoker-reports\BUILD-basic.xml]
[windows-jdk7] Found logs:[f:\jenkins\jenkins-slave\workspace\en-plugin-tools_MPLUGIN-336-OX2XMFOVDYU6CHOQOCEAQPI7JEFEG4IM2KWEE3CCBTWR4DJXZKUQ\m\maven-plugin-tools-javadoc\target\it\basic\build.log]
[windows-jdk7] Finished parsing Maven Invoker results (found 1)
[windows-jdk7] [withMaven] invokerPublisher - Archive invoker results for Maven artifact MavenArtifact{org.apache.maven.plugins:maven-plugin-plugin::3.6-SNAPSHOT(version: 3.6-SNAPSHOT, snapshot:false) } generated by PluginInvocation{org.apache.maven.plugins:maven-invoker-plugin:3.0.1@run  integration-test}: m\maven-plugin-plugin\target\invoker-reports\*.xml
[windows-jdk7] performing MavenInvokerRecorder, reportsFilenamePattern:'**/m\maven-plugin-plugin\target\invoker-reports/BUILD*.xml', invokerBuildDir:'**/m\maven-plugin-plugin\target\it'
[windows-jdk7] Found reports:[f:\jenkins\jenkins-slave\workspace\en-plugin-tools_MPLUGIN-336-OX2XMFOVDYU6CHOQOCEAQPI7JEFEG4IM2KWEE3CCBTWR4DJXZKUQ\m\maven-plugin-plugin\target\invoker-reports\BUILD-annotation-with-inheritance-from-deps.xml, f:\jenkins\jenkins-slave\workspace\en-plugin-tools_MPLUGIN-336-OX2XMFOVDYU6CHOQOCEAQPI7JEFEG4IM2KWEE3CCBTWR4DJXZKUQ\m\maven-plugin-plugin\target\invoker-reports\BUILD-annotation-with-inheritance-reactor.xml, f:\jenkins\jenkins-slave\workspace\en-plugin-tools_MPLUGIN-336-OX2XMFOVDYU6CHOQOCEAQPI7JEFEG4IM2KWEE3CCBTWR4DJXZKUQ\m\maven-plugin-plugin\target\invoker-reports\BUILD-annotation-with-inheritance.xml, f:\jenkins\jenkins-slave\workspace\en-plugin-tools_MPLUGIN-336-OX2XMFOVDYU6CHOQOCEAQPI7JEFEG4IM2KWEE3CCBTWR4DJXZKUQ\m\maven-plugin-plugin\target\invoker-reports\BUILD-ant-basic.xml, f:\jenkins\jenkins-slave\workspace\en-plugin-tools_MPLUGIN-336-OX2XMFOVDYU6CHOQOCEAQPI7JEFEG4IM2KWEE3CCBTWR4DJXZKUQ\m\maven-plugin-plugin\target\invoker-reports\BUILD-ant-reference-parameter.xml, f:\jenkins\jenkins-slave\workspace\en-plugin-tools_MPLUGIN-336-OX2XMFOVDYU6CHOQOCEAQPI7JEFEG4IM2KWEE3CCBTWR4DJXZKUQ\m\maven-plugin-plugin\target\invoker-reports\BUILD-ant-simple-usage.xml, f:\jenkins\jenkins-slave\workspace\en-plugin-tools_MPLUGIN-336-OX2XMFOVDYU6CHOQOCEAQPI7JEFEG4IM2KWEE3CCBTWR4DJXZKUQ\m\maven-plugin-plugin\target\invoker-reports\BUILD-ant-since-maven-plugin.xml, f:\jenkins\jenkins-slave\workspace\en-plugin-tools_MPLUGIN-336-OX2XMFOVDYU6CHOQOCEAQPI7JEFEG4IM2KWEE3CCBTWR4DJXZKUQ\m\maven-plugin-plugin\target\invoker-reports\BUILD-asm-failure.xml, f:\jenkins\jenkins-slave\workspace\en-plugin-tools_MPLUGIN-336-OX2XMFOVDYU6CHOQOCEAQPI7JEFEG4IM2KWEE3CCBTWR4DJXZKUQ\m\maven-plugin-plugin\target\invoker-reports\BUILD-beanshell-simple.xml, f:\jenkins\jenkins-slave\workspace\en-plugin-tools_MPLUGIN-336-OX2XMFOVDYU6CHOQOCEAQPI7JEFEG4IM2KWEE3CCBTWR4DJXZKUQ\m\maven-plugin-plugin\target\invoker-reports\BUILD-fix-maven-since-3.x.xml, f:\jenkins\jenkins-slave\workspace\en-plugin-tools_MPLUGIN-336-OX2XMFOVDYU6CHOQOCEAQPI7JEFEG4IM2KWEE3CCBTWR4DJXZKUQ\m\maven-plugin-plugin\target\invoker-reports\BUILD-help-basic.xml, f:\jenkins\jenkins-slave\workspace\en-plugin-tools_MPLUGIN-336-OX2XMFOVDYU6CHOQOCEAQPI7JEFEG4IM2KWEE3CCBTWR4DJXZKUQ\m\maven-plugin-plugin\target\invoker-reports\BUILD-help-package.xml, f:\jenkins\jenkins-slave\workspace\en-plugin-tools_MPLUGIN-336-OX2XMFOVDYU6CHOQOCEAQPI7JEFEG4IM2KWEE3CCBTWR4DJXZKUQ\m\maven-plugin-plugin\target\invoker-reports\BUILD-ignore-plugin-class-realm.xml, f:\jenkins\jenkins-slave\workspace\en-plugin-tools_MPLUGIN-336-OX2XMFOVDYU6CHOQOCEAQPI7JEFEG4IM2KWEE3CCBTWR4DJXZKUQ\m\maven-plugin-plugin\target\invoker-reports\BUILD-java-basic-annotations-jdk8.xml, f:\jenkins\jenkins-slave\workspace\en-plugin-tools_MPLUGIN-336-OX2XMFOVDYU6CHOQOCEAQPI7JEFEG4IM2KWEE3CCBTWR4DJXZKUQ\m\maven-plugin-plugin\target\invoker-reports\BUILD-java-basic-annotations.xml, f:\jenkins\jenkins-slave\workspace\en-plugin-tools_MPLUGIN-336-OX2XMFOVDYU6CHOQOCEAQPI7JEFEG4IM2KWEE3CCBTWR4DJXZKUQ\m\maven-plugin-plugin\target\invoker-reports\BUILD-java-basic.xml, f:\jenkins\jenkins-slave\workspace\en-plugin-tools_MPLUGIN-336-OX2XMFOVDYU6CHOQOCEAQPI7JEFEG4IM2KWEE3CCBTWR4DJXZKUQ\m\maven-plugin-plugin\target\invoker-reports\BUILD-mplugin-187.xml, f:\jenkins\jenkins-slave\workspace\en-plugin-tools_MPLUGIN-336-OX2XMFOVDYU6CHOQOCEAQPI7JEFEG4IM2KWEE3CCBTWR4DJXZKUQ\m\maven-plugin-plugin\target\invoker-reports\BUILD-mplugin-191.xml, f:\jenkins\jenkins-slave\workspace\en-plugin-tools_MPLUGIN-336-OX2XMFOVDYU6CHOQOCEAQPI7JEFEG4IM2KWEE3CCBTWR4DJXZKUQ\m\maven-plugin-plugin\target\invoker-reports\BUILD-mplugin-223.xml, f:\jenkins\jenkins-slave\workspace\en-plugin-tools_MPLUGIN-336-OX2XMFOVDYU6CHOQOCEAQPI7JEFEG4IM2KWEE3CCBTWR4DJXZKUQ\m\maven-plugin-plugin\target\invoker-reports\BUILD-mplugin-272_java8.xml, f:\jenkins\jenkins-slave\workspace\en-plugin-tools_MPLUGIN-336-OX2XMFOVDYU6CHOQOCEAQPI7JEFEG4IM2KWEE3CCBTWR4DJXZKUQ\m\maven-plugin-plugin\target\invoker-reports\BUILD-mplugin-299_no-configuration.xml, f:\jenkins\jenkins-slave\workspace\en-plugin-tools_MPLUGIN-336-OX2XMFOVDYU6CHOQOCEAQPI7JEFEG4IM2KWEE3CCBTWR4DJXZKUQ\m\maven-plugin-plugin\target\invoker-reports\BUILD-mplugin-305_defaultMojoDependencies.xml, f:\jenkins\jenkins-slave\workspace\en-plugin-tools_MPLUGIN-336-OX2XMFOVDYU6CHOQOCEAQPI7JEFEG4IM2KWEE3CCBTWR4DJXZKUQ\m\maven-plugin-plugin\target\invoker-reports\BUILD-mplugin-305_emptyMojoDependencies.xml, f:\jenkins\jenkins-slave\workspace\en-plugin-tools_MPLUGIN-336-OX2XMFOVDYU6CHOQOCEAQPI7JEFEG4IM2KWEE3CCBTWR4DJXZKUQ\m\maven-plugin-plugin\target\invoker-reports\BUILD-mplugin-305_singleMojoDependencies.xml, f:\jenkins\jenkins-slave\workspace\en-plugin-tools_MPLUGIN-336-OX2XMFOVDYU6CHOQOCEAQPI7JEFEG4IM2KWEE3CCBTWR4DJXZKUQ\m\maven-plugin-plugin\target\invoker-reports\BUILD-mplugin-319_report-since.xml, f:\jenkins\jenkins-slave\workspace\en-plugin-tools_MPLUGIN-336-OX2XMFOVDYU6CHOQOCEAQPI7JEFEG4IM2KWEE3CCBTWR4DJXZKUQ\m\maven-plugin-plugin\target\invoker-reports\BUILD-mplugin-324_javadoc.xml, f:\jenkins\jenkins-slave\workspace\en-plugin-tools_MPLUGIN-336-OX2XMFOVDYU6CHOQOCEAQPI7JEFEG4IM2KWEE3CCBTWR4DJXZKUQ\m\maven-plugin-plugin\target\invoker-reports\BUILD-packaging-jar.xml, f:\jenkins\jenkins-slave\workspace\en-plugin-tools_MPLUGIN-336-OX2XMFOVDYU6CHOQOCEAQPI7JEFEG4IM2KWEE3CCBTWR4DJXZKUQ\m\maven-plugin-plugin\target\invoker-reports\BUILD-plugin-info-jdk-default-version.xml, f:\jenkins\jenkins-slave\workspace\en-plugin-tools_MPLUGIN-336-OX2XMFOVDYU6CHOQOCEAQPI7JEFEG4IM2KWEE3CCBTWR4DJXZKUQ\m\maven-plugin-plugin\target\invoker-reports\BUILD-plugin-info-jdk.xml, f:\jenkins\jenkins-slave\workspace\en-plugin-tools_MPLUGIN-336-OX2XMFOVDYU6CHOQOCEAQPI7JEFEG4IM2KWEE3CCBTWR4DJXZKUQ\m\maven-plugin-plugin\target\invoker-reports\BUILD-plugin-report-annotations.xml, f:\jenkins\jenkins-slave\workspace\en-plugin-tools_MPLUGIN-336-OX2XMFOVDYU6CHOQOCEAQPI7JEFEG4IM2KWEE3CCBTWR4DJXZKUQ\m\maven-plugin-plugin\target\invoker-reports\BUILD-plugin-report.xml, f:\jenkins\jenkins-slave\workspace\en-plugin-tools_MPLUGIN-336-OX2XMFOVDYU6CHOQOCEAQPI7JEFEG4IM2KWEE3CCBTWR4DJXZKUQ\m\maven-plugin-plugin\target\invoker-reports\BUILD-skip.xml, f:\jenkins\jenkins-slave\workspace\en-plugin-tools_MPLUGIN-336-OX2XMFOVDYU6CHOQOCEAQPI7JEFEG4IM2KWEE3CCBTWR4DJXZKUQ\m\maven-plugin-plugin\target\invoker-reports\BUILD-source-encoding.xml]
[windows-jdk7] Found logs:[f:\jenkins\jenkins-slave\workspace\en-plugin-tools_MPLUGIN-336-OX2XMFOVDYU6CHOQOCEAQPI7JEFEG4IM2KWEE3CCBTWR4DJXZKUQ\m\maven-plugin-plugin\target\it\annotation-with-inheritance-from-deps\build.log, f:\jenkins\jenkins-slave\workspace\en-plugin-tools_MPLUGIN-336-OX2XMFOVDYU6CHOQOCEAQPI7JEFEG4IM2KWEE3CCBTWR4DJXZKUQ\m\maven-plugin-plugin\target\it\annotation-with-inheritance-reactor\build.log, f:\jenkins\jenkins-slave\workspace\en-plugin-tools_MPLUGIN-336-OX2XMFOVDYU6CHOQOCEAQPI7JEFEG4IM2KWEE3CCBTWR4DJXZKUQ\m\maven-plugin-plugin\target\it\annotation-with-inheritance\build.log, f:\jenkins\jenkins-slave\workspace\en-plugin-tools_MPLUGIN-336-OX2XMFOVDYU6CHOQOCEAQPI7JEFEG4IM2KWEE3CCBTWR4DJXZKUQ\m\maven-plugin-plugin\target\it\ant-basic\build.log, f:\jenkins\jenkins-slave\workspace\en-plugin-tools_MPLUGIN-336-OX2XMFOVDYU6CHOQOCEAQPI7JEFEG4IM2KWEE3CCBTWR4DJXZKUQ\m\maven-plugin-plugin\target\it\ant-reference-parameter\build.log, f:\jenkins\jenkins-slave\workspace\en-plugin-tools_MPLUGIN-336-OX2XMFOVDYU6CHOQOCEAQPI7JEFEG4IM2KWEE3CCBTWR4DJXZKUQ\m\maven-plugin-plugin\target\it\ant-simple-usage\build.log, f:\jenkins\jenkins-slave\workspace\en-plugin-tools_MPLUGIN-336-OX2XMFOVDYU6CHOQOCEAQPI7JEFEG4IM2KWEE3CCBTWR4DJXZKUQ\m\maven-plugin-plugin\target\it\ant-since-maven-plugin\build.log, f:\jenkins\jenkins-slave\workspace\en-plugin-tools_MPLUGIN-336-OX2XMFOVDYU6CHOQOCEAQPI7JEFEG4IM2KWEE3CCBTWR4DJXZKUQ\m\maven-plugin-plugin\target\it\asm-failure\build.log, f:\jenkins\jenkins-slave\workspace\en-plugin-tools_MPLUGIN-336-OX2XMFOVDYU6CHOQOCEAQPI7JEFEG4IM2KWEE3CCBTWR4DJXZKUQ\m\maven-plugin-plugin\target\it\beanshell-simple\build.log, f:\jenkins\jenkins-slave\workspace\en-plugin-tools_MPLUGIN-336-OX2XMFOVDYU6CHOQOCEAQPI7JEFEG4IM2KWEE3CCBTWR4DJXZKUQ\m\maven-plugin-plugin\target\it\fix-maven-since-3.x\build.log, f:\jenkins\jenkins-slave\workspace\en-plugin-tools_MPLUGIN-336-OX2XMFOVDYU6CHOQOCEAQPI7JEFEG4IM2KWEE3CCBTWR4DJXZKUQ\m\maven-plugin-plugin\target\it\help-basic\build.log, f:\jenkins\jenkins-slave\workspace\en-plugin-tools_MPLUGIN-336-OX2XMFOVDYU6CHOQOCEAQPI7JEFEG4IM2KWEE3CCBTWR4DJXZKUQ\m\maven-plugin-plugin\target\it\help-package\build.log, f:\jenkins\jenkins-slave\workspace\en-plugin-tools_MPLUGIN-336-OX2XMFOVDYU6CHOQOCEAQPI7JEFEG4IM2KWEE3CCBTWR4DJXZKUQ\m\maven-plugin-plugin\target\it\ignore-plugin-class-realm\build.log, f:\jenkins\jenkins-slave\workspace\en-plugin-tools_MPLUGIN-336-OX2XMFOVDYU6CHOQOCEAQPI7JEFEG4IM2KWEE3CCBTWR4DJXZKUQ\m\maven-plugin-plugin\target\it\java-basic-annotations\build.log, f:\jenkins\jenkins-slave\workspace\en-plugin-tools_MPLUGIN-336-OX2XMFOVDYU6CHOQOCEAQPI7JEFEG4IM2KWEE3CCBTWR4DJXZKUQ\m\maven-plugin-plugin\target\it\java-basic\build.log, f:\jenkins\jenkins-slave\workspace\en-plugin-tools_MPLUGIN-336-OX2XMFOVDYU6CHOQOCEAQPI7JEFEG4IM2KWEE3CCBTWR4DJXZKUQ\m\maven-plugin-plugin\target\it\mplugin-187\build.log, f:\jenkins\jenkins-slave\workspace\en-plugin-tools_MPLUGIN-336-OX2XMFOVDYU6CHOQOCEAQPI7JEFEG4IM2KWEE3CCBTWR4DJXZKUQ\m\maven-plugin-plugin\target\it\mplugin-191\build.log, f:\jenkins\jenkins-slave\workspace\en-plugin-tools_MPLUGIN-336-OX2XMFOVDYU6CHOQOCEAQPI7JEFEG4IM2KWEE3CCBTWR4DJXZKUQ\m\maven-plugin-plugin\target\it\mplugin-223\build.log, f:\jenkins\jenkins-slave\workspace\en-plugin-tools_MPLUGIN-336-OX2XMFOVDYU6CHOQOCEAQPI7JEFEG4IM2KWEE3CCBTWR4DJXZKUQ\m\maven-plugin-plugin\target\it\mplugin-299_no-configuration\build.log, f:\jenkins\jenkins-slave\workspace\en-plugin-tools_MPLUGIN-336-OX2XMFOVDYU6CHOQOCEAQPI7JEFEG4IM2KWEE3CCBTWR4DJXZKUQ\m\maven-plugin-plugin\target\it\mplugin-305_defaultMojoDependencies\build.log, f:\jenkins\jenkins-slave\workspace\en-plugin-tools_MPLUGIN-336-OX2XMFOVDYU6CHOQOCEAQPI7JEFEG4IM2KWEE3CCBTWR4DJXZKUQ\m\maven-plugin-plugin\target\it\mplugin-305_emptyMojoDependencies\build.log, f:\jenkins\jenkins-slave\workspace\en-plugin-tools_MPLUGIN-336-OX2XMFOVDYU6CHOQOCEAQPI7JEFEG4IM2KWEE3CCBTWR4DJXZKUQ\m\maven-plugin-plugin\target\it\mplugin-305_singleMojoDependencies\build.log, f:\jenkins\jenkins-slave\workspace\en-plugin-tools_MPLUGIN-336-OX2XMFOVDYU6CHOQOCEAQPI7JEFEG4IM2KWEE3CCBTWR4DJXZKUQ\m\maven-plugin-plugin\target\it\mplugin-319_report-since\build.log, f:\jenkins\jenkins-slave\workspace\en-plugin-tools_MPLUGIN-336-OX2XMFOVDYU6CHOQOCEAQPI7JEFEG4IM2KWEE3CCBTWR4DJXZKUQ\m\maven-plugin-plugin\target\it\mplugin-324_javadoc\build.log, f:\jenkins\jenkins-slave\workspace\en-plugin-tools_MPLUGIN-336-OX2XMFOVDYU6CHOQOCEAQPI7JEFEG4IM2KWEE3CCBTWR4DJXZKUQ\m\maven-plugin-plugin\target\it\packaging-jar\build.log, f:\jenkins\jenkins-slave\workspace\en-plugin-tools_MPLUGIN-336-OX2XMFOVDYU6CHOQOCEAQPI7JEFEG4IM2KWEE3CCBTWR4DJXZKUQ\m\maven-plugin-plugin\target\it\plugin-info-jdk-default-version\build.log, f:\jenkins\jenkins-slave\workspace\en-plugin-tools_MPLUGIN-336-OX2XMFOVDYU6CHOQOCEAQPI7JEFEG4IM2KWEE3CCBTWR4DJXZKUQ\m\maven-plugin-plugin\target\it\plugin-info-jdk\build.log, f:\jenkins\jenkins-slave\workspace\en-plugin-tools_MPLUGIN-336-OX2XMFOVDYU6CHOQOCEAQPI7JEFEG4IM2KWEE3CCBTWR4DJXZKUQ\m\maven-plugin-plugin\target\it\plugin-report-annotations\build.log, f:\jenkins\jenkins-slave\workspace\en-plugin-tools_MPLUGIN-336-OX2XMFOVDYU6CHOQOCEAQPI7JEFEG4IM2KWEE3CCBTWR4DJXZKUQ\m\maven-plugin-plugin\target\it\plugin-report\build.log, f:\jenkins\jenkins-slave\workspace\en-plugin-tools_MPLUGIN-336-OX2XMFOVDYU6CHOQOCEAQPI7JEFEG4IM2KWEE3CCBTWR4DJXZKUQ\m\maven-plugin-plugin\target\it\skip\build.log, f:\jenkins\jenkins-slave\workspace\en-plugin-tools_MPLUGIN-336-OX2XMFOVDYU6CHOQOCEAQPI7JEFEG4IM2KWEE3CCBTWR4DJXZKUQ\m\maven-plugin-plugin\target\it\source-encoding\build.log]
[windows-jdk7] Finished parsing Maven Invoker results (found 33)
[windows-jdk7] [withMaven] junitPublisher - Archive test results for Maven artifact org.apache.maven.plugin-tools:maven-plugin-tools-api:3.6-SNAPSHOT generated by maven-surefire-plugin:test (default-test): m\maven-plugin-tools-api\target\surefire-reports\*.xml
[windows-jdk7] Recording test results
[windows-jdk7] [withMaven] junitPublisher - Archive test results for Maven artifact org.apache.maven.plugin-tools:maven-plugin-tools-generators:3.6-SNAPSHOT generated by maven-surefire-plugin:test (default-test): m\maven-plugin-tools-generators\target\surefire-reports\*.xml
[windows-jdk7] Recording test results
[windows-jdk7] [withMaven] junitPublisher - Archive test results for Maven artifact org.apache.maven.plugin-tools:maven-plugin-tools-java:3.6-SNAPSHOT generated by maven-surefire-plugin:test (default-test): m\maven-plugin-tools-java\target\surefire-reports\*.xml
[windows-jdk7] Recording test results
[windows-jdk7] [withMaven] junitPublisher - Archive test results for Maven artifact org.apache.maven.plugin-tools:maven-plugin-annotations:3.6-SNAPSHOT generated by maven-surefire-plugin:test (default-test): m\maven-plugin-annotations\target\surefire-reports\*.xml
[windows-jdk7] Recording test results
[windows-jdk7] None of the test reports contained any result
[windows-jdk7] [withMaven] junitPublisher - Archive test results for Maven artifact org.apache.maven.plugin-tools:maven-plugin-tools-annotations:3.6-SNAPSHOT generated by maven-surefire-plugin:test (default-test): m\maven-plugin-tools-annotations\target\surefire-reports\*.xml
[windows-jdk7] Recording test results
[windows-jdk7] [withMaven] junitPublisher - Archive test results for Maven artifact org.apache.maven.plugin-tools:maven-plugin-tools-javadoc:3.6-SNAPSHOT generated by maven-surefire-plugin:test (default-test): m\maven-plugin-tools-javadoc\target\surefire-reports\*.xml
[windows-jdk7] Recording test results
[windows-jdk7] None of the test reports contained any result
[windows-jdk7] [withMaven] junitPublisher - Archive test results for Maven artifact org.apache.maven.plugin-tools:maven-plugin-tools-model:3.6-SNAPSHOT generated by maven-surefire-plugin:test (default-test): m\maven-script\maven-plugin-tools-model\target\surefire-reports\*.xml
[windows-jdk7] Recording test results
[windows-jdk7] [withMaven] junitPublisher - Archive test results for Maven artifact org.apache.maven.plugin-tools:maven-plugin-tools-ant:3.6-SNAPSHOT generated by maven-surefire-plugin:test (default-test): m\maven-script\maven-plugin-tools-ant\target\surefire-reports\*.xml
[windows-jdk7] Recording test results
[windows-jdk7] [withMaven] junitPublisher - Archive test results for Maven artifact org.apache.maven.plugin-tools:maven-script-ant:3.6-SNAPSHOT generated by maven-surefire-plugin:test (default-test): m\maven-script\maven-script-ant\target\surefire-reports\*.xml
[windows-jdk7] Recording test results
[windows-jdk7] [withMaven] junitPublisher - Archive test results for Maven artifact org.apache.maven.plugin-tools:maven-plugin-tools-beanshell:3.6-SNAPSHOT generated by maven-surefire-plugin:test (default-test): m\maven-script\maven-plugin-tools-beanshell\target\surefire-reports\*.xml
[windows-jdk7] Recording test results
[windows-jdk7] None of the test reports contained any result
[windows-jdk7] [withMaven] junitPublisher - Archive test results for Maven artifact org.apache.maven.plugin-tools:maven-script-beanshell:3.6-SNAPSHOT generated by maven-surefire-plugin:test (default-test): m\maven-script\maven-script-beanshell\target\surefire-reports\*.xml
[windows-jdk7] Recording test results
[windows-jdk7] None of the test reports contained any result
[windows-jdk7] [withMaven] junitPublisher - Archive test results for Maven artifact org.apache.maven.plugins:maven-plugin-plugin:3.6-SNAPSHOT generated by maven-surefire-plugin:test (default-test): m\maven-plugin-plugin\target\surefire-reports\*.xml
[windows-jdk7] Recording test results
[windows-jdk7] None of the test reports contained any result
[Pipeline] [windows-jdk7] // withMaven
[Pipeline] [windows-jdk7] cleanWs
[Pipeline] [windows-jdk8] }
[Pipeline] [windows-jdk8] // dir
[windows-jdk7] [WS-CLEANUP] Deleting project workspace...[WS-CLEANUP] done
[Pipeline] [windows-jdk8] }
[windows-jdk8] [withMaven] invokerPublisher - Archive invoker results for Maven artifact MavenArtifact{org.apache.maven.plugin-tools:maven-plugin-tools-javadoc::3.6-SNAPSHOT(version: 3.6-SNAPSHOT, snapshot:false) } generated by PluginInvocation{org.apache.maven.plugins:maven-invoker-plugin:3.0.1@run  integration-test}: m\maven-plugin-tools-javadoc\target\invoker-reports\*.xml
[windows-jdk8] performing MavenInvokerRecorder, reportsFilenamePattern:'**/m\maven-plugin-tools-javadoc\target\invoker-reports/BUILD*.xml', invokerBuildDir:'**/m\maven-plugin-tools-javadoc\target\it'
[windows-jdk8] Found reports:[f:\jenkins\jenkins-slave\workspace\en-plugin-tools_MPLUGIN-336-OX2XMFOVDYU6CHOQOCEAQPI7JEFEG4IM2KWEE3CCBTWR4DJXZKUQ@2\m\maven-plugin-tools-javadoc\target\invoker-reports\BUILD-basic.xml]
[windows-jdk8] Found logs:[f:\jenkins\jenkins-slave\workspace\en-plugin-tools_MPLUGIN-336-OX2XMFOVDYU6CHOQOCEAQPI7JEFEG4IM2KWEE3CCBTWR4DJXZKUQ@2\m\maven-plugin-tools-javadoc\target\it\basic\build.log]
[windows-jdk8] Finished parsing Maven Invoker results (found 1)
[windows-jdk8] [withMaven] invokerPublisher - Archive invoker results for Maven artifact MavenArtifact{org.apache.maven.plugins:maven-plugin-plugin::3.6-SNAPSHOT(version: 3.6-SNAPSHOT, snapshot:false) } generated by PluginInvocation{org.apache.maven.plugins:maven-invoker-plugin:3.0.1@run  integration-test}: m\maven-plugin-plugin\target\invoker-reports\*.xml
[windows-jdk8] performing MavenInvokerRecorder, reportsFilenamePattern:'**/m\maven-plugin-plugin\target\invoker-reports/BUILD*.xml', invokerBuildDir:'**/m\maven-plugin-plugin\target\it'
[windows-jdk8] Found reports:[f:\jenkins\jenkins-slave\workspace\en-plugin-tools_MPLUGIN-336-OX2XMFOVDYU6CHOQOCEAQPI7JEFEG4IM2KWEE3CCBTWR4DJXZKUQ@2\m\maven-plugin-plugin\target\invoker-reports\BUILD-annotation-with-inheritance-from-deps.xml, f:\jenkins\jenkins-slave\workspace\en-plugin-tools_MPLUGIN-336-OX2XMFOVDYU6CHOQOCEAQPI7JEFEG4IM2KWEE3CCBTWR4DJXZKUQ@2\m\maven-plugin-plugin\target\invoker-reports\BUILD-annotation-with-inheritance-reactor.xml, f:\jenkins\jenkins-slave\workspace\en-plugin-tools_MPLUGIN-336-OX2XMFOVDYU6CHOQOCEAQPI7JEFEG4IM2KWEE3CCBTWR4DJXZKUQ@2\m\maven-plugin-plugin\target\invoker-reports\BUILD-annotation-with-inheritance.xml, f:\jenkins\jenkins-slave\workspace\en-plugin-tools_MPLUGIN-336-OX2XMFOVDYU6CHOQOCEAQPI7JEFEG4IM2KWEE3CCBTWR4DJXZKUQ@2\m\maven-plugin-plugin\target\invoker-reports\BUILD-ant-basic.xml, f:\jenkins\jenkins-slave\workspace\en-plugin-tools_MPLUGIN-336-OX2XMFOVDYU6CHOQOCEAQPI7JEFEG4IM2KWEE3CCBTWR4DJXZKUQ@2\m\maven-plugin-plugin\target\invoker-reports\BUILD-ant-reference-parameter.xml, f:\jenkins\jenkins-slave\workspace\en-plugin-tools_MPLUGIN-336-OX2XMFOVDYU6CHOQOCEAQPI7JEFEG4IM2KWEE3CCBTWR4DJXZKUQ@2\m\maven-plugin-plugin\target\invoker-reports\BUILD-ant-simple-usage.xml, f:\jenkins\jenkins-slave\workspace\en-plugin-tools_MPLUGIN-336-OX2XMFOVDYU6CHOQOCEAQPI7JEFEG4IM2KWEE3CCBTWR4DJXZKUQ@2\m\maven-plugin-plugin\target\invoker-reports\BUILD-ant-since-maven-plugin.xml, f:\jenkins\jenkins-slave\workspace\en-plugin-tools_MPLUGIN-336-OX2XMFOVDYU6CHOQOCEAQPI7JEFEG4IM2KWEE3CCBTWR4DJXZKUQ@2\m\maven-plugin-plugin\target\invoker-reports\BUILD-asm-failure.xml, f:\jenkins\jenkins-slave\workspace\en-plugin-tools_MPLUGIN-336-OX2XMFOVDYU6CHOQOCEAQPI7JEFEG4IM2KWEE3CCBTWR4DJXZKUQ@2\m\maven-plugin-plugin\target\invoker-reports\BUILD-beanshell-simple.xml, f:\jenkins\jenkins-slave\workspace\en-plugin-tools_MPLUGIN-336-OX2XMFOVDYU6CHOQOCEAQPI7JEFEG4IM2KWEE3CCBTWR4DJXZKUQ@2\m\maven-plugin-plugin\target\invoker-reports\BUILD-fix-maven-since-3.x.xml, f:\jenkins\jenkins-slave\workspace\en-plugin-tools_MPLUGIN-336-OX2XMFOVDYU6CHOQOCEAQPI7JEFEG4IM2KWEE3CCBTWR4DJXZKUQ@2\m\maven-plugin-plugin\target\invoker-reports\BUILD-help-basic.xml, f:\jenkins\jenkins-slave\workspace\en-plugin-tools_MPLUGIN-336-OX2XMFOVDYU6CHOQOCEAQPI7JEFEG4IM2KWEE3CCBTWR4DJXZKUQ@2\m\maven-plugin-plugin\target\invoker-reports\BUILD-help-package.xml, f:\jenkins\jenkins-slave\workspace\en-plugin-tools_MPLUGIN-336-OX2XMFOVDYU6CHOQOCEAQPI7JEFEG4IM2KWEE3CCBTWR4DJXZKUQ@2\m\maven-plugin-plugin\target\invoker-reports\BUILD-ignore-plugin-class-realm.xml, f:\jenkins\jenkins-slave\workspace\en-plugin-tools_MPLUGIN-336-OX2XMFOVDYU6CHOQOCEAQPI7JEFEG4IM2KWEE3CCBTWR4DJXZKUQ@2\m\maven-plugin-plugin\target\invoker-reports\BUILD-java-basic-annotations-jdk8.xml, f:\jenkins\jenkins-slave\workspace\en-plugin-tools_MPLUGIN-336-OX2XMFOVDYU6CHOQOCEAQPI7JEFEG4IM2KWEE3CCBTWR4DJXZKUQ@2\m\maven-plugin-plugin\target\invoker-reports\BUILD-java-basic-annotations.xml, f:\jenkins\jenkins-slave\workspace\en-plugin-tools_MPLUGIN-336-OX2XMFOVDYU6CHOQOCEAQPI7JEFEG4IM2KWEE3CCBTWR4DJXZKUQ@2\m\maven-plugin-plugin\target\invoker-reports\BUILD-java-basic.xml, f:\jenkins\jenkins-slave\workspace\en-plugin-tools_MPLUGIN-336-OX2XMFOVDYU6CHOQOCEAQPI7JEFEG4IM2KWEE3CCBTWR4DJXZKUQ@2\m\maven-plugin-plugin\target\invoker-reports\BUILD-mplugin-187.xml, f:\jenkins\jenkins-slave\workspace\en-plugin-tools_MPLUGIN-336-OX2XMFOVDYU6CHOQOCEAQPI7JEFEG4IM2KWEE3CCBTWR4DJXZKUQ@2\m\maven-plugin-plugin\target\invoker-reports\BUILD-mplugin-191.xml, f:\jenkins\jenkins-slave\workspace\en-plugin-tools_MPLUGIN-336-OX2XMFOVDYU6CHOQOCEAQPI7JEFEG4IM2KWEE3CCBTWR4DJXZKUQ@2\m\maven-plugin-plugin\target\invoker-reports\BUILD-mplugin-223.xml, f:\jenkins\jenkins-slave\workspace\en-plugin-tools_MPLUGIN-336-OX2XMFOVDYU6CHOQOCEAQPI7JEFEG4IM2KWEE3CCBTWR4DJXZKUQ@2\m\maven-plugin-plugin\target\invoker-reports\BUILD-mplugin-272_java8.xml, f:\jenkins\jenkins-slave\workspace\en-plugin-tools_MPLUGIN-336-OX2XMFOVDYU6CHOQOCEAQPI7JEFEG4IM2KWEE3CCBTWR4DJXZKUQ@2\m\maven-plugin-plugin\target\invoker-reports\BUILD-mplugin-299_no-configuration.xml, f:\jenkins\jenkins-slave\workspace\en-plugin-tools_MPLUGIN-336-OX2XMFOVDYU6CHOQOCEAQPI7JEFEG4IM2KWEE3CCBTWR4DJXZKUQ@2\m\maven-plugin-plugin\target\invoker-reports\BUILD-mplugin-305_defaultMojoDependencies.xml, f:\jenkins\jenkins-slave\workspace\en-plugin-tools_MPLUGIN-336-OX2XMFOVDYU6CHOQOCEAQPI7JEFEG4IM2KWEE3CCBTWR4DJXZKUQ@2\m\maven-plugin-plugin\target\invoker-reports\BUILD-mplugin-305_emptyMojoDependencies.xml, f:\jenkins\jenkins-slave\workspace\en-plugin-tools_MPLUGIN-336-OX2XMFOVDYU6CHOQOCEAQPI7JEFEG4IM2KWEE3CCBTWR4DJXZKUQ@2\m\maven-plugin-plugin\target\invoker-reports\BUILD-mplugin-305_singleMojoDependencies.xml, f:\jenkins\jenkins-slave\workspace\en-plugin-tools_MPLUGIN-336-OX2XMFOVDYU6CHOQOCEAQPI7JEFEG4IM2KWEE3CCBTWR4DJXZKUQ@2\m\maven-plugin-plugin\target\invoker-reports\BUILD-mplugin-319_report-since.xml, f:\jenkins\jenkins-slave\workspace\en-plugin-tools_MPLUGIN-336-OX2XMFOVDYU6CHOQOCEAQPI7JEFEG4IM2KWEE3CCBTWR4DJXZKUQ@2\m\maven-plugin-plugin\target\invoker-reports\BUILD-mplugin-324_javadoc.xml, f:\jenkins\jenkins-slave\workspace\en-plugin-tools_MPLUGIN-336-OX2XMFOVDYU6CHOQOCEAQPI7JEFEG4IM2KWEE3CCBTWR4DJXZKUQ@2\m\maven-plugin-plugin\target\invoker-reports\BUILD-packaging-jar.xml, f:\jenkins\jenkins-slave\workspace\en-plugin-tools_MPLUGIN-336-OX2XMFOVDYU6CHOQOCEAQPI7JEFEG4IM2KWEE3CCBTWR4DJXZKUQ@2\m\maven-plugin-plugin\target\invoker-reports\BUILD-plugin-info-jdk-default-version.xml, f:\jenkins\jenkins-slave\workspace\en-plugin-tools_MPLUGIN-336-OX2XMFOVDYU6CHOQOCEAQPI7JEFEG4IM2KWEE3CCBTWR4DJXZKUQ@2\m\maven-plugin-plugin\target\invoker-reports\BUILD-plugin-info-jdk.xml, f:\jenkins\jenkins-slave\workspace\en-plugin-tools_MPLUGIN-336-OX2XMFOVDYU6CHOQOCEAQPI7JEFEG4IM2KWEE3CCBTWR4DJXZKUQ@2\m\maven-plugin-plugin\target\invoker-reports\BUILD-plugin-report-annotations.xml, f:\jenkins\jenkins-slave\workspace\en-plugin-tools_MPLUGIN-336-OX2XMFOVDYU6CHOQOCEAQPI7JEFEG4IM2KWEE3CCBTWR4DJXZKUQ@2\m\maven-plugin-plugin\target\invoker-reports\BUILD-plugin-report.xml, f:\jenkins\jenkins-slave\workspace\en-plugin-tools_MPLUGIN-336-OX2XMFOVDYU6CHOQOCEAQPI7JEFEG4IM2KWEE3CCBTWR4DJXZKUQ@2\m\maven-plugin-plugin\target\invoker-reports\BUILD-skip.xml, f:\jenkins\jenkins-slave\workspace\en-plugin-tools_MPLUGIN-336-OX2XMFOVDYU6CHOQOCEAQPI7JEFEG4IM2KWEE3CCBTWR4DJXZKUQ@2\m\maven-plugin-plugin\target\invoker-reports\BUILD-source-encoding.xml]
[windows-jdk8] Found logs:[f:\jenkins\jenkins-slave\workspace\en-plugin-tools_MPLUGIN-336-OX2XMFOVDYU6CHOQOCEAQPI7JEFEG4IM2KWEE3CCBTWR4DJXZKUQ@2\m\maven-plugin-plugin\target\it\annotation-with-inheritance-from-deps\build.log, f:\jenkins\jenkins-slave\workspace\en-plugin-tools_MPLUGIN-336-OX2XMFOVDYU6CHOQOCEAQPI7JEFEG4IM2KWEE3CCBTWR4DJXZKUQ@2\m\maven-plugin-plugin\target\it\annotation-with-inheritance-reactor\build.log, f:\jenkins\jenkins-slave\workspace\en-plugin-tools_MPLUGIN-336-OX2XMFOVDYU6CHOQOCEAQPI7JEFEG4IM2KWEE3CCBTWR4DJXZKUQ@2\m\maven-plugin-plugin\target\it\annotation-with-inheritance\build.log, f:\jenkins\jenkins-slave\workspace\en-plugin-tools_MPLUGIN-336-OX2XMFOVDYU6CHOQOCEAQPI7JEFEG4IM2KWEE3CCBTWR4DJXZKUQ@2\m\maven-plugin-plugin\target\it\ant-basic\build.log, f:\jenkins\jenkins-slave\workspace\en-plugin-tools_MPLUGIN-336-OX2XMFOVDYU6CHOQOCEAQPI7JEFEG4IM2KWEE3CCBTWR4DJXZKUQ@2\m\maven-plugin-plugin\target\it\ant-reference-parameter\build.log, f:\jenkins\jenkins-slave\workspace\en-plugin-tools_MPLUGIN-336-OX2XMFOVDYU6CHOQOCEAQPI7JEFEG4IM2KWEE3CCBTWR4DJXZKUQ@2\m\maven-plugin-plugin\target\it\ant-simple-usage\build.log, f:\jenkins\jenkins-slave\workspace\en-plugin-tools_MPLUGIN-336-OX2XMFOVDYU6CHOQOCEAQPI7JEFEG4IM2KWEE3CCBTWR4DJXZKUQ@2\m\maven-plugin-plugin\target\it\ant-since-maven-plugin\build.log, f:\jenkins\jenkins-slave\workspace\en-plugin-tools_MPLUGIN-336-OX2XMFOVDYU6CHOQOCEAQPI7JEFEG4IM2KWEE3CCBTWR4DJXZKUQ@2\m\maven-plugin-plugin\target\it\asm-failure\build.log, f:\jenkins\jenkins-slave\workspace\en-plugin-tools_MPLUGIN-336-OX2XMFOVDYU6CHOQOCEAQPI7JEFEG4IM2KWEE3CCBTWR4DJXZKUQ@2\m\maven-plugin-plugin\target\it\beanshell-simple\build.log, f:\jenkins\jenkins-slave\workspace\en-plugin-tools_MPLUGIN-336-OX2XMFOVDYU6CHOQOCEAQPI7JEFEG4IM2KWEE3CCBTWR4DJXZKUQ@2\m\maven-plugin-plugin\target\it\fix-maven-since-3.x\build.log, f:\jenkins\jenkins-slave\workspace\en-plugin-tools_MPLUGIN-336-OX2XMFOVDYU6CHOQOCEAQPI7JEFEG4IM2KWEE3CCBTWR4DJXZKUQ@2\m\maven-plugin-plugin\target\it\help-basic\build.log, f:\jenkins\jenkins-slave\workspace\en-plugin-tools_MPLUGIN-336-OX2XMFOVDYU6CHOQOCEAQPI7JEFEG4IM2KWEE3CCBTWR4DJXZKUQ@2\m\maven-plugin-plugin\target\it\help-package\build.log, f:\jenkins\jenkins-slave\workspace\en-plugin-tools_MPLUGIN-336-OX2XMFOVDYU6CHOQOCEAQPI7JEFEG4IM2KWEE3CCBTWR4DJXZKUQ@2\m\maven-plugin-plugin\target\it\ignore-plugin-class-realm\build.log, f:\jenkins\jenkins-slave\workspace\en-plugin-tools_MPLUGIN-336-OX2XMFOVDYU6CHOQOCEAQPI7JEFEG4IM2KWEE3CCBTWR4DJXZKUQ@2\m\maven-plugin-plugin\target\it\java-basic-annotations-jdk8\build.log, f:\jenkins\jenkins-slave\workspace\en-plugin-tools_MPLUGIN-336-OX2XMFOVDYU6CHOQOCEAQPI7JEFEG4IM2KWEE3CCBTWR4DJXZKUQ@2\m\maven-plugin-plugin\target\it\java-basic-annotations\build.log, f:\jenkins\jenkins-slave\workspace\en-plugin-tools_MPLUGIN-336-OX2XMFOVDYU6CHOQOCEAQPI7JEFEG4IM2KWEE3CCBTWR4DJXZKUQ@2\m\maven-plugin-plugin\target\it\java-basic\build.log, f:\jenkins\jenkins-slave\workspace\en-plugin-tools_MPLUGIN-336-OX2XMFOVDYU6CHOQOCEAQPI7JEFEG4IM2KWEE3CCBTWR4DJXZKUQ@2\m\maven-plugin-plugin\target\it\mplugin-187\build.log, f:\jenkins\jenkins-slave\workspace\en-plugin-tools_MPLUGIN-336-OX2XMFOVDYU6CHOQOCEAQPI7JEFEG4IM2KWEE3CCBTWR4DJXZKUQ@2\m\maven-plugin-plugin\target\it\mplugin-191\build.log, f:\jenkins\jenkins-slave\workspace\en-plugin-tools_MPLUGIN-336-OX2XMFOVDYU6CHOQOCEAQPI7JEFEG4IM2KWEE3CCBTWR4DJXZKUQ@2\m\maven-plugin-plugin\target\it\mplugin-223\build.log, f:\jenkins\jenkins-slave\workspace\en-plugin-tools_MPLUGIN-336-OX2XMFOVDYU6CHOQOCEAQPI7JEFEG4IM2KWEE3CCBTWR4DJXZKUQ@2\m\maven-plugin-plugin\target\it\mplugin-272_java8\build.log, f:\jenkins\jenkins-slave\workspace\en-plugin-tools_MPLUGIN-336-OX2XMFOVDYU6CHOQOCEAQPI7JEFEG4IM2KWEE3CCBTWR4DJXZKUQ@2\m\maven-plugin-plugin\target\it\mplugin-299_no-configuration\build.log, f:\jenkins\jenkins-slave\workspace\en-plugin-tools_MPLUGIN-336-OX2XMFOVDYU6CHOQOCEAQPI7JEFEG4IM2KWEE3CCBTWR4DJXZKUQ@2\m\maven-plugin-plugin\target\it\mplugin-305_defaultMojoDependencies\build.log, f:\jenkins\jenkins-slave\workspace\en-plugin-tools_MPLUGIN-336-OX2XMFOVDYU6CHOQOCEAQPI7JEFEG4IM2KWEE3CCBTWR4DJXZKUQ@2\m\maven-plugin-plugin\target\it\mplugin-305_emptyMojoDependencies\build.log, f:\jenkins\jenkins-slave\workspace\en-plugin-tools_MPLUGIN-336-OX2XMFOVDYU6CHOQOCEAQPI7JEFEG4IM2KWEE3CCBTWR4DJXZKUQ@2\m\maven-plugin-plugin\target\it\mplugin-305_singleMojoDependencies\build.log, f:\jenkins\jenkins-slave\workspace\en-plugin-tools_MPLUGIN-336-OX2XMFOVDYU6CHOQOCEAQPI7JEFEG4IM2KWEE3CCBTWR4DJXZKUQ@2\m\maven-plugin-plugin\target\it\mplugin-319_report-since\build.log, f:\jenkins\jenkins-slave\workspace\en-plugin-tools_MPLUGIN-336-OX2XMFOVDYU6CHOQOCEAQPI7JEFEG4IM2KWEE3CCBTWR4DJXZKUQ@2\m\maven-plugin-plugin\target\it\mplugin-324_javadoc\build.log, f:\jenkins\jenkins-slave\workspace\en-plugin-tools_MPLUGIN-336-OX2XMFOVDYU6CHOQOCEAQPI7JEFEG4IM2KWEE3CCBTWR4DJXZKUQ@2\m\maven-plugin-plugin\target\it\packaging-jar\build.log, f:\jenkins\jenkins-slave\workspace\en-plugin-tools_MPLUGIN-336-OX2XMFOVDYU6CHOQOCEAQPI7JEFEG4IM2KWEE3CCBTWR4DJXZKUQ@2\m\maven-plugin-plugin\target\it\plugin-info-jdk-default-version\build.log, f:\jenkins\jenkins-slave\workspace\en-plugin-tools_MPLUGIN-336-OX2XMFOVDYU6CHOQOCEAQPI7JEFEG4IM2KWEE3CCBTWR4DJXZKUQ@2\m\maven-plugin-plugin\target\it\plugin-info-jdk\build.log, f:\jenkins\jenkins-slave\workspace\en-plugin-tools_MPLUGIN-336-OX2XMFOVDYU6CHOQOCEAQPI7JEFEG4IM2KWEE3CCBTWR4DJXZKUQ@2\m\maven-plugin-plugin\target\it\plugin-report-annotations\build.log, f:\jenkins\jenkins-slave\workspace\en-plugin-tools_MPLUGIN-336-OX2XMFOVDYU6CHOQOCEAQPI7JEFEG4IM2KWEE3CCBTWR4DJXZKUQ@2\m\maven-plugin-plugin\target\it\plugin-report\build.log, f:\jenkins\jenkins-slave\workspace\en-plugin-tools_MPLUGIN-336-OX2XMFOVDYU6CHOQOCEAQPI7JEFEG4IM2KWEE3CCBTWR4DJXZKUQ@2\m\maven-plugin-plugin\target\it\skip\build.log, f:\jenkins\jenkins-slave\workspace\en-plugin-tools_MPLUGIN-336-OX2XMFOVDYU6CHOQOCEAQPI7JEFEG4IM2KWEE3CCBTWR4DJXZKUQ@2\m\maven-plugin-plugin\target\it\source-encoding\build.log]
[windows-jdk8] Finished parsing Maven Invoker results (found 33)
[windows-jdk8] [withMaven] junitPublisher - Archive test results for Maven artifact org.apache.maven.plugin-tools:maven-plugin-tools-api:3.6-SNAPSHOT generated by maven-surefire-plugin:test (default-test): m\maven-plugin-tools-api\target\surefire-reports\*.xml
[windows-jdk8] Recording test results
[windows-jdk8] [withMaven] junitPublisher - Archive test results for Maven artifact org.apache.maven.plugin-tools:maven-plugin-tools-generators:3.6-SNAPSHOT generated by maven-surefire-plugin:test (default-test): m\maven-plugin-tools-generators\target\surefire-reports\*.xml
[windows-jdk8] Recording test results
[windows-jdk8] [withMaven] junitPublisher - Archive test results for Maven artifact org.apache.maven.plugin-tools:maven-plugin-tools-java:3.6-SNAPSHOT generated by maven-surefire-plugin:test (default-test): m\maven-plugin-tools-java\target\surefire-reports\*.xml
[windows-jdk8] Recording test results
[windows-jdk8] [withMaven] junitPublisher - Archive test results for Maven artifact org.apache.maven.plugin-tools:maven-plugin-annotations:3.6-SNAPSHOT generated by maven-surefire-plugin:test (default-test): m\maven-plugin-annotations\target\surefire-reports\*.xml
[windows-jdk8] Recording test results
[windows-jdk8] None of the test reports contained any result
[windows-jdk8] [withMaven] junitPublisher - Archive test results for Maven artifact org.apache.maven.plugin-tools:maven-plugin-tools-annotations:3.6-SNAPSHOT generated by maven-surefire-plugin:test (default-test): m\maven-plugin-tools-annotations\target\surefire-reports\*.xml
[windows-jdk8] Recording test results
[windows-jdk8] [withMaven] junitPublisher - Archive test results for Maven artifact org.apache.maven.plugin-tools:maven-plugin-tools-javadoc:3.6-SNAPSHOT generated by maven-surefire-plugin:test (default-test): m\maven-plugin-tools-javadoc\target\surefire-reports\*.xml
[windows-jdk8] Recording test results
[windows-jdk8] None of the test reports contained any result
[windows-jdk8] [withMaven] junitPublisher - Archive test results for Maven artifact org.apache.maven.plugin-tools:maven-plugin-tools-model:3.6-SNAPSHOT generated by maven-surefire-plugin:test (default-test): m\maven-script\maven-plugin-tools-model\target\surefire-reports\*.xml
[windows-jdk8] Recording test results
[windows-jdk8] [withMaven] junitPublisher - Archive test results for Maven artifact org.apache.maven.plugin-tools:maven-plugin-tools-ant:3.6-SNAPSHOT generated by maven-surefire-plugin:test (default-test): m\maven-script\maven-plugin-tools-ant\target\surefire-reports\*.xml
[windows-jdk8] Recording test results
[windows-jdk8] [withMaven] junitPublisher - Archive test results for Maven artifact org.apache.maven.plugin-tools:maven-script-ant:3.6-SNAPSHOT generated by maven-surefire-plugin:test (default-test): m\maven-script\maven-script-ant\target\surefire-reports\*.xml
[windows-jdk8] Recording test results
[windows-jdk8] [withMaven] junitPublisher - Archive test results for Maven artifact org.apache.maven.plugin-tools:maven-plugin-tools-beanshell:3.6-SNAPSHOT generated by maven-surefire-plugin:test (default-test): m\maven-script\maven-plugin-tools-beanshell\target\surefire-reports\*.xml
[windows-jdk8] Recording test results
[windows-jdk8] None of the test reports contained any result
[windows-jdk8] [withMaven] junitPublisher - Archive test results for Maven artifact org.apache.maven.plugin-tools:maven-script-beanshell:3.6-SNAPSHOT generated by maven-surefire-plugin:test (default-test): m\maven-script\maven-script-beanshell\target\surefire-reports\*.xml
[windows-jdk8] Recording test results
[windows-jdk8] None of the test reports contained any result
[windows-jdk8] [withMaven] junitPublisher - Archive test results for Maven artifact org.apache.maven.plugins:maven-plugin-plugin:3.6-SNAPSHOT generated by maven-surefire-plugin:test (default-test): m\maven-plugin-plugin\target\surefire-reports\*.xml
[windows-jdk8] Recording test results
[windows-jdk8] None of the test reports contained any result
[Pipeline] [windows-jdk8] // withMaven
[Pipeline] [windows-jdk7] }
[Pipeline] [windows-jdk8] cleanWs
[Pipeline] [windows-jdk7] // stage
[Pipeline] [windows-jdk7] }
[Pipeline] [windows-jdk7] // node
[Pipeline] [windows-jdk7] }
[windows-jdk8] [WS-CLEANUP] Deleting project workspace...[WS-CLEANUP] done
[Pipeline] [windows-jdk8] }
[Pipeline] [windows-jdk8] // stage
[Pipeline] [windows-jdk8] }
[Pipeline] [windows-jdk8] // node
[Pipeline] [windows-jdk8] }
[Pipeline] // parallel
[Pipeline] stage
[Pipeline] { (Notifications)
[Pipeline] echo
Build result: FAILURE
[Pipeline] jiraIssueSelector
[Pipeline] emailext
Reply | Threaded
Open this post in threaded view
|

Build failed in Jenkins: Maven TLP » maven-plugin-tools » MPLUGIN-336 #6

Apache Jenkins Server-2
See https://builds.apache.org/job/maven-box/job/maven-plugin-tools/job/MPLUGIN-336/6/

Changes:

* Exclude H25
* [MNGSITE-341] use https for sigs, hashes and KEYS
* [MPOM-205] use sha512 checksums instead of sha1
* Upgrade ASM to 6.2 for Java 10,11...
* [MPLUGIN-336] Upgrade ASM to 7.0-beta Upgrade Opcodes.ASM5 to
* [MNGSITE-341] use https for sigs, hashes and KEYS
* [MPOM-205] use sha512 checksums instead of sha1
* Upgrade ASM to 6.2 for Java 10,11...
* [MPLUGIN-336] Upgrade ASM to 7.0-beta Upgrade Opcodes.ASM5 to
* [MNGSITE-341] use https for sigs, hashes and KEYS
* [MPOM-205] use sha512 checksums instead of sha1
* Upgrade ASM to 6.2 for Java 10,11...
* [MPLUGIN-336] Upgrade ASM to 7.0-beta Upgrade Opcodes.ASM5 to
* [MNGSITE-341] use https for sigs, hashes and KEYS
* [MPOM-205] use sha512 checksums instead of sha1
* Upgrade ASM to 6.2 for Java 10,11...
* [MPLUGIN-336] Upgrade ASM to 7.0-beta Upgrade Opcodes.ASM5 to
* [MNGSITE-341] use https for sigs, hashes and KEYS
* [MPOM-205] use sha512 checksums instead of sha1
* Upgrade ASM to 6.2 for Java 10,11...
* [MPLUGIN-336] Upgrade ASM to 7.0-beta Upgrade Opcodes.ASM5 to
* [MNGSITE-341] use https for sigs, hashes and KEYS
* [MPOM-205] use sha512 checksums instead of sha1
* Upgrade ASM to 6.2 for Java 10,11...
* [MPLUGIN-336] Upgrade ASM to 7.0-beta Upgrade Opcodes.ASM5 to
* [MNGSITE-341] use https for sigs, hashes and KEYS
* [MPOM-205] use sha512 checksums instead of sha1
* Upgrade ASM to 6.2 for Java 10,11...
* [MPLUGIN-336] Upgrade ASM to 7.0-beta Upgrade Opcodes.ASM5 to
* [MNGSITE-341] use https for sigs, hashes and KEYS
* [MPOM-205] use sha512 checksums instead of sha1
* Upgrade ASM to 6.2 for Java 10,11...
* [MPLUGIN-336] Upgrade ASM to 7.0-beta Upgrade Opcodes.ASM5 to

All tests passed

Build log:
[...truncated 3.85 MB...]
[windows-jdk7] [INFO] run post-build script verify.groovy
[windows-jdk7] [INFO]           mplugin-305_emptyMojoDependencies\pom.xml ........ SUCCESS (12.5 s)
[windows-jdk7] [INFO] Building: mplugin-305_singleMojoDependencies\pom.xml
[windows-jdk8] [INFO]           mplugin-299_no-configuration\pom.xml ............. SUCCESS (17.4 s)
[windows-jdk8] [INFO] Building: mplugin-305_defaultMojoDependencies\pom.xml
[windows-jdk7] [INFO] run post-build script verify.groovy
[windows-jdk7] [INFO]           mplugin-305_singleMojoDependencies\pom.xml ....... SUCCESS (14.1 s)
[windows-jdk7] [INFO] Building: mplugin-319_report-since\pom.xml
[windows-jdk8] [INFO] run post-build script verify.groovy
[windows-jdk8] [INFO]           mplugin-305_defaultMojoDependencies\pom.xml ...... SUCCESS (14.9 s)
[windows-jdk8] [INFO] Building: mplugin-305_emptyMojoDependencies\pom.xml
[windows-jdk8] [INFO] run post-build script verify.groovy
[windows-jdk8] [INFO]           mplugin-305_emptyMojoDependencies\pom.xml ........ SUCCESS (12.7 s)
[windows-jdk8] [INFO] Building: mplugin-305_singleMojoDependencies\pom.xml
[windows-jdk7] [INFO] run post-build script verify.groovy
[windows-jdk7] [INFO]           mplugin-319_report-since\pom.xml ................. SUCCESS (15.0 s)
[windows-jdk7] [INFO] Building: mplugin-324_javadoc\pom.xml
[windows-jdk8] [INFO] run post-build script verify.groovy
[windows-jdk8] [INFO]           mplugin-305_singleMojoDependencies\pom.xml ....... SUCCESS (13.9 s)
[windows-jdk8] [INFO] Building: mplugin-319_report-since\pom.xml
[windows-jdk7] [INFO]           mplugin-324_javadoc\pom.xml ...................... SUCCESS (26.4 s)
[windows-jdk7] [INFO] Building: packaging-jar\pom.xml
[windows-jdk8] [INFO] run post-build script verify.groovy
[windows-jdk8] [INFO]           mplugin-319_report-since\pom.xml ................. SUCCESS (13.0 s)
[windows-jdk8] [INFO] Building: mplugin-324_javadoc\pom.xml
[windows-jdk7] [INFO] run post-build script verify.groovy
[windows-jdk7] [INFO]           packaging-jar\pom.xml ............................ SUCCESS (13.8 s)
[windows-jdk7] [INFO] Building: plugin-info-jdk\pom.xml
[windows-jdk8] [INFO]           mplugin-324_javadoc\pom.xml ...................... SUCCESS (24.7 s)
[windows-jdk8] [INFO] Building: packaging-jar\pom.xml
[windows-jdk8] [INFO] run post-build script verify.groovy
[windows-jdk8] [INFO]           packaging-jar\pom.xml ............................ SUCCESS (13.6 s)
[windows-jdk8] [INFO] Building: plugin-info-jdk\pom.xml
[windows-jdk7] [INFO] run post-build script verify.groovy
[windows-jdk7] [INFO]           plugin-info-jdk\pom.xml .......................... SUCCESS (28.8 s)
[windows-jdk7] [INFO] Building: plugin-info-jdk-default-version\pom.xml
[windows-jdk7] [INFO] run post-build script verify.groovy
[windows-jdk7] [INFO]           plugin-info-jdk-default-version\pom.xml .......... SUCCESS (12.6 s)
[windows-jdk7] [INFO] Building: plugin-report\pom.xml
[windows-jdk8] [INFO] run post-build script verify.groovy
[windows-jdk8] [INFO]           plugin-info-jdk\pom.xml .......................... SUCCESS (27.3 s)
[windows-jdk8] [INFO] Building: plugin-info-jdk-default-version\pom.xml
[windows-jdk8] [INFO] run post-build script verify.groovy
[windows-jdk8] [INFO]           plugin-info-jdk-default-version\pom.xml .......... SUCCESS (12.4 s)
[windows-jdk8] [INFO] Building: plugin-report\pom.xml
[windows-jdk7] [INFO] run post-build script verify.bsh
[windows-jdk7] [INFO]           plugin-report\pom.xml ............................ SUCCESS (46.8 s)
[windows-jdk7] [INFO] Building: plugin-report-annotations\pom.xml
[windows-jdk7] [INFO] run post-build script verify.bsh
[windows-jdk7] [INFO]           plugin-report-annotations\pom.xml ................ SUCCESS (20.6 s)
[windows-jdk7] [INFO] Building: skip\pom.xml
[windows-jdk8] [INFO] run post-build script verify.bsh
[windows-jdk8] [INFO]           plugin-report\pom.xml ............................ SUCCESS (44.1 s)
[windows-jdk8] [INFO] Building: plugin-report-annotations\pom.xml
[windows-jdk7] [INFO] run post-build script verify.groovy
[windows-jdk7] [INFO]           skip\pom.xml ..................................... SUCCESS (13.1 s)
[windows-jdk7] [INFO] Building: source-encoding\pom.xml
[windows-jdk8] [INFO] run post-build script verify.bsh
[windows-jdk8] [INFO]           plugin-report-annotations\pom.xml ................ SUCCESS (18.8 s)
[windows-jdk8] [INFO] Building: skip\pom.xml
[windows-jdk7] [INFO] run post-build script verify.groovy
[windows-jdk7] [INFO]           source-encoding\pom.xml .......................... SUCCESS (12.0 s)
[windows-jdk7] [INFO] -------------------------------------------------
[windows-jdk7] [INFO] Build Summary:
[windows-jdk7] [INFO]   Passed: 30, Failed: 1, Errors: 0, Skipped: 2
[windows-jdk7] [INFO] -------------------------------------------------
[windows-jdk7] [WARNING] The following builds failed:
[windows-jdk7] [WARNING] *  asm-failure\pom.xml
[windows-jdk7] [INFO] -------------------------------------------------
[windows-jdk7] [WARNING] Ignoring that 1 build failed.
[windows-jdk7] [INFO]
[windows-jdk7] [INFO] --- maven-checkstyle-plugin:3.0.0:check (checkstyle-check) @ maven-plugin-plugin ---
[windows-jdk7] [INFO] ------------------------------------------------------------------------
[windows-jdk7] [INFO] Reactor Summary:
[windows-jdk7] [INFO]
[windows-jdk7] [INFO] Maven Plugin Tools ................................. SUCCESS [ 45.335 s]
[windows-jdk7] [INFO] Maven Plugin Tools Extractor API ................... SUCCESS [ 17.714 s]
[windows-jdk7] [INFO] Maven Plugin Tools Generators ...................... SUCCESS [ 11.455 s]
[windows-jdk7] [INFO] Maven Plugin Tool for Java with Javadoc Tags ....... SUCCESS [  9.900 s]
[windows-jdk7] [INFO] Maven Plugin Tools Java 5 Annotations .............. SUCCESS [  1.909 s]
[windows-jdk7] [INFO] Maven Plugin Tool for Java with Annotations ........ SUCCESS [  8.222 s]
[windows-jdk7] [INFO] Maven Plugin Tools Javadoc Taglets ................. SUCCESS [ 17.248 s]
[windows-jdk7] [INFO] Maven Script Mojo Support .......................... SUCCESS [  1.376 s]
[windows-jdk7] [INFO] Maven Plugin Metadata Model ........................ SUCCESS [  7.395 s]
[windows-jdk7] [INFO] Maven Plugin Tool for Ant .......................... SUCCESS [  3.834 s]
[windows-jdk7] [INFO] Maven Ant Mojo Support ............................. SUCCESS [  8.301 s]
[windows-jdk7] [INFO] Maven Plugin Tool for Beanshell .................... SUCCESS [  3.001 s]
[windows-jdk7] [INFO] Maven Beanshell Mojo Support ....................... SUCCESS [  2.287 s]
[windows-jdk7] [INFO] Maven Plugin Plugin ................................ SUCCESS [11:13 min]
[windows-jdk7] [INFO] ------------------------------------------------------------------------
[windows-jdk7] [INFO] BUILD SUCCESS
[windows-jdk7] [INFO] ------------------------------------------------------------------------
[windows-jdk7] [INFO] Total time: 13:34 min
[windows-jdk7] [INFO] Finished at: 2018-09-30T11:51:19-07:00
[windows-jdk7] [INFO] Final Memory: 68M/585M
[windows-jdk7] [INFO] ------------------------------------------------------------------------
[windows-jdk7] [INFO] [jenkins-event-spy] Generated F:\jenkins\jenkins-slave\workspace\en-plugin-tools_MPLUGIN-336-OX2XMFOVDYU6CHOQOCEAQPI7JEFEG4IM2KWEE3CCBTWR4DJXZKUQ@tmp\withMaven59dabf4a\maven-spy-20180930-113744-5674164031656834861358.log
[windows-jdk7] Picked up JAVA_TOOL_OPTIONS: -Dmaven.ext.class.path="f:\jenkins\jenkins-slave\workspace\en-plugin-tools_MPLUGIN-336-OX2XMFOVDYU6CHOQOCEAQPI7JEFEG4IM2KWEE3CCBTWR4DJXZKUQ@tmp\withMaven59dabf4a\pipeline-maven-spy.jar" -Dorg.jenkinsci.plugins.pipeline.maven.reportsFolder="f:\jenkins\jenkins-slave\workspace\en-plugin-tools_MPLUGIN-336-OX2XMFOVDYU6CHOQOCEAQPI7JEFEG4IM2KWEE3CCBTWR4DJXZKUQ@tmp\withMaven59dabf4a"
[Pipeline] [windows-jdk7] }
[Pipeline] [windows-jdk7] // dir
[windows-jdk8] [INFO] run post-build script verify.groovy
[windows-jdk8] [INFO]           skip\pom.xml ..................................... SUCCESS (10.6 s)
[windows-jdk8] [INFO] Building: source-encoding\pom.xml
[Pipeline] [windows-jdk7] }
[windows-jdk7] [withMaven] invokerPublisher - Archive invoker results for Maven artifact MavenArtifact{org.apache.maven.plugin-tools:maven-plugin-tools-javadoc::3.6-SNAPSHOT(version: 3.6-SNAPSHOT, snapshot:false) } generated by PluginInvocation{org.apache.maven.plugins:maven-invoker-plugin:3.0.1@run  integration-test}: m\maven-plugin-tools-javadoc\target\invoker-reports\*.xml
[windows-jdk7] performing MavenInvokerRecorder, reportsFilenamePattern:'**/m\maven-plugin-tools-javadoc\target\invoker-reports/BUILD*.xml', invokerBuildDir:'**/m\maven-plugin-tools-javadoc\target\it'
[windows-jdk7] Found reports:[f:\jenkins\jenkins-slave\workspace\en-plugin-tools_MPLUGIN-336-OX2XMFOVDYU6CHOQOCEAQPI7JEFEG4IM2KWEE3CCBTWR4DJXZKUQ\m\maven-plugin-tools-javadoc\target\invoker-reports\BUILD-basic.xml]
[windows-jdk7] Found logs:[f:\jenkins\jenkins-slave\workspace\en-plugin-tools_MPLUGIN-336-OX2XMFOVDYU6CHOQOCEAQPI7JEFEG4IM2KWEE3CCBTWR4DJXZKUQ\m\maven-plugin-tools-javadoc\target\it\basic\build.log]
[windows-jdk7] Finished parsing Maven Invoker results (found 1)
[windows-jdk7] [withMaven] invokerPublisher - Archive invoker results for Maven artifact MavenArtifact{org.apache.maven.plugins:maven-plugin-plugin::3.6-SNAPSHOT(version: 3.6-SNAPSHOT, snapshot:false) } generated by PluginInvocation{org.apache.maven.plugins:maven-invoker-plugin:3.0.1@run  integration-test}: m\maven-plugin-plugin\target\invoker-reports\*.xml
[windows-jdk7] performing MavenInvokerRecorder, reportsFilenamePattern:'**/m\maven-plugin-plugin\target\invoker-reports/BUILD*.xml', invokerBuildDir:'**/m\maven-plugin-plugin\target\it'
[windows-jdk7] Found reports:[f:\jenkins\jenkins-slave\workspace\en-plugin-tools_MPLUGIN-336-OX2XMFOVDYU6CHOQOCEAQPI7JEFEG4IM2KWEE3CCBTWR4DJXZKUQ\m\maven-plugin-plugin\target\invoker-reports\BUILD-annotation-with-inheritance-from-deps.xml, f:\jenkins\jenkins-slave\workspace\en-plugin-tools_MPLUGIN-336-OX2XMFOVDYU6CHOQOCEAQPI7JEFEG4IM2KWEE3CCBTWR4DJXZKUQ\m\maven-plugin-plugin\target\invoker-reports\BUILD-annotation-with-inheritance-reactor.xml, f:\jenkins\jenkins-slave\workspace\en-plugin-tools_MPLUGIN-336-OX2XMFOVDYU6CHOQOCEAQPI7JEFEG4IM2KWEE3CCBTWR4DJXZKUQ\m\maven-plugin-plugin\target\invoker-reports\BUILD-annotation-with-inheritance.xml, f:\jenkins\jenkins-slave\workspace\en-plugin-tools_MPLUGIN-336-OX2XMFOVDYU6CHOQOCEAQPI7JEFEG4IM2KWEE3CCBTWR4DJXZKUQ\m\maven-plugin-plugin\target\invoker-reports\BUILD-ant-basic.xml, f:\jenkins\jenkins-slave\workspace\en-plugin-tools_MPLUGIN-336-OX2XMFOVDYU6CHOQOCEAQPI7JEFEG4IM2KWEE3CCBTWR4DJXZKUQ\m\maven-plugin-plugin\target\invoker-reports\BUILD-ant-reference-parameter.xml, f:\jenkins\jenkins-slave\workspace\en-plugin-tools_MPLUGIN-336-OX2XMFOVDYU6CHOQOCEAQPI7JEFEG4IM2KWEE3CCBTWR4DJXZKUQ\m\maven-plugin-plugin\target\invoker-reports\BUILD-ant-simple-usage.xml, f:\jenkins\jenkins-slave\workspace\en-plugin-tools_MPLUGIN-336-OX2XMFOVDYU6CHOQOCEAQPI7JEFEG4IM2KWEE3CCBTWR4DJXZKUQ\m\maven-plugin-plugin\target\invoker-reports\BUILD-ant-since-maven-plugin.xml, f:\jenkins\jenkins-slave\workspace\en-plugin-tools_MPLUGIN-336-OX2XMFOVDYU6CHOQOCEAQPI7JEFEG4IM2KWEE3CCBTWR4DJXZKUQ\m\maven-plugin-plugin\target\invoker-reports\BUILD-asm-failure.xml, f:\jenkins\jenkins-slave\workspace\en-plugin-tools_MPLUGIN-336-OX2XMFOVDYU6CHOQOCEAQPI7JEFEG4IM2KWEE3CCBTWR4DJXZKUQ\m\maven-plugin-plugin\target\invoker-reports\BUILD-beanshell-simple.xml, f:\jenkins\jenkins-slave\workspace\en-plugin-tools_MPLUGIN-336-OX2XMFOVDYU6CHOQOCEAQPI7JEFEG4IM2KWEE3CCBTWR4DJXZKUQ\m\maven-plugin-plugin\target\invoker-reports\BUILD-fix-maven-since-3.x.xml, f:\jenkins\jenkins-slave\workspace\en-plugin-tools_MPLUGIN-336-OX2XMFOVDYU6CHOQOCEAQPI7JEFEG4IM2KWEE3CCBTWR4DJXZKUQ\m\maven-plugin-plugin\target\invoker-reports\BUILD-help-basic.xml, f:\jenkins\jenkins-slave\workspace\en-plugin-tools_MPLUGIN-336-OX2XMFOVDYU6CHOQOCEAQPI7JEFEG4IM2KWEE3CCBTWR4DJXZKUQ\m\maven-plugin-plugin\target\invoker-reports\BUILD-help-package.xml, f:\jenkins\jenkins-slave\workspace\en-plugin-tools_MPLUGIN-336-OX2XMFOVDYU6CHOQOCEAQPI7JEFEG4IM2KWEE3CCBTWR4DJXZKUQ\m\maven-plugin-plugin\target\invoker-reports\BUILD-ignore-plugin-class-realm.xml, f:\jenkins\jenkins-slave\workspace\en-plugin-tools_MPLUGIN-336-OX2XMFOVDYU6CHOQOCEAQPI7JEFEG4IM2KWEE3CCBTWR4DJXZKUQ\m\maven-plugin-plugin\target\invoker-reports\BUILD-java-basic-annotations-jdk8.xml, f:\jenkins\jenkins-slave\workspace\en-plugin-tools_MPLUGIN-336-OX2XMFOVDYU6CHOQOCEAQPI7JEFEG4IM2KWEE3CCBTWR4DJXZKUQ\m\maven-plugin-plugin\target\invoker-reports\BUILD-java-basic-annotations.xml, f:\jenkins\jenkins-slave\workspace\en-plugin-tools_MPLUGIN-336-OX2XMFOVDYU6CHOQOCEAQPI7JEFEG4IM2KWEE3CCBTWR4DJXZKUQ\m\maven-plugin-plugin\target\invoker-reports\BUILD-java-basic.xml, f:\jenkins\jenkins-slave\workspace\en-plugin-tools_MPLUGIN-336-OX2XMFOVDYU6CHOQOCEAQPI7JEFEG4IM2KWEE3CCBTWR4DJXZKUQ\m\maven-plugin-plugin\target\invoker-reports\BUILD-mplugin-187.xml, f:\jenkins\jenkins-slave\workspace\en-plugin-tools_MPLUGIN-336-OX2XMFOVDYU6CHOQOCEAQPI7JEFEG4IM2KWEE3CCBTWR4DJXZKUQ\m\maven-plugin-plugin\target\invoker-reports\BUILD-mplugin-191.xml, f:\jenkins\jenkins-slave\workspace\en-plugin-tools_MPLUGIN-336-OX2XMFOVDYU6CHOQOCEAQPI7JEFEG4IM2KWEE3CCBTWR4DJXZKUQ\m\maven-plugin-plugin\target\invoker-reports\BUILD-mplugin-223.xml, f:\jenkins\jenkins-slave\workspace\en-plugin-tools_MPLUGIN-336-OX2XMFOVDYU6CHOQOCEAQPI7JEFEG4IM2KWEE3CCBTWR4DJXZKUQ\m\maven-plugin-plugin\target\invoker-reports\BUILD-mplugin-272_java8.xml, f:\jenkins\jenkins-slave\workspace\en-plugin-tools_MPLUGIN-336-OX2XMFOVDYU6CHOQOCEAQPI7JEFEG4IM2KWEE3CCBTWR4DJXZKUQ\m\maven-plugin-plugin\target\invoker-reports\BUILD-mplugin-299_no-configuration.xml, f:\jenkins\jenkins-slave\workspace\en-plugin-tools_MPLUGIN-336-OX2XMFOVDYU6CHOQOCEAQPI7JEFEG4IM2KWEE3CCBTWR4DJXZKUQ\m\maven-plugin-plugin\target\invoker-reports\BUILD-mplugin-305_defaultMojoDependencies.xml, f:\jenkins\jenkins-slave\workspace\en-plugin-tools_MPLUGIN-336-OX2XMFOVDYU6CHOQOCEAQPI7JEFEG4IM2KWEE3CCBTWR4DJXZKUQ\m\maven-plugin-plugin\target\invoker-reports\BUILD-mplugin-305_emptyMojoDependencies.xml, f:\jenkins\jenkins-slave\workspace\en-plugin-tools_MPLUGIN-336-OX2XMFOVDYU6CHOQOCEAQPI7JEFEG4IM2KWEE3CCBTWR4DJXZKUQ\m\maven-plugin-plugin\target\invoker-reports\BUILD-mplugin-305_singleMojoDependencies.xml, f:\jenkins\jenkins-slave\workspace\en-plugin-tools_MPLUGIN-336-OX2XMFOVDYU6CHOQOCEAQPI7JEFEG4IM2KWEE3CCBTWR4DJXZKUQ\m\maven-plugin-plugin\target\invoker-reports\BUILD-mplugin-319_report-since.xml, f:\jenkins\jenkins-slave\workspace\en-plugin-tools_MPLUGIN-336-OX2XMFOVDYU6CHOQOCEAQPI7JEFEG4IM2KWEE3CCBTWR4DJXZKUQ\m\maven-plugin-plugin\target\invoker-reports\BUILD-mplugin-324_javadoc.xml, f:\jenkins\jenkins-slave\workspace\en-plugin-tools_MPLUGIN-336-OX2XMFOVDYU6CHOQOCEAQPI7JEFEG4IM2KWEE3CCBTWR4DJXZKUQ\m\maven-plugin-plugin\target\invoker-reports\BUILD-packaging-jar.xml, f:\jenkins\jenkins-slave\workspace\en-plugin-tools_MPLUGIN-336-OX2XMFOVDYU6CHOQOCEAQPI7JEFEG4IM2KWEE3CCBTWR4DJXZKUQ\m\maven-plugin-plugin\target\invoker-reports\BUILD-plugin-info-jdk-default-version.xml, f:\jenkins\jenkins-slave\workspace\en-plugin-tools_MPLUGIN-336-OX2XMFOVDYU6CHOQOCEAQPI7JEFEG4IM2KWEE3CCBTWR4DJXZKUQ\m\maven-plugin-plugin\target\invoker-reports\BUILD-plugin-info-jdk.xml, f:\jenkins\jenkins-slave\workspace\en-plugin-tools_MPLUGIN-336-OX2XMFOVDYU6CHOQOCEAQPI7JEFEG4IM2KWEE3CCBTWR4DJXZKUQ\m\maven-plugin-plugin\target\invoker-reports\BUILD-plugin-report-annotations.xml, f:\jenkins\jenkins-slave\workspace\en-plugin-tools_MPLUGIN-336-OX2XMFOVDYU6CHOQOCEAQPI7JEFEG4IM2KWEE3CCBTWR4DJXZKUQ\m\maven-plugin-plugin\target\invoker-reports\BUILD-plugin-report.xml, f:\jenkins\jenkins-slave\workspace\en-plugin-tools_MPLUGIN-336-OX2XMFOVDYU6CHOQOCEAQPI7JEFEG4IM2KWEE3CCBTWR4DJXZKUQ\m\maven-plugin-plugin\target\invoker-reports\BUILD-skip.xml, f:\jenkins\jenkins-slave\workspace\en-plugin-tools_MPLUGIN-336-OX2XMFOVDYU6CHOQOCEAQPI7JEFEG4IM2KWEE3CCBTWR4DJXZKUQ\m\maven-plugin-plugin\target\invoker-reports\BUILD-source-encoding.xml]
[windows-jdk7] Found logs:[f:\jenkins\jenkins-slave\workspace\en-plugin-tools_MPLUGIN-336-OX2XMFOVDYU6CHOQOCEAQPI7JEFEG4IM2KWEE3CCBTWR4DJXZKUQ\m\maven-plugin-plugin\target\it\annotation-with-inheritance-from-deps\build.log, f:\jenkins\jenkins-slave\workspace\en-plugin-tools_MPLUGIN-336-OX2XMFOVDYU6CHOQOCEAQPI7JEFEG4IM2KWEE3CCBTWR4DJXZKUQ\m\maven-plugin-plugin\target\it\annotation-with-inheritance-reactor\build.log, f:\jenkins\jenkins-slave\workspace\en-plugin-tools_MPLUGIN-336-OX2XMFOVDYU6CHOQOCEAQPI7JEFEG4IM2KWEE3CCBTWR4DJXZKUQ\m\maven-plugin-plugin\target\it\annotation-with-inheritance\build.log, f:\jenkins\jenkins-slave\workspace\en-plugin-tools_MPLUGIN-336-OX2XMFOVDYU6CHOQOCEAQPI7JEFEG4IM2KWEE3CCBTWR4DJXZKUQ\m\maven-plugin-plugin\target\it\ant-basic\build.log, f:\jenkins\jenkins-slave\workspace\en-plugin-tools_MPLUGIN-336-OX2XMFOVDYU6CHOQOCEAQPI7JEFEG4IM2KWEE3CCBTWR4DJXZKUQ\m\maven-plugin-plugin\target\it\ant-reference-parameter\build.log, f:\jenkins\jenkins-slave\workspace\en-plugin-tools_MPLUGIN-336-OX2XMFOVDYU6CHOQOCEAQPI7JEFEG4IM2KWEE3CCBTWR4DJXZKUQ\m\maven-plugin-plugin\target\it\ant-simple-usage\build.log, f:\jenkins\jenkins-slave\workspace\en-plugin-tools_MPLUGIN-336-OX2XMFOVDYU6CHOQOCEAQPI7JEFEG4IM2KWEE3CCBTWR4DJXZKUQ\m\maven-plugin-plugin\target\it\ant-since-maven-plugin\build.log, f:\jenkins\jenkins-slave\workspace\en-plugin-tools_MPLUGIN-336-OX2XMFOVDYU6CHOQOCEAQPI7JEFEG4IM2KWEE3CCBTWR4DJXZKUQ\m\maven-plugin-plugin\target\it\asm-failure\build.log, f:\jenkins\jenkins-slave\workspace\en-plugin-tools_MPLUGIN-336-OX2XMFOVDYU6CHOQOCEAQPI7JEFEG4IM2KWEE3CCBTWR4DJXZKUQ\m\maven-plugin-plugin\target\it\beanshell-simple\build.log, f:\jenkins\jenkins-slave\workspace\en-plugin-tools_MPLUGIN-336-OX2XMFOVDYU6CHOQOCEAQPI7JEFEG4IM2KWEE3CCBTWR4DJXZKUQ\m\maven-plugin-plugin\target\it\fix-maven-since-3.x\build.log, f:\jenkins\jenkins-slave\workspace\en-plugin-tools_MPLUGIN-336-OX2XMFOVDYU6CHOQOCEAQPI7JEFEG4IM2KWEE3CCBTWR4DJXZKUQ\m\maven-plugin-plugin\target\it\help-basic\build.log, f:\jenkins\jenkins-slave\workspace\en-plugin-tools_MPLUGIN-336-OX2XMFOVDYU6CHOQOCEAQPI7JEFEG4IM2KWEE3CCBTWR4DJXZKUQ\m\maven-plugin-plugin\target\it\help-package\build.log, f:\jenkins\jenkins-slave\workspace\en-plugin-tools_MPLUGIN-336-OX2XMFOVDYU6CHOQOCEAQPI7JEFEG4IM2KWEE3CCBTWR4DJXZKUQ\m\maven-plugin-plugin\target\it\ignore-plugin-class-realm\build.log, f:\jenkins\jenkins-slave\workspace\en-plugin-tools_MPLUGIN-336-OX2XMFOVDYU6CHOQOCEAQPI7JEFEG4IM2KWEE3CCBTWR4DJXZKUQ\m\maven-plugin-plugin\target\it\java-basic-annotations\build.log, f:\jenkins\jenkins-slave\workspace\en-plugin-tools_MPLUGIN-336-OX2XMFOVDYU6CHOQOCEAQPI7JEFEG4IM2KWEE3CCBTWR4DJXZKUQ\m\maven-plugin-plugin\target\it\java-basic\build.log, f:\jenkins\jenkins-slave\workspace\en-plugin-tools_MPLUGIN-336-OX2XMFOVDYU6CHOQOCEAQPI7JEFEG4IM2KWEE3CCBTWR4DJXZKUQ\m\maven-plugin-plugin\target\it\mplugin-187\build.log, f:\jenkins\jenkins-slave\workspace\en-plugin-tools_MPLUGIN-336-OX2XMFOVDYU6CHOQOCEAQPI7JEFEG4IM2KWEE3CCBTWR4DJXZKUQ\m\maven-plugin-plugin\target\it\mplugin-191\build.log, f:\jenkins\jenkins-slave\workspace\en-plugin-tools_MPLUGIN-336-OX2XMFOVDYU6CHOQOCEAQPI7JEFEG4IM2KWEE3CCBTWR4DJXZKUQ\m\maven-plugin-plugin\target\it\mplugin-223\build.log, f:\jenkins\jenkins-slave\workspace\en-plugin-tools_MPLUGIN-336-OX2XMFOVDYU6CHOQOCEAQPI7JEFEG4IM2KWEE3CCBTWR4DJXZKUQ\m\maven-plugin-plugin\target\it\mplugin-299_no-configuration\build.log, f:\jenkins\jenkins-slave\workspace\en-plugin-tools_MPLUGIN-336-OX2XMFOVDYU6CHOQOCEAQPI7JEFEG4IM2KWEE3CCBTWR4DJXZKUQ\m\maven-plugin-plugin\target\it\mplugin-305_defaultMojoDependencies\build.log, f:\jenkins\jenkins-slave\workspace\en-plugin-tools_MPLUGIN-336-OX2XMFOVDYU6CHOQOCEAQPI7JEFEG4IM2KWEE3CCBTWR4DJXZKUQ\m\maven-plugin-plugin\target\it\mplugin-305_emptyMojoDependencies\build.log, f:\jenkins\jenkins-slave\workspace\en-plugin-tools_MPLUGIN-336-OX2XMFOVDYU6CHOQOCEAQPI7JEFEG4IM2KWEE3CCBTWR4DJXZKUQ\m\maven-plugin-plugin\target\it\mplugin-305_singleMojoDependencies\build.log, f:\jenkins\jenkins-slave\workspace\en-plugin-tools_MPLUGIN-336-OX2XMFOVDYU6CHOQOCEAQPI7JEFEG4IM2KWEE3CCBTWR4DJXZKUQ\m\maven-plugin-plugin\target\it\mplugin-319_report-since\build.log, f:\jenkins\jenkins-slave\workspace\en-plugin-tools_MPLUGIN-336-OX2XMFOVDYU6CHOQOCEAQPI7JEFEG4IM2KWEE3CCBTWR4DJXZKUQ\m\maven-plugin-plugin\target\it\mplugin-324_javadoc\build.log, f:\jenkins\jenkins-slave\workspace\en-plugin-tools_MPLUGIN-336-OX2XMFOVDYU6CHOQOCEAQPI7JEFEG4IM2KWEE3CCBTWR4DJXZKUQ\m\maven-plugin-plugin\target\it\packaging-jar\build.log, f:\jenkins\jenkins-slave\workspace\en-plugin-tools_MPLUGIN-336-OX2XMFOVDYU6CHOQOCEAQPI7JEFEG4IM2KWEE3CCBTWR4DJXZKUQ\m\maven-plugin-plugin\target\it\plugin-info-jdk-default-version\build.log, f:\jenkins\jenkins-slave\workspace\en-plugin-tools_MPLUGIN-336-OX2XMFOVDYU6CHOQOCEAQPI7JEFEG4IM2KWEE3CCBTWR4DJXZKUQ\m\maven-plugin-plugin\target\it\plugin-info-jdk\build.log, f:\jenkins\jenkins-slave\workspace\en-plugin-tools_MPLUGIN-336-OX2XMFOVDYU6CHOQOCEAQPI7JEFEG4IM2KWEE3CCBTWR4DJXZKUQ\m\maven-plugin-plugin\target\it\plugin-report-annotations\build.log, f:\jenkins\jenkins-slave\workspace\en-plugin-tools_MPLUGIN-336-OX2XMFOVDYU6CHOQOCEAQPI7JEFEG4IM2KWEE3CCBTWR4DJXZKUQ\m\maven-plugin-plugin\target\it\plugin-report\build.log, f:\jenkins\jenkins-slave\workspace\en-plugin-tools_MPLUGIN-336-OX2XMFOVDYU6CHOQOCEAQPI7JEFEG4IM2KWEE3CCBTWR4DJXZKUQ\m\maven-plugin-plugin\target\it\skip\build.log, f:\jenkins\jenkins-slave\workspace\en-plugin-tools_MPLUGIN-336-OX2XMFOVDYU6CHOQOCEAQPI7JEFEG4IM2KWEE3CCBTWR4DJXZKUQ\m\maven-plugin-plugin\target\it\source-encoding\build.log]
[windows-jdk7] Finished parsing Maven Invoker results (found 33)
[windows-jdk7] [withMaven] junitPublisher - Archive test results for Maven artifact org.apache.maven.plugin-tools:maven-plugin-tools-api:3.6-SNAPSHOT generated by maven-surefire-plugin:test (default-test): m\maven-plugin-tools-api\target\surefire-reports\*.xml
[windows-jdk7] Recording test results
[windows-jdk7] [withMaven] junitPublisher - Archive test results for Maven artifact org.apache.maven.plugin-tools:maven-plugin-tools-generators:3.6-SNAPSHOT generated by maven-surefire-plugin:test (default-test): m\maven-plugin-tools-generators\target\surefire-reports\*.xml
[windows-jdk7] Recording test results
[windows-jdk7] [withMaven] junitPublisher - Archive test results for Maven artifact org.apache.maven.plugin-tools:maven-plugin-tools-java:3.6-SNAPSHOT generated by maven-surefire-plugin:test (default-test): m\maven-plugin-tools-java\target\surefire-reports\*.xml
[windows-jdk7] Recording test results
[windows-jdk7] [withMaven] junitPublisher - Archive test results for Maven artifact org.apache.maven.plugin-tools:maven-plugin-annotations:3.6-SNAPSHOT generated by maven-surefire-plugin:test (default-test): m\maven-plugin-annotations\target\surefire-reports\*.xml
[windows-jdk7] Recording test results
[windows-jdk7] None of the test reports contained any result
[windows-jdk7] [withMaven] junitPublisher - Archive test results for Maven artifact org.apache.maven.plugin-tools:maven-plugin-tools-annotations:3.6-SNAPSHOT generated by maven-surefire-plugin:test (default-test): m\maven-plugin-tools-annotations\target\surefire-reports\*.xml
[windows-jdk7] Recording test results
[windows-jdk7] [withMaven] junitPublisher - Archive test results for Maven artifact org.apache.maven.plugin-tools:maven-plugin-tools-javadoc:3.6-SNAPSHOT generated by maven-surefire-plugin:test (default-test): m\maven-plugin-tools-javadoc\target\surefire-reports\*.xml
[windows-jdk7] Recording test results
[windows-jdk7] None of the test reports contained any result
[windows-jdk7] [withMaven] junitPublisher - Archive test results for Maven artifact org.apache.maven.plugin-tools:maven-plugin-tools-model:3.6-SNAPSHOT generated by maven-surefire-plugin:test (default-test): m\maven-script\maven-plugin-tools-model\target\surefire-reports\*.xml
[windows-jdk7] Recording test results
[windows-jdk7] [withMaven] junitPublisher - Archive test results for Maven artifact org.apache.maven.plugin-tools:maven-plugin-tools-ant:3.6-SNAPSHOT generated by maven-surefire-plugin:test (default-test): m\maven-script\maven-plugin-tools-ant\target\surefire-reports\*.xml
[windows-jdk7] Recording test results
[windows-jdk7] [withMaven] junitPublisher - Archive test results for Maven artifact org.apache.maven.plugin-tools:maven-script-ant:3.6-SNAPSHOT generated by maven-surefire-plugin:test (default-test): m\maven-script\maven-script-ant\target\surefire-reports\*.xml
[windows-jdk7] Recording test results
[windows-jdk7] [withMaven] junitPublisher - Archive test results for Maven artifact org.apache.maven.plugin-tools:maven-plugin-tools-beanshell:3.6-SNAPSHOT generated by maven-surefire-plugin:test (default-test): m\maven-script\maven-plugin-tools-beanshell\target\surefire-reports\*.xml
[windows-jdk7] Recording test results
[windows-jdk7] None of the test reports contained any result
[windows-jdk7] [withMaven] junitPublisher - Archive test results for Maven artifact org.apache.maven.plugin-tools:maven-script-beanshell:3.6-SNAPSHOT generated by maven-surefire-plugin:test (default-test): m\maven-script\maven-script-beanshell\target\surefire-reports\*.xml
[windows-jdk7] Recording test results
[windows-jdk7] None of the test reports contained any result
[windows-jdk7] [withMaven] junitPublisher - Archive test results for Maven artifact org.apache.maven.plugins:maven-plugin-plugin:3.6-SNAPSHOT generated by maven-surefire-plugin:test (default-test): m\maven-plugin-plugin\target\surefire-reports\*.xml
[windows-jdk7] Recording test results
[windows-jdk7] None of the test reports contained any result
[Pipeline] [windows-jdk7] // withMaven
[Pipeline] [windows-jdk7] cleanWs
[windows-jdk7] [WS-CLEANUP] Deleting project workspace...[WS-CLEANUP] done
[Pipeline] [windows-jdk7] }
[Pipeline] [windows-jdk7] // stage
[Pipeline] [windows-jdk7] }
[Pipeline] [windows-jdk7] // node
[Pipeline] [windows-jdk7] }
[windows-jdk8] [INFO] run post-build script verify.groovy
[windows-jdk8] [INFO]           source-encoding\pom.xml .......................... SUCCESS (11.0 s)
[windows-jdk8] [INFO] -------------------------------------------------
[windows-jdk8] [INFO] Build Summary:
[windows-jdk8] [INFO]   Passed: 32, Failed: 1, Errors: 0, Skipped: 0
[windows-jdk8] [INFO] -------------------------------------------------
[windows-jdk8] [WARNING] The following builds failed:
[windows-jdk8] [WARNING] *  asm-failure\pom.xml
[windows-jdk8] [INFO] -------------------------------------------------
[windows-jdk8] [WARNING] Ignoring that 1 build failed.
[windows-jdk8] [INFO]
[windows-jdk8] [INFO] --- maven-checkstyle-plugin:3.0.0:check (checkstyle-check) @ maven-plugin-plugin ---
[windows-jdk8] [INFO] ------------------------------------------------------------------------
[windows-jdk8] [INFO] Reactor Summary:
[windows-jdk8] [INFO]
[windows-jdk8] [INFO] Maven Plugin Tools ................................. SUCCESS [ 45.947 s]
[windows-jdk8] [INFO] Maven Plugin Tools Extractor API ................... SUCCESS [ 17.422 s]
[windows-jdk8] [INFO] Maven Plugin Tools Generators ...................... SUCCESS [ 10.053 s]
[windows-jdk8] [INFO] Maven Plugin Tool for Java with Javadoc Tags ....... SUCCESS [ 10.179 s]
[windows-jdk8] [INFO] Maven Plugin Tools Java 5 Annotations .............. SUCCESS [  1.939 s]
[windows-jdk8] [INFO] Maven Plugin Tool for Java with Annotations ........ SUCCESS [  7.078 s]
[windows-jdk8] [INFO] Maven Plugin Tools Javadoc Taglets ................. SUCCESS [ 34.398 s]
[windows-jdk8] [INFO] Maven Script Mojo Support .......................... SUCCESS [  1.436 s]
[windows-jdk8] [INFO] Maven Plugin Metadata Model ........................ SUCCESS [  7.761 s]
[windows-jdk8] [INFO] Maven Plugin Tool for Ant .......................... SUCCESS [  3.827 s]
[windows-jdk8] [INFO] Maven Ant Mojo Support ............................. SUCCESS [  7.896 s]
[windows-jdk8] [INFO] Maven Plugin Tool for Beanshell .................... SUCCESS [  2.473 s]
[windows-jdk8] [INFO] Maven Beanshell Mojo Support ....................... SUCCESS [  1.637 s]
[windows-jdk8] [INFO] Maven Plugin Plugin ................................ SUCCESS [11:14 min]
[windows-jdk8] [INFO] ------------------------------------------------------------------------
[windows-jdk8] [INFO] BUILD SUCCESS
[windows-jdk8] [INFO] ------------------------------------------------------------------------
[windows-jdk8] [INFO] Total time: 13:48 min
[windows-jdk8] [INFO] Finished at: 2018-09-30T11:51:33-07:00
[windows-jdk8] [INFO] Final Memory: 82M/950M
[windows-jdk8] [INFO] ------------------------------------------------------------------------
[windows-jdk8] [INFO] [jenkins-event-spy] Generated F:\jenkins\jenkins-slave\workspace\en-plugin-tools_MPLUGIN-336-OX2XMFOVDYU6CHOQOCEAQPI7JEFEG4IM2KWEE3CCBTWR4DJXZKUQ@2@tmp\withMavenb0438a6e\maven-spy-20180930-113743-8893831171173434809058.log
[windows-jdk8] Picked up JAVA_TOOL_OPTIONS: -Dmaven.ext.class.path="f:\jenkins\jenkins-slave\workspace\en-plugin-tools_MPLUGIN-336-OX2XMFOVDYU6CHOQOCEAQPI7JEFEG4IM2KWEE3CCBTWR4DJXZKUQ@2@tmp\withMavenb0438a6e\pipeline-maven-spy.jar" -Dorg.jenkinsci.plugins.pipeline.maven.reportsFolder="f:\jenkins\jenkins-slave\workspace\en-plugin-tools_MPLUGIN-336-OX2XMFOVDYU6CHOQOCEAQPI7JEFEG4IM2KWEE3CCBTWR4DJXZKUQ@2@tmp\withMavenb0438a6e"
[Pipeline] [windows-jdk8] }
[Pipeline] [windows-jdk8] // dir
[Pipeline] [windows-jdk8] }
[windows-jdk8] [withMaven] invokerPublisher - Archive invoker results for Maven artifact MavenArtifact{org.apache.maven.plugin-tools:maven-plugin-tools-javadoc::3.6-SNAPSHOT(version: 3.6-SNAPSHOT, snapshot:false) } generated by PluginInvocation{org.apache.maven.plugins:maven-invoker-plugin:3.0.1@run  integration-test}: m\maven-plugin-tools-javadoc\target\invoker-reports\*.xml
[windows-jdk8] performing MavenInvokerRecorder, reportsFilenamePattern:'**/m\maven-plugin-tools-javadoc\target\invoker-reports/BUILD*.xml', invokerBuildDir:'**/m\maven-plugin-tools-javadoc\target\it'
[windows-jdk8] Found reports:[f:\jenkins\jenkins-slave\workspace\en-plugin-tools_MPLUGIN-336-OX2XMFOVDYU6CHOQOCEAQPI7JEFEG4IM2KWEE3CCBTWR4DJXZKUQ@2\m\maven-plugin-tools-javadoc\target\invoker-reports\BUILD-basic.xml]
[windows-jdk8] Found logs:[f:\jenkins\jenkins-slave\workspace\en-plugin-tools_MPLUGIN-336-OX2XMFOVDYU6CHOQOCEAQPI7JEFEG4IM2KWEE3CCBTWR4DJXZKUQ@2\m\maven-plugin-tools-javadoc\target\it\basic\build.log]
[windows-jdk8] Finished parsing Maven Invoker results (found 1)
[windows-jdk8] [withMaven] invokerPublisher - Archive invoker results for Maven artifact MavenArtifact{org.apache.maven.plugins:maven-plugin-plugin::3.6-SNAPSHOT(version: 3.6-SNAPSHOT, snapshot:false) } generated by PluginInvocation{org.apache.maven.plugins:maven-invoker-plugin:3.0.1@run  integration-test}: m\maven-plugin-plugin\target\invoker-reports\*.xml
[windows-jdk8] performing MavenInvokerRecorder, reportsFilenamePattern:'**/m\maven-plugin-plugin\target\invoker-reports/BUILD*.xml', invokerBuildDir:'**/m\maven-plugin-plugin\target\it'
[windows-jdk8] Found reports:[f:\jenkins\jenkins-slave\workspace\en-plugin-tools_MPLUGIN-336-OX2XMFOVDYU6CHOQOCEAQPI7JEFEG4IM2KWEE3CCBTWR4DJXZKUQ@2\m\maven-plugin-plugin\target\invoker-reports\BUILD-annotation-with-inheritance-from-deps.xml, f:\jenkins\jenkins-slave\workspace\en-plugin-tools_MPLUGIN-336-OX2XMFOVDYU6CHOQOCEAQPI7JEFEG4IM2KWEE3CCBTWR4DJXZKUQ@2\m\maven-plugin-plugin\target\invoker-reports\BUILD-annotation-with-inheritance-reactor.xml, f:\jenkins\jenkins-slave\workspace\en-plugin-tools_MPLUGIN-336-OX2XMFOVDYU6CHOQOCEAQPI7JEFEG4IM2KWEE3CCBTWR4DJXZKUQ@2\m\maven-plugin-plugin\target\invoker-reports\BUILD-annotation-with-inheritance.xml, f:\jenkins\jenkins-slave\workspace\en-plugin-tools_MPLUGIN-336-OX2XMFOVDYU6CHOQOCEAQPI7JEFEG4IM2KWEE3CCBTWR4DJXZKUQ@2\m\maven-plugin-plugin\target\invoker-reports\BUILD-ant-basic.xml, f:\jenkins\jenkins-slave\workspace\en-plugin-tools_MPLUGIN-336-OX2XMFOVDYU6CHOQOCEAQPI7JEFEG4IM2KWEE3CCBTWR4DJXZKUQ@2\m\maven-plugin-plugin\target\invoker-reports\BUILD-ant-reference-parameter.xml, f:\jenkins\jenkins-slave\workspace\en-plugin-tools_MPLUGIN-336-OX2XMFOVDYU6CHOQOCEAQPI7JEFEG4IM2KWEE3CCBTWR4DJXZKUQ@2\m\maven-plugin-plugin\target\invoker-reports\BUILD-ant-simple-usage.xml, f:\jenkins\jenkins-slave\workspace\en-plugin-tools_MPLUGIN-336-OX2XMFOVDYU6CHOQOCEAQPI7JEFEG4IM2KWEE3CCBTWR4DJXZKUQ@2\m\maven-plugin-plugin\target\invoker-reports\BUILD-ant-since-maven-plugin.xml, f:\jenkins\jenkins-slave\workspace\en-plugin-tools_MPLUGIN-336-OX2XMFOVDYU6CHOQOCEAQPI7JEFEG4IM2KWEE3CCBTWR4DJXZKUQ@2\m\maven-plugin-plugin\target\invoker-reports\BUILD-asm-failure.xml, f:\jenkins\jenkins-slave\workspace\en-plugin-tools_MPLUGIN-336-OX2XMFOVDYU6CHOQOCEAQPI7JEFEG4IM2KWEE3CCBTWR4DJXZKUQ@2\m\maven-plugin-plugin\target\invoker-reports\BUILD-beanshell-simple.xml, f:\jenkins\jenkins-slave\workspace\en-plugin-tools_MPLUGIN-336-OX2XMFOVDYU6CHOQOCEAQPI7JEFEG4IM2KWEE3CCBTWR4DJXZKUQ@2\m\maven-plugin-plugin\target\invoker-reports\BUILD-fix-maven-since-3.x.xml, f:\jenkins\jenkins-slave\workspace\en-plugin-tools_MPLUGIN-336-OX2XMFOVDYU6CHOQOCEAQPI7JEFEG4IM2KWEE3CCBTWR4DJXZKUQ@2\m\maven-plugin-plugin\target\invoker-reports\BUILD-help-basic.xml, f:\jenkins\jenkins-slave\workspace\en-plugin-tools_MPLUGIN-336-OX2XMFOVDYU6CHOQOCEAQPI7JEFEG4IM2KWEE3CCBTWR4DJXZKUQ@2\m\maven-plugin-plugin\target\invoker-reports\BUILD-help-package.xml, f:\jenkins\jenkins-slave\workspace\en-plugin-tools_MPLUGIN-336-OX2XMFOVDYU6CHOQOCEAQPI7JEFEG4IM2KWEE3CCBTWR4DJXZKUQ@2\m\maven-plugin-plugin\target\invoker-reports\BUILD-ignore-plugin-class-realm.xml, f:\jenkins\jenkins-slave\workspace\en-plugin-tools_MPLUGIN-336-OX2XMFOVDYU6CHOQOCEAQPI7JEFEG4IM2KWEE3CCBTWR4DJXZKUQ@2\m\maven-plugin-plugin\target\invoker-reports\BUILD-java-basic-annotations-jdk8.xml, f:\jenkins\jenkins-slave\workspace\en-plugin-tools_MPLUGIN-336-OX2XMFOVDYU6CHOQOCEAQPI7JEFEG4IM2KWEE3CCBTWR4DJXZKUQ@2\m\maven-plugin-plugin\target\invoker-reports\BUILD-java-basic-annotations.xml, f:\jenkins\jenkins-slave\workspace\en-plugin-tools_MPLUGIN-336-OX2XMFOVDYU6CHOQOCEAQPI7JEFEG4IM2KWEE3CCBTWR4DJXZKUQ@2\m\maven-plugin-plugin\target\invoker-reports\BUILD-java-basic.xml, f:\jenkins\jenkins-slave\workspace\en-plugin-tools_MPLUGIN-336-OX2XMFOVDYU6CHOQOCEAQPI7JEFEG4IM2KWEE3CCBTWR4DJXZKUQ@2\m\maven-plugin-plugin\target\invoker-reports\BUILD-mplugin-187.xml, f:\jenkins\jenkins-slave\workspace\en-plugin-tools_MPLUGIN-336-OX2XMFOVDYU6CHOQOCEAQPI7JEFEG4IM2KWEE3CCBTWR4DJXZKUQ@2\m\maven-plugin-plugin\target\invoker-reports\BUILD-mplugin-191.xml, f:\jenkins\jenkins-slave\workspace\en-plugin-tools_MPLUGIN-336-OX2XMFOVDYU6CHOQOCEAQPI7JEFEG4IM2KWEE3CCBTWR4DJXZKUQ@2\m\maven-plugin-plugin\target\invoker-reports\BUILD-mplugin-223.xml, f:\jenkins\jenkins-slave\workspace\en-plugin-tools_MPLUGIN-336-OX2XMFOVDYU6CHOQOCEAQPI7JEFEG4IM2KWEE3CCBTWR4DJXZKUQ@2\m\maven-plugin-plugin\target\invoker-reports\BUILD-mplugin-272_java8.xml, f:\jenkins\jenkins-slave\workspace\en-plugin-tools_MPLUGIN-336-OX2XMFOVDYU6CHOQOCEAQPI7JEFEG4IM2KWEE3CCBTWR4DJXZKUQ@2\m\maven-plugin-plugin\target\invoker-reports\BUILD-mplugin-299_no-configuration.xml, f:\jenkins\jenkins-slave\workspace\en-plugin-tools_MPLUGIN-336-OX2XMFOVDYU6CHOQOCEAQPI7JEFEG4IM2KWEE3CCBTWR4DJXZKUQ@2\m\maven-plugin-plugin\target\invoker-reports\BUILD-mplugin-305_defaultMojoDependencies.xml, f:\jenkins\jenkins-slave\workspace\en-plugin-tools_MPLUGIN-336-OX2XMFOVDYU6CHOQOCEAQPI7JEFEG4IM2KWEE3CCBTWR4DJXZKUQ@2\m\maven-plugin-plugin\target\invoker-reports\BUILD-mplugin-305_emptyMojoDependencies.xml, f:\jenkins\jenkins-slave\workspace\en-plugin-tools_MPLUGIN-336-OX2XMFOVDYU6CHOQOCEAQPI7JEFEG4IM2KWEE3CCBTWR4DJXZKUQ@2\m\maven-plugin-plugin\target\invoker-reports\BUILD-mplugin-305_singleMojoDependencies.xml, f:\jenkins\jenkins-slave\workspace\en-plugin-tools_MPLUGIN-336-OX2XMFOVDYU6CHOQOCEAQPI7JEFEG4IM2KWEE3CCBTWR4DJXZKUQ@2\m\maven-plugin-plugin\target\invoker-reports\BUILD-mplugin-319_report-since.xml, f:\jenkins\jenkins-slave\workspace\en-plugin-tools_MPLUGIN-336-OX2XMFOVDYU6CHOQOCEAQPI7JEFEG4IM2KWEE3CCBTWR4DJXZKUQ@2\m\maven-plugin-plugin\target\invoker-reports\BUILD-mplugin-324_javadoc.xml, f:\jenkins\jenkins-slave\workspace\en-plugin-tools_MPLUGIN-336-OX2XMFOVDYU6CHOQOCEAQPI7JEFEG4IM2KWEE3CCBTWR4DJXZKUQ@2\m\maven-plugin-plugin\target\invoker-reports\BUILD-packaging-jar.xml, f:\jenkins\jenkins-slave\workspace\en-plugin-tools_MPLUGIN-336-OX2XMFOVDYU6CHOQOCEAQPI7JEFEG4IM2KWEE3CCBTWR4DJXZKUQ@2\m\maven-plugin-plugin\target\invoker-reports\BUILD-plugin-info-jdk-default-version.xml, f:\jenkins\jenkins-slave\workspace\en-plugin-tools_MPLUGIN-336-OX2XMFOVDYU6CHOQOCEAQPI7JEFEG4IM2KWEE3CCBTWR4DJXZKUQ@2\m\maven-plugin-plugin\target\invoker-reports\BUILD-plugin-info-jdk.xml, f:\jenkins\jenkins-slave\workspace\en-plugin-tools_MPLUGIN-336-OX2XMFOVDYU6CHOQOCEAQPI7JEFEG4IM2KWEE3CCBTWR4DJXZKUQ@2\m\maven-plugin-plugin\target\invoker-reports\BUILD-plugin-report-annotations.xml, f:\jenkins\jenkins-slave\workspace\en-plugin-tools_MPLUGIN-336-OX2XMFOVDYU6CHOQOCEAQPI7JEFEG4IM2KWEE3CCBTWR4DJXZKUQ@2\m\maven-plugin-plugin\target\invoker-reports\BUILD-plugin-report.xml, f:\jenkins\jenkins-slave\workspace\en-plugin-tools_MPLUGIN-336-OX2XMFOVDYU6CHOQOCEAQPI7JEFEG4IM2KWEE3CCBTWR4DJXZKUQ@2\m\maven-plugin-plugin\target\invoker-reports\BUILD-skip.xml, f:\jenkins\jenkins-slave\workspace\en-plugin-tools_MPLUGIN-336-OX2XMFOVDYU6CHOQOCEAQPI7JEFEG4IM2KWEE3CCBTWR4DJXZKUQ@2\m\maven-plugin-plugin\target\invoker-reports\BUILD-source-encoding.xml]
[windows-jdk8] Found logs:[f:\jenkins\jenkins-slave\workspace\en-plugin-tools_MPLUGIN-336-OX2XMFOVDYU6CHOQOCEAQPI7JEFEG4IM2KWEE3CCBTWR4DJXZKUQ@2\m\maven-plugin-plugin\target\it\annotation-with-inheritance-from-deps\build.log, f:\jenkins\jenkins-slave\workspace\en-plugin-tools_MPLUGIN-336-OX2XMFOVDYU6CHOQOCEAQPI7JEFEG4IM2KWEE3CCBTWR4DJXZKUQ@2\m\maven-plugin-plugin\target\it\annotation-with-inheritance-reactor\build.log, f:\jenkins\jenkins-slave\workspace\en-plugin-tools_MPLUGIN-336-OX2XMFOVDYU6CHOQOCEAQPI7JEFEG4IM2KWEE3CCBTWR4DJXZKUQ@2\m\maven-plugin-plugin\target\it\annotation-with-inheritance\build.log, f:\jenkins\jenkins-slave\workspace\en-plugin-tools_MPLUGIN-336-OX2XMFOVDYU6CHOQOCEAQPI7JEFEG4IM2KWEE3CCBTWR4DJXZKUQ@2\m\maven-plugin-plugin\target\it\ant-basic\build.log, f:\jenkins\jenkins-slave\workspace\en-plugin-tools_MPLUGIN-336-OX2XMFOVDYU6CHOQOCEAQPI7JEFEG4IM2KWEE3CCBTWR4DJXZKUQ@2\m\maven-plugin-plugin\target\it\ant-reference-parameter\build.log, f:\jenkins\jenkins-slave\workspace\en-plugin-tools_MPLUGIN-336-OX2XMFOVDYU6CHOQOCEAQPI7JEFEG4IM2KWEE3CCBTWR4DJXZKUQ@2\m\maven-plugin-plugin\target\it\ant-simple-usage\build.log, f:\jenkins\jenkins-slave\workspace\en-plugin-tools_MPLUGIN-336-OX2XMFOVDYU6CHOQOCEAQPI7JEFEG4IM2KWEE3CCBTWR4DJXZKUQ@2\m\maven-plugin-plugin\target\it\ant-since-maven-plugin\build.log, f:\jenkins\jenkins-slave\workspace\en-plugin-tools_MPLUGIN-336-OX2XMFOVDYU6CHOQOCEAQPI7JEFEG4IM2KWEE3CCBTWR4DJXZKUQ@2\m\maven-plugin-plugin\target\it\asm-failure\build.log, f:\jenkins\jenkins-slave\workspace\en-plugin-tools_MPLUGIN-336-OX2XMFOVDYU6CHOQOCEAQPI7JEFEG4IM2KWEE3CCBTWR4DJXZKUQ@2\m\maven-plugin-plugin\target\it\beanshell-simple\build.log, f:\jenkins\jenkins-slave\workspace\en-plugin-tools_MPLUGIN-336-OX2XMFOVDYU6CHOQOCEAQPI7JEFEG4IM2KWEE3CCBTWR4DJXZKUQ@2\m\maven-plugin-plugin\target\it\fix-maven-since-3.x\build.log, f:\jenkins\jenkins-slave\workspace\en-plugin-tools_MPLUGIN-336-OX2XMFOVDYU6CHOQOCEAQPI7JEFEG4IM2KWEE3CCBTWR4DJXZKUQ@2\m\maven-plugin-plugin\target\it\help-basic\build.log, f:\jenkins\jenkins-slave\workspace\en-plugin-tools_MPLUGIN-336-OX2XMFOVDYU6CHOQOCEAQPI7JEFEG4IM2KWEE3CCBTWR4DJXZKUQ@2\m\maven-plugin-plugin\target\it\help-package\build.log, f:\jenkins\jenkins-slave\workspace\en-plugin-tools_MPLUGIN-336-OX2XMFOVDYU6CHOQOCEAQPI7JEFEG4IM2KWEE3CCBTWR4DJXZKUQ@2\m\maven-plugin-plugin\target\it\ignore-plugin-class-realm\build.log, f:\jenkins\jenkins-slave\workspace\en-plugin-tools_MPLUGIN-336-OX2XMFOVDYU6CHOQOCEAQPI7JEFEG4IM2KWEE3CCBTWR4DJXZKUQ@2\m\maven-plugin-plugin\target\it\java-basic-annotations-jdk8\build.log, f:\jenkins\jenkins-slave\workspace\en-plugin-tools_MPLUGIN-336-OX2XMFOVDYU6CHOQOCEAQPI7JEFEG4IM2KWEE3CCBTWR4DJXZKUQ@2\m\maven-plugin-plugin\target\it\java-basic-annotations\build.log, f:\jenkins\jenkins-slave\workspace\en-plugin-tools_MPLUGIN-336-OX2XMFOVDYU6CHOQOCEAQPI7JEFEG4IM2KWEE3CCBTWR4DJXZKUQ@2\m\maven-plugin-plugin\target\it\java-basic\build.log, f:\jenkins\jenkins-slave\workspace\en-plugin-tools_MPLUGIN-336-OX2XMFOVDYU6CHOQOCEAQPI7JEFEG4IM2KWEE3CCBTWR4DJXZKUQ@2\m\maven-plugin-plugin\target\it\mplugin-187\build.log, f:\jenkins\jenkins-slave\workspace\en-plugin-tools_MPLUGIN-336-OX2XMFOVDYU6CHOQOCEAQPI7JEFEG4IM2KWEE3CCBTWR4DJXZKUQ@2\m\maven-plugin-plugin\target\it\mplugin-191\build.log, f:\jenkins\jenkins-slave\workspace\en-plugin-tools_MPLUGIN-336-OX2XMFOVDYU6CHOQOCEAQPI7JEFEG4IM2KWEE3CCBTWR4DJXZKUQ@2\m\maven-plugin-plugin\target\it\mplugin-223\build.log, f:\jenkins\jenkins-slave\workspace\en-plugin-tools_MPLUGIN-336-OX2XMFOVDYU6CHOQOCEAQPI7JEFEG4IM2KWEE3CCBTWR4DJXZKUQ@2\m\maven-plugin-plugin\target\it\mplugin-272_java8\build.log, f:\jenkins\jenkins-slave\workspace\en-plugin-tools_MPLUGIN-336-OX2XMFOVDYU6CHOQOCEAQPI7JEFEG4IM2KWEE3CCBTWR4DJXZKUQ@2\m\maven-plugin-plugin\target\it\mplugin-299_no-configuration\build.log, f:\jenkins\jenkins-slave\workspace\en-plugin-tools_MPLUGIN-336-OX2XMFOVDYU6CHOQOCEAQPI7JEFEG4IM2KWEE3CCBTWR4DJXZKUQ@2\m\maven-plugin-plugin\target\it\mplugin-305_defaultMojoDependencies\build.log, f:\jenkins\jenkins-slave\workspace\en-plugin-tools_MPLUGIN-336-OX2XMFOVDYU6CHOQOCEAQPI7JEFEG4IM2KWEE3CCBTWR4DJXZKUQ@2\m\maven-plugin-plugin\target\it\mplugin-305_emptyMojoDependencies\build.log, f:\jenkins\jenkins-slave\workspace\en-plugin-tools_MPLUGIN-336-OX2XMFOVDYU6CHOQOCEAQPI7JEFEG4IM2KWEE3CCBTWR4DJXZKUQ@2\m\maven-plugin-plugin\target\it\mplugin-305_singleMojoDependencies\build.log, f:\jenkins\jenkins-slave\workspace\en-plugin-tools_MPLUGIN-336-OX2XMFOVDYU6CHOQOCEAQPI7JEFEG4IM2KWEE3CCBTWR4DJXZKUQ@2\m\maven-plugin-plugin\target\it\mplugin-319_report-since\build.log, f:\jenkins\jenkins-slave\workspace\en-plugin-tools_MPLUGIN-336-OX2XMFOVDYU6CHOQOCEAQPI7JEFEG4IM2KWEE3CCBTWR4DJXZKUQ@2\m\maven-plugin-plugin\target\it\mplugin-324_javadoc\build.log, f:\jenkins\jenkins-slave\workspace\en-plugin-tools_MPLUGIN-336-OX2XMFOVDYU6CHOQOCEAQPI7JEFEG4IM2KWEE3CCBTWR4DJXZKUQ@2\m\maven-plugin-plugin\target\it\packaging-jar\build.log, f:\jenkins\jenkins-slave\workspace\en-plugin-tools_MPLUGIN-336-OX2XMFOVDYU6CHOQOCEAQPI7JEFEG4IM2KWEE3CCBTWR4DJXZKUQ@2\m\maven-plugin-plugin\target\it\plugin-info-jdk-default-version\build.log, f:\jenkins\jenkins-slave\workspace\en-plugin-tools_MPLUGIN-336-OX2XMFOVDYU6CHOQOCEAQPI7JEFEG4IM2KWEE3CCBTWR4DJXZKUQ@2\m\maven-plugin-plugin\target\it\plugin-info-jdk\build.log, f:\jenkins\jenkins-slave\workspace\en-plugin-tools_MPLUGIN-336-OX2XMFOVDYU6CHOQOCEAQPI7JEFEG4IM2KWEE3CCBTWR4DJXZKUQ@2\m\maven-plugin-plugin\target\it\plugin-report-annotations\build.log, f:\jenkins\jenkins-slave\workspace\en-plugin-tools_MPLUGIN-336-OX2XMFOVDYU6CHOQOCEAQPI7JEFEG4IM2KWEE3CCBTWR4DJXZKUQ@2\m\maven-plugin-plugin\target\it\plugin-report\build.log, f:\jenkins\jenkins-slave\workspace\en-plugin-tools_MPLUGIN-336-OX2XMFOVDYU6CHOQOCEAQPI7JEFEG4IM2KWEE3CCBTWR4DJXZKUQ@2\m\maven-plugin-plugin\target\it\skip\build.log, f:\jenkins\jenkins-slave\workspace\en-plugin-tools_MPLUGIN-336-OX2XMFOVDYU6CHOQOCEAQPI7JEFEG4IM2KWEE3CCBTWR4DJXZKUQ@2\m\maven-plugin-plugin\target\it\source-encoding\build.log]
[windows-jdk8] Finished parsing Maven Invoker results (found 33)
[windows-jdk8] [withMaven] junitPublisher - Archive test results for Maven artifact org.apache.maven.plugin-tools:maven-plugin-tools-api:3.6-SNAPSHOT generated by maven-surefire-plugin:test (default-test): m\maven-plugin-tools-api\target\surefire-reports\*.xml
[windows-jdk8] Recording test results
[windows-jdk8] [withMaven] junitPublisher - Archive test results for Maven artifact org.apache.maven.plugin-tools:maven-plugin-tools-generators:3.6-SNAPSHOT generated by maven-surefire-plugin:test (default-test): m\maven-plugin-tools-generators\target\surefire-reports\*.xml
[windows-jdk8] Recording test results
[windows-jdk8] [withMaven] junitPublisher - Archive test results for Maven artifact org.apache.maven.plugin-tools:maven-plugin-tools-java:3.6-SNAPSHOT generated by maven-surefire-plugin:test (default-test): m\maven-plugin-tools-java\target\surefire-reports\*.xml
[windows-jdk8] Recording test results
[windows-jdk8] [withMaven] junitPublisher - Archive test results for Maven artifact org.apache.maven.plugin-tools:maven-plugin-annotations:3.6-SNAPSHOT generated by maven-surefire-plugin:test (default-test): m\maven-plugin-annotations\target\surefire-reports\*.xml
[windows-jdk8] Recording test results
[windows-jdk8] None of the test reports contained any result
[windows-jdk8] [withMaven] junitPublisher - Archive test results for Maven artifact org.apache.maven.plugin-tools:maven-plugin-tools-annotations:3.6-SNAPSHOT generated by maven-surefire-plugin:test (default-test): m\maven-plugin-tools-annotations\target\surefire-reports\*.xml
[windows-jdk8] Recording test results
[windows-jdk8] [withMaven] junitPublisher - Archive test results for Maven artifact org.apache.maven.plugin-tools:maven-plugin-tools-javadoc:3.6-SNAPSHOT generated by maven-surefire-plugin:test (default-test): m\maven-plugin-tools-javadoc\target\surefire-reports\*.xml
[windows-jdk8] Recording test results
[windows-jdk8] None of the test reports contained any result
[windows-jdk8] [withMaven] junitPublisher - Archive test results for Maven artifact org.apache.maven.plugin-tools:maven-plugin-tools-model:3.6-SNAPSHOT generated by maven-surefire-plugin:test (default-test): m\maven-script\maven-plugin-tools-model\target\surefire-reports\*.xml
[windows-jdk8] Recording test results
[windows-jdk8] [withMaven] junitPublisher - Archive test results for Maven artifact org.apache.maven.plugin-tools:maven-plugin-tools-ant:3.6-SNAPSHOT generated by maven-surefire-plugin:test (default-test): m\maven-script\maven-plugin-tools-ant\target\surefire-reports\*.xml
[windows-jdk8] Recording test results
[windows-jdk8] [withMaven] junitPublisher - Archive test results for Maven artifact org.apache.maven.plugin-tools:maven-script-ant:3.6-SNAPSHOT generated by maven-surefire-plugin:test (default-test): m\maven-script\maven-script-ant\target\surefire-reports\*.xml
[windows-jdk8] Recording test results
[windows-jdk8] [withMaven] junitPublisher - Archive test results for Maven artifact org.apache.maven.plugin-tools:maven-plugin-tools-beanshell:3.6-SNAPSHOT generated by maven-surefire-plugin:test (default-test): m\maven-script\maven-plugin-tools-beanshell\target\surefire-reports\*.xml
[windows-jdk8] Recording test results
[windows-jdk8] None of the test reports contained any result
[windows-jdk8] [withMaven] junitPublisher - Archive test results for Maven artifact org.apache.maven.plugin-tools:maven-script-beanshell:3.6-SNAPSHOT generated by maven-surefire-plugin:test (default-test): m\maven-script\maven-script-beanshell\target\surefire-reports\*.xml
[windows-jdk8] Recording test results
[windows-jdk8] None of the test reports contained any result
[windows-jdk8] [withMaven] junitPublisher - Archive test results for Maven artifact org.apache.maven.plugins:maven-plugin-plugin:3.6-SNAPSHOT generated by maven-surefire-plugin:test (default-test): m\maven-plugin-plugin\target\surefire-reports\*.xml
[windows-jdk8] Recording test results
[windows-jdk8] None of the test reports contained any result
[Pipeline] [windows-jdk8] // withMaven
[Pipeline] [windows-jdk8] cleanWs
[windows-jdk8] [WS-CLEANUP] Deleting project workspace...[WS-CLEANUP] done
[Pipeline] [windows-jdk8] }
[Pipeline] [windows-jdk8] // stage
[Pipeline] [windows-jdk8] }
[Pipeline] [windows-jdk8] // node
[Pipeline] [windows-jdk8] }
[Pipeline] // parallel
[Pipeline] stage
[Pipeline] { (Notifications)
[Pipeline] echo
Build result: FAILURE
[Pipeline] jiraIssueSelector
[Pipeline] jiraComment
[Pipeline] jiraComment
[Pipeline] jiraComment
[Pipeline] emailext
Reply | Threaded
Open this post in threaded view
|

Build failed in Jenkins: Maven TLP » maven-plugin-tools » MPLUGIN-336 #7

Apache Jenkins Server-2
See https://builds.apache.org/job/maven-box/job/maven-plugin-tools/job/MPLUGIN-336/7/

Changes:

* Exclude H31 cause master is failing constantly.
* no need to test anymore with '3.0.x'
* Add Java 11 to defaults
* Try to shorten path for Windows by using tempDir
* Fix arguments
* Add option for temp workspace
* disable tmpWs
* enable tmpWs
* Use def
* Try to shorten wsDir

All tests passed

Build log:
[...truncated 3.85 MB...]
[windows-jdk7] [INFO] run post-build script verify.groovy
[windows-jdk7] [INFO]           mplugin-305_defaultMojoDependencies\pom.xml ...... SUCCESS (16.8 s)
[windows-jdk7] [INFO] Building: mplugin-305_emptyMojoDependencies\pom.xml
[windows-jdk7] [INFO] run post-build script verify.groovy
[windows-jdk7] [INFO]           mplugin-305_emptyMojoDependencies\pom.xml ........ SUCCESS (13.6 s)
[windows-jdk7] [INFO] Building: mplugin-305_singleMojoDependencies\pom.xml
[windows-jdk8] [INFO]           mplugin-299_no-configuration\pom.xml ............. SUCCESS (18.0 s)
[windows-jdk8] [INFO] Building: mplugin-305_defaultMojoDependencies\pom.xml
[windows-jdk7] [INFO] run post-build script verify.groovy
[windows-jdk7] [INFO]           mplugin-305_singleMojoDependencies\pom.xml ....... SUCCESS (13.3 s)
[windows-jdk7] [INFO] Building: mplugin-319_report-since\pom.xml
[windows-jdk8] [INFO] run post-build script verify.groovy
[windows-jdk8] [INFO]           mplugin-305_defaultMojoDependencies\pom.xml ...... SUCCESS (15.2 s)
[windows-jdk8] [INFO] Building: mplugin-305_emptyMojoDependencies\pom.xml
[windows-jdk7] [INFO] run post-build script verify.groovy
[windows-jdk7] [INFO]           mplugin-319_report-since\pom.xml ................. SUCCESS (14.0 s)
[windows-jdk7] [INFO] Building: mplugin-324_javadoc\pom.xml
[windows-jdk8] [INFO] run post-build script verify.groovy
[windows-jdk8] [INFO]           mplugin-305_emptyMojoDependencies\pom.xml ........ SUCCESS (12.1 s)
[windows-jdk8] [INFO] Building: mplugin-305_singleMojoDependencies\pom.xml
[windows-jdk8] [INFO] run post-build script verify.groovy
[windows-jdk8] [INFO]           mplugin-305_singleMojoDependencies\pom.xml ....... SUCCESS (12.4 s)
[windows-jdk8] [INFO] Building: mplugin-319_report-since\pom.xml
[windows-jdk7] [INFO]           mplugin-324_javadoc\pom.xml ...................... SUCCESS (25.2 s)
[windows-jdk7] [INFO] Building: packaging-jar\pom.xml
[windows-jdk8] [INFO] run post-build script verify.groovy
[windows-jdk8] [INFO]           mplugin-319_report-since\pom.xml ................. SUCCESS (13.1 s)
[windows-jdk8] [INFO] Building: mplugin-324_javadoc\pom.xml
[windows-jdk7] [INFO] run post-build script verify.groovy
[windows-jdk7] [INFO]           packaging-jar\pom.xml ............................ SUCCESS (12.9 s)
[windows-jdk7] [INFO] Building: plugin-info-jdk\pom.xml
[windows-jdk8] [INFO]           mplugin-324_javadoc\pom.xml ...................... SUCCESS (24.3 s)
[windows-jdk8] [INFO] Building: packaging-jar\pom.xml
[windows-jdk7] [INFO] run post-build script verify.groovy
[windows-jdk7] [INFO]           plugin-info-jdk\pom.xml .......................... SUCCESS (27.8 s)
[windows-jdk7] [INFO] Building: plugin-info-jdk-default-version\pom.xml
[windows-jdk8] [INFO] run post-build script verify.groovy
[windows-jdk8] [INFO]           packaging-jar\pom.xml ............................ SUCCESS (15.0 s)
[windows-jdk8] [INFO] Building: plugin-info-jdk\pom.xml
[windows-jdk7] [INFO] run post-build script verify.groovy
[windows-jdk7] [INFO]           plugin-info-jdk-default-version\pom.xml .......... SUCCESS (12.3 s)
[windows-jdk7] [INFO] Building: plugin-report\pom.xml
[windows-jdk8] [INFO] run post-build script verify.groovy
[windows-jdk8] [INFO]           plugin-info-jdk\pom.xml .......................... SUCCESS (27.4 s)
[windows-jdk8] [INFO] Building: plugin-info-jdk-default-version\pom.xml
[windows-jdk8] [INFO] run post-build script verify.groovy
[windows-jdk8] [INFO]           plugin-info-jdk-default-version\pom.xml .......... SUCCESS (12.3 s)
[windows-jdk8] [INFO] Building: plugin-report\pom.xml
[windows-jdk7] [INFO] run post-build script verify.bsh
[windows-jdk7] [INFO]           plugin-report\pom.xml ............................ SUCCESS (46.4 s)
[windows-jdk7] [INFO] Building: plugin-report-annotations\pom.xml
[windows-jdk7] [INFO] run post-build script verify.bsh
[windows-jdk7] [INFO]           plugin-report-annotations\pom.xml ................ SUCCESS (22.2 s)
[windows-jdk7] [INFO] Building: skip\pom.xml
[windows-jdk8] [INFO] run post-build script verify.bsh
[windows-jdk8] [INFO]           plugin-report\pom.xml ............................ SUCCESS (43.6 s)
[windows-jdk8] [INFO] Building: plugin-report-annotations\pom.xml
[windows-jdk7] [INFO] run post-build script verify.groovy
[windows-jdk7] [INFO]           skip\pom.xml ..................................... SUCCESS (12.7 s)
[windows-jdk7] [INFO] Building: source-encoding\pom.xml
[windows-jdk8] [INFO] run post-build script verify.bsh
[windows-jdk8] [INFO]           plugin-report-annotations\pom.xml ................ SUCCESS (18.7 s)
[windows-jdk8] [INFO] Building: skip\pom.xml
[windows-jdk7] [INFO] run post-build script verify.groovy
[windows-jdk7] [INFO]           source-encoding\pom.xml .......................... SUCCESS (12.2 s)
[windows-jdk7] [INFO] -------------------------------------------------
[windows-jdk7] [INFO] Build Summary:
[windows-jdk7] [INFO]   Passed: 30, Failed: 1, Errors: 0, Skipped: 2
[windows-jdk7] [INFO] -------------------------------------------------
[windows-jdk7] [WARNING] The following builds failed:
[windows-jdk7] [WARNING] *  asm-failure\pom.xml
[windows-jdk7] [INFO] -------------------------------------------------
[windows-jdk7] [WARNING] Ignoring that 1 build failed.
[windows-jdk7] [INFO]
[windows-jdk7] [INFO] --- maven-checkstyle-plugin:3.0.0:check (checkstyle-check) @ maven-plugin-plugin ---
[windows-jdk7] [INFO] ------------------------------------------------------------------------
[windows-jdk7] [INFO] Reactor Summary:
[windows-jdk7] [INFO]
[windows-jdk7] [INFO] Maven Plugin Tools ................................. SUCCESS [ 47.536 s]
[windows-jdk7] [INFO] Maven Plugin Tools Extractor API ................... SUCCESS [ 18.435 s]
[windows-jdk7] [INFO] Maven Plugin Tools Generators ...................... SUCCESS [ 12.064 s]
[windows-jdk7] [INFO] Maven Plugin Tool for Java with Javadoc Tags ....... SUCCESS [  9.971 s]
[windows-jdk7] [INFO] Maven Plugin Tools Java 5 Annotations .............. SUCCESS [  2.016 s]
[windows-jdk7] [INFO] Maven Plugin Tool for Java with Annotations ........ SUCCESS [  8.715 s]
[windows-jdk7] [INFO] Maven Plugin Tools Javadoc Taglets ................. SUCCESS [ 16.620 s]
[windows-jdk7] [INFO] Maven Script Mojo Support .......................... SUCCESS [  1.581 s]
[windows-jdk7] [INFO] Maven Plugin Metadata Model ........................ SUCCESS [  6.573 s]
[windows-jdk7] [INFO] Maven Plugin Tool for Ant .......................... SUCCESS [  4.711 s]
[windows-jdk7] [INFO] Maven Ant Mojo Support ............................. SUCCESS [  7.233 s]
[windows-jdk7] [INFO] Maven Plugin Tool for Beanshell .................... SUCCESS [  2.748 s]
[windows-jdk7] [INFO] Maven Beanshell Mojo Support ....................... SUCCESS [  1.978 s]
[windows-jdk7] [INFO] Maven Plugin Plugin ................................ SUCCESS [11:22 min]
[windows-jdk7] [INFO] ------------------------------------------------------------------------
[windows-jdk7] [INFO] BUILD SUCCESS
[windows-jdk7] [INFO] ------------------------------------------------------------------------
[windows-jdk7] [INFO] Total time: 13:45 min
[windows-jdk7] [INFO] Finished at: 2018-10-09T09:28:11-07:00
[windows-jdk7] [INFO] Final Memory: 67M/562M
[windows-jdk7] [INFO] ------------------------------------------------------------------------
[windows-jdk7] [INFO] [jenkins-event-spy] Generated F:\jenkins\jenkins-slave\workspace\en-plugin-tools_MPLUGIN-336-OX2XMFOVDYU6CHOQOCEAQPI7JEFEG4IM2KWEE3CCBTWR4DJXZKUQ@tmp\withMaven18f9a7af\maven-spy-20181009-091424-9947902174241896586942.log
[windows-jdk7] Picked up JAVA_TOOL_OPTIONS: -Dmaven.ext.class.path="f:\jenkins\jenkins-slave\workspace\en-plugin-tools_MPLUGIN-336-OX2XMFOVDYU6CHOQOCEAQPI7JEFEG4IM2KWEE3CCBTWR4DJXZKUQ@tmp\withMaven18f9a7af\pipeline-maven-spy.jar" -Dorg.jenkinsci.plugins.pipeline.maven.reportsFolder="f:\jenkins\jenkins-slave\workspace\en-plugin-tools_MPLUGIN-336-OX2XMFOVDYU6CHOQOCEAQPI7JEFEG4IM2KWEE3CCBTWR4DJXZKUQ@tmp\withMaven18f9a7af"
[Pipeline] [windows-jdk7] }
[Pipeline] [windows-jdk7] // dir
[Pipeline] [windows-jdk7] }
[windows-jdk7] [withMaven] invokerPublisher - Archive invoker results for Maven artifact MavenArtifact{org.apache.maven.plugin-tools:maven-plugin-tools-javadoc::3.6-SNAPSHOT(version: 3.6-SNAPSHOT, snapshot:false) } generated by PluginInvocation{org.apache.maven.plugins:maven-invoker-plugin:3.0.1@run  integration-test}: m\maven-plugin-tools-javadoc\target\invoker-reports\*.xml
[windows-jdk7] performing MavenInvokerRecorder, reportsFilenamePattern:'**/m\maven-plugin-tools-javadoc\target\invoker-reports/BUILD*.xml', invokerBuildDir:'**/m\maven-plugin-tools-javadoc\target\it'
[windows-jdk7] Found reports:[f:\jenkins\jenkins-slave\workspace\en-plugin-tools_MPLUGIN-336-OX2XMFOVDYU6CHOQOCEAQPI7JEFEG4IM2KWEE3CCBTWR4DJXZKUQ\m\maven-plugin-tools-javadoc\target\invoker-reports\BUILD-basic.xml]
[windows-jdk7] Found logs:[f:\jenkins\jenkins-slave\workspace\en-plugin-tools_MPLUGIN-336-OX2XMFOVDYU6CHOQOCEAQPI7JEFEG4IM2KWEE3CCBTWR4DJXZKUQ\m\maven-plugin-tools-javadoc\target\it\basic\build.log]
[windows-jdk7] Finished parsing Maven Invoker results (found 1)
[windows-jdk7] [withMaven] invokerPublisher - Archive invoker results for Maven artifact MavenArtifact{org.apache.maven.plugins:maven-plugin-plugin::3.6-SNAPSHOT(version: 3.6-SNAPSHOT, snapshot:false) } generated by PluginInvocation{org.apache.maven.plugins:maven-invoker-plugin:3.0.1@run  integration-test}: m\maven-plugin-plugin\target\invoker-reports\*.xml
[windows-jdk7] performing MavenInvokerRecorder, reportsFilenamePattern:'**/m\maven-plugin-plugin\target\invoker-reports/BUILD*.xml', invokerBuildDir:'**/m\maven-plugin-plugin\target\it'
[windows-jdk7] Found reports:[f:\jenkins\jenkins-slave\workspace\en-plugin-tools_MPLUGIN-336-OX2XMFOVDYU6CHOQOCEAQPI7JEFEG4IM2KWEE3CCBTWR4DJXZKUQ\m\maven-plugin-plugin\target\invoker-reports\BUILD-annotation-with-inheritance-from-deps.xml, f:\jenkins\jenkins-slave\workspace\en-plugin-tools_MPLUGIN-336-OX2XMFOVDYU6CHOQOCEAQPI7JEFEG4IM2KWEE3CCBTWR4DJXZKUQ\m\maven-plugin-plugin\target\invoker-reports\BUILD-annotation-with-inheritance-reactor.xml, f:\jenkins\jenkins-slave\workspace\en-plugin-tools_MPLUGIN-336-OX2XMFOVDYU6CHOQOCEAQPI7JEFEG4IM2KWEE3CCBTWR4DJXZKUQ\m\maven-plugin-plugin\target\invoker-reports\BUILD-annotation-with-inheritance.xml, f:\jenkins\jenkins-slave\workspace\en-plugin-tools_MPLUGIN-336-OX2XMFOVDYU6CHOQOCEAQPI7JEFEG4IM2KWEE3CCBTWR4DJXZKUQ\m\maven-plugin-plugin\target\invoker-reports\BUILD-ant-basic.xml, f:\jenkins\jenkins-slave\workspace\en-plugin-tools_MPLUGIN-336-OX2XMFOVDYU6CHOQOCEAQPI7JEFEG4IM2KWEE3CCBTWR4DJXZKUQ\m\maven-plugin-plugin\target\invoker-reports\BUILD-ant-reference-parameter.xml, f:\jenkins\jenkins-slave\workspace\en-plugin-tools_MPLUGIN-336-OX2XMFOVDYU6CHOQOCEAQPI7JEFEG4IM2KWEE3CCBTWR4DJXZKUQ\m\maven-plugin-plugin\target\invoker-reports\BUILD-ant-simple-usage.xml, f:\jenkins\jenkins-slave\workspace\en-plugin-tools_MPLUGIN-336-OX2XMFOVDYU6CHOQOCEAQPI7JEFEG4IM2KWEE3CCBTWR4DJXZKUQ\m\maven-plugin-plugin\target\invoker-reports\BUILD-ant-since-maven-plugin.xml, f:\jenkins\jenkins-slave\workspace\en-plugin-tools_MPLUGIN-336-OX2XMFOVDYU6CHOQOCEAQPI7JEFEG4IM2KWEE3CCBTWR4DJXZKUQ\m\maven-plugin-plugin\target\invoker-reports\BUILD-asm-failure.xml, f:\jenkins\jenkins-slave\workspace\en-plugin-tools_MPLUGIN-336-OX2XMFOVDYU6CHOQOCEAQPI7JEFEG4IM2KWEE3CCBTWR4DJXZKUQ\m\maven-plugin-plugin\target\invoker-reports\BUILD-beanshell-simple.xml, f:\jenkins\jenkins-slave\workspace\en-plugin-tools_MPLUGIN-336-OX2XMFOVDYU6CHOQOCEAQPI7JEFEG4IM2KWEE3CCBTWR4DJXZKUQ\m\maven-plugin-plugin\target\invoker-reports\BUILD-fix-maven-since-3.x.xml, f:\jenkins\jenkins-slave\workspace\en-plugin-tools_MPLUGIN-336-OX2XMFOVDYU6CHOQOCEAQPI7JEFEG4IM2KWEE3CCBTWR4DJXZKUQ\m\maven-plugin-plugin\target\invoker-reports\BUILD-help-basic.xml, f:\jenkins\jenkins-slave\workspace\en-plugin-tools_MPLUGIN-336-OX2XMFOVDYU6CHOQOCEAQPI7JEFEG4IM2KWEE3CCBTWR4DJXZKUQ\m\maven-plugin-plugin\target\invoker-reports\BUILD-help-package.xml, f:\jenkins\jenkins-slave\workspace\en-plugin-tools_MPLUGIN-336-OX2XMFOVDYU6CHOQOCEAQPI7JEFEG4IM2KWEE3CCBTWR4DJXZKUQ\m\maven-plugin-plugin\target\invoker-reports\BUILD-ignore-plugin-class-realm.xml, f:\jenkins\jenkins-slave\workspace\en-plugin-tools_MPLUGIN-336-OX2XMFOVDYU6CHOQOCEAQPI7JEFEG4IM2KWEE3CCBTWR4DJXZKUQ\m\maven-plugin-plugin\target\invoker-reports\BUILD-java-basic-annotations-jdk8.xml, f:\jenkins\jenkins-slave\workspace\en-plugin-tools_MPLUGIN-336-OX2XMFOVDYU6CHOQOCEAQPI7JEFEG4IM2KWEE3CCBTWR4DJXZKUQ\m\maven-plugin-plugin\target\invoker-reports\BUILD-java-basic-annotations.xml, f:\jenkins\jenkins-slave\workspace\en-plugin-tools_MPLUGIN-336-OX2XMFOVDYU6CHOQOCEAQPI7JEFEG4IM2KWEE3CCBTWR4DJXZKUQ\m\maven-plugin-plugin\target\invoker-reports\BUILD-java-basic.xml, f:\jenkins\jenkins-slave\workspace\en-plugin-tools_MPLUGIN-336-OX2XMFOVDYU6CHOQOCEAQPI7JEFEG4IM2KWEE3CCBTWR4DJXZKUQ\m\maven-plugin-plugin\target\invoker-reports\BUILD-mplugin-187.xml, f:\jenkins\jenkins-slave\workspace\en-plugin-tools_MPLUGIN-336-OX2XMFOVDYU6CHOQOCEAQPI7JEFEG4IM2KWEE3CCBTWR4DJXZKUQ\m\maven-plugin-plugin\target\invoker-reports\BUILD-mplugin-191.xml, f:\jenkins\jenkins-slave\workspace\en-plugin-tools_MPLUGIN-336-OX2XMFOVDYU6CHOQOCEAQPI7JEFEG4IM2KWEE3CCBTWR4DJXZKUQ\m\maven-plugin-plugin\target\invoker-reports\BUILD-mplugin-223.xml, f:\jenkins\jenkins-slave\workspace\en-plugin-tools_MPLUGIN-336-OX2XMFOVDYU6CHOQOCEAQPI7JEFEG4IM2KWEE3CCBTWR4DJXZKUQ\m\maven-plugin-plugin\target\invoker-reports\BUILD-mplugin-272_java8.xml, f:\jenkins\jenkins-slave\workspace\en-plugin-tools_MPLUGIN-336-OX2XMFOVDYU6CHOQOCEAQPI7JEFEG4IM2KWEE3CCBTWR4DJXZKUQ\m\maven-plugin-plugin\target\invoker-reports\BUILD-mplugin-299_no-configuration.xml, f:\jenkins\jenkins-slave\workspace\en-plugin-tools_MPLUGIN-336-OX2XMFOVDYU6CHOQOCEAQPI7JEFEG4IM2KWEE3CCBTWR4DJXZKUQ\m\maven-plugin-plugin\target\invoker-reports\BUILD-mplugin-305_defaultMojoDependencies.xml, f:\jenkins\jenkins-slave\workspace\en-plugin-tools_MPLUGIN-336-OX2XMFOVDYU6CHOQOCEAQPI7JEFEG4IM2KWEE3CCBTWR4DJXZKUQ\m\maven-plugin-plugin\target\invoker-reports\BUILD-mplugin-305_emptyMojoDependencies.xml, f:\jenkins\jenkins-slave\workspace\en-plugin-tools_MPLUGIN-336-OX2XMFOVDYU6CHOQOCEAQPI7JEFEG4IM2KWEE3CCBTWR4DJXZKUQ\m\maven-plugin-plugin\target\invoker-reports\BUILD-mplugin-305_singleMojoDependencies.xml, f:\jenkins\jenkins-slave\workspace\en-plugin-tools_MPLUGIN-336-OX2XMFOVDYU6CHOQOCEAQPI7JEFEG4IM2KWEE3CCBTWR4DJXZKUQ\m\maven-plugin-plugin\target\invoker-reports\BUILD-mplugin-319_report-since.xml, f:\jenkins\jenkins-slave\workspace\en-plugin-tools_MPLUGIN-336-OX2XMFOVDYU6CHOQOCEAQPI7JEFEG4IM2KWEE3CCBTWR4DJXZKUQ\m\maven-plugin-plugin\target\invoker-reports\BUILD-mplugin-324_javadoc.xml, f:\jenkins\jenkins-slave\workspace\en-plugin-tools_MPLUGIN-336-OX2XMFOVDYU6CHOQOCEAQPI7JEFEG4IM2KWEE3CCBTWR4DJXZKUQ\m\maven-plugin-plugin\target\invoker-reports\BUILD-packaging-jar.xml, f:\jenkins\jenkins-slave\workspace\en-plugin-tools_MPLUGIN-336-OX2XMFOVDYU6CHOQOCEAQPI7JEFEG4IM2KWEE3CCBTWR4DJXZKUQ\m\maven-plugin-plugin\target\invoker-reports\BUILD-plugin-info-jdk-default-version.xml, f:\jenkins\jenkins-slave\workspace\en-plugin-tools_MPLUGIN-336-OX2XMFOVDYU6CHOQOCEAQPI7JEFEG4IM2KWEE3CCBTWR4DJXZKUQ\m\maven-plugin-plugin\target\invoker-reports\BUILD-plugin-info-jdk.xml, f:\jenkins\jenkins-slave\workspace\en-plugin-tools_MPLUGIN-336-OX2XMFOVDYU6CHOQOCEAQPI7JEFEG4IM2KWEE3CCBTWR4DJXZKUQ\m\maven-plugin-plugin\target\invoker-reports\BUILD-plugin-report-annotations.xml, f:\jenkins\jenkins-slave\workspace\en-plugin-tools_MPLUGIN-336-OX2XMFOVDYU6CHOQOCEAQPI7JEFEG4IM2KWEE3CCBTWR4DJXZKUQ\m\maven-plugin-plugin\target\invoker-reports\BUILD-plugin-report.xml, f:\jenkins\jenkins-slave\workspace\en-plugin-tools_MPLUGIN-336-OX2XMFOVDYU6CHOQOCEAQPI7JEFEG4IM2KWEE3CCBTWR4DJXZKUQ\m\maven-plugin-plugin\target\invoker-reports\BUILD-skip.xml, f:\jenkins\jenkins-slave\workspace\en-plugin-tools_MPLUGIN-336-OX2XMFOVDYU6CHOQOCEAQPI7JEFEG4IM2KWEE3CCBTWR4DJXZKUQ\m\maven-plugin-plugin\target\invoker-reports\BUILD-source-encoding.xml]
[windows-jdk7] Found logs:[f:\jenkins\jenkins-slave\workspace\en-plugin-tools_MPLUGIN-336-OX2XMFOVDYU6CHOQOCEAQPI7JEFEG4IM2KWEE3CCBTWR4DJXZKUQ\m\maven-plugin-plugin\target\it\annotation-with-inheritance-from-deps\build.log, f:\jenkins\jenkins-slave\workspace\en-plugin-tools_MPLUGIN-336-OX2XMFOVDYU6CHOQOCEAQPI7JEFEG4IM2KWEE3CCBTWR4DJXZKUQ\m\maven-plugin-plugin\target\it\annotation-with-inheritance-reactor\build.log, f:\jenkins\jenkins-slave\workspace\en-plugin-tools_MPLUGIN-336-OX2XMFOVDYU6CHOQOCEAQPI7JEFEG4IM2KWEE3CCBTWR4DJXZKUQ\m\maven-plugin-plugin\target\it\annotation-with-inheritance\build.log, f:\jenkins\jenkins-slave\workspace\en-plugin-tools_MPLUGIN-336-OX2XMFOVDYU6CHOQOCEAQPI7JEFEG4IM2KWEE3CCBTWR4DJXZKUQ\m\maven-plugin-plugin\target\it\ant-basic\build.log, f:\jenkins\jenkins-slave\workspace\en-plugin-tools_MPLUGIN-336-OX2XMFOVDYU6CHOQOCEAQPI7JEFEG4IM2KWEE3CCBTWR4DJXZKUQ\m\maven-plugin-plugin\target\it\ant-reference-parameter\build.log, f:\jenkins\jenkins-slave\workspace\en-plugin-tools_MPLUGIN-336-OX2XMFOVDYU6CHOQOCEAQPI7JEFEG4IM2KWEE3CCBTWR4DJXZKUQ\m\maven-plugin-plugin\target\it\ant-simple-usage\build.log, f:\jenkins\jenkins-slave\workspace\en-plugin-tools_MPLUGIN-336-OX2XMFOVDYU6CHOQOCEAQPI7JEFEG4IM2KWEE3CCBTWR4DJXZKUQ\m\maven-plugin-plugin\target\it\ant-since-maven-plugin\build.log, f:\jenkins\jenkins-slave\workspace\en-plugin-tools_MPLUGIN-336-OX2XMFOVDYU6CHOQOCEAQPI7JEFEG4IM2KWEE3CCBTWR4DJXZKUQ\m\maven-plugin-plugin\target\it\asm-failure\build.log, f:\jenkins\jenkins-slave\workspace\en-plugin-tools_MPLUGIN-336-OX2XMFOVDYU6CHOQOCEAQPI7JEFEG4IM2KWEE3CCBTWR4DJXZKUQ\m\maven-plugin-plugin\target\it\beanshell-simple\build.log, f:\jenkins\jenkins-slave\workspace\en-plugin-tools_MPLUGIN-336-OX2XMFOVDYU6CHOQOCEAQPI7JEFEG4IM2KWEE3CCBTWR4DJXZKUQ\m\maven-plugin-plugin\target\it\fix-maven-since-3.x\build.log, f:\jenkins\jenkins-slave\workspace\en-plugin-tools_MPLUGIN-336-OX2XMFOVDYU6CHOQOCEAQPI7JEFEG4IM2KWEE3CCBTWR4DJXZKUQ\m\maven-plugin-plugin\target\it\help-basic\build.log, f:\jenkins\jenkins-slave\workspace\en-plugin-tools_MPLUGIN-336-OX2XMFOVDYU6CHOQOCEAQPI7JEFEG4IM2KWEE3CCBTWR4DJXZKUQ\m\maven-plugin-plugin\target\it\help-package\build.log, f:\jenkins\jenkins-slave\workspace\en-plugin-tools_MPLUGIN-336-OX2XMFOVDYU6CHOQOCEAQPI7JEFEG4IM2KWEE3CCBTWR4DJXZKUQ\m\maven-plugin-plugin\target\it\ignore-plugin-class-realm\build.log, f:\jenkins\jenkins-slave\workspace\en-plugin-tools_MPLUGIN-336-OX2XMFOVDYU6CHOQOCEAQPI7JEFEG4IM2KWEE3CCBTWR4DJXZKUQ\m\maven-plugin-plugin\target\it\java-basic-annotations\build.log, f:\jenkins\jenkins-slave\workspace\en-plugin-tools_MPLUGIN-336-OX2XMFOVDYU6CHOQOCEAQPI7JEFEG4IM2KWEE3CCBTWR4DJXZKUQ\m\maven-plugin-plugin\target\it\java-basic\build.log, f:\jenkins\jenkins-slave\workspace\en-plugin-tools_MPLUGIN-336-OX2XMFOVDYU6CHOQOCEAQPI7JEFEG4IM2KWEE3CCBTWR4DJXZKUQ\m\maven-plugin-plugin\target\it\mplugin-187\build.log, f:\jenkins\jenkins-slave\workspace\en-plugin-tools_MPLUGIN-336-OX2XMFOVDYU6CHOQOCEAQPI7JEFEG4IM2KWEE3CCBTWR4DJXZKUQ\m\maven-plugin-plugin\target\it\mplugin-191\build.log, f:\jenkins\jenkins-slave\workspace\en-plugin-tools_MPLUGIN-336-OX2XMFOVDYU6CHOQOCEAQPI7JEFEG4IM2KWEE3CCBTWR4DJXZKUQ\m\maven-plugin-plugin\target\it\mplugin-223\build.log, f:\jenkins\jenkins-slave\workspace\en-plugin-tools_MPLUGIN-336-OX2XMFOVDYU6CHOQOCEAQPI7JEFEG4IM2KWEE3CCBTWR4DJXZKUQ\m\maven-plugin-plugin\target\it\mplugin-299_no-configuration\build.log, f:\jenkins\jenkins-slave\workspace\en-plugin-tools_MPLUGIN-336-OX2XMFOVDYU6CHOQOCEAQPI7JEFEG4IM2KWEE3CCBTWR4DJXZKUQ\m\maven-plugin-plugin\target\it\mplugin-305_defaultMojoDependencies\build.log, f:\jenkins\jenkins-slave\workspace\en-plugin-tools_MPLUGIN-336-OX2XMFOVDYU6CHOQOCEAQPI7JEFEG4IM2KWEE3CCBTWR4DJXZKUQ\m\maven-plugin-plugin\target\it\mplugin-305_emptyMojoDependencies\build.log, f:\jenkins\jenkins-slave\workspace\en-plugin-tools_MPLUGIN-336-OX2XMFOVDYU6CHOQOCEAQPI7JEFEG4IM2KWEE3CCBTWR4DJXZKUQ\m\maven-plugin-plugin\target\it\mplugin-305_singleMojoDependencies\build.log, f:\jenkins\jenkins-slave\workspace\en-plugin-tools_MPLUGIN-336-OX2XMFOVDYU6CHOQOCEAQPI7JEFEG4IM2KWEE3CCBTWR4DJXZKUQ\m\maven-plugin-plugin\target\it\mplugin-319_report-since\build.log, f:\jenkins\jenkins-slave\workspace\en-plugin-tools_MPLUGIN-336-OX2XMFOVDYU6CHOQOCEAQPI7JEFEG4IM2KWEE3CCBTWR4DJXZKUQ\m\maven-plugin-plugin\target\it\mplugin-324_javadoc\build.log, f:\jenkins\jenkins-slave\workspace\en-plugin-tools_MPLUGIN-336-OX2XMFOVDYU6CHOQOCEAQPI7JEFEG4IM2KWEE3CCBTWR4DJXZKUQ\m\maven-plugin-plugin\target\it\packaging-jar\build.log, f:\jenkins\jenkins-slave\workspace\en-plugin-tools_MPLUGIN-336-OX2XMFOVDYU6CHOQOCEAQPI7JEFEG4IM2KWEE3CCBTWR4DJXZKUQ\m\maven-plugin-plugin\target\it\plugin-info-jdk-default-version\build.log, f:\jenkins\jenkins-slave\workspace\en-plugin-tools_MPLUGIN-336-OX2XMFOVDYU6CHOQOCEAQPI7JEFEG4IM2KWEE3CCBTWR4DJXZKUQ\m\maven-plugin-plugin\target\it\plugin-info-jdk\build.log, f:\jenkins\jenkins-slave\workspace\en-plugin-tools_MPLUGIN-336-OX2XMFOVDYU6CHOQOCEAQPI7JEFEG4IM2KWEE3CCBTWR4DJXZKUQ\m\maven-plugin-plugin\target\it\plugin-report-annotations\build.log, f:\jenkins\jenkins-slave\workspace\en-plugin-tools_MPLUGIN-336-OX2XMFOVDYU6CHOQOCEAQPI7JEFEG4IM2KWEE3CCBTWR4DJXZKUQ\m\maven-plugin-plugin\target\it\plugin-report\build.log, f:\jenkins\jenkins-slave\workspace\en-plugin-tools_MPLUGIN-336-OX2XMFOVDYU6CHOQOCEAQPI7JEFEG4IM2KWEE3CCBTWR4DJXZKUQ\m\maven-plugin-plugin\target\it\skip\build.log, f:\jenkins\jenkins-slave\workspace\en-plugin-tools_MPLUGIN-336-OX2XMFOVDYU6CHOQOCEAQPI7JEFEG4IM2KWEE3CCBTWR4DJXZKUQ\m\maven-plugin-plugin\target\it\source-encoding\build.log]
[windows-jdk7] Finished parsing Maven Invoker results (found 33)
[windows-jdk7] [withMaven] junitPublisher - Archive test results for Maven artifact org.apache.maven.plugin-tools:maven-plugin-tools-api:3.6-SNAPSHOT generated by maven-surefire-plugin:test (default-test): m\maven-plugin-tools-api\target\surefire-reports\*.xml
[windows-jdk7] Recording test results
[windows-jdk7] [withMaven] junitPublisher - Archive test results for Maven artifact org.apache.maven.plugin-tools:maven-plugin-tools-generators:3.6-SNAPSHOT generated by maven-surefire-plugin:test (default-test): m\maven-plugin-tools-generators\target\surefire-reports\*.xml
[windows-jdk7] Recording test results
[windows-jdk7] [withMaven] junitPublisher - Archive test results for Maven artifact org.apache.maven.plugin-tools:maven-plugin-tools-java:3.6-SNAPSHOT generated by maven-surefire-plugin:test (default-test): m\maven-plugin-tools-java\target\surefire-reports\*.xml
[windows-jdk7] Recording test results
[windows-jdk7] [withMaven] junitPublisher - Archive test results for Maven artifact org.apache.maven.plugin-tools:maven-plugin-annotations:3.6-SNAPSHOT generated by maven-surefire-plugin:test (default-test): m\maven-plugin-annotations\target\surefire-reports\*.xml
[windows-jdk7] Recording test results
[windows-jdk7] None of the test reports contained any result
[windows-jdk7] [withMaven] junitPublisher - Archive test results for Maven artifact org.apache.maven.plugin-tools:maven-plugin-tools-annotations:3.6-SNAPSHOT generated by maven-surefire-plugin:test (default-test): m\maven-plugin-tools-annotations\target\surefire-reports\*.xml
[windows-jdk7] Recording test results
[windows-jdk7] [withMaven] junitPublisher - Archive test results for Maven artifact org.apache.maven.plugin-tools:maven-plugin-tools-javadoc:3.6-SNAPSHOT generated by maven-surefire-plugin:test (default-test): m\maven-plugin-tools-javadoc\target\surefire-reports\*.xml
[windows-jdk7] Recording test results
[windows-jdk7] None of the test reports contained any result
[windows-jdk7] [withMaven] junitPublisher - Archive test results for Maven artifact org.apache.maven.plugin-tools:maven-plugin-tools-model:3.6-SNAPSHOT generated by maven-surefire-plugin:test (default-test): m\maven-script\maven-plugin-tools-model\target\surefire-reports\*.xml
[windows-jdk7] Recording test results
[windows-jdk7] [withMaven] junitPublisher - Archive test results for Maven artifact org.apache.maven.plugin-tools:maven-plugin-tools-ant:3.6-SNAPSHOT generated by maven-surefire-plugin:test (default-test): m\maven-script\maven-plugin-tools-ant\target\surefire-reports\*.xml
[windows-jdk7] Recording test results
[windows-jdk7] [withMaven] junitPublisher - Archive test results for Maven artifact org.apache.maven.plugin-tools:maven-script-ant:3.6-SNAPSHOT generated by maven-surefire-plugin:test (default-test): m\maven-script\maven-script-ant\target\surefire-reports\*.xml
[windows-jdk7] Recording test results
[windows-jdk7] [withMaven] junitPublisher - Archive test results for Maven artifact org.apache.maven.plugin-tools:maven-plugin-tools-beanshell:3.6-SNAPSHOT generated by maven-surefire-plugin:test (default-test): m\maven-script\maven-plugin-tools-beanshell\target\surefire-reports\*.xml
[windows-jdk7] Recording test results
[windows-jdk7] None of the test reports contained any result
[windows-jdk7] [withMaven] junitPublisher - Archive test results for Maven artifact org.apache.maven.plugin-tools:maven-script-beanshell:3.6-SNAPSHOT generated by maven-surefire-plugin:test (default-test): m\maven-script\maven-script-beanshell\target\surefire-reports\*.xml
[windows-jdk7] Recording test results
[windows-jdk7] None of the test reports contained any result
[windows-jdk7] [withMaven] junitPublisher - Archive test results for Maven artifact org.apache.maven.plugins:maven-plugin-plugin:3.6-SNAPSHOT generated by maven-surefire-plugin:test (default-test): m\maven-plugin-plugin\target\surefire-reports\*.xml
[windows-jdk7] Recording test results
[windows-jdk7] None of the test reports contained any result
[Pipeline] [windows-jdk7] // withMaven
[Pipeline] [windows-jdk7] cleanWs
[windows-jdk7] [WS-CLEANUP] Deleting project workspace...[WS-CLEANUP] done
[Pipeline] [windows-jdk7] }
[Pipeline] [windows-jdk7] // stage
[Pipeline] [windows-jdk7] }
[Pipeline] [windows-jdk7] // node
[Pipeline] [windows-jdk7] }
[windows-jdk8] [INFO] run post-build script verify.groovy
[windows-jdk8] [INFO]           skip\pom.xml ..................................... SUCCESS (10.3 s)
[windows-jdk8] [INFO] Building: source-encoding\pom.xml
[windows-jdk8] [INFO] run post-build script verify.groovy
[windows-jdk8] [INFO]           source-encoding\pom.xml .......................... SUCCESS (10.7 s)
[windows-jdk8] [INFO] -------------------------------------------------
[windows-jdk8] [INFO] Build Summary:
[windows-jdk8] [INFO]   Passed: 32, Failed: 1, Errors: 0, Skipped: 0
[windows-jdk8] [INFO] -------------------------------------------------
[windows-jdk8] [WARNING] The following builds failed:
[windows-jdk8] [WARNING] *  asm-failure\pom.xml
[windows-jdk8] [INFO] -------------------------------------------------
[windows-jdk8] [WARNING] Ignoring that 1 build failed.
[windows-jdk8] [INFO]
[windows-jdk8] [INFO] --- maven-checkstyle-plugin:3.0.0:check (checkstyle-check) @ maven-plugin-plugin ---
[windows-jdk8] [INFO] ------------------------------------------------------------------------
[windows-jdk8] [INFO] Reactor Summary:
[windows-jdk8] [INFO]
[windows-jdk8] [INFO] Maven Plugin Tools ................................. SUCCESS [ 47.330 s]
[windows-jdk8] [INFO] Maven Plugin Tools Extractor API ................... SUCCESS [ 17.949 s]
[windows-jdk8] [INFO] Maven Plugin Tools Generators ...................... SUCCESS [ 12.353 s]
[windows-jdk8] [INFO] Maven Plugin Tool for Java with Javadoc Tags ....... SUCCESS [ 10.267 s]
[windows-jdk8] [INFO] Maven Plugin Tools Java 5 Annotations .............. SUCCESS [  1.741 s]
[windows-jdk8] [INFO] Maven Plugin Tool for Java with Annotations ........ SUCCESS [  8.456 s]
[windows-jdk8] [INFO] Maven Plugin Tools Javadoc Taglets ................. SUCCESS [ 36.173 s]
[windows-jdk8] [INFO] Maven Script Mojo Support .......................... SUCCESS [  1.054 s]
[windows-jdk8] [INFO] Maven Plugin Metadata Model ........................ SUCCESS [  7.301 s]
[windows-jdk8] [INFO] Maven Plugin Tool for Ant .......................... SUCCESS [  3.593 s]
[windows-jdk8] [INFO] Maven Ant Mojo Support ............................. SUCCESS [  7.323 s]
[windows-jdk8] [INFO] Maven Plugin Tool for Beanshell .................... SUCCESS [  2.433 s]
[windows-jdk8] [INFO] Maven Beanshell Mojo Support ....................... SUCCESS [  1.717 s]
[windows-jdk8] [INFO] Maven Plugin Plugin ................................ SUCCESS [11:25 min]
[windows-jdk8] [INFO] ------------------------------------------------------------------------
[windows-jdk8] [INFO] BUILD SUCCESS
[windows-jdk8] [INFO] ------------------------------------------------------------------------
[windows-jdk8] [INFO] Total time: 14:06 min
[windows-jdk8] [INFO] Finished at: 2018-10-09T09:28:31-07:00
[windows-jdk8] [INFO] Final Memory: 74M/890M
[windows-jdk8] [INFO] ------------------------------------------------------------------------
[windows-jdk8] [INFO] [jenkins-event-spy] Generated F:\jenkins\jenkins-slave\workspace\en-plugin-tools_MPLUGIN-336-OX2XMFOVDYU6CHOQOCEAQPI7JEFEG4IM2KWEE3CCBTWR4DJXZKUQ@2@tmp\withMavenc2af8bd5\maven-spy-20181009-091424-7896813523209575116368.log
[windows-jdk8] Picked up JAVA_TOOL_OPTIONS: -Dmaven.ext.class.path="f:\jenkins\jenkins-slave\workspace\en-plugin-tools_MPLUGIN-336-OX2XMFOVDYU6CHOQOCEAQPI7JEFEG4IM2KWEE3CCBTWR4DJXZKUQ@2@tmp\withMavenc2af8bd5\pipeline-maven-spy.jar" -Dorg.jenkinsci.plugins.pipeline.maven.reportsFolder="f:\jenkins\jenkins-slave\workspace\en-plugin-tools_MPLUGIN-336-OX2XMFOVDYU6CHOQOCEAQPI7JEFEG4IM2KWEE3CCBTWR4DJXZKUQ@2@tmp\withMavenc2af8bd5"
[Pipeline] [windows-jdk8] }
[Pipeline] [windows-jdk8] // dir
[Pipeline] [windows-jdk8] }
[windows-jdk8] [withMaven] invokerPublisher - Archive invoker results for Maven artifact MavenArtifact{org.apache.maven.plugin-tools:maven-plugin-tools-javadoc::3.6-SNAPSHOT(version: 3.6-SNAPSHOT, snapshot:false) } generated by PluginInvocation{org.apache.maven.plugins:maven-invoker-plugin:3.0.1@run  integration-test}: m\maven-plugin-tools-javadoc\target\invoker-reports\*.xml
[windows-jdk8] performing MavenInvokerRecorder, reportsFilenamePattern:'**/m\maven-plugin-tools-javadoc\target\invoker-reports/BUILD*.xml', invokerBuildDir:'**/m\maven-plugin-tools-javadoc\target\it'
[windows-jdk8] Found reports:[f:\jenkins\jenkins-slave\workspace\en-plugin-tools_MPLUGIN-336-OX2XMFOVDYU6CHOQOCEAQPI7JEFEG4IM2KWEE3CCBTWR4DJXZKUQ@2\m\maven-plugin-tools-javadoc\target\invoker-reports\BUILD-basic.xml]
[windows-jdk8] Found logs:[f:\jenkins\jenkins-slave\workspace\en-plugin-tools_MPLUGIN-336-OX2XMFOVDYU6CHOQOCEAQPI7JEFEG4IM2KWEE3CCBTWR4DJXZKUQ@2\m\maven-plugin-tools-javadoc\target\it\basic\build.log]
[windows-jdk8] Finished parsing Maven Invoker results (found 1)
[windows-jdk8] [withMaven] invokerPublisher - Archive invoker results for Maven artifact MavenArtifact{org.apache.maven.plugins:maven-plugin-plugin::3.6-SNAPSHOT(version: 3.6-SNAPSHOT, snapshot:false) } generated by PluginInvocation{org.apache.maven.plugins:maven-invoker-plugin:3.0.1@run  integration-test}: m\maven-plugin-plugin\target\invoker-reports\*.xml
[windows-jdk8] performing MavenInvokerRecorder, reportsFilenamePattern:'**/m\maven-plugin-plugin\target\invoker-reports/BUILD*.xml', invokerBuildDir:'**/m\maven-plugin-plugin\target\it'
[windows-jdk8] Found reports:[f:\jenkins\jenkins-slave\workspace\en-plugin-tools_MPLUGIN-336-OX2XMFOVDYU6CHOQOCEAQPI7JEFEG4IM2KWEE3CCBTWR4DJXZKUQ@2\m\maven-plugin-plugin\target\invoker-reports\BUILD-annotation-with-inheritance-from-deps.xml, f:\jenkins\jenkins-slave\workspace\en-plugin-tools_MPLUGIN-336-OX2XMFOVDYU6CHOQOCEAQPI7JEFEG4IM2KWEE3CCBTWR4DJXZKUQ@2\m\maven-plugin-plugin\target\invoker-reports\BUILD-annotation-with-inheritance-reactor.xml, f:\jenkins\jenkins-slave\workspace\en-plugin-tools_MPLUGIN-336-OX2XMFOVDYU6CHOQOCEAQPI7JEFEG4IM2KWEE3CCBTWR4DJXZKUQ@2\m\maven-plugin-plugin\target\invoker-reports\BUILD-annotation-with-inheritance.xml, f:\jenkins\jenkins-slave\workspace\en-plugin-tools_MPLUGIN-336-OX2XMFOVDYU6CHOQOCEAQPI7JEFEG4IM2KWEE3CCBTWR4DJXZKUQ@2\m\maven-plugin-plugin\target\invoker-reports\BUILD-ant-basic.xml, f:\jenkins\jenkins-slave\workspace\en-plugin-tools_MPLUGIN-336-OX2XMFOVDYU6CHOQOCEAQPI7JEFEG4IM2KWEE3CCBTWR4DJXZKUQ@2\m\maven-plugin-plugin\target\invoker-reports\BUILD-ant-reference-parameter.xml, f:\jenkins\jenkins-slave\workspace\en-plugin-tools_MPLUGIN-336-OX2XMFOVDYU6CHOQOCEAQPI7JEFEG4IM2KWEE3CCBTWR4DJXZKUQ@2\m\maven-plugin-plugin\target\invoker-reports\BUILD-ant-simple-usage.xml, f:\jenkins\jenkins-slave\workspace\en-plugin-tools_MPLUGIN-336-OX2XMFOVDYU6CHOQOCEAQPI7JEFEG4IM2KWEE3CCBTWR4DJXZKUQ@2\m\maven-plugin-plugin\target\invoker-reports\BUILD-ant-since-maven-plugin.xml, f:\jenkins\jenkins-slave\workspace\en-plugin-tools_MPLUGIN-336-OX2XMFOVDYU6CHOQOCEAQPI7JEFEG4IM2KWEE3CCBTWR4DJXZKUQ@2\m\maven-plugin-plugin\target\invoker-reports\BUILD-asm-failure.xml, f:\jenkins\jenkins-slave\workspace\en-plugin-tools_MPLUGIN-336-OX2XMFOVDYU6CHOQOCEAQPI7JEFEG4IM2KWEE3CCBTWR4DJXZKUQ@2\m\maven-plugin-plugin\target\invoker-reports\BUILD-beanshell-simple.xml, f:\jenkins\jenkins-slave\workspace\en-plugin-tools_MPLUGIN-336-OX2XMFOVDYU6CHOQOCEAQPI7JEFEG4IM2KWEE3CCBTWR4DJXZKUQ@2\m\maven-plugin-plugin\target\invoker-reports\BUILD-fix-maven-since-3.x.xml, f:\jenkins\jenkins-slave\workspace\en-plugin-tools_MPLUGIN-336-OX2XMFOVDYU6CHOQOCEAQPI7JEFEG4IM2KWEE3CCBTWR4DJXZKUQ@2\m\maven-plugin-plugin\target\invoker-reports\BUILD-help-basic.xml, f:\jenkins\jenkins-slave\workspace\en-plugin-tools_MPLUGIN-336-OX2XMFOVDYU6CHOQOCEAQPI7JEFEG4IM2KWEE3CCBTWR4DJXZKUQ@2\m\maven-plugin-plugin\target\invoker-reports\BUILD-help-package.xml, f:\jenkins\jenkins-slave\workspace\en-plugin-tools_MPLUGIN-336-OX2XMFOVDYU6CHOQOCEAQPI7JEFEG4IM2KWEE3CCBTWR4DJXZKUQ@2\m\maven-plugin-plugin\target\invoker-reports\BUILD-ignore-plugin-class-realm.xml, f:\jenkins\jenkins-slave\workspace\en-plugin-tools_MPLUGIN-336-OX2XMFOVDYU6CHOQOCEAQPI7JEFEG4IM2KWEE3CCBTWR4DJXZKUQ@2\m\maven-plugin-plugin\target\invoker-reports\BUILD-java-basic-annotations-jdk8.xml, f:\jenkins\jenkins-slave\workspace\en-plugin-tools_MPLUGIN-336-OX2XMFOVDYU6CHOQOCEAQPI7JEFEG4IM2KWEE3CCBTWR4DJXZKUQ@2\m\maven-plugin-plugin\target\invoker-reports\BUILD-java-basic-annotations.xml, f:\jenkins\jenkins-slave\workspace\en-plugin-tools_MPLUGIN-336-OX2XMFOVDYU6CHOQOCEAQPI7JEFEG4IM2KWEE3CCBTWR4DJXZKUQ@2\m\maven-plugin-plugin\target\invoker-reports\BUILD-java-basic.xml, f:\jenkins\jenkins-slave\workspace\en-plugin-tools_MPLUGIN-336-OX2XMFOVDYU6CHOQOCEAQPI7JEFEG4IM2KWEE3CCBTWR4DJXZKUQ@2\m\maven-plugin-plugin\target\invoker-reports\BUILD-mplugin-187.xml, f:\jenkins\jenkins-slave\workspace\en-plugin-tools_MPLUGIN-336-OX2XMFOVDYU6CHOQOCEAQPI7JEFEG4IM2KWEE3CCBTWR4DJXZKUQ@2\m\maven-plugin-plugin\target\invoker-reports\BUILD-mplugin-191.xml, f:\jenkins\jenkins-slave\workspace\en-plugin-tools_MPLUGIN-336-OX2XMFOVDYU6CHOQOCEAQPI7JEFEG4IM2KWEE3CCBTWR4DJXZKUQ@2\m\maven-plugin-plugin\target\invoker-reports\BUILD-mplugin-223.xml, f:\jenkins\jenkins-slave\workspace\en-plugin-tools_MPLUGIN-336-OX2XMFOVDYU6CHOQOCEAQPI7JEFEG4IM2KWEE3CCBTWR4DJXZKUQ@2\m\maven-plugin-plugin\target\invoker-reports\BUILD-mplugin-272_java8.xml, f:\jenkins\jenkins-slave\workspace\en-plugin-tools_MPLUGIN-336-OX2XMFOVDYU6CHOQOCEAQPI7JEFEG4IM2KWEE3CCBTWR4DJXZKUQ@2\m\maven-plugin-plugin\target\invoker-reports\BUILD-mplugin-299_no-configuration.xml, f:\jenkins\jenkins-slave\workspace\en-plugin-tools_MPLUGIN-336-OX2XMFOVDYU6CHOQOCEAQPI7JEFEG4IM2KWEE3CCBTWR4DJXZKUQ@2\m\maven-plugin-plugin\target\invoker-reports\BUILD-mplugin-305_defaultMojoDependencies.xml, f:\jenkins\jenkins-slave\workspace\en-plugin-tools_MPLUGIN-336-OX2XMFOVDYU6CHOQOCEAQPI7JEFEG4IM2KWEE3CCBTWR4DJXZKUQ@2\m\maven-plugin-plugin\target\invoker-reports\BUILD-mplugin-305_emptyMojoDependencies.xml, f:\jenkins\jenkins-slave\workspace\en-plugin-tools_MPLUGIN-336-OX2XMFOVDYU6CHOQOCEAQPI7JEFEG4IM2KWEE3CCBTWR4DJXZKUQ@2\m\maven-plugin-plugin\target\invoker-reports\BUILD-mplugin-305_singleMojoDependencies.xml, f:\jenkins\jenkins-slave\workspace\en-plugin-tools_MPLUGIN-336-OX2XMFOVDYU6CHOQOCEAQPI7JEFEG4IM2KWEE3CCBTWR4DJXZKUQ@2\m\maven-plugin-plugin\target\invoker-reports\BUILD-mplugin-319_report-since.xml, f:\jenkins\jenkins-slave\workspace\en-plugin-tools_MPLUGIN-336-OX2XMFOVDYU6CHOQOCEAQPI7JEFEG4IM2KWEE3CCBTWR4DJXZKUQ@2\m\maven-plugin-plugin\target\invoker-reports\BUILD-mplugin-324_javadoc.xml, f:\jenkins\jenkins-slave\workspace\en-plugin-tools_MPLUGIN-336-OX2XMFOVDYU6CHOQOCEAQPI7JEFEG4IM2KWEE3CCBTWR4DJXZKUQ@2\m\maven-plugin-plugin\target\invoker-reports\BUILD-packaging-jar.xml, f:\jenkins\jenkins-slave\workspace\en-plugin-tools_MPLUGIN-336-OX2XMFOVDYU6CHOQOCEAQPI7JEFEG4IM2KWEE3CCBTWR4DJXZKUQ@2\m\maven-plugin-plugin\target\invoker-reports\BUILD-plugin-info-jdk-default-version.xml, f:\jenkins\jenkins-slave\workspace\en-plugin-tools_MPLUGIN-336-OX2XMFOVDYU6CHOQOCEAQPI7JEFEG4IM2KWEE3CCBTWR4DJXZKUQ@2\m\maven-plugin-plugin\target\invoker-reports\BUILD-plugin-info-jdk.xml, f:\jenkins\jenkins-slave\workspace\en-plugin-tools_MPLUGIN-336-OX2XMFOVDYU6CHOQOCEAQPI7JEFEG4IM2KWEE3CCBTWR4DJXZKUQ@2\m\maven-plugin-plugin\target\invoker-reports\BUILD-plugin-report-annotations.xml, f:\jenkins\jenkins-slave\workspace\en-plugin-tools_MPLUGIN-336-OX2XMFOVDYU6CHOQOCEAQPI7JEFEG4IM2KWEE3CCBTWR4DJXZKUQ@2\m\maven-plugin-plugin\target\invoker-reports\BUILD-plugin-report.xml, f:\jenkins\jenkins-slave\workspace\en-plugin-tools_MPLUGIN-336-OX2XMFOVDYU6CHOQOCEAQPI7JEFEG4IM2KWEE3CCBTWR4DJXZKUQ@2\m\maven-plugin-plugin\target\invoker-reports\BUILD-skip.xml, f:\jenkins\jenkins-slave\workspace\en-plugin-tools_MPLUGIN-336-OX2XMFOVDYU6CHOQOCEAQPI7JEFEG4IM2KWEE3CCBTWR4DJXZKUQ@2\m\maven-plugin-plugin\target\invoker-reports\BUILD-source-encoding.xml]
[windows-jdk8] Found logs:[f:\jenkins\jenkins-slave\workspace\en-plugin-tools_MPLUGIN-336-OX2XMFOVDYU6CHOQOCEAQPI7JEFEG4IM2KWEE3CCBTWR4DJXZKUQ@2\m\maven-plugin-plugin\target\it\annotation-with-inheritance-from-deps\build.log, f:\jenkins\jenkins-slave\workspace\en-plugin-tools_MPLUGIN-336-OX2XMFOVDYU6CHOQOCEAQPI7JEFEG4IM2KWEE3CCBTWR4DJXZKUQ@2\m\maven-plugin-plugin\target\it\annotation-with-inheritance-reactor\build.log, f:\jenkins\jenkins-slave\workspace\en-plugin-tools_MPLUGIN-336-OX2XMFOVDYU6CHOQOCEAQPI7JEFEG4IM2KWEE3CCBTWR4DJXZKUQ@2\m\maven-plugin-plugin\target\it\annotation-with-inheritance\build.log, f:\jenkins\jenkins-slave\workspace\en-plugin-tools_MPLUGIN-336-OX2XMFOVDYU6CHOQOCEAQPI7JEFEG4IM2KWEE3CCBTWR4DJXZKUQ@2\m\maven-plugin-plugin\target\it\ant-basic\build.log, f:\jenkins\jenkins-slave\workspace\en-plugin-tools_MPLUGIN-336-OX2XMFOVDYU6CHOQOCEAQPI7JEFEG4IM2KWEE3CCBTWR4DJXZKUQ@2\m\maven-plugin-plugin\target\it\ant-reference-parameter\build.log, f:\jenkins\jenkins-slave\workspace\en-plugin-tools_MPLUGIN-336-OX2XMFOVDYU6CHOQOCEAQPI7JEFEG4IM2KWEE3CCBTWR4DJXZKUQ@2\m\maven-plugin-plugin\target\it\ant-simple-usage\build.log, f:\jenkins\jenkins-slave\workspace\en-plugin-tools_MPLUGIN-336-OX2XMFOVDYU6CHOQOCEAQPI7JEFEG4IM2KWEE3CCBTWR4DJXZKUQ@2\m\maven-plugin-plugin\target\it\ant-since-maven-plugin\build.log, f:\jenkins\jenkins-slave\workspace\en-plugin-tools_MPLUGIN-336-OX2XMFOVDYU6CHOQOCEAQPI7JEFEG4IM2KWEE3CCBTWR4DJXZKUQ@2\m\maven-plugin-plugin\target\it\asm-failure\build.log, f:\jenkins\jenkins-slave\workspace\en-plugin-tools_MPLUGIN-336-OX2XMFOVDYU6CHOQOCEAQPI7JEFEG4IM2KWEE3CCBTWR4DJXZKUQ@2\m\maven-plugin-plugin\target\it\beanshell-simple\build.log, f:\jenkins\jenkins-slave\workspace\en-plugin-tools_MPLUGIN-336-OX2XMFOVDYU6CHOQOCEAQPI7JEFEG4IM2KWEE3CCBTWR4DJXZKUQ@2\m\maven-plugin-plugin\target\it\fix-maven-since-3.x\build.log, f:\jenkins\jenkins-slave\workspace\en-plugin-tools_MPLUGIN-336-OX2XMFOVDYU6CHOQOCEAQPI7JEFEG4IM2KWEE3CCBTWR4DJXZKUQ@2\m\maven-plugin-plugin\target\it\help-basic\build.log, f:\jenkins\jenkins-slave\workspace\en-plugin-tools_MPLUGIN-336-OX2XMFOVDYU6CHOQOCEAQPI7JEFEG4IM2KWEE3CCBTWR4DJXZKUQ@2\m\maven-plugin-plugin\target\it\help-package\build.log, f:\jenkins\jenkins-slave\workspace\en-plugin-tools_MPLUGIN-336-OX2XMFOVDYU6CHOQOCEAQPI7JEFEG4IM2KWEE3CCBTWR4DJXZKUQ@2\m\maven-plugin-plugin\target\it\ignore-plugin-class-realm\build.log, f:\jenkins\jenkins-slave\workspace\en-plugin-tools_MPLUGIN-336-OX2XMFOVDYU6CHOQOCEAQPI7JEFEG4IM2KWEE3CCBTWR4DJXZKUQ@2\m\maven-plugin-plugin\target\it\java-basic-annotations-jdk8\build.log, f:\jenkins\jenkins-slave\workspace\en-plugin-tools_MPLUGIN-336-OX2XMFOVDYU6CHOQOCEAQPI7JEFEG4IM2KWEE3CCBTWR4DJXZKUQ@2\m\maven-plugin-plugin\target\it\java-basic-annotations\build.log, f:\jenkins\jenkins-slave\workspace\en-plugin-tools_MPLUGIN-336-OX2XMFOVDYU6CHOQOCEAQPI7JEFEG4IM2KWEE3CCBTWR4DJXZKUQ@2\m\maven-plugin-plugin\target\it\java-basic\build.log, f:\jenkins\jenkins-slave\workspace\en-plugin-tools_MPLUGIN-336-OX2XMFOVDYU6CHOQOCEAQPI7JEFEG4IM2KWEE3CCBTWR4DJXZKUQ@2\m\maven-plugin-plugin\target\it\mplugin-187\build.log, f:\jenkins\jenkins-slave\workspace\en-plugin-tools_MPLUGIN-336-OX2XMFOVDYU6CHOQOCEAQPI7JEFEG4IM2KWEE3CCBTWR4DJXZKUQ@2\m\maven-plugin-plugin\target\it\mplugin-191\build.log, f:\jenkins\jenkins-slave\workspace\en-plugin-tools_MPLUGIN-336-OX2XMFOVDYU6CHOQOCEAQPI7JEFEG4IM2KWEE3CCBTWR4DJXZKUQ@2\m\maven-plugin-plugin\target\it\mplugin-223\build.log, f:\jenkins\jenkins-slave\workspace\en-plugin-tools_MPLUGIN-336-OX2XMFOVDYU6CHOQOCEAQPI7JEFEG4IM2KWEE3CCBTWR4DJXZKUQ@2\m\maven-plugin-plugin\target\it\mplugin-272_java8\build.log, f:\jenkins\jenkins-slave\workspace\en-plugin-tools_MPLUGIN-336-OX2XMFOVDYU6CHOQOCEAQPI7JEFEG4IM2KWEE3CCBTWR4DJXZKUQ@2\m\maven-plugin-plugin\target\it\mplugin-299_no-configuration\build.log, f:\jenkins\jenkins-slave\workspace\en-plugin-tools_MPLUGIN-336-OX2XMFOVDYU6CHOQOCEAQPI7JEFEG4IM2KWEE3CCBTWR4DJXZKUQ@2\m\maven-plugin-plugin\target\it\mplugin-305_defaultMojoDependencies\build.log, f:\jenkins\jenkins-slave\workspace\en-plugin-tools_MPLUGIN-336-OX2XMFOVDYU6CHOQOCEAQPI7JEFEG4IM2KWEE3CCBTWR4DJXZKUQ@2\m\maven-plugin-plugin\target\it\mplugin-305_emptyMojoDependencies\build.log, f:\jenkins\jenkins-slave\workspace\en-plugin-tools_MPLUGIN-336-OX2XMFOVDYU6CHOQOCEAQPI7JEFEG4IM2KWEE3CCBTWR4DJXZKUQ@2\m\maven-plugin-plugin\target\it\mplugin-305_singleMojoDependencies\build.log, f:\jenkins\jenkins-slave\workspace\en-plugin-tools_MPLUGIN-336-OX2XMFOVDYU6CHOQOCEAQPI7JEFEG4IM2KWEE3CCBTWR4DJXZKUQ@2\m\maven-plugin-plugin\target\it\mplugin-319_report-since\build.log, f:\jenkins\jenkins-slave\workspace\en-plugin-tools_MPLUGIN-336-OX2XMFOVDYU6CHOQOCEAQPI7JEFEG4IM2KWEE3CCBTWR4DJXZKUQ@2\m\maven-plugin-plugin\target\it\mplugin-324_javadoc\build.log, f:\jenkins\jenkins-slave\workspace\en-plugin-tools_MPLUGIN-336-OX2XMFOVDYU6CHOQOCEAQPI7JEFEG4IM2KWEE3CCBTWR4DJXZKUQ@2\m\maven-plugin-plugin\target\it\packaging-jar\build.log, f:\jenkins\jenkins-slave\workspace\en-plugin-tools_MPLUGIN-336-OX2XMFOVDYU6CHOQOCEAQPI7JEFEG4IM2KWEE3CCBTWR4DJXZKUQ@2\m\maven-plugin-plugin\target\it\plugin-info-jdk-default-version\build.log, f:\jenkins\jenkins-slave\workspace\en-plugin-tools_MPLUGIN-336-OX2XMFOVDYU6CHOQOCEAQPI7JEFEG4IM2KWEE3CCBTWR4DJXZKUQ@2\m\maven-plugin-plugin\target\it\plugin-info-jdk\build.log, f:\jenkins\jenkins-slave\workspace\en-plugin-tools_MPLUGIN-336-OX2XMFOVDYU6CHOQOCEAQPI7JEFEG4IM2KWEE3CCBTWR4DJXZKUQ@2\m\maven-plugin-plugin\target\it\plugin-report-annotations\build.log, f:\jenkins\jenkins-slave\workspace\en-plugin-tools_MPLUGIN-336-OX2XMFOVDYU6CHOQOCEAQPI7JEFEG4IM2KWEE3CCBTWR4DJXZKUQ@2\m\maven-plugin-plugin\target\it\plugin-report\build.log, f:\jenkins\jenkins-slave\workspace\en-plugin-tools_MPLUGIN-336-OX2XMFOVDYU6CHOQOCEAQPI7JEFEG4IM2KWEE3CCBTWR4DJXZKUQ@2\m\maven-plugin-plugin\target\it\skip\build.log, f:\jenkins\jenkins-slave\workspace\en-plugin-tools_MPLUGIN-336-OX2XMFOVDYU6CHOQOCEAQPI7JEFEG4IM2KWEE3CCBTWR4DJXZKUQ@2\m\maven-plugin-plugin\target\it\source-encoding\build.log]
[windows-jdk8] Finished parsing Maven Invoker results (found 33)
[windows-jdk8] [withMaven] junitPublisher - Archive test results for Maven artifact org.apache.maven.plugin-tools:maven-plugin-tools-api:3.6-SNAPSHOT generated by maven-surefire-plugin:test (default-test): m\maven-plugin-tools-api\target\surefire-reports\*.xml
[windows-jdk8] Recording test results
[windows-jdk8] [withMaven] junitPublisher - Archive test results for Maven artifact org.apache.maven.plugin-tools:maven-plugin-tools-generators:3.6-SNAPSHOT generated by maven-surefire-plugin:test (default-test): m\maven-plugin-tools-generators\target\surefire-reports\*.xml
[windows-jdk8] Recording test results
[windows-jdk8] [withMaven] junitPublisher - Archive test results for Maven artifact org.apache.maven.plugin-tools:maven-plugin-tools-java:3.6-SNAPSHOT generated by maven-surefire-plugin:test (default-test): m\maven-plugin-tools-java\target\surefire-reports\*.xml
[windows-jdk8] Recording test results
[windows-jdk8] [withMaven] junitPublisher - Archive test results for Maven artifact org.apache.maven.plugin-tools:maven-plugin-annotations:3.6-SNAPSHOT generated by maven-surefire-plugin:test (default-test): m\maven-plugin-annotations\target\surefire-reports\*.xml
[windows-jdk8] Recording test results
[windows-jdk8] None of the test reports contained any result
[windows-jdk8] [withMaven] junitPublisher - Archive test results for Maven artifact org.apache.maven.plugin-tools:maven-plugin-tools-annotations:3.6-SNAPSHOT generated by maven-surefire-plugin:test (default-test): m\maven-plugin-tools-annotations\target\surefire-reports\*.xml
[windows-jdk8] Recording test results
[windows-jdk8] [withMaven] junitPublisher - Archive test results for Maven artifact org.apache.maven.plugin-tools:maven-plugin-tools-javadoc:3.6-SNAPSHOT generated by maven-surefire-plugin:test (default-test): m\maven-plugin-tools-javadoc\target\surefire-reports\*.xml
[windows-jdk8] Recording test results
[windows-jdk8] None of the test reports contained any result
[windows-jdk8] [withMaven] junitPublisher - Archive test results for Maven artifact org.apache.maven.plugin-tools:maven-plugin-tools-model:3.6-SNAPSHOT generated by maven-surefire-plugin:test (default-test): m\maven-script\maven-plugin-tools-model\target\surefire-reports\*.xml
[windows-jdk8] Recording test results
[windows-jdk8] [withMaven] junitPublisher - Archive test results for Maven artifact org.apache.maven.plugin-tools:maven-plugin-tools-ant:3.6-SNAPSHOT generated by maven-surefire-plugin:test (default-test): m\maven-script\maven-plugin-tools-ant\target\surefire-reports\*.xml
[windows-jdk8] Recording test results
[windows-jdk8] [withMaven] junitPublisher - Archive test results for Maven artifact org.apache.maven.plugin-tools:maven-script-ant:3.6-SNAPSHOT generated by maven-surefire-plugin:test (default-test): m\maven-script\maven-script-ant\target\surefire-reports\*.xml
[windows-jdk8] Recording test results
[windows-jdk8] [withMaven] junitPublisher - Archive test results for Maven artifact org.apache.maven.plugin-tools:maven-plugin-tools-beanshell:3.6-SNAPSHOT generated by maven-surefire-plugin:test (default-test): m\maven-script\maven-plugin-tools-beanshell\target\surefire-reports\*.xml
[windows-jdk8] Recording test results
[windows-jdk8] None of the test reports contained any result
[windows-jdk8] [withMaven] junitPublisher - Archive test results for Maven artifact org.apache.maven.plugin-tools:maven-script-beanshell:3.6-SNAPSHOT generated by maven-surefire-plugin:test (default-test): m\maven-script\maven-script-beanshell\target\surefire-reports\*.xml
[windows-jdk8] Recording test results
[windows-jdk8] None of the test reports contained any result
[windows-jdk8] [withMaven] junitPublisher - Archive test results for Maven artifact org.apache.maven.plugins:maven-plugin-plugin:3.6-SNAPSHOT generated by maven-surefire-plugin:test (default-test): m\maven-plugin-plugin\target\surefire-reports\*.xml
[windows-jdk8] Recording test results
[windows-jdk8] None of the test reports contained any result
[Pipeline] [windows-jdk8] // withMaven
[Pipeline] [windows-jdk8] cleanWs
[windows-jdk8] [WS-CLEANUP] Deleting project workspace...[WS-CLEANUP] done
[Pipeline] [windows-jdk8] }
[Pipeline] [windows-jdk8] // stage
[Pipeline] [windows-jdk8] }
[Pipeline] [windows-jdk8] // node
[Pipeline] [windows-jdk8] }
[Pipeline] // parallel
[Pipeline] stage
[Pipeline] { (Notifications)
[Pipeline] echo
Build result: FAILURE
[Pipeline] jiraIssueSelector
[Pipeline] emailext