Build failed in Jenkins: Maven TLP » maven-parent » failing-build #5

Previous Topic Next Topic
 
classic Classic list List threaded Threaded
2 messages Options
Reply | Threaded
Open this post in threaded view
|

Build failed in Jenkins: Maven TLP » maven-parent » failing-build #5

Apache Jenkins Server-2
See https://builds.apache.org/job/maven-box/job/maven-parent/job/failing-build/5/

Changes:

* more safety

No tests ran.

Build log:
[...truncated 4.01 KB...]
[linux-jdk8] Running on H22 in /home/jenkins/jenkins-slave/workspace/_maven-parent_failing-build-5AQVKWO5HNV6NUH7J5T7OKVFOEYUJRNLH6XIJJMLSEKZEF5XHUIA
[Pipeline] [windows-jdk8] node
[Pipeline] [linux-jdk8] {
[windows-jdk8] Running on windows-2012-2 in f:\jenkins\jenkins-slave\workspace\_maven-parent_failing-build-5AQVKWO5HNV6NUH7J5T7OKVFOEYUJRNLH6XIJJMLSEKZEF5XHUIA
[Pipeline] [linux-jdk8] stage
[Pipeline] [linux-jdk8] { (Checkout linux-jdk8)
[Pipeline] [windows-jdk8] {
[Pipeline] [linux-jdk8] dir
[linux-jdk8] Running in /home/jenkins/jenkins-slave/workspace/_maven-parent_failing-build-5AQVKWO5HNV6NUH7J5T7OKVFOEYUJRNLH6XIJJMLSEKZEF5XHUIA/m
[Pipeline] [linux-jdk8] {
[Pipeline] [windows-jdk8] stage
[Pipeline] [windows-jdk8] { (Checkout windows-jdk8)
[Pipeline] [linux-jdk8] checkout
[Pipeline] [windows-jdk8] dir
[windows-jdk8] Running in f:\jenkins\jenkins-slave\workspace\_maven-parent_failing-build-5AQVKWO5HNV6NUH7J5T7OKVFOEYUJRNLH6XIJJMLSEKZEF5XHUIA\m
[Pipeline] [windows-jdk8] {
[Pipeline] [windows-jdk8] checkout
[windows-jdk8]  > git rev-parse --is-inside-work-tree # timeout=10
[windows-jdk8] Fetching changes from the remote Git repository
[windows-jdk8]  > git config remote.origin.url https://gitbox.apache.org/repos/asf/maven-parent.git # timeout=10
[windows-jdk8] Fetching without tags
[windows-jdk8] Fetching upstream changes from https://gitbox.apache.org/repos/asf/maven-parent.git
[windows-jdk8]  > git --version # timeout=10
[windows-jdk8]  > git fetch --no-tags --progress https://gitbox.apache.org/repos/asf/maven-parent.git +refs/heads/*:refs/remotes/origin/*
[linux-jdk8]  > git rev-parse --is-inside-work-tree # timeout=10
[linux-jdk8] Fetching changes from the remote Git repository
[linux-jdk8]  > git config remote.origin.url https://gitbox.apache.org/repos/asf/maven-parent.git # timeout=10
[linux-jdk8] Fetching without tags
[linux-jdk8] Fetching upstream changes from https://gitbox.apache.org/repos/asf/maven-parent.git
[linux-jdk8]  > git --version # timeout=10
[linux-jdk8]  > git fetch --no-tags --progress https://gitbox.apache.org/repos/asf/maven-parent.git +refs/heads/*:refs/remotes/origin/*
[windows-jdk8] Checking out Revision d61585cd41f0e51ac66450bbd71d697a5cf0508b (failing-build)
[windows-jdk8]  > git config core.sparsecheckout # timeout=10
[windows-jdk8]  > git checkout -f d61585cd41f0e51ac66450bbd71d697a5cf0508b
[windows-jdk8] Commit message: "break the build"
[windows-jdk8]  > git rev-list d61585cd41f0e51ac66450bbd71d697a5cf0508b # timeout=10
[windows-jdk8] Cleaning workspace
[windows-jdk8]  > git rev-parse --verify HEAD # timeout=10
[windows-jdk8] Resetting working tree
[windows-jdk8]  > git reset --hard # timeout=10
[windows-jdk8]  > git clean -fdx # timeout=10
[Pipeline] [windows-jdk8] }
[Pipeline] [windows-jdk8] // dir
[Pipeline] [windows-jdk8] }
[Pipeline] [windows-jdk8] // stage
[Pipeline] [windows-jdk8] stage
[Pipeline] [windows-jdk8] { (Build windows-jdk8)
[Pipeline] [windows-jdk8] withMaven
[windows-jdk8] [withMaven] Options: []
[windows-jdk8] [withMaven] Available options:
[windows-jdk8] [withMaven] use JDK installation JDK 1.8 (latest)
[windows-jdk8] [withMaven] use Maven installation 'Maven 3.5.0 (Windows)'
[Pipeline] [windows-jdk8] {
[Pipeline] [windows-jdk8] dir
[windows-jdk8] Running in f:\jenkins\jenkins-slave\workspace\_maven-parent_failing-build-5AQVKWO5HNV6NUH7J5T7OKVFOEYUJRNLH6XIJJMLSEKZEF5XHUIA\m
[Pipeline] [windows-jdk8] {
[Pipeline] [windows-jdk8] isUnix
[Pipeline] [windows-jdk8] bat
[linux-jdk8] Checking out Revision d61585cd41f0e51ac66450bbd71d697a5cf0508b (failing-build)
[linux-jdk8]  > git config core.sparsecheckout # timeout=10
[linux-jdk8]  > git checkout -f d61585cd41f0e51ac66450bbd71d697a5cf0508b
[linux-jdk8] Commit message: "break the build"
[linux-jdk8] Cleaning workspace
[linux-jdk8]  > git rev-parse --verify HEAD # timeout=10
[linux-jdk8] Resetting working tree
[linux-jdk8]  > git reset --hard # timeout=10
[linux-jdk8]  > git clean -fdx # timeout=10
[windows-jdk8] [m] Running batch script
[windows-jdk8]
[windows-jdk8] f:\jenkins\jenkins-slave\workspace\_maven-parent_failing-build-5AQVKWO5HNV6NUH7J5T7OKVFOEYUJRNLH6XIJJMLSEKZEF5XHUIA\m>mvn clean verify
[windows-jdk8] ----- withMaven Wrapper script -----
[Pipeline] [linux-jdk8] }
[Pipeline] [linux-jdk8] // dir
[Pipeline] [linux-jdk8] }
[Pipeline] [linux-jdk8] // stage
[Pipeline] [linux-jdk8] stage
[Pipeline] [linux-jdk8] { (Build linux-jdk8)
[windows-jdk8] Apache Maven 3.5.0 (ff8f5e7444045639af65f6095c62210b5713f426; 2017-04-03T19:39:06Z)
[windows-jdk8] Maven home: F:\jenkins\tools\maven\apache-maven-3.5.0\bin\..
[windows-jdk8] Java version: 1.8.0_152, vendor: Oracle Corporation
[windows-jdk8] Java home: f:\jenkins\tools\java\latest1.8\jre
[windows-jdk8] Default locale: en_US, platform encoding: Cp1252
[windows-jdk8] OS name: "windows server 2012 r2", version: "6.3", arch: "amd64", family: "windows"
[Pipeline] [linux-jdk8] withMaven
[linux-jdk8] [withMaven] Options: []
[linux-jdk8] [withMaven] Available options:
[linux-jdk8] [withMaven] use JDK installation JDK 1.8 (latest)
[linux-jdk8] [withMaven] use Maven installation 'Maven 3.5.2'
[Pipeline] [linux-jdk8] {
[Pipeline] [linux-jdk8] dir
[linux-jdk8] Running in /home/jenkins/jenkins-slave/workspace/_maven-parent_failing-build-5AQVKWO5HNV6NUH7J5T7OKVFOEYUJRNLH6XIJJMLSEKZEF5XHUIA/m
[Pipeline] [linux-jdk8] {
[windows-jdk8] [jenkins-maven-event-spy] INFO generate F:\jenkins\jenkins-slave\workspace\_maven-parent_failing-build-5AQVKWO5HNV6NUH7J5T7OKVFOEYUJRNLH6XIJJMLSEKZEF5XHUIA@tmp\withMaven321140d4\maven-spy-20171129-113924-5971310327558090907194.log.tmp ...
[Pipeline] [linux-jdk8] isUnix
[Pipeline] [linux-jdk8] sh
[windows-jdk8] [INFO] Scanning for projects...
[linux-jdk8] [m] Running shell script
[windows-jdk8] [INFO] ------------------------------------------------------------------------
[windows-jdk8] [INFO] Reactor Build Order:
[windows-jdk8] [INFO]
[windows-jdk8] [INFO] Apache Maven
[windows-jdk8] [INFO] Apache Maven Archetypes
[windows-jdk8] [INFO] Apache Maven Plugins
[windows-jdk8] [INFO] Apache Maven Shared Components
[windows-jdk8] [INFO] Apache Maven Skins
[windows-jdk8] [INFO] Apache Maven Doxia Tools
[windows-jdk8] [INFO] Apache Resource Bundles
[windows-jdk8] [INFO]
[windows-jdk8] [INFO] ------------------------------------------------------------------------
[windows-jdk8] [INFO] Building Apache Maven 31-SNAPSHOT
[windows-jdk8] [INFO] ------------------------------------------------------------------------
[windows-jdk8] [INFO]
[windows-jdk8] [INFO] --- maven-clean-plugin:3.0.0:clean (default-clean) @ maven-parent ---
[windows-jdk8] [INFO]
[windows-jdk8] [INFO] --- maven-enforcer-plugin:1.4.1:enforce (enforce-maven-version) @ maven-parent ---
[linux-jdk8] + mvn clean verify
[linux-jdk8] ----- withMaven Wrapper script -----
[linux-jdk8] Picked up JAVA_TOOL_OPTIONS: -Dmaven.ext.class.path="/home/jenkins/jenkins-slave/workspace/_maven-parent_failing-build-5AQVKWO5HNV6NUH7J5T7OKVFOEYUJRNLH6XIJJMLSEKZEF5XHUIA@tmp/withMaven2ea4b396/pipeline-maven-spy.jar" -Dorg.jenkinsci.plugins.pipeline.maven.reportsFolder="/home/jenkins/jenkins-slave/workspace/_maven-parent_failing-build-5AQVKWO5HNV6NUH7J5T7OKVFOEYUJRNLH6XIJJMLSEKZEF5XHUIA@tmp/withMaven2ea4b396"
[linux-jdk8] Apache Maven 3.5.2 (138edd61fd100ec658bfa2d307c43b76940a5d7d; 2017-10-18T07:58:13Z)
[linux-jdk8] Maven home: /home/jenkins/tools/maven/apache-maven-3.5.2
[linux-jdk8] Java version: 1.8.0_152, vendor: Oracle Corporation
[linux-jdk8] Java home: /usr/local/asfpackages/java/jdk1.8.0_152/jre
[linux-jdk8] Default locale: en_US, platform encoding: ISO-8859-1
[linux-jdk8] OS name: "linux", version: "4.4.0-87-generic", arch: "amd64", family: "unix"
[windows-jdk8] [INFO]
[windows-jdk8] [INFO] --- maven-enforcer-plugin:1.4.1:enforce (enforce-bytecode-version) @ maven-parent ---
[windows-jdk8] [INFO]
[windows-jdk8] [INFO] --- maven-enforcer-plugin:1.4.1:enforce (ban-known-bad-maven-versions) @ maven-parent ---
[windows-jdk8] [INFO]
[windows-jdk8] [INFO] --- apache-rat-plugin:0.12:check (rat-check) @ maven-parent ---
[windows-jdk8] [INFO] Enabled default license matchers.
[windows-jdk8] [INFO] Will parse SCM ignores for exclusions...
[windows-jdk8] [INFO] Parsing exclusions from f:\jenkins\jenkins-slave\workspace\_maven-parent_failing-build-5AQVKWO5HNV6NUH7J5T7OKVFOEYUJRNLH6XIJJMLSEKZEF5XHUIA\m\.gitignore
[windows-jdk8] [INFO] Finished adding exclusions from SCM ignore files.
[windows-jdk8] [INFO] 77 implicit excludes (use -debug for more details).
[windows-jdk8] [INFO] Exclude: .re-bropository/**
[windows-jdk8] [INFO] 8 resources included (use -debug for more details)
[linux-jdk8] [jenkins-maven-event-spy] INFO generate /home/jenkins/jenkins-slave/workspace/_maven-parent_failing-build-5AQVKWO5HNV6NUH7J5T7OKVFOEYUJRNLH6XIJJMLSEKZEF5XHUIA@tmp/withMaven2ea4b396/maven-spy-20171129-113927-1818901740636999567610.log.tmp ...
[linux-jdk8] [INFO] Scanning for projects...
[linux-jdk8] [INFO] ------------------------------------------------------------------------
[linux-jdk8] [INFO] Reactor Build Order:
[linux-jdk8] [INFO]
[linux-jdk8] [INFO] Apache Maven
[linux-jdk8] [INFO] Apache Maven Archetypes
[linux-jdk8] [INFO] Apache Maven Plugins
[linux-jdk8] [INFO] Apache Maven Shared Components
[linux-jdk8] [INFO] Apache Maven Skins
[linux-jdk8] [INFO] Apache Maven Doxia Tools
[linux-jdk8] [INFO] Apache Resource Bundles
[linux-jdk8] [INFO]
[linux-jdk8] [INFO] ------------------------------------------------------------------------
[linux-jdk8] [INFO] Building Apache Maven 31-SNAPSHOT
[linux-jdk8] [INFO] ------------------------------------------------------------------------
[linux-jdk8] [INFO]
[linux-jdk8] [INFO] --- maven-clean-plugin:3.0.0:clean (default-clean) @ maven-parent ---
[windows-jdk8] [INFO] Rat check: Summary over all files. Unapproved: 1, unknown: 1, generated: 0, approved: 7 licenses.
[windows-jdk8] [INFO] ------------------------------------------------------------------------
[windows-jdk8] [INFO] Reactor Summary:
[windows-jdk8] [INFO]
[windows-jdk8] [INFO] Apache Maven ....................................... FAILURE [  1.695 s]
[windows-jdk8] [INFO] Apache Maven Archetypes ............................ SKIPPED
[windows-jdk8] [INFO] Apache Maven Plugins ............................... SKIPPED
[windows-jdk8] [INFO] Apache Maven Shared Components ..................... SKIPPED
[windows-jdk8] [INFO] Apache Maven Skins ................................. SKIPPED
[windows-jdk8] [INFO] Apache Maven Doxia Tools ........................... SKIPPED
[windows-jdk8] [INFO] Apache Resource Bundles ............................ SKIPPED
[windows-jdk8] [INFO] ------------------------------------------------------------------------
[windows-jdk8] [INFO] BUILD FAILURE
[windows-jdk8] [INFO] ------------------------------------------------------------------------
[windows-jdk8] [INFO] Total time: 2.223 s
[windows-jdk8] [INFO] Finished at: 2017-11-29T11:39:27Z
[windows-jdk8] [INFO] Final Memory: 16M/303M
[windows-jdk8] [INFO] ------------------------------------------------------------------------
[windows-jdk8] [jenkins-maven-event-spy] INFO generated F:\jenkins\jenkins-slave\workspace\_maven-parent_failing-build-5AQVKWO5HNV6NUH7J5T7OKVFOEYUJRNLH6XIJJMLSEKZEF5XHUIA@tmp\withMaven321140d4\maven-spy-20171129-113924-5971310327558090907194.log
[windows-jdk8] [ERROR] Failed to execute goal org.apache.rat:apache-rat-plugin:0.12:check (rat-check) on project maven-parent: Too many files with unapproved license: 1 See RAT report in: f:\jenkins\jenkins-slave\workspace\_maven-parent_failing-build-5AQVKWO5HNV6NUH7J5T7OKVFOEYUJRNLH6XIJJMLSEKZEF5XHUIA\m\target\rat.txt -> [Help 1]
[windows-jdk8] [ERROR]
[windows-jdk8] [ERROR] To see the full stack trace of the errors, re-run Maven with the -e switch.
[windows-jdk8] [ERROR] Re-run Maven using the -X switch to enable full debug logging.
[windows-jdk8] [ERROR]
[windows-jdk8] [ERROR] For more information about the errors and possible solutions, please read the following articles:
[windows-jdk8] [ERROR] [Help 1] http://cwiki.apache.org/confluence/display/MAVEN/MojoFailureException
[windows-jdk8] Picked up JAVA_TOOL_OPTIONS: -Dmaven.ext.class.path="f:\jenkins\jenkins-slave\workspace\_maven-parent_failing-build-5AQVKWO5HNV6NUH7J5T7OKVFOEYUJRNLH6XIJJMLSEKZEF5XHUIA@tmp\withMaven321140d4\pipeline-maven-spy.jar" -Dorg.jenkinsci.plugins.pipeline.maven.reportsFolder="f:\jenkins\jenkins-slave\workspace\_maven-parent_failing-build-5AQVKWO5HNV6NUH7J5T7OKVFOEYUJRNLH6XIJJMLSEKZEF5XHUIA@tmp\withMaven321140d4"
[linux-jdk8] [INFO]
[linux-jdk8] [INFO] --- maven-enforcer-plugin:1.4.1:enforce (enforce-maven-version) @ maven-parent ---
[linux-jdk8] [INFO]
[linux-jdk8] [INFO] --- maven-enforcer-plugin:1.4.1:enforce (enforce-bytecode-version) @ maven-parent ---
[linux-jdk8] [INFO]
[linux-jdk8] [INFO] --- maven-enforcer-plugin:1.4.1:enforce (ban-known-bad-maven-versions) @ maven-parent ---
[linux-jdk8] [INFO]
[linux-jdk8] [INFO] --- apache-rat-plugin:0.12:check (rat-check) @ maven-parent ---
[Pipeline] [windows-jdk8] }
[Pipeline] [windows-jdk8] // dir
[Pipeline] [windows-jdk8] }
[windows-jdk8] [TASKS] Scanning folder 'f:\jenkins\jenkins-slave\workspace\_maven-parent_failing-build-5AQVKWO5HNV6NUH7J5T7OKVFOEYUJRNLH6XIJJMLSEKZEF5XHUIA' for files matching the pattern '**/*.java' - excludes: null
[windows-jdk8] [TASKS] Found 0 files to scan for tasks
[windows-jdk8] [TASKS] Found 0 open tasks.
[windows-jdk8] Skipping warnings blame since pipelines do not have an SCM link.%n
[windows-jdk8] [TASKS] Computing warning deltas based on reference build #1
[Pipeline] [windows-jdk8] // withMaven
[Pipeline] [windows-jdk8] }
[Pipeline] [windows-jdk8] // stage
[Pipeline] [windows-jdk8] }
[Pipeline] [windows-jdk8] // node
[Pipeline] [windows-jdk8] }
[linux-jdk8] Sending interrupt signal to process
[windows-jdk8] Failed in branch windows-jdk8
[linux-jdk8] [INFO] Enabled default license matchers.
[linux-jdk8] [INFO] Will parse SCM ignores for exclusions...
[linux-jdk8] [INFO] Parsing exclusions from /home/jenkins/jenkins-slave/workspace/_maven-parent_failing-build-5AQVKWO5HNV6NUH7J5T7OKVFOEYUJRNLH6XIJJMLSEKZEF5XHUIA/m/.gitignore
[linux-jdk8] [INFO] Finished adding exclusions from SCM ignore files.
[linux-jdk8] [INFO] 77 implicit excludes (use -debug for more details).
[linux-jdk8] [INFO] Exclude: .re-bropository/**
[linux-jdk8] [INFO] 8 resources included (use -debug for more details)
[linux-jdk8] [INFO] Rat check: Summary over all files. Unapproved: 1, unknown: 1, generated: 0, approved: 7 licenses.
[linux-jdk8] [INFO] ------------------------------------------------------------------------
[linux-jdk8] [INFO] Reactor Summary:
[linux-jdk8] [INFO]
[linux-jdk8] [INFO] Apache Maven ....................................... FAILURE [  1.461 s]
[linux-jdk8] [INFO] Apache Maven Archetypes ............................ SKIPPED
[linux-jdk8] [INFO] Apache Maven Plugins ............................... SKIPPED
[linux-jdk8] [INFO] Apache Maven Shared Components ..................... SKIPPED
[linux-jdk8] [INFO] Apache Maven Skins ................................. SKIPPED
[linux-jdk8] [INFO] Apache Maven Doxia Tools ........................... SKIPPED
[linux-jdk8] [INFO] Apache Resource Bundles ............................ SKIPPED
[linux-jdk8] [INFO] ------------------------------------------------------------------------
[linux-jdk8] [INFO] BUILD FAILURE
[linux-jdk8] [INFO] ------------------------------------------------------------------------
[linux-jdk8] [INFO] Total time: 1.822 s
[linux-jdk8] [INFO] Finished at: 2017-11-29T11:39:29Z
[linux-jdk8] [INFO] Final Memory: 19M/1127M
[linux-jdk8] [INFO] ------------------------------------------------------------------------
[Pipeline] [linux-jdk8] }
[Pipeline] [linux-jdk8] // dir
[Pipeline] [linux-jdk8] }
[linux-jdk8] [withMaven] One or multiple Maven executions have been ignored by the Jenkins Pipeline Maven Plugin because they have been interrupted before completion (1). See Pipeline Maven Plugin FAQ for more details.
[Pipeline] [linux-jdk8] // withMaven
[Pipeline] [linux-jdk8] }
[Pipeline] [linux-jdk8] // stage
[Pipeline] [linux-jdk8] }
[Pipeline] [linux-jdk8] // node
[Pipeline] [linux-jdk8] }
[linux-jdk8] Failed in branch linux-jdk8
[Pipeline] // parallel
[Pipeline] stage
[Pipeline] { (Notifications)
[Pipeline] echo
Build result: FAILURE
[Pipeline] jiraIssueSelector
[Pipeline] emailext
Reply | Threaded
Open this post in threaded view
|

Build failed in Jenkins: Maven TLP » maven-parent » failing-build #6

Apache Jenkins Server-2
See https://builds.apache.org/job/maven-box/job/maven-parent/job/failing-build/6/

Changes:

* Allow failing tests to be recorded as unstable build

No tests ran.

Build log:
[...truncated 7.05 KB...]
[Pipeline] [windows-jdk8] dir
[windows-jdk8] Running in f:\jenkins\jenkins-slave\workspace\_maven-parent_failing-build-5AQVKWO5HNV6NUH7J5T7OKVFOEYUJRNLH6XIJJMLSEKZEF5XHUIA\m
[Pipeline] [windows-jdk8] {
[Pipeline] [linux-jdk8] checkout
[Pipeline] [windows-jdk8] checkout
[windows-jdk8]  > git rev-parse --is-inside-work-tree # timeout=10
[windows-jdk8] Fetching changes from the remote Git repository
[windows-jdk8]  > git config remote.origin.url https://gitbox.apache.org/repos/asf/maven-parent.git # timeout=10
[windows-jdk8] Fetching without tags
[linux-jdk8]  > git rev-parse --is-inside-work-tree # timeout=10
[linux-jdk8] Fetching changes from the remote Git repository
[linux-jdk8]  > git config remote.origin.url https://gitbox.apache.org/repos/asf/maven-parent.git # timeout=10
[linux-jdk8] Fetching without tags
[linux-jdk8] Fetching upstream changes from https://gitbox.apache.org/repos/asf/maven-parent.git
[linux-jdk8]  > git --version # timeout=10
[linux-jdk8]  > git fetch --no-tags --progress https://gitbox.apache.org/repos/asf/maven-parent.git +refs/heads/*:refs/remotes/origin/*
[windows-jdk8] Fetching upstream changes from https://gitbox.apache.org/repos/asf/maven-parent.git
[windows-jdk8]  > git --version # timeout=10
[windows-jdk8]  > git fetch --no-tags --progress https://gitbox.apache.org/repos/asf/maven-parent.git +refs/heads/*:refs/remotes/origin/*
[windows-jdk8] Checking out Revision d61585cd41f0e51ac66450bbd71d697a5cf0508b (failing-build)
[windows-jdk8]  > git config core.sparsecheckout # timeout=10
[windows-jdk8]  > git checkout -f d61585cd41f0e51ac66450bbd71d697a5cf0508b
[windows-jdk8] Commit message: "break the build"
[windows-jdk8]  > git rev-list d61585cd41f0e51ac66450bbd71d697a5cf0508b # timeout=10
[windows-jdk8] Cleaning workspace
[windows-jdk8]  > git rev-parse --verify HEAD # timeout=10
[windows-jdk8] Resetting working tree
[windows-jdk8]  > git reset --hard # timeout=10
[windows-jdk8]  > git clean -fdx # timeout=10
[Pipeline] [windows-jdk8] }
[Pipeline] [windows-jdk8] // dir
[Pipeline] [windows-jdk8] }
[Pipeline] [windows-jdk8] // stage
[Pipeline] [windows-jdk8] stage
[Pipeline] [windows-jdk8] { (Build windows-jdk8)
[Pipeline] [windows-jdk8] withMaven
[windows-jdk8] [withMaven] Options: []
[windows-jdk8] [withMaven] Available options:
[windows-jdk8] [withMaven] use JDK installation JDK 1.8 (latest)
[windows-jdk8] [withMaven] use Maven installation 'Maven 3.5.0 (Windows)'
[Pipeline] [windows-jdk8] {
[Pipeline] [windows-jdk8] dir
[windows-jdk8] Running in f:\jenkins\jenkins-slave\workspace\_maven-parent_failing-build-5AQVKWO5HNV6NUH7J5T7OKVFOEYUJRNLH6XIJJMLSEKZEF5XHUIA\m
[Pipeline] [windows-jdk8] {
[linux-jdk8] Checking out Revision d61585cd41f0e51ac66450bbd71d697a5cf0508b (failing-build)
[Pipeline] [windows-jdk8] isUnix
[Pipeline] [windows-jdk8] bat
[linux-jdk8]  > git config core.sparsecheckout # timeout=10
[linux-jdk8]  > git checkout -f d61585cd41f0e51ac66450bbd71d697a5cf0508b
[linux-jdk8] Commit message: "break the build"
[linux-jdk8] Cleaning workspace
[linux-jdk8]  > git rev-parse --verify HEAD # timeout=10
[linux-jdk8] Resetting working tree
[linux-jdk8]  > git reset --hard # timeout=10
[linux-jdk8]  > git clean -fdx # timeout=10
[windows-jdk8] [m] Running batch script
[windows-jdk8]
[windows-jdk8] f:\jenkins\jenkins-slave\workspace\_maven-parent_failing-build-5AQVKWO5HNV6NUH7J5T7OKVFOEYUJRNLH6XIJJMLSEKZEF5XHUIA\m>mvn clean verify -Dmaven.test.failure.ignore=true -Dfindbugs.failOnError=false
[windows-jdk8] ----- withMaven Wrapper script -----
[Pipeline] [linux-jdk8] }
[Pipeline] [linux-jdk8] // dir
[Pipeline] [linux-jdk8] }
[Pipeline] [linux-jdk8] // stage
[Pipeline] [linux-jdk8] stage
[Pipeline] [linux-jdk8] { (Build linux-jdk8)
[windows-jdk8] Apache Maven 3.5.0 (ff8f5e7444045639af65f6095c62210b5713f426; 2017-04-03T19:39:06Z)
[windows-jdk8] Maven home: F:\jenkins\tools\maven\apache-maven-3.5.0\bin\..
[windows-jdk8] Java version: 1.8.0_152, vendor: Oracle Corporation
[windows-jdk8] Java home: f:\jenkins\tools\java\latest1.8\jre
[windows-jdk8] Default locale: en_US, platform encoding: Cp1252
[windows-jdk8] OS name: "windows server 2012 r2", version: "6.3", arch: "amd64", family: "windows"
[Pipeline] [linux-jdk8] withMaven
[linux-jdk8] [withMaven] Options: []
[linux-jdk8] [withMaven] Available options:
[linux-jdk8] [withMaven] use JDK installation JDK 1.8 (latest)
[linux-jdk8] [withMaven] use Maven installation 'Maven 3.5.2'
[Pipeline] [linux-jdk8] {
[Pipeline] [linux-jdk8] dir
[linux-jdk8] Running in /home/jenkins/jenkins-slave/workspace/_maven-parent_failing-build-5AQVKWO5HNV6NUH7J5T7OKVFOEYUJRNLH6XIJJMLSEKZEF5XHUIA/m
[Pipeline] [linux-jdk8] {
[Pipeline] [linux-jdk8] isUnix
[Pipeline] [linux-jdk8] sh
[windows-jdk8] [jenkins-maven-event-spy] INFO generate F:\jenkins\jenkins-slave\workspace\_maven-parent_failing-build-5AQVKWO5HNV6NUH7J5T7OKVFOEYUJRNLH6XIJJMLSEKZEF5XHUIA@tmp\withMaven438cf3cd\maven-spy-20171129-114526-6798178099347094386959.log.tmp ...
[windows-jdk8] [INFO] Scanning for projects...
[linux-jdk8] [m] Running shell script
[linux-jdk8] + mvn clean verify -Dmaven.test.failure.ignore=true -Dfindbugs.failOnError=false
[linux-jdk8] ----- withMaven Wrapper script -----
[linux-jdk8] Picked up JAVA_TOOL_OPTIONS: -Dmaven.ext.class.path="/home/jenkins/jenkins-slave/workspace/_maven-parent_failing-build-5AQVKWO5HNV6NUH7J5T7OKVFOEYUJRNLH6XIJJMLSEKZEF5XHUIA@tmp/withMaven625cf02e/pipeline-maven-spy.jar" -Dorg.jenkinsci.plugins.pipeline.maven.reportsFolder="/home/jenkins/jenkins-slave/workspace/_maven-parent_failing-build-5AQVKWO5HNV6NUH7J5T7OKVFOEYUJRNLH6XIJJMLSEKZEF5XHUIA@tmp/withMaven625cf02e"
[linux-jdk8] Apache Maven 3.5.2 (138edd61fd100ec658bfa2d307c43b76940a5d7d; 2017-10-18T07:58:13Z)
[linux-jdk8] Maven home: /home/jenkins/tools/maven/apache-maven-3.5.2
[linux-jdk8] Java version: 1.8.0_152, vendor: Oracle Corporation
[linux-jdk8] Java home: /usr/local/asfpackages/java/jdk1.8.0_152/jre
[linux-jdk8] Default locale: en_US, platform encoding: ISO-8859-1
[linux-jdk8] OS name: "linux", version: "4.4.0-87-generic", arch: "amd64", family: "unix"
[windows-jdk8] [INFO] ------------------------------------------------------------------------
[windows-jdk8] [INFO] Reactor Build Order:
[windows-jdk8] [INFO]
[windows-jdk8] [INFO] Apache Maven
[windows-jdk8] [INFO] Apache Maven Archetypes
[windows-jdk8] [INFO] Apache Maven Plugins
[windows-jdk8] [INFO] Apache Maven Shared Components
[windows-jdk8] [INFO] Apache Maven Skins
[windows-jdk8] [INFO] Apache Maven Doxia Tools
[windows-jdk8] [INFO] Apache Resource Bundles
[windows-jdk8] [INFO]
[windows-jdk8] [INFO] ------------------------------------------------------------------------
[windows-jdk8] [INFO] Building Apache Maven 31-SNAPSHOT
[windows-jdk8] [INFO] ------------------------------------------------------------------------
[windows-jdk8] [INFO]
[windows-jdk8] [INFO] --- maven-clean-plugin:3.0.0:clean (default-clean) @ maven-parent ---
[windows-jdk8] [INFO]
[windows-jdk8] [INFO] --- maven-enforcer-plugin:1.4.1:enforce (enforce-maven-version) @ maven-parent ---
[windows-jdk8] [INFO]
[windows-jdk8] [INFO] --- maven-enforcer-plugin:1.4.1:enforce (enforce-bytecode-version) @ maven-parent ---
[windows-jdk8] [INFO]
[windows-jdk8] [INFO] --- maven-enforcer-plugin:1.4.1:enforce (ban-known-bad-maven-versions) @ maven-parent ---
[windows-jdk8] [INFO]
[windows-jdk8] [INFO] --- apache-rat-plugin:0.12:check (rat-check) @ maven-parent ---
[windows-jdk8] [INFO] Enabled default license matchers.
[windows-jdk8] [INFO] Will parse SCM ignores for exclusions...
[windows-jdk8] [INFO] Parsing exclusions from f:\jenkins\jenkins-slave\workspace\_maven-parent_failing-build-5AQVKWO5HNV6NUH7J5T7OKVFOEYUJRNLH6XIJJMLSEKZEF5XHUIA\m\.gitignore
[windows-jdk8] [INFO] Finished adding exclusions from SCM ignore files.
[windows-jdk8] [INFO] 77 implicit excludes (use -debug for more details).
[windows-jdk8] [INFO] Exclude: .re-bropository/**
[windows-jdk8] [INFO] 8 resources included (use -debug for more details)
[windows-jdk8] [INFO] Rat check: Summary over all files. Unapproved: 1, unknown: 1, generated: 0, approved: 7 licenses.
[windows-jdk8] [INFO] ------------------------------------------------------------------------
[windows-jdk8] [INFO] Reactor Summary:
[windows-jdk8] [INFO]
[windows-jdk8] [INFO] Apache Maven ....................................... FAILURE [  1.743 s]
[windows-jdk8] [INFO] Apache Maven Archetypes ............................ SKIPPED
[windows-jdk8] [INFO] Apache Maven Plugins ............................... SKIPPED
[windows-jdk8] [INFO] Apache Maven Shared Components ..................... SKIPPED
[windows-jdk8] [INFO] Apache Maven Skins ................................. SKIPPED
[windows-jdk8] [INFO] Apache Maven Doxia Tools ........................... SKIPPED
[windows-jdk8] [INFO] Apache Resource Bundles ............................ SKIPPED
[windows-jdk8] [INFO] ------------------------------------------------------------------------
[windows-jdk8] [INFO] BUILD FAILURE
[windows-jdk8] [INFO] ------------------------------------------------------------------------
[windows-jdk8] [INFO] Total time: 2.306 s
[windows-jdk8] [INFO] Finished at: 2017-11-29T11:45:29Z
[windows-jdk8] [INFO] Final Memory: 15M/303M
[windows-jdk8] [INFO] ------------------------------------------------------------------------
[windows-jdk8] [jenkins-maven-event-spy] INFO generated F:\jenkins\jenkins-slave\workspace\_maven-parent_failing-build-5AQVKWO5HNV6NUH7J5T7OKVFOEYUJRNLH6XIJJMLSEKZEF5XHUIA@tmp\withMaven438cf3cd\maven-spy-20171129-114526-6798178099347094386959.log
[windows-jdk8] [ERROR] Failed to execute goal org.apache.rat:apache-rat-plugin:0.12:check (rat-check) on project maven-parent: Too many files with unapproved license: 1 See RAT report in: f:\jenkins\jenkins-slave\workspace\_maven-parent_failing-build-5AQVKWO5HNV6NUH7J5T7OKVFOEYUJRNLH6XIJJMLSEKZEF5XHUIA\m\target\rat.txt -> [Help 1]
[windows-jdk8] [ERROR]
[windows-jdk8] [ERROR] To see the full stack trace of the errors, re-run Maven with the -e switch.
[windows-jdk8] [ERROR] Re-run Maven using the -X switch to enable full debug logging.
[windows-jdk8] [ERROR]
[windows-jdk8] [ERROR] For more information about the errors and possible solutions, please read the following articles:
[windows-jdk8] [ERROR] [Help 1] http://cwiki.apache.org/confluence/display/MAVEN/MojoFailureException
[windows-jdk8] Picked up JAVA_TOOL_OPTIONS: -Dmaven.ext.class.path="f:\jenkins\jenkins-slave\workspace\_maven-parent_failing-build-5AQVKWO5HNV6NUH7J5T7OKVFOEYUJRNLH6XIJJMLSEKZEF5XHUIA@tmp\withMaven438cf3cd\pipeline-maven-spy.jar" -Dorg.jenkinsci.plugins.pipeline.maven.reportsFolder="f:\jenkins\jenkins-slave\workspace\_maven-parent_failing-build-5AQVKWO5HNV6NUH7J5T7OKVFOEYUJRNLH6XIJJMLSEKZEF5XHUIA@tmp\withMaven438cf3cd"
[linux-jdk8] [jenkins-maven-event-spy] INFO generate /home/jenkins/jenkins-slave/workspace/_maven-parent_failing-build-5AQVKWO5HNV6NUH7J5T7OKVFOEYUJRNLH6XIJJMLSEKZEF5XHUIA@tmp/withMaven625cf02e/maven-spy-20171129-114529-1261563436100003572331.log.tmp ...
[linux-jdk8] [INFO] Scanning for projects...
[linux-jdk8] [INFO] ------------------------------------------------------------------------
[linux-jdk8] [INFO] Reactor Build Order:
[linux-jdk8] [INFO]
[linux-jdk8] [INFO] Apache Maven
[linux-jdk8] [INFO] Apache Maven Archetypes
[linux-jdk8] [INFO] Apache Maven Plugins
[linux-jdk8] [INFO] Apache Maven Shared Components
[linux-jdk8] [INFO] Apache Maven Skins
[linux-jdk8] [INFO] Apache Maven Doxia Tools
[linux-jdk8] [INFO] Apache Resource Bundles
[linux-jdk8] [INFO]
[linux-jdk8] [INFO] ------------------------------------------------------------------------
[linux-jdk8] [INFO] Building Apache Maven 31-SNAPSHOT
[linux-jdk8] [INFO] ------------------------------------------------------------------------
[linux-jdk8] [INFO]
[linux-jdk8] [INFO] --- maven-clean-plugin:3.0.0:clean (default-clean) @ maven-parent ---
[linux-jdk8] [INFO]
[linux-jdk8] [INFO] --- maven-enforcer-plugin:1.4.1:enforce (enforce-maven-version) @ maven-parent ---
[linux-jdk8] [INFO]
[linux-jdk8] [INFO] --- maven-enforcer-plugin:1.4.1:enforce (enforce-bytecode-version) @ maven-parent ---
[linux-jdk8] [INFO]
[linux-jdk8] [INFO] --- maven-enforcer-plugin:1.4.1:enforce (ban-known-bad-maven-versions) @ maven-parent ---
[linux-jdk8] [INFO]
[linux-jdk8] [INFO] --- apache-rat-plugin:0.12:check (rat-check) @ maven-parent ---
[Pipeline] [windows-jdk8] }
[Pipeline] [windows-jdk8] // dir
[linux-jdk8] [INFO] Enabled default license matchers.
[linux-jdk8] [INFO] Will parse SCM ignores for exclusions...
[linux-jdk8] [INFO] Parsing exclusions from /home/jenkins/jenkins-slave/workspace/_maven-parent_failing-build-5AQVKWO5HNV6NUH7J5T7OKVFOEYUJRNLH6XIJJMLSEKZEF5XHUIA/m/.gitignore
[linux-jdk8] [INFO] Finished adding exclusions from SCM ignore files.
[linux-jdk8] [INFO] 77 implicit excludes (use -debug for more details).
[linux-jdk8] [INFO] Exclude: .re-bropository/**
[linux-jdk8] [INFO] 8 resources included (use -debug for more details)
[linux-jdk8] [INFO] Rat check: Summary over all files. Unapproved: 1, unknown: 1, generated: 0, approved: 7 licenses.
[linux-jdk8] [INFO] ------------------------------------------------------------------------
[linux-jdk8] [INFO] Reactor Summary:
[linux-jdk8] [INFO]
[linux-jdk8] [INFO] Apache Maven ....................................... FAILURE [  1.464 s]
[linux-jdk8] [INFO] Apache Maven Archetypes ............................ SKIPPED
[linux-jdk8] [INFO] Apache Maven Plugins ............................... SKIPPED
[linux-jdk8] [INFO] Apache Maven Shared Components ..................... SKIPPED
[linux-jdk8] [INFO] Apache Maven Skins ................................. SKIPPED
[linux-jdk8] [INFO] Apache Maven Doxia Tools ........................... SKIPPED
[linux-jdk8] [INFO] Apache Resource Bundles ............................ SKIPPED
[linux-jdk8] [INFO] ------------------------------------------------------------------------
[linux-jdk8] [INFO] BUILD FAILURE
[linux-jdk8] [INFO] ------------------------------------------------------------------------
[linux-jdk8] [INFO] Total time: 1.786 s
[linux-jdk8] [INFO] Finished at: 2017-11-29T11:45:31Z
[linux-jdk8] [INFO] Final Memory: 21M/1159M
[linux-jdk8] [INFO] ------------------------------------------------------------------------
[linux-jdk8] [jenkins-maven-event-spy] INFO generated /home/jenkins/jenkins-slave/workspace/_maven-parent_failing-build-5AQVKWO5HNV6NUH7J5T7OKVFOEYUJRNLH6XIJJMLSEKZEF5XHUIA@tmp/withMaven625cf02e/maven-spy-20171129-114529-1261563436100003572331.log
[linux-jdk8] [ERROR] Failed to execute goal org.apache.rat:apache-rat-plugin:0.12:check (rat-check) on project maven-parent: Too many files with unapproved license: 1 See RAT report in: /home/jenkins/jenkins-slave/workspace/_maven-parent_failing-build-5AQVKWO5HNV6NUH7J5T7OKVFOEYUJRNLH6XIJJMLSEKZEF5XHUIA/m/target/rat.txt -> [Help 1]
[linux-jdk8] [ERROR]
[linux-jdk8] [ERROR] To see the full stack trace of the errors, re-run Maven with the -e switch.
[linux-jdk8] [ERROR] Re-run Maven using the -X switch to enable full debug logging.
[linux-jdk8] [ERROR]
[linux-jdk8] [ERROR] For more information about the errors and possible solutions, please read the following articles:
[linux-jdk8] [ERROR] [Help 1] http://cwiki.apache.org/confluence/display/MAVEN/MojoFailureException
[Pipeline] [windows-jdk8] }
[windows-jdk8] [TASKS] Scanning folder 'f:\jenkins\jenkins-slave\workspace\_maven-parent_failing-build-5AQVKWO5HNV6NUH7J5T7OKVFOEYUJRNLH6XIJJMLSEKZEF5XHUIA' for files matching the pattern '**/*.java' - excludes: null
[windows-jdk8] [TASKS] Found 0 files to scan for tasks
[windows-jdk8] [TASKS] Found 0 open tasks.
[windows-jdk8] Skipping warnings blame since pipelines do not have an SCM link.%n
[windows-jdk8] [TASKS] Computing warning deltas based on reference build #1
[Pipeline] [windows-jdk8] // withMaven
[Pipeline] [windows-jdk8] }
[Pipeline] [windows-jdk8] // stage
[Pipeline] [windows-jdk8] }
[Pipeline] [windows-jdk8] // node
[Pipeline] [windows-jdk8] }
[linux-jdk8] Sending interrupt signal to process
[windows-jdk8] Failed in branch windows-jdk8
[Pipeline] [linux-jdk8] }
[Pipeline] [linux-jdk8] // dir
[Pipeline] [linux-jdk8] }
[linux-jdk8] [TASKS] Scanning folder '/home/jenkins/jenkins-slave/workspace/_maven-parent_failing-build-5AQVKWO5HNV6NUH7J5T7OKVFOEYUJRNLH6XIJJMLSEKZEF5XHUIA' for files matching the pattern '**/*.java' - excludes: null
[linux-jdk8] [TASKS] Found 0 files to scan for tasks
[linux-jdk8] [TASKS] Found 0 open tasks.
[linux-jdk8] Skipping warnings blame since pipelines do not have an SCM link.%n
[linux-jdk8] [TASKS] Computing warning deltas based on reference build #1
[Pipeline] [linux-jdk8] // withMaven
[Pipeline] [linux-jdk8] }
[Pipeline] [linux-jdk8] // stage
[Pipeline] [linux-jdk8] }
[Pipeline] [linux-jdk8] // node
[Pipeline] [linux-jdk8] }
[linux-jdk8] Failed in branch linux-jdk8
[Pipeline] // parallel
[Pipeline] stage
[Pipeline] { (Notifications)
[Pipeline] echo
Build result: FAILURE
[Pipeline] jiraIssueSelector
[Pipeline] emailext