Build failed in Jenkins: Maven TLP » maven » master #159

classic Classic list List threaded Threaded
6 messages Options
Reply | Threaded
Open this post in threaded view
|

Build failed in Jenkins: Maven TLP » maven » master #159

Apache Jenkins Server-2
See https://builds.apache.org/job/maven-box/job/maven/job/master/159/

Changes:

* Revert [MNG-6069] Migrate to non deprecated parts of Commons CLI

No tests ran.

Build log:
[...truncated 95 lines...]

    at org.apache.maven.project.DefaultProjectBuilder.build (DefaultProjectBuilder.java:383)
    at org.apache.maven.graph.DefaultGraphBuilder.collectProjects (DefaultGraphBuilder.java:414)
    at org.apache.maven.graph.DefaultGraphBuilder.getProjectsForMavenReactor (DefaultGraphBuilder.java:405)
    at org.apache.maven.graph.DefaultGraphBuilder.build (DefaultGraphBuilder.java:82)
    at org.apache.maven.DefaultMaven.buildGraph (DefaultMaven.java:507)
    at org.apache.maven.DefaultMaven.doExecute (DefaultMaven.java:219)
    at org.apache.maven.DefaultMaven.doExecute (DefaultMaven.java:192)
    at org.apache.maven.DefaultMaven.execute (DefaultMaven.java:105)
    at org.apache.maven.cli.MavenCli.execute (MavenCli.java:956)
    at org.apache.maven.cli.MavenCli.doMain (MavenCli.java:288)
    at org.apache.maven.cli.MavenCli.main (MavenCli.java:192)
    at sun.reflect.NativeMethodAccessorImpl.invoke0 (Native Method)
    at sun.reflect.NativeMethodAccessorImpl.invoke (NativeMethodAccessorImpl.java:62)
    at sun.reflect.DelegatingMethodAccessorImpl.invoke (DelegatingMethodAccessorImpl.java:43)
    at java.lang.reflect.Method.invoke (Method.java:498)
    at org.codehaus.plexus.classworlds.launcher.Launcher.launchEnhanced (Launcher.java:289)
    at org.codehaus.plexus.classworlds.launcher.Launcher.launch (Launcher.java:229)
    at org.codehaus.plexus.classworlds.launcher.Launcher.mainWithExitCode (Launcher.java:415)
    at org.codehaus.plexus.classworlds.launcher.Launcher.main (Launcher.java:356)
[ERROR]  
[ERROR]   The project org.apache.maven:maven:3.6.1-SNAPSHOT (/home/jenkins/jenkins-slave/workspace/maven-box_maven_master-DVEN5KAF4FLE3WDK7SWFNYUY4YZ7X45JVWYY6FZT5ZEB3CLWABVQ/build/pom.xml) has 1 error
[ERROR]     Non-resolvable parent POM for org.apache.maven:maven:3.6.1-SNAPSHOT: Could not transfer artifact org.apache.maven:maven-parent:pom:33 from/to central (https://repo.maven.apache.org/maven2): repo.maven.apache.org: Name or service not known and 'parent.relativePath' points at wrong local POM @ line 25, column 11: Unknown host repo.maven.apache.org: Name or service not known -> [Help 2]
org.apache.maven.model.resolution.UnresolvableModelException: Could not transfer artifact org.apache.maven:maven-parent:pom:33 from/to central (https://repo.maven.apache.org/maven2): repo.maven.apache.org: Name or service not known
    at org.apache.maven.project.ProjectModelResolver.resolveModel (ProjectModelResolver.java:196)
    at org.apache.maven.project.ProjectModelResolver.resolveModel (ProjectModelResolver.java:242)
    at org.apache.maven.model.building.DefaultModelBuilder.readParentExternally (DefaultModelBuilder.java:1061)
    at org.apache.maven.model.building.DefaultModelBuilder.readParent (DefaultModelBuilder.java:838)
    at org.apache.maven.model.building.DefaultModelBuilder.build (DefaultModelBuilder.java:332)
    at org.apache.maven.project.DefaultProjectBuilder.build (DefaultProjectBuilder.java:432)
    at org.apache.maven.project.DefaultProjectBuilder.build (DefaultProjectBuilder.java:400)
    at org.apache.maven.project.DefaultProjectBuilder.build (DefaultProjectBuilder.java:362)
    at org.apache.maven.graph.DefaultGraphBuilder.collectProjects (DefaultGraphBuilder.java:414)
    at org.apache.maven.graph.DefaultGraphBuilder.getProjectsForMavenReactor (DefaultGraphBuilder.java:405)
    at org.apache.maven.graph.DefaultGraphBuilder.build (DefaultGraphBuilder.java:82)
    at org.apache.maven.DefaultMaven.buildGraph (DefaultMaven.java:507)
    at org.apache.maven.DefaultMaven.doExecute (DefaultMaven.java:219)
    at org.apache.maven.DefaultMaven.doExecute (DefaultMaven.java:192)
    at org.apache.maven.DefaultMaven.execute (DefaultMaven.java:105)
    at org.apache.maven.cli.MavenCli.execute (MavenCli.java:956)
    at org.apache.maven.cli.MavenCli.doMain (MavenCli.java:288)
    at org.apache.maven.cli.MavenCli.main (MavenCli.java:192)
    at sun.reflect.NativeMethodAccessorImpl.invoke0 (Native Method)
    at sun.reflect.NativeMethodAccessorImpl.invoke (NativeMethodAccessorImpl.java:62)
    at sun.reflect.DelegatingMethodAccessorImpl.invoke (DelegatingMethodAccessorImpl.java:43)
    at java.lang.reflect.Method.invoke (Method.java:498)
    at org.codehaus.plexus.classworlds.launcher.Launcher.launchEnhanced (Launcher.java:289)
    at org.codehaus.plexus.classworlds.launcher.Launcher.launch (Launcher.java:229)
    at org.codehaus.plexus.classworlds.launcher.Launcher.mainWithExitCode (Launcher.java:415)
    at org.codehaus.plexus.classworlds.launcher.Launcher.main (Launcher.java:356)
Caused by: org.eclipse.aether.resolution.ArtifactResolutionException: Could not transfer artifact org.apache.maven:maven-parent:pom:33 from/to central (https://repo.maven.apache.org/maven2): repo.maven.apache.org: Name or service not known
    at org.eclipse.aether.internal.impl.DefaultArtifactResolver.resolve (DefaultArtifactResolver.java:413)
    at org.eclipse.aether.internal.impl.DefaultArtifactResolver.resolveArtifacts (DefaultArtifactResolver.java:215)
    at org.eclipse.aether.internal.impl.DefaultArtifactResolver.resolveArtifact (DefaultArtifactResolver.java:192)
    at org.eclipse.aether.internal.impl.DefaultRepositorySystem.resolveArtifact (DefaultRepositorySystem.java:247)
    at org.apache.maven.project.ProjectModelResolver.resolveModel (ProjectModelResolver.java:192)
    at org.apache.maven.project.ProjectModelResolver.resolveModel (ProjectModelResolver.java:242)
    at org.apache.maven.model.building.DefaultModelBuilder.readParentExternally (DefaultModelBuilder.java:1061)
    at org.apache.maven.model.building.DefaultModelBuilder.readParent (DefaultModelBuilder.java:838)
    at org.apache.maven.model.building.DefaultModelBuilder.build (DefaultModelBuilder.java:332)
    at org.apache.maven.project.DefaultProjectBuilder.build (DefaultProjectBuilder.java:432)
    at org.apache.maven.project.DefaultProjectBuilder.build (DefaultProjectBuilder.java:400)
    at org.apache.maven.project.DefaultProjectBuilder.build (DefaultProjectBuilder.java:362)
    at org.apache.maven.graph.DefaultGraphBuilder.collectProjects (DefaultGraphBuilder.java:414)
    at org.apache.maven.graph.DefaultGraphBuilder.getProjectsForMavenReactor (DefaultGraphBuilder.java:405)
    at org.apache.maven.graph.DefaultGraphBuilder.build (DefaultGraphBuilder.java:82)
    at org.apache.maven.DefaultMaven.buildGraph (DefaultMaven.java:507)
    at org.apache.maven.DefaultMaven.doExecute (DefaultMaven.java:219)
    at org.apache.maven.DefaultMaven.doExecute (DefaultMaven.java:192)
    at org.apache.maven.DefaultMaven.execute (DefaultMaven.java:105)
    at org.apache.maven.cli.MavenCli.execute (MavenCli.java:956)
    at org.apache.maven.cli.MavenCli.doMain (MavenCli.java:288)
    at org.apache.maven.cli.MavenCli.main (MavenCli.java:192)
    at sun.reflect.NativeMethodAccessorImpl.invoke0 (Native Method)
    at sun.reflect.NativeMethodAccessorImpl.invoke (NativeMethodAccessorImpl.java:62)
    at sun.reflect.DelegatingMethodAccessorImpl.invoke (DelegatingMethodAccessorImpl.java:43)
    at java.lang.reflect.Method.invoke (Method.java:498)
    at org.codehaus.plexus.classworlds.launcher.Launcher.launchEnhanced (Launcher.java:289)
    at org.codehaus.plexus.classworlds.launcher.Launcher.launch (Launcher.java:229)
    at org.codehaus.plexus.classworlds.launcher.Launcher.mainWithExitCode (Launcher.java:415)
    at org.codehaus.plexus.classworlds.launcher.Launcher.main (Launcher.java:356)
Caused by: org.eclipse.aether.transfer.ArtifactTransferException: Could not transfer artifact org.apache.maven:maven-parent:pom:33 from/to central (https://repo.maven.apache.org/maven2): repo.maven.apache.org: Name or service not known
    at org.eclipse.aether.connector.basic.ArtifactTransportListener.transferFailed (ArtifactTransportListener.java:52)
    at org.eclipse.aether.connector.basic.BasicRepositoryConnector$TaskRunner.run (BasicRepositoryConnector.java:368)
    at org.eclipse.aether.util.concurrency.RunnableErrorForwarder$1.run (RunnableErrorForwarder.java:75)
    at org.eclipse.aether.connector.basic.BasicRepositoryConnector$DirectExecutor.execute (BasicRepositoryConnector.java:642)
    at org.eclipse.aether.connector.basic.BasicRepositoryConnector.get (BasicRepositoryConnector.java:262)
    at org.eclipse.aether.internal.impl.DefaultArtifactResolver.performDownloads (DefaultArtifactResolver.java:489)
    at org.eclipse.aether.internal.impl.DefaultArtifactResolver.resolve (DefaultArtifactResolver.java:390)
    at org.eclipse.aether.internal.impl.DefaultArtifactResolver.resolveArtifacts (DefaultArtifactResolver.java:215)
    at org.eclipse.aether.internal.impl.DefaultArtifactResolver.resolveArtifact (DefaultArtifactResolver.java:192)
    at org.eclipse.aether.internal.impl.DefaultRepositorySystem.resolveArtifact (DefaultRepositorySystem.java:247)
    at org.apache.maven.project.ProjectModelResolver.resolveModel (ProjectModelResolver.java:192)
    at org.apache.maven.project.ProjectModelResolver.resolveModel (ProjectModelResolver.java:242)
    at org.apache.maven.model.building.DefaultModelBuilder.readParentExternally (DefaultModelBuilder.java:1061)
    at org.apache.maven.model.building.DefaultModelBuilder.readParent (DefaultModelBuilder.java:838)
    at org.apache.maven.model.building.DefaultModelBuilder.build (DefaultModelBuilder.java:332)
    at org.apache.maven.project.DefaultProjectBuilder.build (DefaultProjectBuilder.java:432)
    at org.apache.maven.project.DefaultProjectBuilder.build (DefaultProjectBuilder.java:400)
    at org.apache.maven.project.DefaultProjectBuilder.build (DefaultProjectBuilder.java:362)
    at org.apache.maven.graph.DefaultGraphBuilder.collectProjects (DefaultGraphBuilder.java:414)
    at org.apache.maven.graph.DefaultGraphBuilder.getProjectsForMavenReactor (DefaultGraphBuilder.java:405)
    at org.apache.maven.graph.DefaultGraphBuilder.build (DefaultGraphBuilder.java:82)
    at org.apache.maven.DefaultMaven.buildGraph (DefaultMaven.java:507)
    at org.apache.maven.DefaultMaven.doExecute (DefaultMaven.java:219)
    at org.apache.maven.DefaultMaven.doExecute (DefaultMaven.java:192)
    at org.apache.maven.DefaultMaven.execute (DefaultMaven.java:105)
    at org.apache.maven.cli.MavenCli.execute (MavenCli.java:956)
    at org.apache.maven.cli.MavenCli.doMain (MavenCli.java:288)
    at org.apache.maven.cli.MavenCli.main (MavenCli.java:192)
    at sun.reflect.NativeMethodAccessorImpl.invoke0 (Native Method)
    at sun.reflect.NativeMethodAccessorImpl.invoke (NativeMethodAccessorImpl.java:62)
    at sun.reflect.DelegatingMethodAccessorImpl.invoke (DelegatingMethodAccessorImpl.java:43)
    at java.lang.reflect.Method.invoke (Method.java:498)
    at org.codehaus.plexus.classworlds.launcher.Launcher.launchEnhanced (Launcher.java:289)
    at org.codehaus.plexus.classworlds.launcher.Launcher.launch (Launcher.java:229)
    at org.codehaus.plexus.classworlds.launcher.Launcher.mainWithExitCode (Launcher.java:415)
    at org.codehaus.plexus.classworlds.launcher.Launcher.main (Launcher.java:356)
Caused by: org.apache.maven.wagon.TransferFailedException: repo.maven.apache.org: Name or service not known
    at org.apache.maven.wagon.providers.http.wagon.shared.AbstractHttpClientWagon.fillInputData (AbstractHttpClientWagon.java:1184)
    at org.apache.maven.wagon.providers.http.wagon.shared.AbstractHttpClientWagon.fillInputData (AbstractHttpClientWagon.java:1072)
    at org.apache.maven.wagon.StreamWagon.getInputStream (StreamWagon.java:126)
    at org.apache.maven.wagon.StreamWagon.getIfNewer (StreamWagon.java:88)
    at org.apache.maven.wagon.StreamWagon.get (StreamWagon.java:61)
    at org.eclipse.aether.transport.wagon.WagonTransporter$GetTaskRunner.run (WagonTransporter.java:567)
    at org.eclipse.aether.transport.wagon.WagonTransporter.execute (WagonTransporter.java:435)
    at org.eclipse.aether.transport.wagon.WagonTransporter.get (WagonTransporter.java:412)
    at org.eclipse.aether.connector.basic.BasicRepositoryConnector$GetTaskRunner.runTask (BasicRepositoryConnector.java:456)
    at org.eclipse.aether.connector.basic.BasicRepositoryConnector$TaskRunner.run (BasicRepositoryConnector.java:363)
    at org.eclipse.aether.util.concurrency.RunnableErrorForwarder$1.run (RunnableErrorForwarder.java:75)
    at org.eclipse.aether.connector.basic.BasicRepositoryConnector$DirectExecutor.execute (BasicRepositoryConnector.java:642)
    at org.eclipse.aether.connector.basic.BasicRepositoryConnector.get (BasicRepositoryConnector.java:262)
    at org.eclipse.aether.internal.impl.DefaultArtifactResolver.performDownloads (DefaultArtifactResolver.java:489)
    at org.eclipse.aether.internal.impl.DefaultArtifactResolver.resolve (DefaultArtifactResolver.java:390)
    at org.eclipse.aether.internal.impl.DefaultArtifactResolver.resolveArtifacts (DefaultArtifactResolver.java:215)
    at org.eclipse.aether.internal.impl.DefaultArtifactResolver.resolveArtifact (DefaultArtifactResolver.java:192)
    at org.eclipse.aether.internal.impl.DefaultRepositorySystem.resolveArtifact (DefaultRepositorySystem.java:247)
    at org.apache.maven.project.ProjectModelResolver.resolveModel (ProjectModelResolver.java:192)
    at org.apache.maven.project.ProjectModelResolver.resolveModel (ProjectModelResolver.java:242)
    at org.apache.maven.model.building.DefaultModelBuilder.readParentExternally (DefaultModelBuilder.java:1061)
    at org.apache.maven.model.building.DefaultModelBuilder.readParent (DefaultModelBuilder.java:838)
    at org.apache.maven.model.building.DefaultModelBuilder.build (DefaultModelBuilder.java:332)
    at org.apache.maven.project.DefaultProjectBuilder.build (DefaultProjectBuilder.java:432)
    at org.apache.maven.project.DefaultProjectBuilder.build (DefaultProjectBuilder.java:400)
    at org.apache.maven.project.DefaultProjectBuilder.build (DefaultProjectBuilder.java:362)
    at org.apache.maven.graph.DefaultGraphBuilder.collectProjects (DefaultGraphBuilder.java:414)
    at org.apache.maven.graph.DefaultGraphBuilder.getProjectsForMavenReactor (DefaultGraphBuilder.java:405)
    at org.apache.maven.graph.DefaultGraphBuilder.build (DefaultGraphBuilder.java:82)
    at org.apache.maven.DefaultMaven.buildGraph (DefaultMaven.java:507)
    at org.apache.maven.DefaultMaven.doExecute (DefaultMaven.java:219)
    at org.apache.maven.DefaultMaven.doExecute (DefaultMaven.java:192)
    at org.apache.maven.DefaultMaven.execute (DefaultMaven.java:105)
    at org.apache.maven.cli.MavenCli.execute (MavenCli.java:956)
    at org.apache.maven.cli.MavenCli.doMain (MavenCli.java:288)
    at org.apache.maven.cli.MavenCli.main (MavenCli.java:192)
    at sun.reflect.NativeMethodAccessorImpl.invoke0 (Native Method)
    at sun.reflect.NativeMethodAccessorImpl.invoke (NativeMethodAccessorImpl.java:62)
    at sun.reflect.DelegatingMethodAccessorImpl.invoke (DelegatingMethodAccessorImpl.java:43)
    at java.lang.reflect.Method.invoke (Method.java:498)
    at org.codehaus.plexus.classworlds.launcher.Launcher.launchEnhanced (Launcher.java:289)
    at org.codehaus.plexus.classworlds.launcher.Launcher.launch (Launcher.java:229)
    at org.codehaus.plexus.classworlds.launcher.Launcher.mainWithExitCode (Launcher.java:415)
    at org.codehaus.plexus.classworlds.launcher.Launcher.main (Launcher.java:356)
Caused by: java.net.UnknownHostException: repo.maven.apache.org: Name or service not known
    at java.net.Inet6AddressImpl.lookupAllHostAddr (Native Method)
    at java.net.InetAddress$2.lookupAllHostAddr (InetAddress.java:929)
    at java.net.InetAddress.getAddressesFromNameService (InetAddress.java:1324)
    at java.net.InetAddress.getAllByName0 (InetAddress.java:1277)
    at java.net.InetAddress.getAllByName (InetAddress.java:1193)
    at java.net.InetAddress.getAllByName (InetAddress.java:1127)
    at org.apache.maven.wagon.providers.http.httpclient.impl.conn.SystemDefaultDnsResolver.resolve (SystemDefaultDnsResolver.java:45)
    at org.apache.maven.wagon.providers.http.httpclient.impl.conn.DefaultHttpClientConnectionOperator.connect (DefaultHttpClientConnectionOperator.java:112)
    at org.apache.maven.wagon.providers.http.httpclient.impl.conn.PoolingHttpClientConnectionManager.connect (PoolingHttpClientConnectionManager.java:373)
    at org.apache.maven.wagon.providers.http.httpclient.impl.execchain.MainClientExec.establishRoute (MainClientExec.java:394)
    at org.apache.maven.wagon.providers.http.httpclient.impl.execchain.MainClientExec.execute (MainClientExec.java:237)
    at org.apache.maven.wagon.providers.http.httpclient.impl.execchain.ProtocolExec.execute (ProtocolExec.java:185)
    at org.apache.maven.wagon.providers.http.httpclient.impl.execchain.RetryExec.execute (RetryExec.java:89)
    at org.apache.maven.wagon.providers.http.httpclient.impl.execchain.RedirectExec.execute (RedirectExec.java:110)
    at org.apache.maven.wagon.providers.http.httpclient.impl.client.InternalHttpClient.doExecute (InternalHttpClient.java:185)
    at org.apache.maven.wagon.providers.http.httpclient.impl.client.CloseableHttpClient.execute (CloseableHttpClient.java:83)
    at org.apache.maven.wagon.providers.http.wagon.shared.AbstractHttpClientWagon.execute (AbstractHttpClientWagon.java:936)
    at org.apache.maven.wagon.providers.http.wagon.shared.AbstractHttpClientWagon.fillInputData (AbstractHttpClientWagon.java:1095)
    at org.apache.maven.wagon.providers.http.wagon.shared.AbstractHttpClientWagon.fillInputData (AbstractHttpClientWagon.java:1072)
    at org.apache.maven.wagon.StreamWagon.getInputStream (StreamWagon.java:126)
    at org.apache.maven.wagon.StreamWagon.getIfNewer (StreamWagon.java:88)
    at org.apache.maven.wagon.StreamWagon.get (StreamWagon.java:61)
    at org.eclipse.aether.transport.wagon.WagonTransporter$GetTaskRunner.run (WagonTransporter.java:567)
    at org.eclipse.aether.transport.wagon.WagonTransporter.execute (WagonTransporter.java:435)
    at org.eclipse.aether.transport.wagon.WagonTransporter.get (WagonTransporter.java:412)
    at org.eclipse.aether.connector.basic.BasicRepositoryConnector$GetTaskRunner.runTask (BasicRepositoryConnector.java:456)
    at org.eclipse.aether.connector.basic.BasicRepositoryConnector$TaskRunner.run (BasicRepositoryConnector.java:363)
    at org.eclipse.aether.util.concurrency.RunnableErrorForwarder$1.run (RunnableErrorForwarder.java:75)
    at org.eclipse.aether.connector.basic.BasicRepositoryConnector$DirectExecutor.execute (BasicRepositoryConnector.java:642)
    at org.eclipse.aether.connector.basic.BasicRepositoryConnector.get (BasicRepositoryConnector.java:262)
    at org.eclipse.aether.internal.impl.DefaultArtifactResolver.performDownloads (DefaultArtifactResolver.java:489)
    at org.eclipse.aether.internal.impl.DefaultArtifactResolver.resolve (DefaultArtifactResolver.java:390)
    at org.eclipse.aether.internal.impl.DefaultArtifactResolver.resolveArtifacts (DefaultArtifactResolver.java:215)
    at org.eclipse.aether.internal.impl.DefaultArtifactResolver.resolveArtifact (DefaultArtifactResolver.java:192)
    at org.eclipse.aether.internal.impl.DefaultRepositorySystem.resolveArtifact (DefaultRepositorySystem.java:247)
    at org.apache.maven.project.ProjectModelResolver.resolveModel (ProjectModelResolver.java:192)
    at org.apache.maven.project.ProjectModelResolver.resolveModel (ProjectModelResolver.java:242)
    at org.apache.maven.model.building.DefaultModelBuilder.readParentExternally (DefaultModelBuilder.java:1061)
    at org.apache.maven.model.building.DefaultModelBuilder.readParent (DefaultModelBuilder.java:838)
    at org.apache.maven.model.building.DefaultModelBuilder.build (DefaultModelBuilder.java:332)
    at org.apache.maven.project.DefaultProjectBuilder.build (DefaultProjectBuilder.java:432)
    at org.apache.maven.project.DefaultProjectBuilder.build (DefaultProjectBuilder.java:400)
    at org.apache.maven.project.DefaultProjectBuilder.build (DefaultProjectBuilder.java:362)
    at org.apache.maven.graph.DefaultGraphBuilder.collectProjects (DefaultGraphBuilder.java:414)
    at org.apache.maven.graph.DefaultGraphBuilder.getProjectsForMavenReactor (DefaultGraphBuilder.java:405)
    at org.apache.maven.graph.DefaultGraphBuilder.build (DefaultGraphBuilder.java:82)
    at org.apache.maven.DefaultMaven.buildGraph (DefaultMaven.java:507)
    at org.apache.maven.DefaultMaven.doExecute (DefaultMaven.java:219)
    at org.apache.maven.DefaultMaven.doExecute (DefaultMaven.java:192)
    at org.apache.maven.DefaultMaven.execute (DefaultMaven.java:105)
    at org.apache.maven.cli.MavenCli.execute (MavenCli.java:956)
    at org.apache.maven.cli.MavenCli.doMain (MavenCli.java:288)
    at org.apache.maven.cli.MavenCli.main (MavenCli.java:192)
    at sun.reflect.NativeMethodAccessorImpl.invoke0 (Native Method)
    at sun.reflect.NativeMethodAccessorImpl.invoke (NativeMethodAccessorImpl.java:62)
    at sun.reflect.DelegatingMethodAccessorImpl.invoke (DelegatingMethodAccessorImpl.java:43)
    at java.lang.reflect.Method.invoke (Method.java:498)
    at org.codehaus.plexus.classworlds.launcher.Launcher.launchEnhanced (Launcher.java:289)
    at org.codehaus.plexus.classworlds.launcher.Launcher.launch (Launcher.java:229)
    at org.codehaus.plexus.classworlds.launcher.Launcher.mainWithExitCode (Launcher.java:415)
    at org.codehaus.plexus.classworlds.launcher.Launcher.main (Launcher.java:356)
[ERROR]
[ERROR] Re-run Maven using the -X switch to enable full debug logging.
[ERROR]
[ERROR] For more information about the errors and possible solutions, please read the following articles:
[ERROR] [Help 1] http://cwiki.apache.org/confluence/display/MAVEN/ProjectBuildingException
[ERROR] [Help 2] http://cwiki.apache.org/confluence/display/MAVEN/UnresolvableModelException
[Pipeline] }
[withMaven] Publishers: Generated Artifacts Publisher: 410 ms
[Pipeline] // withMaven
[Pipeline] }
[Pipeline] // stage
[Pipeline] }
[Pipeline] // dir
[Pipeline] }
[Pipeline] // node
[Pipeline] echo
[FAILURE-003] AbortException hudson.AbortException: script returned exit code 1
[Pipeline] stage
[Pipeline] { (Notifications)
[Pipeline] echo
Build result: FAILURE
[Pipeline] jiraIssueSelector
[Pipeline] jiraComment
[Pipeline] emailext
Reply | Threaded
Open this post in threaded view
|

Build failed in Jenkins: Maven TLP » maven » master #160

Apache Jenkins Server-2
See https://builds.apache.org/job/maven-box/job/maven/job/master/160/

No changes.

No tests ran.

Build log:
[...truncated 115 lines...]
remote: Compressing objects:  42% (66/155)          
remote: Compressing objects:  43% (67/155)          
remote: Compressing objects:  44% (69/155)          
remote: Compressing objects:  45% (70/155)          
remote: Compressing objects:  46% (72/155)          
remote: Compressing objects:  47% (73/155)          
remote: Compressing objects:  48% (75/155)          
remote: Compressing objects:  49% (76/155)          
remote: Compressing objects:  50% (78/155)          
remote: Compressing objects:  51% (80/155)          
remote: Compressing objects:  52% (81/155)          
remote: Compressing objects:  53% (83/155)          
remote: Compressing objects:  54% (84/155)          
remote: Compressing objects:  55% (86/155)          
remote: Compressing objects:  56% (87/155)          
remote: Compressing objects:  57% (89/155)          
remote: Compressing objects:  58% (90/155)          
remote: Compressing objects:  59% (92/155)          
remote: Compressing objects:  60% (93/155)          
remote: Compressing objects:  61% (95/155)          
remote: Compressing objects:  62% (97/155)          
remote: Compressing objects:  63% (98/155)          
remote: Compressing objects:  64% (100/155)          
remote: Compressing objects:  65% (101/155)          
remote: Compressing objects:  66% (103/155)          
remote: Compressing objects:  67% (104/155)          
remote: Compressing objects:  68% (106/155)          
remote: Compressing objects:  69% (107/155)          
remote: Compressing objects:  70% (109/155)          
remote: Compressing objects:  71% (111/155)          
remote: Compressing objects:  72% (112/155)          
remote: Compressing objects:  73% (114/155)          
remote: Compressing objects:  74% (115/155)          
remote: Compressing objects:  75% (117/155)          
remote: Compressing objects:  76% (118/155)          
remote: Compressing objects:  77% (120/155)          
remote: Compressing objects:  78% (121/155)          
remote: Compressing objects:  79% (123/155)          
remote: Compressing objects:  80% (124/155)          
remote: Compressing objects:  81% (126/155)          
remote: Compressing objects:  82% (128/155)          
remote: Compressing objects:  83% (129/155)          
remote: Compressing objects:  84% (131/155)          
remote: Compressing objects:  85% (132/155)          
remote: Compressing objects:  86% (134/155)          
remote: Compressing objects:  87% (135/155)          
remote: Compressing objects:  88% (137/155)          
remote: Compressing objects:  89% (138/155)          
remote: Compressing objects:  90% (140/155)          
remote: Compressing objects:  91% (142/155)          
remote: Compressing objects:  92% (143/155)          
remote: Compressing objects:  93% (145/155)          
remote: Compressing objects:  94% (146/155)          
remote: Compressing objects:  95% (148/155)          
remote: Compressing objects:  96% (149/155)          
remote: Compressing objects:  97% (151/155)          
remote: Compressing objects:  98% (152/155)          
remote: Compressing objects:  99% (154/155)          
remote: Compressing objects: 100% (155/155)          
remote: Compressing objects: 100% (155/155), done.        
remote: Total 162 (delta 89), reused 0 (delta 0)        
Receiving objects:   0% (1/162)  
Receiving objects:   1% (2/162)  
Receiving objects:   2% (4/162)  
Receiving objects:   3% (5/162)  
Receiving objects:   4% (7/162)  
Receiving objects:   5% (9/162)  
Receiving objects:   6% (10/162)  
Receiving objects:   7% (12/162)  
Receiving objects:   8% (13/162)  
Receiving objects:   9% (15/162)  
Receiving objects:  10% (17/162)  
Receiving objects:  11% (18/162)  
Receiving objects:  12% (20/162)  
Receiving objects:  13% (22/162)  
Receiving objects:  14% (23/162)  
Receiving objects:  15% (25/162)  
Receiving objects:  16% (26/162)  
Receiving objects:  17% (28/162)  
Receiving objects:  18% (30/162)  
Receiving objects:  19% (31/162)  
Receiving objects:  20% (33/162)  
Receiving objects:  21% (35/162)  
Receiving objects:  22% (36/162)  
Receiving objects:  23% (38/162)  
Receiving objects:  24% (39/162)  
Receiving objects:  25% (41/162)  
Receiving objects:  26% (43/162)  
Receiving objects:  27% (44/162)  
Receiving objects:  28% (46/162)  
Receiving objects:  29% (47/162)  
Receiving objects:  30% (49/162)  
Receiving objects:  31% (51/162)  
Receiving objects:  32% (52/162)  
Receiving objects:  33% (54/162)  
Receiving objects:  34% (56/162)  
Receiving objects:  35% (57/162)  
Receiving objects:  36% (59/162)  
Receiving objects:  37% (60/162)  
Receiving objects:  38% (62/162)  
Receiving objects:  39% (64/162)  
Receiving objects:  40% (65/162)  
Receiving objects:  41% (67/162)  
Receiving objects:  42% (69/162)  
Receiving objects:  43% (70/162)  
Receiving objects:  44% (72/162)  
Receiving objects:  45% (73/162)  
Receiving objects:  46% (75/162)  
Receiving objects:  47% (77/162)  
Receiving objects:  48% (78/162)  
Receiving objects:  49% (80/162)  
Receiving objects:  50% (81/162)  
Receiving objects:  51% (83/162)  
Receiving objects:  52% (85/162)  
Receiving objects:  53% (86/162)  
Receiving objects:  54% (88/162)  
Receiving objects:  55% (90/162)  
Receiving objects:  56% (91/162)  
Receiving objects:  57% (93/162)  
Receiving objects:  58% (94/162)  
Receiving objects:  59% (96/162)  
Receiving objects:  60% (98/162)  
Receiving objects:  61% (99/162)  
Receiving objects:  62% (101/162)  
Receiving objects:  63% (103/162)  
Receiving objects:  64% (104/162)  
Receiving objects:  65% (106/162)  
Receiving objects:  66% (107/162)  
Receiving objects:  67% (109/162)  
Receiving objects:  68% (111/162)  
Receiving objects:  69% (112/162)  
Receiving objects:  70% (114/162)  
Receiving objects:  71% (116/162)  
Receiving objects:  72% (117/162)  
Receiving objects:  73% (119/162)  
Receiving objects:  74% (120/162)  
Receiving objects:  75% (122/162)  
Receiving objects:  76% (124/162)  
Receiving objects:  77% (125/162)  
Receiving objects:  78% (127/162)  
Receiving objects:  79% (128/162)  
Receiving objects:  80% (130/162)  
Receiving objects:  81% (132/162)  
Receiving objects:  82% (133/162)  
Receiving objects:  83% (135/162)  
Receiving objects:  84% (137/162)  
Receiving objects:  85% (138/162)  
Receiving objects:  86% (140/162)  
Receiving objects:  87% (141/162)  
Receiving objects:  88% (143/162)  
Receiving objects:  89% (145/162)  
Receiving objects:  90% (146/162)  
Receiving objects:  91% (148/162)  
Receiving objects:  92% (150/162)  
Receiving objects:  93% (151/162)  
Receiving objects:  94% (153/162)  
Receiving objects:  95% (154/162)  
Receiving objects:  96% (156/162)  
Receiving objects:  97% (158/162)  
Receiving objects:  98% (159/162)  
Receiving objects:  99% (161/162)  
Receiving objects: 100% (162/162)  
Receiving objects: 100% (162/162), 12.64 KiB | 0 bytes/s, done.
Resolving deltas:   0% (0/89)  
Resolving deltas:   3% (3/89)  
Resolving deltas:   4% (4/89)  
Resolving deltas:   5% (5/89)  
Resolving deltas:   6% (6/89)  
Resolving deltas:   7% (7/89)  
Resolving deltas:   8% (8/89)  
Resolving deltas:  10% (9/89)  
Resolving deltas:  28% (25/89)  
Resolving deltas:  46% (41/89)  
Resolving deltas:  64% (57/89)  
Resolving deltas:  82% (73/89)  
Resolving deltas:  88% (79/89)  
Resolving deltas: 100% (89/89)  
Resolving deltas: 100% (89/89), completed with 11 local objects.
error: cannot lock ref 'refs/remotes/origin/MNG-6169/MNG-6550': 'refs/remotes/origin/MNG-6169' exists; cannot create 'refs/remotes/origin/MNG-6169/MNG-6550'
From https://gitbox.apache.org/repos/asf/maven
 ! [new branch]      MNG-6169/MNG-6550 -> origin/MNG-6169/MNG-6550  (unable to update local ref)
error: cannot lock ref 'refs/remotes/origin/MNG-6169/MNG-6551': 'refs/remotes/origin/MNG-6169' exists; cannot create 'refs/remotes/origin/MNG-6169/MNG-6551'
 ! [new branch]      MNG-6169/MNG-6551 -> origin/MNG-6169/MNG-6551  (unable to update local ref)
error: cannot lock ref 'refs/remotes/origin/MNG-6169/MNG-6552': 'refs/remotes/origin/MNG-6169' exists; cannot create 'refs/remotes/origin/MNG-6169/MNG-6552'
 ! [new branch]      MNG-6169/MNG-6552 -> origin/MNG-6169/MNG-6552  (unable to update local ref)
error: cannot lock ref 'refs/remotes/origin/MNG-6169/MNG-6553': 'refs/remotes/origin/MNG-6169' exists; cannot create 'refs/remotes/origin/MNG-6169/MNG-6553'
 ! [new branch]      MNG-6169/MNG-6553 -> origin/MNG-6169/MNG-6553  (unable to update local ref)
error: cannot lock ref 'refs/remotes/origin/MNG-6169/MNG-6554': 'refs/remotes/origin/MNG-6169' exists; cannot create 'refs/remotes/origin/MNG-6169/MNG-6554'
 ! [new branch]      MNG-6169/MNG-6554 -> origin/MNG-6169/MNG-6554  (unable to update local ref)
error: cannot lock ref 'refs/remotes/origin/MNG-6169/MNG-6555': 'refs/remotes/origin/MNG-6169' exists; cannot create 'refs/remotes/origin/MNG-6169/MNG-6555'
 ! [new branch]      MNG-6169/MNG-6555 -> origin/MNG-6169/MNG-6555  (unable to update local ref)
error: cannot lock ref 'refs/remotes/origin/MNG-6169/MNG-6556': 'refs/remotes/origin/MNG-6169' exists; cannot create 'refs/remotes/origin/MNG-6169/MNG-6556'
 ! [new branch]      MNG-6169/MNG-6556 -> origin/MNG-6169/MNG-6556  (unable to update local ref)
   15c6471..b7249af  master     -> origin/master
error: some local refs could not be updated; try running
 'git remote prune https://gitbox.apache.org/repos/asf/maven.git' to remove any old, conflicting branches

        at org.jenkinsci.plugins.gitclient.CliGitAPIImpl.launchCommandIn(CliGitAPIImpl.java:2038)
        at org.jenkinsci.plugins.gitclient.CliGitAPIImpl.launchCommandWithCredentials(CliGitAPIImpl.java:1757)
        at org.jenkinsci.plugins.gitclient.CliGitAPIImpl.access$300(CliGitAPIImpl.java:72)
        at org.jenkinsci.plugins.gitclient.CliGitAPIImpl$1.execute(CliGitAPIImpl.java:438)
        at org.jenkinsci.plugins.gitclient.RemoteGitImpl$CommandInvocationHandler$1.call(RemoteGitImpl.java:153)
        at org.jenkinsci.plugins.gitclient.RemoteGitImpl$CommandInvocationHandler$1.call(RemoteGitImpl.java:146)
        at hudson.remoting.UserRequest.perform(UserRequest.java:212)
        at hudson.remoting.UserRequest.perform(UserRequest.java:54)
        at hudson.remoting.Request$2.run(Request.java:369)
        at hudson.remoting.InterceptingExecutorService$1.call(InterceptingExecutorService.java:72)
        at java.util.concurrent.FutureTask.run(FutureTask.java:266)
        at java.util.concurrent.ThreadPoolExecutor.runWorker(ThreadPoolExecutor.java:1142)
        at java.util.concurrent.ThreadPoolExecutor$Worker.run(ThreadPoolExecutor.java:617)
        ... 1 more
        Suppressed: hudson.remoting.Channel$CallSiteStackTrace: Remote call to H28
                at hudson.remoting.Channel.attachCallSiteStackTrace(Channel.java:1741)
                at hudson.remoting.UserRequest$ExceptionResponse.retrieve(UserRequest.java:357)
                at hudson.remoting.Channel.call(Channel.java:955)
                at org.jenkinsci.plugins.gitclient.RemoteGitImpl$CommandInvocationHandler.execute(RemoteGitImpl.java:146)
                at sun.reflect.GeneratedMethodAccessor499.invoke(Unknown Source)
                at sun.reflect.DelegatingMethodAccessorImpl.invoke(DelegatingMethodAccessorImpl.java:43)
                at java.lang.reflect.Method.invoke(Method.java:498)
                at org.jenkinsci.plugins.gitclient.RemoteGitImpl$CommandInvocationHandler.invoke(RemoteGitImpl.java:132)
                at com.sun.proxy.$Proxy115.execute(Unknown Source)
                at hudson.plugins.git.GitSCM.fetchFrom(GitSCM.java:886)
                at hudson.plugins.git.GitSCM.retrieveChanges(GitSCM.java:1155)
                at hudson.plugins.git.GitSCM.checkout(GitSCM.java:1186)
                at org.jenkinsci.plugins.workflow.steps.scm.SCMStep.checkout(SCMStep.java:120)
                at org.jenkinsci.plugins.workflow.steps.scm.SCMStep$StepExecutionImpl.run(SCMStep.java:90)
                at org.jenkinsci.plugins.workflow.steps.scm.SCMStep$StepExecutionImpl.run(SCMStep.java:77)
                at org.jenkinsci.plugins.workflow.steps.SynchronousNonBlockingStepExecution$1$1.call(SynchronousNonBlockingStepExecution.java:51)
                at hudson.security.ACL.impersonate(ACL.java:290)
                at org.jenkinsci.plugins.workflow.steps.SynchronousNonBlockingStepExecution$1.run(SynchronousNonBlockingStepExecution.java:48)
                at java.util.concurrent.Executors$RunnableAdapter.call(Executors.java:511)
                at java.util.concurrent.FutureTask.run(FutureTask.java:266)
                at java.util.concurrent.ThreadPoolExecutor.runWorker(ThreadPoolExecutor.java:1149)
                at java.util.concurrent.ThreadPoolExecutor$Worker.run(ThreadPoolExecutor.java:624)
                ... 1 more
[Pipeline] }
[Pipeline] // stage
[Pipeline] }
[Pipeline] // dir
[Pipeline] }
[Pipeline] // node
[Pipeline] echo
[FAILURE-003] AbortException hudson.AbortException: Error fetching remote repo 'origin'
[Pipeline] stage
[Pipeline] { (Notifications)
[Pipeline] echo
Build result: FAILURE
[Pipeline] jiraIssueSelector
[Pipeline] emailext
Reply | Threaded
Open this post in threaded view
|

Build failed in Jenkins: Maven TLP » maven » master #161

Apache Jenkins Server-2
See https://builds.apache.org/job/maven-box/job/maven/job/master/161/

No changes.

No tests ran.

Build log:
Started by user slachiewicz
Obtained Jenkinsfile from b7249aff22b8993ddecfed26003c2e1bc04e708c
Running in Durability level: MAX_SURVIVABILITY
Loading library jenkins-env@master
Attempting to resolve master from remote references...
 > git --version # timeout=10
 > git ls-remote -h https://gitbox.apache.org/repos/asf/maven-jenkins-env.git # timeout=10
Found match: refs/heads/master revision 301add823574336a6bc9f551351ac881b87e0d79
 > git rev-parse --is-inside-work-tree # timeout=10
Fetching changes from the remote Git repository
 > git config remote.origin.url https://gitbox.apache.org/repos/asf/maven-jenkins-env.git # timeout=10
Fetching without tags
Fetching upstream changes from https://gitbox.apache.org/repos/asf/maven-jenkins-env.git
 > git --version # timeout=10
 > git fetch --no-tags --progress https://gitbox.apache.org/repos/asf/maven-jenkins-env.git +refs/heads/*:refs/remotes/origin/*
Checking out Revision 301add823574336a6bc9f551351ac881b87e0d79 (master)
 > git config core.sparsecheckout # timeout=10
 > git checkout -f 301add823574336a6bc9f551351ac881b87e0d79
Commit message: "Add support for Maven 3.6.x/3.6.0"
 > git rev-list --no-walk 301add823574336a6bc9f551351ac881b87e0d79 # timeout=10
Loading library jenkins-lib@master
Attempting to resolve master from remote references...
 > git --version # timeout=10
 > git ls-remote -h https://gitbox.apache.org/repos/asf/maven-jenkins-lib.git # timeout=10
Found match: refs/heads/master revision 758b9a7c6749fde348ad70a4505011eb978235ab
 > git rev-parse --is-inside-work-tree # timeout=10
Fetching changes from the remote Git repository
 > git config remote.origin.url https://gitbox.apache.org/repos/asf/maven-jenkins-lib.git # timeout=10
Fetching without tags
Fetching upstream changes from https://gitbox.apache.org/repos/asf/maven-jenkins-lib.git
 > git --version # timeout=10
 > git fetch --no-tags --progress https://gitbox.apache.org/repos/asf/maven-jenkins-lib.git +refs/heads/*:refs/remotes/origin/*
Checking out Revision 758b9a7c6749fde348ad70a4505011eb978235ab (master)
 > git config core.sparsecheckout # timeout=10
 > git checkout -f 758b9a7c6749fde348ad70a4505011eb978235ab
Commit message: "Revert: no access to currntBuild.rawBuild"
 > git rev-list --no-walk 758b9a7c6749fde348ad70a4505011eb978235ab # timeout=10
[Pipeline] properties
[Pipeline] node
Running on H28 in /home/jenkins/jenkins-slave/workspace/maven-box_maven_master-DVEN5KAF4FLE3WDK7SWFNYUY4YZ7X45JVWYY6FZT5ZEB3CLWABVQ
[Pipeline] {
[Pipeline] dir
Running in /home/jenkins/jenkins-slave/workspace/maven-box_maven_master-DVEN5KAF4FLE3WDK7SWFNYUY4YZ7X45JVWYY6FZT5ZEB3CLWABVQ/build
[Pipeline] {
[Pipeline] stage
[Pipeline] { (Checkout)
[Pipeline] checkout
Fetching changes from the remote Git repository
Fetching without tags
 > git rev-parse --is-inside-work-tree # timeout=10
 > git config remote.origin.url https://gitbox.apache.org/repos/asf/maven.git # timeout=10
Fetching upstream changes from https://gitbox.apache.org/repos/asf/maven.git
 > git --version # timeout=10
 > git fetch --no-tags --progress https://gitbox.apache.org/repos/asf/maven.git +refs/heads/*:refs/remotes/origin/*
ERROR: Error fetching remote repo 'origin'
hudson.plugins.git.GitException: Failed to fetch from https://gitbox.apache.org/repos/asf/maven.git
        at hudson.plugins.git.GitSCM.fetchFrom(GitSCM.java:888)
        at hudson.plugins.git.GitSCM.retrieveChanges(GitSCM.java:1155)
        at hudson.plugins.git.GitSCM.checkout(GitSCM.java:1186)
        at org.jenkinsci.plugins.workflow.steps.scm.SCMStep.checkout(SCMStep.java:120)
        at org.jenkinsci.plugins.workflow.steps.scm.SCMStep$StepExecutionImpl.run(SCMStep.java:90)
        at org.jenkinsci.plugins.workflow.steps.scm.SCMStep$StepExecutionImpl.run(SCMStep.java:77)
        at org.jenkinsci.plugins.workflow.steps.SynchronousNonBlockingStepExecution$1$1.call(SynchronousNonBlockingStepExecution.java:51)
        at hudson.security.ACL.impersonate(ACL.java:290)
        at org.jenkinsci.plugins.workflow.steps.SynchronousNonBlockingStepExecution$1.run(SynchronousNonBlockingStepExecution.java:48)
        at java.util.concurrent.Executors$RunnableAdapter.call(Executors.java:511)
        at java.util.concurrent.FutureTask.run(FutureTask.java:266)
        at java.util.concurrent.ThreadPoolExecutor.runWorker(ThreadPoolExecutor.java:1149)
        at java.util.concurrent.ThreadPoolExecutor$Worker.run(ThreadPoolExecutor.java:624)
        at java.lang.Thread.run(Thread.java:748)
Caused by: hudson.plugins.git.GitException: Command "git fetch --no-tags --progress https://gitbox.apache.org/repos/asf/maven.git +refs/heads/*:refs/remotes/origin/*" returned status code 1:
stdout:
stderr: error: cannot lock ref 'refs/remotes/origin/MNG-6169/MNG-6550': 'refs/remotes/origin/MNG-6169' exists; cannot create 'refs/remotes/origin/MNG-6169/MNG-6550'
From https://gitbox.apache.org/repos/asf/maven
 ! [new branch]      MNG-6169/MNG-6550 -> origin/MNG-6169/MNG-6550  (unable to update local ref)
error: cannot lock ref 'refs/remotes/origin/MNG-6169/MNG-6551': 'refs/remotes/origin/MNG-6169' exists; cannot create 'refs/remotes/origin/MNG-6169/MNG-6551'
 ! [new branch]      MNG-6169/MNG-6551 -> origin/MNG-6169/MNG-6551  (unable to update local ref)
error: cannot lock ref 'refs/remotes/origin/MNG-6169/MNG-6552': 'refs/remotes/origin/MNG-6169' exists; cannot create 'refs/remotes/origin/MNG-6169/MNG-6552'
 ! [new branch]      MNG-6169/MNG-6552 -> origin/MNG-6169/MNG-6552  (unable to update local ref)
error: cannot lock ref 'refs/remotes/origin/MNG-6169/MNG-6553': 'refs/remotes/origin/MNG-6169' exists; cannot create 'refs/remotes/origin/MNG-6169/MNG-6553'
 ! [new branch]      MNG-6169/MNG-6553 -> origin/MNG-6169/MNG-6553  (unable to update local ref)
error: cannot lock ref 'refs/remotes/origin/MNG-6169/MNG-6554': 'refs/remotes/origin/MNG-6169' exists; cannot create 'refs/remotes/origin/MNG-6169/MNG-6554'
 ! [new branch]      MNG-6169/MNG-6554 -> origin/MNG-6169/MNG-6554  (unable to update local ref)
error: cannot lock ref 'refs/remotes/origin/MNG-6169/MNG-6555': 'refs/remotes/origin/MNG-6169' exists; cannot create 'refs/remotes/origin/MNG-6169/MNG-6555'
 ! [new branch]      MNG-6169/MNG-6555 -> origin/MNG-6169/MNG-6555  (unable to update local ref)
error: cannot lock ref 'refs/remotes/origin/MNG-6169/MNG-6556': 'refs/remotes/origin/MNG-6169' exists; cannot create 'refs/remotes/origin/MNG-6169/MNG-6556'
 ! [new branch]      MNG-6169/MNG-6556 -> origin/MNG-6169/MNG-6556  (unable to update local ref)
error: some local refs could not be updated; try running
 'git remote prune https://gitbox.apache.org/repos/asf/maven.git' to remove any old, conflicting branches

        at org.jenkinsci.plugins.gitclient.CliGitAPIImpl.launchCommandIn(CliGitAPIImpl.java:2038)
        at org.jenkinsci.plugins.gitclient.CliGitAPIImpl.launchCommandWithCredentials(CliGitAPIImpl.java:1757)
        at org.jenkinsci.plugins.gitclient.CliGitAPIImpl.access$300(CliGitAPIImpl.java:72)
        at org.jenkinsci.plugins.gitclient.CliGitAPIImpl$1.execute(CliGitAPIImpl.java:438)
        at org.jenkinsci.plugins.gitclient.RemoteGitImpl$CommandInvocationHandler$1.call(RemoteGitImpl.java:153)
        at org.jenkinsci.plugins.gitclient.RemoteGitImpl$CommandInvocationHandler$1.call(RemoteGitImpl.java:146)
        at hudson.remoting.UserRequest.perform(UserRequest.java:212)
        at hudson.remoting.UserRequest.perform(UserRequest.java:54)
        at hudson.remoting.Request$2.run(Request.java:369)
        at hudson.remoting.InterceptingExecutorService$1.call(InterceptingExecutorService.java:72)
        at java.util.concurrent.FutureTask.run(FutureTask.java:266)
        at java.util.concurrent.ThreadPoolExecutor.runWorker(ThreadPoolExecutor.java:1142)
        at java.util.concurrent.ThreadPoolExecutor$Worker.run(ThreadPoolExecutor.java:617)
        ... 1 more
        Suppressed: hudson.remoting.Channel$CallSiteStackTrace: Remote call to H28
                at hudson.remoting.Channel.attachCallSiteStackTrace(Channel.java:1741)
                at hudson.remoting.UserRequest$ExceptionResponse.retrieve(UserRequest.java:357)
                at hudson.remoting.Channel.call(Channel.java:955)
                at org.jenkinsci.plugins.gitclient.RemoteGitImpl$CommandInvocationHandler.execute(RemoteGitImpl.java:146)
                at sun.reflect.GeneratedMethodAccessor499.invoke(Unknown Source)
                at sun.reflect.DelegatingMethodAccessorImpl.invoke(DelegatingMethodAccessorImpl.java:43)
                at java.lang.reflect.Method.invoke(Method.java:498)
                at org.jenkinsci.plugins.gitclient.RemoteGitImpl$CommandInvocationHandler.invoke(RemoteGitImpl.java:132)
                at com.sun.proxy.$Proxy115.execute(Unknown Source)
                at hudson.plugins.git.GitSCM.fetchFrom(GitSCM.java:886)
                at hudson.plugins.git.GitSCM.retrieveChanges(GitSCM.java:1155)
                at hudson.plugins.git.GitSCM.checkout(GitSCM.java:1186)
                at org.jenkinsci.plugins.workflow.steps.scm.SCMStep.checkout(SCMStep.java:120)
                at org.jenkinsci.plugins.workflow.steps.scm.SCMStep$StepExecutionImpl.run(SCMStep.java:90)
                at org.jenkinsci.plugins.workflow.steps.scm.SCMStep$StepExecutionImpl.run(SCMStep.java:77)
                at org.jenkinsci.plugins.workflow.steps.SynchronousNonBlockingStepExecution$1$1.call(SynchronousNonBlockingStepExecution.java:51)
                at hudson.security.ACL.impersonate(ACL.java:290)
                at org.jenkinsci.plugins.workflow.steps.SynchronousNonBlockingStepExecution$1.run(SynchronousNonBlockingStepExecution.java:48)
                at java.util.concurrent.Executors$RunnableAdapter.call(Executors.java:511)
                at java.util.concurrent.FutureTask.run(FutureTask.java:266)
                at java.util.concurrent.ThreadPoolExecutor.runWorker(ThreadPoolExecutor.java:1149)
                at java.util.concurrent.ThreadPoolExecutor$Worker.run(ThreadPoolExecutor.java:624)
                ... 1 more
[Pipeline] }
[Pipeline] // stage
[Pipeline] }
[Pipeline] // dir
[Pipeline] }
[Pipeline] // node
[Pipeline] echo
[FAILURE-003] AbortException hudson.AbortException: Error fetching remote repo 'origin'
[Pipeline] stage
[Pipeline] { (Notifications)
[Pipeline] echo
Build result: FAILURE
[Pipeline] jiraIssueSelector
[Pipeline] emailext
Reply | Threaded
Open this post in threaded view
|

Build failed in Jenkins: Maven TLP » maven » master #162

Apache Jenkins Server-2
See https://builds.apache.org/job/maven-box/job/maven/job/master/162/

No changes.

No tests ran.

Build log:
Started by user slachiewicz
Obtained Jenkinsfile from b7249aff22b8993ddecfed26003c2e1bc04e708c
Running in Durability level: MAX_SURVIVABILITY
Loading library jenkins-env@master
Attempting to resolve master from remote references...
 > git --version # timeout=10
 > git ls-remote -h https://gitbox.apache.org/repos/asf/maven-jenkins-env.git # timeout=10
Found match: refs/heads/master revision 301add823574336a6bc9f551351ac881b87e0d79
 > git rev-parse --is-inside-work-tree # timeout=10
Fetching changes from the remote Git repository
 > git config remote.origin.url https://gitbox.apache.org/repos/asf/maven-jenkins-env.git # timeout=10
Fetching without tags
Fetching upstream changes from https://gitbox.apache.org/repos/asf/maven-jenkins-env.git
 > git --version # timeout=10
 > git fetch --no-tags --progress https://gitbox.apache.org/repos/asf/maven-jenkins-env.git +refs/heads/*:refs/remotes/origin/*
Checking out Revision 301add823574336a6bc9f551351ac881b87e0d79 (master)
 > git config core.sparsecheckout # timeout=10
 > git checkout -f 301add823574336a6bc9f551351ac881b87e0d79
Commit message: "Add support for Maven 3.6.x/3.6.0"
 > git rev-list --no-walk 301add823574336a6bc9f551351ac881b87e0d79 # timeout=10
Loading library jenkins-lib@master
Attempting to resolve master from remote references...
 > git --version # timeout=10
 > git ls-remote -h https://gitbox.apache.org/repos/asf/maven-jenkins-lib.git # timeout=10
Found match: refs/heads/master revision 758b9a7c6749fde348ad70a4505011eb978235ab
 > git rev-parse --is-inside-work-tree # timeout=10
Fetching changes from the remote Git repository
 > git config remote.origin.url https://gitbox.apache.org/repos/asf/maven-jenkins-lib.git # timeout=10
Fetching without tags
Fetching upstream changes from https://gitbox.apache.org/repos/asf/maven-jenkins-lib.git
 > git --version # timeout=10
 > git fetch --no-tags --progress https://gitbox.apache.org/repos/asf/maven-jenkins-lib.git +refs/heads/*:refs/remotes/origin/*
Checking out Revision 758b9a7c6749fde348ad70a4505011eb978235ab (master)
 > git config core.sparsecheckout # timeout=10
 > git checkout -f 758b9a7c6749fde348ad70a4505011eb978235ab
Commit message: "Revert: no access to currntBuild.rawBuild"
 > git rev-list --no-walk 758b9a7c6749fde348ad70a4505011eb978235ab # timeout=10
[Pipeline] properties
[Pipeline] node
Running on H28 in /home/jenkins/jenkins-slave/workspace/maven-box_maven_master-DVEN5KAF4FLE3WDK7SWFNYUY4YZ7X45JVWYY6FZT5ZEB3CLWABVQ
[Pipeline] {
[Pipeline] dir
Running in /home/jenkins/jenkins-slave/workspace/maven-box_maven_master-DVEN5KAF4FLE3WDK7SWFNYUY4YZ7X45JVWYY6FZT5ZEB3CLWABVQ/build
[Pipeline] {
[Pipeline] stage
[Pipeline] { (Checkout)
[Pipeline] checkout
Fetching changes from the remote Git repository
Fetching without tags
 > git rev-parse --is-inside-work-tree # timeout=10
 > git config remote.origin.url https://gitbox.apache.org/repos/asf/maven.git # timeout=10
Fetching upstream changes from https://gitbox.apache.org/repos/asf/maven.git
 > git --version # timeout=10
 > git fetch --no-tags --progress https://gitbox.apache.org/repos/asf/maven.git +refs/heads/*:refs/remotes/origin/*
ERROR: Error fetching remote repo 'origin'
hudson.plugins.git.GitException: Failed to fetch from https://gitbox.apache.org/repos/asf/maven.git
        at hudson.plugins.git.GitSCM.fetchFrom(GitSCM.java:888)
        at hudson.plugins.git.GitSCM.retrieveChanges(GitSCM.java:1155)
        at hudson.plugins.git.GitSCM.checkout(GitSCM.java:1186)
        at org.jenkinsci.plugins.workflow.steps.scm.SCMStep.checkout(SCMStep.java:120)
        at org.jenkinsci.plugins.workflow.steps.scm.SCMStep$StepExecutionImpl.run(SCMStep.java:90)
        at org.jenkinsci.plugins.workflow.steps.scm.SCMStep$StepExecutionImpl.run(SCMStep.java:77)
        at org.jenkinsci.plugins.workflow.steps.SynchronousNonBlockingStepExecution$1$1.call(SynchronousNonBlockingStepExecution.java:51)
        at hudson.security.ACL.impersonate(ACL.java:290)
        at org.jenkinsci.plugins.workflow.steps.SynchronousNonBlockingStepExecution$1.run(SynchronousNonBlockingStepExecution.java:48)
        at java.util.concurrent.Executors$RunnableAdapter.call(Executors.java:511)
        at java.util.concurrent.FutureTask.run(FutureTask.java:266)
        at java.util.concurrent.ThreadPoolExecutor.runWorker(ThreadPoolExecutor.java:1149)
        at java.util.concurrent.ThreadPoolExecutor$Worker.run(ThreadPoolExecutor.java:624)
        at java.lang.Thread.run(Thread.java:748)
Caused by: hudson.plugins.git.GitException: Command "git fetch --no-tags --progress https://gitbox.apache.org/repos/asf/maven.git +refs/heads/*:refs/remotes/origin/*" returned status code 1:
stdout:
stderr: error: cannot lock ref 'refs/remotes/origin/MNG-6169/MNG-6550': 'refs/remotes/origin/MNG-6169' exists; cannot create 'refs/remotes/origin/MNG-6169/MNG-6550'
From https://gitbox.apache.org/repos/asf/maven
 ! [new branch]      MNG-6169/MNG-6550 -> origin/MNG-6169/MNG-6550  (unable to update local ref)
error: cannot lock ref 'refs/remotes/origin/MNG-6169/MNG-6551': 'refs/remotes/origin/MNG-6169' exists; cannot create 'refs/remotes/origin/MNG-6169/MNG-6551'
 ! [new branch]      MNG-6169/MNG-6551 -> origin/MNG-6169/MNG-6551  (unable to update local ref)
error: cannot lock ref 'refs/remotes/origin/MNG-6169/MNG-6552': 'refs/remotes/origin/MNG-6169' exists; cannot create 'refs/remotes/origin/MNG-6169/MNG-6552'
 ! [new branch]      MNG-6169/MNG-6552 -> origin/MNG-6169/MNG-6552  (unable to update local ref)
error: cannot lock ref 'refs/remotes/origin/MNG-6169/MNG-6553': 'refs/remotes/origin/MNG-6169' exists; cannot create 'refs/remotes/origin/MNG-6169/MNG-6553'
 ! [new branch]      MNG-6169/MNG-6553 -> origin/MNG-6169/MNG-6553  (unable to update local ref)
error: cannot lock ref 'refs/remotes/origin/MNG-6169/MNG-6554': 'refs/remotes/origin/MNG-6169' exists; cannot create 'refs/remotes/origin/MNG-6169/MNG-6554'
 ! [new branch]      MNG-6169/MNG-6554 -> origin/MNG-6169/MNG-6554  (unable to update local ref)
error: cannot lock ref 'refs/remotes/origin/MNG-6169/MNG-6555': 'refs/remotes/origin/MNG-6169' exists; cannot create 'refs/remotes/origin/MNG-6169/MNG-6555'
 ! [new branch]      MNG-6169/MNG-6555 -> origin/MNG-6169/MNG-6555  (unable to update local ref)
error: cannot lock ref 'refs/remotes/origin/MNG-6169/MNG-6556': 'refs/remotes/origin/MNG-6169' exists; cannot create 'refs/remotes/origin/MNG-6169/MNG-6556'
 ! [new branch]      MNG-6169/MNG-6556 -> origin/MNG-6169/MNG-6556  (unable to update local ref)
error: some local refs could not be updated; try running
 'git remote prune https://gitbox.apache.org/repos/asf/maven.git' to remove any old, conflicting branches

        at org.jenkinsci.plugins.gitclient.CliGitAPIImpl.launchCommandIn(CliGitAPIImpl.java:2038)
        at org.jenkinsci.plugins.gitclient.CliGitAPIImpl.launchCommandWithCredentials(CliGitAPIImpl.java:1757)
        at org.jenkinsci.plugins.gitclient.CliGitAPIImpl.access$300(CliGitAPIImpl.java:72)
        at org.jenkinsci.plugins.gitclient.CliGitAPIImpl$1.execute(CliGitAPIImpl.java:438)
        at org.jenkinsci.plugins.gitclient.RemoteGitImpl$CommandInvocationHandler$1.call(RemoteGitImpl.java:153)
        at org.jenkinsci.plugins.gitclient.RemoteGitImpl$CommandInvocationHandler$1.call(RemoteGitImpl.java:146)
        at hudson.remoting.UserRequest.perform(UserRequest.java:212)
        at hudson.remoting.UserRequest.perform(UserRequest.java:54)
        at hudson.remoting.Request$2.run(Request.java:369)
        at hudson.remoting.InterceptingExecutorService$1.call(InterceptingExecutorService.java:72)
        at java.util.concurrent.FutureTask.run(FutureTask.java:266)
        at java.util.concurrent.ThreadPoolExecutor.runWorker(ThreadPoolExecutor.java:1142)
        at java.util.concurrent.ThreadPoolExecutor$Worker.run(ThreadPoolExecutor.java:617)
        ... 1 more
        Suppressed: hudson.remoting.Channel$CallSiteStackTrace: Remote call to H28
                at hudson.remoting.Channel.attachCallSiteStackTrace(Channel.java:1741)
                at hudson.remoting.UserRequest$ExceptionResponse.retrieve(UserRequest.java:357)
                at hudson.remoting.Channel.call(Channel.java:955)
                at org.jenkinsci.plugins.gitclient.RemoteGitImpl$CommandInvocationHandler.execute(RemoteGitImpl.java:146)
                at sun.reflect.GeneratedMethodAccessor499.invoke(Unknown Source)
                at sun.reflect.DelegatingMethodAccessorImpl.invoke(DelegatingMethodAccessorImpl.java:43)
                at java.lang.reflect.Method.invoke(Method.java:498)
                at org.jenkinsci.plugins.gitclient.RemoteGitImpl$CommandInvocationHandler.invoke(RemoteGitImpl.java:132)
                at com.sun.proxy.$Proxy115.execute(Unknown Source)
                at hudson.plugins.git.GitSCM.fetchFrom(GitSCM.java:886)
                at hudson.plugins.git.GitSCM.retrieveChanges(GitSCM.java:1155)
                at hudson.plugins.git.GitSCM.checkout(GitSCM.java:1186)
                at org.jenkinsci.plugins.workflow.steps.scm.SCMStep.checkout(SCMStep.java:120)
                at org.jenkinsci.plugins.workflow.steps.scm.SCMStep$StepExecutionImpl.run(SCMStep.java:90)
                at org.jenkinsci.plugins.workflow.steps.scm.SCMStep$StepExecutionImpl.run(SCMStep.java:77)
                at org.jenkinsci.plugins.workflow.steps.SynchronousNonBlockingStepExecution$1$1.call(SynchronousNonBlockingStepExecution.java:51)
                at hudson.security.ACL.impersonate(ACL.java:290)
                at org.jenkinsci.plugins.workflow.steps.SynchronousNonBlockingStepExecution$1.run(SynchronousNonBlockingStepExecution.java:48)
                at java.util.concurrent.Executors$RunnableAdapter.call(Executors.java:511)
                at java.util.concurrent.FutureTask.run(FutureTask.java:266)
                at java.util.concurrent.ThreadPoolExecutor.runWorker(ThreadPoolExecutor.java:1149)
                at java.util.concurrent.ThreadPoolExecutor$Worker.run(ThreadPoolExecutor.java:624)
                ... 1 more
[Pipeline] }
[Pipeline] // stage
[Pipeline] }
[Pipeline] // dir
[Pipeline] }
[Pipeline] // node
[Pipeline] echo
[FAILURE-003] AbortException hudson.AbortException: Error fetching remote repo 'origin'
[Pipeline] stage
[Pipeline] { (Notifications)
[Pipeline] echo
Build result: FAILURE
[Pipeline] jiraIssueSelector
[Pipeline] emailext
Reply | Threaded
Open this post in threaded view
|

Build failed in Jenkins: Maven TLP » maven » master #163

Apache Jenkins Server-2
See https://builds.apache.org/job/maven-box/job/maven/job/master/163/

No changes.

No tests ran.

Build log:
Started by user slachiewicz
Obtained Jenkinsfile from b7249aff22b8993ddecfed26003c2e1bc04e708c
Running in Durability level: MAX_SURVIVABILITY
Loading library jenkins-env@master
Attempting to resolve master from remote references...
 > git --version # timeout=10
 > git ls-remote -h https://gitbox.apache.org/repos/asf/maven-jenkins-env.git # timeout=10
Found match: refs/heads/master revision 301add823574336a6bc9f551351ac881b87e0d79
 > git rev-parse --is-inside-work-tree # timeout=10
Fetching changes from the remote Git repository
 > git config remote.origin.url https://gitbox.apache.org/repos/asf/maven-jenkins-env.git # timeout=10
Fetching without tags
Fetching upstream changes from https://gitbox.apache.org/repos/asf/maven-jenkins-env.git
 > git --version # timeout=10
 > git fetch --no-tags --progress https://gitbox.apache.org/repos/asf/maven-jenkins-env.git +refs/heads/*:refs/remotes/origin/*
Checking out Revision 301add823574336a6bc9f551351ac881b87e0d79 (master)
 > git config core.sparsecheckout # timeout=10
 > git checkout -f 301add823574336a6bc9f551351ac881b87e0d79
Commit message: "Add support for Maven 3.6.x/3.6.0"
 > git rev-list --no-walk 301add823574336a6bc9f551351ac881b87e0d79 # timeout=10
Loading library jenkins-lib@master
Attempting to resolve master from remote references...
 > git --version # timeout=10
 > git ls-remote -h https://gitbox.apache.org/repos/asf/maven-jenkins-lib.git # timeout=10
Found match: refs/heads/master revision 758b9a7c6749fde348ad70a4505011eb978235ab
 > git rev-parse --is-inside-work-tree # timeout=10
Fetching changes from the remote Git repository
 > git config remote.origin.url https://gitbox.apache.org/repos/asf/maven-jenkins-lib.git # timeout=10
Fetching without tags
Fetching upstream changes from https://gitbox.apache.org/repos/asf/maven-jenkins-lib.git
 > git --version # timeout=10
 > git fetch --no-tags --progress https://gitbox.apache.org/repos/asf/maven-jenkins-lib.git +refs/heads/*:refs/remotes/origin/*
Checking out Revision 758b9a7c6749fde348ad70a4505011eb978235ab (master)
 > git config core.sparsecheckout # timeout=10
 > git checkout -f 758b9a7c6749fde348ad70a4505011eb978235ab
Commit message: "Revert: no access to currntBuild.rawBuild"
 > git rev-list --no-walk 758b9a7c6749fde348ad70a4505011eb978235ab # timeout=10
[Pipeline] properties
[Pipeline] node
Running on H28 in /home/jenkins/jenkins-slave/workspace/maven-box_maven_master-DVEN5KAF4FLE3WDK7SWFNYUY4YZ7X45JVWYY6FZT5ZEB3CLWABVQ
[Pipeline] {
[Pipeline] dir
Running in /home/jenkins/jenkins-slave/workspace/maven-box_maven_master-DVEN5KAF4FLE3WDK7SWFNYUY4YZ7X45JVWYY6FZT5ZEB3CLWABVQ/build
[Pipeline] {
[Pipeline] stage
[Pipeline] { (Checkout)
[Pipeline] checkout
Fetching changes from the remote Git repository
Fetching without tags
 > git rev-parse --is-inside-work-tree # timeout=10
 > git config remote.origin.url https://gitbox.apache.org/repos/asf/maven.git # timeout=10
Fetching upstream changes from https://gitbox.apache.org/repos/asf/maven.git
 > git --version # timeout=10
 > git fetch --no-tags --progress https://gitbox.apache.org/repos/asf/maven.git +refs/heads/*:refs/remotes/origin/*
ERROR: Error fetching remote repo 'origin'
hudson.plugins.git.GitException: Failed to fetch from https://gitbox.apache.org/repos/asf/maven.git
        at hudson.plugins.git.GitSCM.fetchFrom(GitSCM.java:888)
        at hudson.plugins.git.GitSCM.retrieveChanges(GitSCM.java:1155)
        at hudson.plugins.git.GitSCM.checkout(GitSCM.java:1186)
        at org.jenkinsci.plugins.workflow.steps.scm.SCMStep.checkout(SCMStep.java:120)
        at org.jenkinsci.plugins.workflow.steps.scm.SCMStep$StepExecutionImpl.run(SCMStep.java:90)
        at org.jenkinsci.plugins.workflow.steps.scm.SCMStep$StepExecutionImpl.run(SCMStep.java:77)
        at org.jenkinsci.plugins.workflow.steps.SynchronousNonBlockingStepExecution$1$1.call(SynchronousNonBlockingStepExecution.java:51)
        at hudson.security.ACL.impersonate(ACL.java:290)
        at org.jenkinsci.plugins.workflow.steps.SynchronousNonBlockingStepExecution$1.run(SynchronousNonBlockingStepExecution.java:48)
        at java.util.concurrent.Executors$RunnableAdapter.call(Executors.java:511)
        at java.util.concurrent.FutureTask.run(FutureTask.java:266)
        at java.util.concurrent.ThreadPoolExecutor.runWorker(ThreadPoolExecutor.java:1149)
        at java.util.concurrent.ThreadPoolExecutor$Worker.run(ThreadPoolExecutor.java:624)
        at java.lang.Thread.run(Thread.java:748)
Caused by: hudson.plugins.git.GitException: Command "git fetch --no-tags --progress https://gitbox.apache.org/repos/asf/maven.git +refs/heads/*:refs/remotes/origin/*" returned status code 1:
stdout:
stderr: error: cannot lock ref 'refs/remotes/origin/MNG-6169/MNG-6550': 'refs/remotes/origin/MNG-6169' exists; cannot create 'refs/remotes/origin/MNG-6169/MNG-6550'
From https://gitbox.apache.org/repos/asf/maven
 ! [new branch]      MNG-6169/MNG-6550 -> origin/MNG-6169/MNG-6550  (unable to update local ref)
error: cannot lock ref 'refs/remotes/origin/MNG-6169/MNG-6551': 'refs/remotes/origin/MNG-6169' exists; cannot create 'refs/remotes/origin/MNG-6169/MNG-6551'
 ! [new branch]      MNG-6169/MNG-6551 -> origin/MNG-6169/MNG-6551  (unable to update local ref)
error: cannot lock ref 'refs/remotes/origin/MNG-6169/MNG-6552': 'refs/remotes/origin/MNG-6169' exists; cannot create 'refs/remotes/origin/MNG-6169/MNG-6552'
 ! [new branch]      MNG-6169/MNG-6552 -> origin/MNG-6169/MNG-6552  (unable to update local ref)
error: cannot lock ref 'refs/remotes/origin/MNG-6169/MNG-6553': 'refs/remotes/origin/MNG-6169' exists; cannot create 'refs/remotes/origin/MNG-6169/MNG-6553'
 ! [new branch]      MNG-6169/MNG-6553 -> origin/MNG-6169/MNG-6553  (unable to update local ref)
error: cannot lock ref 'refs/remotes/origin/MNG-6169/MNG-6554': 'refs/remotes/origin/MNG-6169' exists; cannot create 'refs/remotes/origin/MNG-6169/MNG-6554'
 ! [new branch]      MNG-6169/MNG-6554 -> origin/MNG-6169/MNG-6554  (unable to update local ref)
error: cannot lock ref 'refs/remotes/origin/MNG-6169/MNG-6555': 'refs/remotes/origin/MNG-6169' exists; cannot create 'refs/remotes/origin/MNG-6169/MNG-6555'
 ! [new branch]      MNG-6169/MNG-6555 -> origin/MNG-6169/MNG-6555  (unable to update local ref)
error: cannot lock ref 'refs/remotes/origin/MNG-6169/MNG-6556': 'refs/remotes/origin/MNG-6169' exists; cannot create 'refs/remotes/origin/MNG-6169/MNG-6556'
 ! [new branch]      MNG-6169/MNG-6556 -> origin/MNG-6169/MNG-6556  (unable to update local ref)
error: some local refs could not be updated; try running
 'git remote prune https://gitbox.apache.org/repos/asf/maven.git' to remove any old, conflicting branches

        at org.jenkinsci.plugins.gitclient.CliGitAPIImpl.launchCommandIn(CliGitAPIImpl.java:2038)
        at org.jenkinsci.plugins.gitclient.CliGitAPIImpl.launchCommandWithCredentials(CliGitAPIImpl.java:1757)
        at org.jenkinsci.plugins.gitclient.CliGitAPIImpl.access$300(CliGitAPIImpl.java:72)
        at org.jenkinsci.plugins.gitclient.CliGitAPIImpl$1.execute(CliGitAPIImpl.java:438)
        at org.jenkinsci.plugins.gitclient.RemoteGitImpl$CommandInvocationHandler$1.call(RemoteGitImpl.java:153)
        at org.jenkinsci.plugins.gitclient.RemoteGitImpl$CommandInvocationHandler$1.call(RemoteGitImpl.java:146)
        at hudson.remoting.UserRequest.perform(UserRequest.java:212)
        at hudson.remoting.UserRequest.perform(UserRequest.java:54)
        at hudson.remoting.Request$2.run(Request.java:369)
        at hudson.remoting.InterceptingExecutorService$1.call(InterceptingExecutorService.java:72)
        at java.util.concurrent.FutureTask.run(FutureTask.java:266)
        at java.util.concurrent.ThreadPoolExecutor.runWorker(ThreadPoolExecutor.java:1142)
        at java.util.concurrent.ThreadPoolExecutor$Worker.run(ThreadPoolExecutor.java:617)
        ... 1 more
        Suppressed: hudson.remoting.Channel$CallSiteStackTrace: Remote call to H28
                at hudson.remoting.Channel.attachCallSiteStackTrace(Channel.java:1741)
                at hudson.remoting.UserRequest$ExceptionResponse.retrieve(UserRequest.java:357)
                at hudson.remoting.Channel.call(Channel.java:955)
                at org.jenkinsci.plugins.gitclient.RemoteGitImpl$CommandInvocationHandler.execute(RemoteGitImpl.java:146)
                at sun.reflect.GeneratedMethodAccessor499.invoke(Unknown Source)
                at sun.reflect.DelegatingMethodAccessorImpl.invoke(DelegatingMethodAccessorImpl.java:43)
                at java.lang.reflect.Method.invoke(Method.java:498)
                at org.jenkinsci.plugins.gitclient.RemoteGitImpl$CommandInvocationHandler.invoke(RemoteGitImpl.java:132)
                at com.sun.proxy.$Proxy115.execute(Unknown Source)
                at hudson.plugins.git.GitSCM.fetchFrom(GitSCM.java:886)
                at hudson.plugins.git.GitSCM.retrieveChanges(GitSCM.java:1155)
                at hudson.plugins.git.GitSCM.checkout(GitSCM.java:1186)
                at org.jenkinsci.plugins.workflow.steps.scm.SCMStep.checkout(SCMStep.java:120)
                at org.jenkinsci.plugins.workflow.steps.scm.SCMStep$StepExecutionImpl.run(SCMStep.java:90)
                at org.jenkinsci.plugins.workflow.steps.scm.SCMStep$StepExecutionImpl.run(SCMStep.java:77)
                at org.jenkinsci.plugins.workflow.steps.SynchronousNonBlockingStepExecution$1$1.call(SynchronousNonBlockingStepExecution.java:51)
                at hudson.security.ACL.impersonate(ACL.java:290)
                at org.jenkinsci.plugins.workflow.steps.SynchronousNonBlockingStepExecution$1.run(SynchronousNonBlockingStepExecution.java:48)
                at java.util.concurrent.Executors$RunnableAdapter.call(Executors.java:511)
                at java.util.concurrent.FutureTask.run(FutureTask.java:266)
                at java.util.concurrent.ThreadPoolExecutor.runWorker(ThreadPoolExecutor.java:1149)
                at java.util.concurrent.ThreadPoolExecutor$Worker.run(ThreadPoolExecutor.java:624)
                ... 1 more
[Pipeline] }
[Pipeline] // stage
[Pipeline] }
[Pipeline] // dir
[Pipeline] }
[Pipeline] // node
[Pipeline] echo
[FAILURE-003] AbortException hudson.AbortException: Error fetching remote repo 'origin'
[Pipeline] stage
[Pipeline] { (Notifications)
[Pipeline] echo
Build result: FAILURE
[Pipeline] jiraIssueSelector
[Pipeline] emailext
Reply | Threaded
Open this post in threaded view
|

Build succeeded in Jenkins: Maven TLP » maven » master #164

Apache Jenkins Server-2