Build failed in Jenkins: Maven TLP » maven » master #128

classic Classic list List threaded Threaded
6 messages Options
Reply | Threaded
Open this post in threaded view
|

Build failed in Jenkins: Maven TLP » maven » master #128

Apache Jenkins Server-2
See https://builds.apache.org/job/maven-box/job/maven/job/master/128/

No changes.

No tests ran.

Build log:
[...truncated 122 lines...]
remote: Compressing objects:  49% (77/156)          
remote: Compressing objects:  50% (78/156)          
remote: Compressing objects:  51% (80/156)          
remote: Compressing objects:  52% (82/156)          
remote: Compressing objects:  53% (83/156)          
remote: Compressing objects:  54% (85/156)          
remote: Compressing objects:  55% (86/156)          
remote: Compressing objects:  56% (88/156)          
remote: Compressing objects:  57% (89/156)          
remote: Compressing objects:  58% (91/156)          
remote: Compressing objects:  59% (93/156)          
remote: Compressing objects:  60% (94/156)          
remote: Compressing objects:  61% (96/156)          
remote: Compressing objects:  62% (97/156)          
remote: Compressing objects:  63% (99/156)          
remote: Compressing objects:  64% (100/156)          
remote: Compressing objects:  65% (102/156)          
remote: Compressing objects:  66% (103/156)          
remote: Compressing objects:  67% (105/156)          
remote: Compressing objects:  68% (107/156)          
remote: Compressing objects:  69% (108/156)          
remote: Compressing objects:  70% (110/156)          
remote: Compressing objects:  71% (111/156)          
remote: Compressing objects:  72% (113/156)          
remote: Compressing objects:  73% (114/156)          
remote: Compressing objects:  74% (116/156)          
remote: Compressing objects:  75% (117/156)          
remote: Compressing objects:  76% (119/156)          
remote: Compressing objects:  77% (121/156)          
remote: Compressing objects:  78% (122/156)          
remote: Compressing objects:  79% (124/156)          
remote: Compressing objects:  80% (125/156)          
remote: Compressing objects:  81% (127/156)          
remote: Compressing objects:  82% (128/156)          
remote: Compressing objects:  83% (130/156)          
remote: Compressing objects:  84% (132/156)          
remote: Compressing objects:  85% (133/156)          
remote: Compressing objects:  86% (135/156)          
remote: Compressing objects:  87% (136/156)          
remote: Compressing objects:  88% (138/156)          
remote: Compressing objects:  89% (139/156)          
remote: Compressing objects:  90% (141/156)          
remote: Compressing objects:  91% (142/156)          
remote: Compressing objects:  92% (144/156)          
remote: Compressing objects:  93% (146/156)          
remote: Compressing objects:  94% (147/156)          
remote: Compressing objects:  95% (149/156)          
remote: Compressing objects:  96% (150/156)          
remote: Compressing objects:  97% (152/156)          
remote: Compressing objects:  98% (153/156)          
remote: Compressing objects:  99% (155/156)          
remote: Compressing objects: 100% (156/156)          
remote: Compressing objects: 100% (156/156), done.        
Receiving objects:   0% (1/170)  
Receiving objects:   1% (2/170)  
Receiving objects:   2% (4/170)  
Receiving objects:   3% (6/170)  
Receiving objects:   4% (7/170)  
Receiving objects:   5% (9/170)  
Receiving objects:   6% (11/170)  
Receiving objects:   7% (12/170)  
Receiving objects:   8% (14/170)  
Receiving objects:   9% (16/170)  
Receiving objects:  10% (17/170)  
Receiving objects:  11% (19/170)  
Receiving objects:  12% (21/170)  
Receiving objects:  13% (23/170)  
Receiving objects:  14% (24/170)  
Receiving objects:  15% (26/170)  
Receiving objects:  16% (28/170)  
Receiving objects:  17% (29/170)  
Receiving objects:  18% (31/170)  
Receiving objects:  19% (33/170)  
Receiving objects:  20% (34/170)  
Receiving objects:  21% (36/170)  
Receiving objects:  22% (38/170)  
Receiving objects:  23% (40/170)  
Receiving objects:  24% (41/170)  
Receiving objects:  25% (43/170)  
Receiving objects:  26% (45/170)  
Receiving objects:  27% (46/170)  
Receiving objects:  28% (48/170)  
Receiving objects:  29% (50/170)  
Receiving objects:  30% (51/170)  
Receiving objects:  31% (53/170)  
Receiving objects:  32% (55/170)  
Receiving objects:  33% (57/170)  
Receiving objects:  34% (58/170)  
remote: Total 170 (delta 93), reused 1 (delta 1)        
Receiving objects:  35% (60/170)  
Receiving objects:  36% (62/170)  
Receiving objects:  37% (63/170)  
Receiving objects:  38% (65/170)  
Receiving objects:  39% (67/170)  
Receiving objects:  40% (68/170)  
Receiving objects:  41% (70/170)  
Receiving objects:  42% (72/170)  
Receiving objects:  43% (74/170)  
Receiving objects:  44% (75/170)  
Receiving objects:  45% (77/170)  
Receiving objects:  46% (79/170)  
Receiving objects:  47% (80/170)  
Receiving objects:  48% (82/170)  
Receiving objects:  49% (84/170)  
Receiving objects:  50% (85/170)  
Receiving objects:  51% (87/170)  
Receiving objects:  52% (89/170)  
Receiving objects:  53% (91/170)  
Receiving objects:  54% (92/170)  
Receiving objects:  55% (94/170)  
Receiving objects:  56% (96/170)  
Receiving objects:  57% (97/170)  
Receiving objects:  58% (99/170)  
Receiving objects:  59% (101/170)  
Receiving objects:  60% (102/170)  
Receiving objects:  61% (104/170)  
Receiving objects:  62% (106/170)  
Receiving objects:  63% (108/170)  
Receiving objects:  64% (109/170)  
Receiving objects:  65% (111/170)  
Receiving objects:  66% (113/170)  
Receiving objects:  67% (114/170)  
Receiving objects:  68% (116/170)  
Receiving objects:  69% (118/170)  
Receiving objects:  70% (119/170)  
Receiving objects:  71% (121/170)  
Receiving objects:  72% (123/170)  
Receiving objects:  73% (125/170)  
Receiving objects:  74% (126/170)  
Receiving objects:  75% (128/170)  
Receiving objects:  76% (130/170)  
Receiving objects:  77% (131/170)  
Receiving objects:  78% (133/170)  
Receiving objects:  79% (135/170)  
Receiving objects:  80% (136/170)  
Receiving objects:  81% (138/170)  
Receiving objects:  82% (140/170)  
Receiving objects:  83% (142/170)  
Receiving objects:  84% (143/170)  
Receiving objects:  85% (145/170)  
Receiving objects:  86% (147/170)  
Receiving objects:  87% (148/170)  
Receiving objects:  88% (150/170)  
Receiving objects:  89% (152/170)  
Receiving objects:  90% (153/170)  
Receiving objects:  91% (155/170)  
Receiving objects:  92% (157/170)  
Receiving objects:  93% (159/170)  
Receiving objects:  94% (160/170)  
Receiving objects:  95% (162/170)  
Receiving objects:  96% (164/170)  
Receiving objects:  97% (165/170)  
Receiving objects:  98% (167/170)  
Receiving objects:  99% (169/170)  
Receiving objects: 100% (170/170)  
Receiving objects: 100% (170/170), 16.69 KiB | 0 bytes/s, done.
Resolving deltas:   0% (0/93)  
Resolving deltas:   4% (4/93)  
Resolving deltas:  22% (21/93)  
Resolving deltas:  38% (36/93)  
Resolving deltas:  53% (50/93)  
Resolving deltas:  68% (64/93)  
Resolving deltas:  83% (78/93)  
Resolving deltas:  84% (79/93)  
Resolving deltas:  86% (80/93)  
Resolving deltas:  87% (81/93)  
Resolving deltas:  88% (82/93)  
Resolving deltas:  89% (83/93)  
Resolving deltas:  90% (84/93)  
Resolving deltas:  91% (85/93)  
Resolving deltas:  92% (86/93)  
Resolving deltas:  93% (87/93)  
Resolving deltas:  94% (88/93)  
Resolving deltas:  95% (89/93)  
Resolving deltas:  96% (90/93)  
Resolving deltas:  97% (91/93)  
Resolving deltas:  98% (92/93)  
Resolving deltas: 100% (93/93)  
Resolving deltas: 100% (93/93), completed with 20 local objects.
From https://gitbox.apache.org/repos/asf/maven
 + b2f1141...81dd133 MNG-6069v2 -> origin/MNG-6069v2  (forced update)
error: cannot lock ref 'refs/remotes/origin/MNG-6169/MNG-6550': 'refs/remotes/origin/MNG-6169' exists; cannot create 'refs/remotes/origin/MNG-6169/MNG-6550'
 ! [new branch]      MNG-6169/MNG-6550 -> origin/MNG-6169/MNG-6550  (unable to update local ref)
error: cannot lock ref 'refs/remotes/origin/MNG-6169/MNG-6551': 'refs/remotes/origin/MNG-6169' exists; cannot create 'refs/remotes/origin/MNG-6169/MNG-6551'
 ! [new branch]      MNG-6169/MNG-6551 -> origin/MNG-6169/MNG-6551  (unable to update local ref)
error: cannot lock ref 'refs/remotes/origin/MNG-6169/MNG-6552': 'refs/remotes/origin/MNG-6169' exists; cannot create 'refs/remotes/origin/MNG-6169/MNG-6552'
 ! [new branch]      MNG-6169/MNG-6552 -> origin/MNG-6169/MNG-6552  (unable to update local ref)
error: cannot lock ref 'refs/remotes/origin/MNG-6169/MNG-6553': 'refs/remotes/origin/MNG-6169' exists; cannot create 'refs/remotes/origin/MNG-6169/MNG-6553'
 ! [new branch]      MNG-6169/MNG-6553 -> origin/MNG-6169/MNG-6553  (unable to update local ref)
error: cannot lock ref 'refs/remotes/origin/MNG-6169/MNG-6554': 'refs/remotes/origin/MNG-6169' exists; cannot create 'refs/remotes/origin/MNG-6169/MNG-6554'
 ! [new branch]      MNG-6169/MNG-6554 -> origin/MNG-6169/MNG-6554  (unable to update local ref)
error: cannot lock ref 'refs/remotes/origin/MNG-6169/MNG-6555': 'refs/remotes/origin/MNG-6169' exists; cannot create 'refs/remotes/origin/MNG-6169/MNG-6555'
 ! [new branch]      MNG-6169/MNG-6555 -> origin/MNG-6169/MNG-6555  (unable to update local ref)
 + 21d3bc0...a939654 MNG-6256   -> origin/MNG-6256  (forced update)
 * [new branch]      MNG-6530   -> origin/MNG-6530
   33e4f20..a939654  master     -> origin/master
error: some local refs could not be updated; try running
 'git remote prune https://gitbox.apache.org/repos/asf/maven.git' to remove any old, conflicting branches

        at org.jenkinsci.plugins.gitclient.CliGitAPIImpl.launchCommandIn(CliGitAPIImpl.java:2038)
        at org.jenkinsci.plugins.gitclient.CliGitAPIImpl.launchCommandWithCredentials(CliGitAPIImpl.java:1757)
        at org.jenkinsci.plugins.gitclient.CliGitAPIImpl.access$300(CliGitAPIImpl.java:72)
        at org.jenkinsci.plugins.gitclient.CliGitAPIImpl$1.execute(CliGitAPIImpl.java:438)
        at org.jenkinsci.plugins.gitclient.RemoteGitImpl$CommandInvocationHandler$1.call(RemoteGitImpl.java:153)
        at org.jenkinsci.plugins.gitclient.RemoteGitImpl$CommandInvocationHandler$1.call(RemoteGitImpl.java:146)
        at hudson.remoting.UserRequest.perform(UserRequest.java:212)
        at hudson.remoting.UserRequest.perform(UserRequest.java:54)
        at hudson.remoting.Request$2.run(Request.java:369)
        at hudson.remoting.InterceptingExecutorService$1.call(InterceptingExecutorService.java:72)
        at java.util.concurrent.FutureTask.run(FutureTask.java:266)
        at java.util.concurrent.ThreadPoolExecutor.runWorker(ThreadPoolExecutor.java:1142)
        at java.util.concurrent.ThreadPoolExecutor$Worker.run(ThreadPoolExecutor.java:617)
        ... 1 more
        Suppressed: hudson.remoting.Channel$CallSiteStackTrace: Remote call to H28
                at hudson.remoting.Channel.attachCallSiteStackTrace(Channel.java:1741)
                at hudson.remoting.UserRequest$ExceptionResponse.retrieve(UserRequest.java:357)
                at hudson.remoting.Channel.call(Channel.java:955)
                at org.jenkinsci.plugins.gitclient.RemoteGitImpl$CommandInvocationHandler.execute(RemoteGitImpl.java:146)
                at sun.reflect.GeneratedMethodAccessor499.invoke(Unknown Source)
                at sun.reflect.DelegatingMethodAccessorImpl.invoke(DelegatingMethodAccessorImpl.java:43)
                at java.lang.reflect.Method.invoke(Method.java:498)
                at org.jenkinsci.plugins.gitclient.RemoteGitImpl$CommandInvocationHandler.invoke(RemoteGitImpl.java:132)
                at com.sun.proxy.$Proxy115.execute(Unknown Source)
                at hudson.plugins.git.GitSCM.fetchFrom(GitSCM.java:886)
                at hudson.plugins.git.GitSCM.retrieveChanges(GitSCM.java:1155)
                at hudson.plugins.git.GitSCM.checkout(GitSCM.java:1186)
                at org.jenkinsci.plugins.workflow.steps.scm.SCMStep.checkout(SCMStep.java:120)
                at org.jenkinsci.plugins.workflow.steps.scm.SCMStep$StepExecutionImpl.run(SCMStep.java:90)
                at org.jenkinsci.plugins.workflow.steps.scm.SCMStep$StepExecutionImpl.run(SCMStep.java:77)
                at org.jenkinsci.plugins.workflow.steps.SynchronousNonBlockingStepExecution$1$1.call(SynchronousNonBlockingStepExecution.java:51)
                at hudson.security.ACL.impersonate(ACL.java:290)
                at org.jenkinsci.plugins.workflow.steps.SynchronousNonBlockingStepExecution$1.run(SynchronousNonBlockingStepExecution.java:48)
                at java.util.concurrent.Executors$RunnableAdapter.call(Executors.java:511)
                at java.util.concurrent.FutureTask.run(FutureTask.java:266)
                at java.util.concurrent.ThreadPoolExecutor.runWorker(ThreadPoolExecutor.java:1149)
                at java.util.concurrent.ThreadPoolExecutor$Worker.run(ThreadPoolExecutor.java:624)
                ... 1 more
[Pipeline] }
[Pipeline] // stage
[Pipeline] }
[Pipeline] // dir
[Pipeline] }
[Pipeline] // node
[Pipeline] stage
[Pipeline] { (Notifications)
[Pipeline] echo
Build result: FAILURE
[Pipeline] jiraIssueSelector
[Pipeline] emailext
Reply | Threaded
Open this post in threaded view
|

Build failed in Jenkins: Maven TLP » maven » master #129

Apache Jenkins Server-2
See https://builds.apache.org/job/maven-box/job/maven/job/master/129/

No changes.

No tests ran.

Build log:
Started by user slachiewicz
Obtained Jenkinsfile from a939654b765f06b1c1ee811a297b02e83b4ac316
Running in Durability level: MAX_SURVIVABILITY
Loading library jenkins-env@master
Attempting to resolve master from remote references...
 > git --version # timeout=10
 > git ls-remote -h https://gitbox.apache.org/repos/asf/maven-jenkins-env.git # timeout=10
Found match: refs/heads/master revision 8f749a419697e74f2d1ef4e9a9637ae6b51a5f60
 > git rev-parse --is-inside-work-tree # timeout=10
Fetching changes from the remote Git repository
 > git config remote.origin.url https://gitbox.apache.org/repos/asf/maven-jenkins-env.git # timeout=10
Fetching without tags
Fetching upstream changes from https://gitbox.apache.org/repos/asf/maven-jenkins-env.git
 > git --version # timeout=10
 > git fetch --no-tags --progress https://gitbox.apache.org/repos/asf/maven-jenkins-env.git +refs/heads/*:refs/remotes/origin/*
Checking out Revision 8f749a419697e74f2d1ef4e9a9637ae6b51a5f60 (master)
 > git config core.sparsecheckout # timeout=10
 > git checkout -f 8f749a419697e74f2d1ef4e9a9637ae6b51a5f60
Commit message: "Removed exclusion for problematic node cause the node is back online."
 > git rev-list --no-walk 8f749a419697e74f2d1ef4e9a9637ae6b51a5f60 # timeout=10
Loading library jenkins-lib@master
Attempting to resolve master from remote references...
 > git --version # timeout=10
 > git ls-remote -h https://gitbox.apache.org/repos/asf/maven-jenkins-lib.git # timeout=10
Found match: refs/heads/master revision c1af97116a4f55d2250bf316b1c4b19d055bf5ba
 > git rev-parse --is-inside-work-tree # timeout=10
Fetching changes from the remote Git repository
 > git config remote.origin.url https://gitbox.apache.org/repos/asf/maven-jenkins-lib.git # timeout=10
Fetching without tags
Fetching upstream changes from https://gitbox.apache.org/repos/asf/maven-jenkins-lib.git
 > git --version # timeout=10
 > git fetch --no-tags --progress https://gitbox.apache.org/repos/asf/maven-jenkins-lib.git +refs/heads/*:refs/remotes/origin/*
Checking out Revision c1af97116a4f55d2250bf316b1c4b19d055bf5ba (master)
 > git config core.sparsecheckout # timeout=10
 > git checkout -f c1af97116a4f55d2250bf316b1c4b19d055bf5ba
Commit message: "fixed markup (asciidoc, not markdown...)"
 > git rev-list --no-walk c1af97116a4f55d2250bf316b1c4b19d055bf5ba # timeout=10
[Pipeline] properties
[Pipeline] node
Running on H28 in /home/jenkins/jenkins-slave/workspace/maven-box_maven_master-DVEN5KAF4FLE3WDK7SWFNYUY4YZ7X45JVWYY6FZT5ZEB3CLWABVQ
[Pipeline] {
[Pipeline] dir
Running in /home/jenkins/jenkins-slave/workspace/maven-box_maven_master-DVEN5KAF4FLE3WDK7SWFNYUY4YZ7X45JVWYY6FZT5ZEB3CLWABVQ/build
[Pipeline] {
[Pipeline] stage
[Pipeline] { (Checkout)
[Pipeline] checkout
Fetching changes from the remote Git repository
Fetching without tags
 > git rev-parse --is-inside-work-tree # timeout=10
 > git config remote.origin.url https://gitbox.apache.org/repos/asf/maven.git # timeout=10
Fetching upstream changes from https://gitbox.apache.org/repos/asf/maven.git
 > git --version # timeout=10
 > git fetch --no-tags --progress https://gitbox.apache.org/repos/asf/maven.git +refs/heads/*:refs/remotes/origin/*
ERROR: Error fetching remote repo 'origin'
hudson.plugins.git.GitException: Failed to fetch from https://gitbox.apache.org/repos/asf/maven.git
        at hudson.plugins.git.GitSCM.fetchFrom(GitSCM.java:888)
        at hudson.plugins.git.GitSCM.retrieveChanges(GitSCM.java:1155)
        at hudson.plugins.git.GitSCM.checkout(GitSCM.java:1186)
        at org.jenkinsci.plugins.workflow.steps.scm.SCMStep.checkout(SCMStep.java:120)
        at org.jenkinsci.plugins.workflow.steps.scm.SCMStep$StepExecutionImpl.run(SCMStep.java:90)
        at org.jenkinsci.plugins.workflow.steps.scm.SCMStep$StepExecutionImpl.run(SCMStep.java:77)
        at org.jenkinsci.plugins.workflow.steps.SynchronousNonBlockingStepExecution$1$1.call(SynchronousNonBlockingStepExecution.java:51)
        at hudson.security.ACL.impersonate(ACL.java:290)
        at org.jenkinsci.plugins.workflow.steps.SynchronousNonBlockingStepExecution$1.run(SynchronousNonBlockingStepExecution.java:48)
        at java.util.concurrent.Executors$RunnableAdapter.call(Executors.java:511)
        at java.util.concurrent.FutureTask.run(FutureTask.java:266)
        at java.util.concurrent.ThreadPoolExecutor.runWorker(ThreadPoolExecutor.java:1149)
        at java.util.concurrent.ThreadPoolExecutor$Worker.run(ThreadPoolExecutor.java:624)
        at java.lang.Thread.run(Thread.java:748)
Caused by: hudson.plugins.git.GitException: Command "git fetch --no-tags --progress https://gitbox.apache.org/repos/asf/maven.git +refs/heads/*:refs/remotes/origin/*" returned status code 1:
stdout:
stderr: error: cannot lock ref 'refs/remotes/origin/MNG-6169/MNG-6550': 'refs/remotes/origin/MNG-6169' exists; cannot create 'refs/remotes/origin/MNG-6169/MNG-6550'
From https://gitbox.apache.org/repos/asf/maven
 ! [new branch]      MNG-6169/MNG-6550 -> origin/MNG-6169/MNG-6550  (unable to update local ref)
error: cannot lock ref 'refs/remotes/origin/MNG-6169/MNG-6551': 'refs/remotes/origin/MNG-6169' exists; cannot create 'refs/remotes/origin/MNG-6169/MNG-6551'
 ! [new branch]      MNG-6169/MNG-6551 -> origin/MNG-6169/MNG-6551  (unable to update local ref)
error: cannot lock ref 'refs/remotes/origin/MNG-6169/MNG-6552': 'refs/remotes/origin/MNG-6169' exists; cannot create 'refs/remotes/origin/MNG-6169/MNG-6552'
 ! [new branch]      MNG-6169/MNG-6552 -> origin/MNG-6169/MNG-6552  (unable to update local ref)
error: cannot lock ref 'refs/remotes/origin/MNG-6169/MNG-6553': 'refs/remotes/origin/MNG-6169' exists; cannot create 'refs/remotes/origin/MNG-6169/MNG-6553'
 ! [new branch]      MNG-6169/MNG-6553 -> origin/MNG-6169/MNG-6553  (unable to update local ref)
error: cannot lock ref 'refs/remotes/origin/MNG-6169/MNG-6554': 'refs/remotes/origin/MNG-6169' exists; cannot create 'refs/remotes/origin/MNG-6169/MNG-6554'
 ! [new branch]      MNG-6169/MNG-6554 -> origin/MNG-6169/MNG-6554  (unable to update local ref)
error: cannot lock ref 'refs/remotes/origin/MNG-6169/MNG-6555': 'refs/remotes/origin/MNG-6169' exists; cannot create 'refs/remotes/origin/MNG-6169/MNG-6555'
 ! [new branch]      MNG-6169/MNG-6555 -> origin/MNG-6169/MNG-6555  (unable to update local ref)
error: some local refs could not be updated; try running
 'git remote prune https://gitbox.apache.org/repos/asf/maven.git' to remove any old, conflicting branches

        at org.jenkinsci.plugins.gitclient.CliGitAPIImpl.launchCommandIn(CliGitAPIImpl.java:2038)
        at org.jenkinsci.plugins.gitclient.CliGitAPIImpl.launchCommandWithCredentials(CliGitAPIImpl.java:1757)
        at org.jenkinsci.plugins.gitclient.CliGitAPIImpl.access$300(CliGitAPIImpl.java:72)
        at org.jenkinsci.plugins.gitclient.CliGitAPIImpl$1.execute(CliGitAPIImpl.java:438)
        at org.jenkinsci.plugins.gitclient.RemoteGitImpl$CommandInvocationHandler$1.call(RemoteGitImpl.java:153)
        at org.jenkinsci.plugins.gitclient.RemoteGitImpl$CommandInvocationHandler$1.call(RemoteGitImpl.java:146)
        at hudson.remoting.UserRequest.perform(UserRequest.java:212)
        at hudson.remoting.UserRequest.perform(UserRequest.java:54)
        at hudson.remoting.Request$2.run(Request.java:369)
        at hudson.remoting.InterceptingExecutorService$1.call(InterceptingExecutorService.java:72)
        at java.util.concurrent.FutureTask.run(FutureTask.java:266)
        at java.util.concurrent.ThreadPoolExecutor.runWorker(ThreadPoolExecutor.java:1142)
        at java.util.concurrent.ThreadPoolExecutor$Worker.run(ThreadPoolExecutor.java:617)
        ... 1 more
        Suppressed: hudson.remoting.Channel$CallSiteStackTrace: Remote call to H28
                at hudson.remoting.Channel.attachCallSiteStackTrace(Channel.java:1741)
                at hudson.remoting.UserRequest$ExceptionResponse.retrieve(UserRequest.java:357)
                at hudson.remoting.Channel.call(Channel.java:955)
                at org.jenkinsci.plugins.gitclient.RemoteGitImpl$CommandInvocationHandler.execute(RemoteGitImpl.java:146)
                at sun.reflect.GeneratedMethodAccessor499.invoke(Unknown Source)
                at sun.reflect.DelegatingMethodAccessorImpl.invoke(DelegatingMethodAccessorImpl.java:43)
                at java.lang.reflect.Method.invoke(Method.java:498)
                at org.jenkinsci.plugins.gitclient.RemoteGitImpl$CommandInvocationHandler.invoke(RemoteGitImpl.java:132)
                at com.sun.proxy.$Proxy115.execute(Unknown Source)
                at hudson.plugins.git.GitSCM.fetchFrom(GitSCM.java:886)
                at hudson.plugins.git.GitSCM.retrieveChanges(GitSCM.java:1155)
                at hudson.plugins.git.GitSCM.checkout(GitSCM.java:1186)
                at org.jenkinsci.plugins.workflow.steps.scm.SCMStep.checkout(SCMStep.java:120)
                at org.jenkinsci.plugins.workflow.steps.scm.SCMStep$StepExecutionImpl.run(SCMStep.java:90)
                at org.jenkinsci.plugins.workflow.steps.scm.SCMStep$StepExecutionImpl.run(SCMStep.java:77)
                at org.jenkinsci.plugins.workflow.steps.SynchronousNonBlockingStepExecution$1$1.call(SynchronousNonBlockingStepExecution.java:51)
                at hudson.security.ACL.impersonate(ACL.java:290)
                at org.jenkinsci.plugins.workflow.steps.SynchronousNonBlockingStepExecution$1.run(SynchronousNonBlockingStepExecution.java:48)
                at java.util.concurrent.Executors$RunnableAdapter.call(Executors.java:511)
                at java.util.concurrent.FutureTask.run(FutureTask.java:266)
                at java.util.concurrent.ThreadPoolExecutor.runWorker(ThreadPoolExecutor.java:1149)
                at java.util.concurrent.ThreadPoolExecutor$Worker.run(ThreadPoolExecutor.java:624)
                ... 1 more
[Pipeline] }
[Pipeline] // stage
[Pipeline] }
[Pipeline] // dir
[Pipeline] }
[Pipeline] // node
[Pipeline] stage
[Pipeline] { (Notifications)
[Pipeline] echo
Build result: FAILURE
[Pipeline] jiraIssueSelector
[Pipeline] emailext
Reply | Threaded
Open this post in threaded view
|

Build failed in Jenkins: Maven TLP » maven » master #130

Apache Jenkins Server-2
See https://builds.apache.org/job/maven-box/job/maven/job/master/130/

No changes.

No tests ran.

Build log:
Started by user slachiewicz
Obtained Jenkinsfile from a939654b765f06b1c1ee811a297b02e83b4ac316
Running in Durability level: MAX_SURVIVABILITY
Loading library jenkins-env@master
Attempting to resolve master from remote references...
 > git --version # timeout=10
 > git ls-remote -h https://gitbox.apache.org/repos/asf/maven-jenkins-env.git # timeout=10
Found match: refs/heads/master revision 8f749a419697e74f2d1ef4e9a9637ae6b51a5f60
 > git rev-parse --is-inside-work-tree # timeout=10
Fetching changes from the remote Git repository
 > git config remote.origin.url https://gitbox.apache.org/repos/asf/maven-jenkins-env.git # timeout=10
Fetching without tags
Fetching upstream changes from https://gitbox.apache.org/repos/asf/maven-jenkins-env.git
 > git --version # timeout=10
 > git fetch --no-tags --progress https://gitbox.apache.org/repos/asf/maven-jenkins-env.git +refs/heads/*:refs/remotes/origin/*
Checking out Revision 8f749a419697e74f2d1ef4e9a9637ae6b51a5f60 (master)
 > git config core.sparsecheckout # timeout=10
 > git checkout -f 8f749a419697e74f2d1ef4e9a9637ae6b51a5f60
Commit message: "Removed exclusion for problematic node cause the node is back online."
 > git rev-list --no-walk 8f749a419697e74f2d1ef4e9a9637ae6b51a5f60 # timeout=10
Loading library jenkins-lib@master
Attempting to resolve master from remote references...
 > git --version # timeout=10
 > git ls-remote -h https://gitbox.apache.org/repos/asf/maven-jenkins-lib.git # timeout=10
Found match: refs/heads/master revision c1af97116a4f55d2250bf316b1c4b19d055bf5ba
 > git rev-parse --is-inside-work-tree # timeout=10
Fetching changes from the remote Git repository
 > git config remote.origin.url https://gitbox.apache.org/repos/asf/maven-jenkins-lib.git # timeout=10
Fetching without tags
Fetching upstream changes from https://gitbox.apache.org/repos/asf/maven-jenkins-lib.git
 > git --version # timeout=10
 > git fetch --no-tags --progress https://gitbox.apache.org/repos/asf/maven-jenkins-lib.git +refs/heads/*:refs/remotes/origin/*
Checking out Revision c1af97116a4f55d2250bf316b1c4b19d055bf5ba (master)
 > git config core.sparsecheckout # timeout=10
 > git checkout -f c1af97116a4f55d2250bf316b1c4b19d055bf5ba
Commit message: "fixed markup (asciidoc, not markdown...)"
 > git rev-list --no-walk c1af97116a4f55d2250bf316b1c4b19d055bf5ba # timeout=10
[Pipeline] properties
[Pipeline] node
Running on H28 in /home/jenkins/jenkins-slave/workspace/maven-box_maven_master-DVEN5KAF4FLE3WDK7SWFNYUY4YZ7X45JVWYY6FZT5ZEB3CLWABVQ
[Pipeline] {
[Pipeline] dir
Running in /home/jenkins/jenkins-slave/workspace/maven-box_maven_master-DVEN5KAF4FLE3WDK7SWFNYUY4YZ7X45JVWYY6FZT5ZEB3CLWABVQ/build
[Pipeline] {
[Pipeline] stage
[Pipeline] { (Checkout)
[Pipeline] checkout
Fetching changes from the remote Git repository
Fetching without tags
 > git rev-parse --is-inside-work-tree # timeout=10
 > git config remote.origin.url https://gitbox.apache.org/repos/asf/maven.git # timeout=10
Fetching upstream changes from https://gitbox.apache.org/repos/asf/maven.git
 > git --version # timeout=10
 > git fetch --no-tags --progress https://gitbox.apache.org/repos/asf/maven.git +refs/heads/*:refs/remotes/origin/*
ERROR: Error fetching remote repo 'origin'
hudson.plugins.git.GitException: Failed to fetch from https://gitbox.apache.org/repos/asf/maven.git
        at hudson.plugins.git.GitSCM.fetchFrom(GitSCM.java:888)
        at hudson.plugins.git.GitSCM.retrieveChanges(GitSCM.java:1155)
        at hudson.plugins.git.GitSCM.checkout(GitSCM.java:1186)
        at org.jenkinsci.plugins.workflow.steps.scm.SCMStep.checkout(SCMStep.java:120)
        at org.jenkinsci.plugins.workflow.steps.scm.SCMStep$StepExecutionImpl.run(SCMStep.java:90)
        at org.jenkinsci.plugins.workflow.steps.scm.SCMStep$StepExecutionImpl.run(SCMStep.java:77)
        at org.jenkinsci.plugins.workflow.steps.SynchronousNonBlockingStepExecution$1$1.call(SynchronousNonBlockingStepExecution.java:51)
        at hudson.security.ACL.impersonate(ACL.java:290)
        at org.jenkinsci.plugins.workflow.steps.SynchronousNonBlockingStepExecution$1.run(SynchronousNonBlockingStepExecution.java:48)
        at java.util.concurrent.Executors$RunnableAdapter.call(Executors.java:511)
        at java.util.concurrent.FutureTask.run(FutureTask.java:266)
        at java.util.concurrent.ThreadPoolExecutor.runWorker(ThreadPoolExecutor.java:1149)
        at java.util.concurrent.ThreadPoolExecutor$Worker.run(ThreadPoolExecutor.java:624)
        at java.lang.Thread.run(Thread.java:748)
Caused by: hudson.plugins.git.GitException: Command "git fetch --no-tags --progress https://gitbox.apache.org/repos/asf/maven.git +refs/heads/*:refs/remotes/origin/*" returned status code 1:
stdout:
stderr: error: cannot lock ref 'refs/remotes/origin/MNG-6169/MNG-6550': 'refs/remotes/origin/MNG-6169' exists; cannot create 'refs/remotes/origin/MNG-6169/MNG-6550'
From https://gitbox.apache.org/repos/asf/maven
 ! [new branch]      MNG-6169/MNG-6550 -> origin/MNG-6169/MNG-6550  (unable to update local ref)
error: cannot lock ref 'refs/remotes/origin/MNG-6169/MNG-6551': 'refs/remotes/origin/MNG-6169' exists; cannot create 'refs/remotes/origin/MNG-6169/MNG-6551'
 ! [new branch]      MNG-6169/MNG-6551 -> origin/MNG-6169/MNG-6551  (unable to update local ref)
error: cannot lock ref 'refs/remotes/origin/MNG-6169/MNG-6552': 'refs/remotes/origin/MNG-6169' exists; cannot create 'refs/remotes/origin/MNG-6169/MNG-6552'
 ! [new branch]      MNG-6169/MNG-6552 -> origin/MNG-6169/MNG-6552  (unable to update local ref)
error: cannot lock ref 'refs/remotes/origin/MNG-6169/MNG-6553': 'refs/remotes/origin/MNG-6169' exists; cannot create 'refs/remotes/origin/MNG-6169/MNG-6553'
 ! [new branch]      MNG-6169/MNG-6553 -> origin/MNG-6169/MNG-6553  (unable to update local ref)
error: cannot lock ref 'refs/remotes/origin/MNG-6169/MNG-6554': 'refs/remotes/origin/MNG-6169' exists; cannot create 'refs/remotes/origin/MNG-6169/MNG-6554'
 ! [new branch]      MNG-6169/MNG-6554 -> origin/MNG-6169/MNG-6554  (unable to update local ref)
error: cannot lock ref 'refs/remotes/origin/MNG-6169/MNG-6555': 'refs/remotes/origin/MNG-6169' exists; cannot create 'refs/remotes/origin/MNG-6169/MNG-6555'
 ! [new branch]      MNG-6169/MNG-6555 -> origin/MNG-6169/MNG-6555  (unable to update local ref)
error: some local refs could not be updated; try running
 'git remote prune https://gitbox.apache.org/repos/asf/maven.git' to remove any old, conflicting branches

        at org.jenkinsci.plugins.gitclient.CliGitAPIImpl.launchCommandIn(CliGitAPIImpl.java:2038)
        at org.jenkinsci.plugins.gitclient.CliGitAPIImpl.launchCommandWithCredentials(CliGitAPIImpl.java:1757)
        at org.jenkinsci.plugins.gitclient.CliGitAPIImpl.access$300(CliGitAPIImpl.java:72)
        at org.jenkinsci.plugins.gitclient.CliGitAPIImpl$1.execute(CliGitAPIImpl.java:438)
        at org.jenkinsci.plugins.gitclient.RemoteGitImpl$CommandInvocationHandler$1.call(RemoteGitImpl.java:153)
        at org.jenkinsci.plugins.gitclient.RemoteGitImpl$CommandInvocationHandler$1.call(RemoteGitImpl.java:146)
        at hudson.remoting.UserRequest.perform(UserRequest.java:212)
        at hudson.remoting.UserRequest.perform(UserRequest.java:54)
        at hudson.remoting.Request$2.run(Request.java:369)
        at hudson.remoting.InterceptingExecutorService$1.call(InterceptingExecutorService.java:72)
        at java.util.concurrent.FutureTask.run(FutureTask.java:266)
        at java.util.concurrent.ThreadPoolExecutor.runWorker(ThreadPoolExecutor.java:1142)
        at java.util.concurrent.ThreadPoolExecutor$Worker.run(ThreadPoolExecutor.java:617)
        ... 1 more
        Suppressed: hudson.remoting.Channel$CallSiteStackTrace: Remote call to H28
                at hudson.remoting.Channel.attachCallSiteStackTrace(Channel.java:1741)
                at hudson.remoting.UserRequest$ExceptionResponse.retrieve(UserRequest.java:357)
                at hudson.remoting.Channel.call(Channel.java:955)
                at org.jenkinsci.plugins.gitclient.RemoteGitImpl$CommandInvocationHandler.execute(RemoteGitImpl.java:146)
                at sun.reflect.GeneratedMethodAccessor499.invoke(Unknown Source)
                at sun.reflect.DelegatingMethodAccessorImpl.invoke(DelegatingMethodAccessorImpl.java:43)
                at java.lang.reflect.Method.invoke(Method.java:498)
                at org.jenkinsci.plugins.gitclient.RemoteGitImpl$CommandInvocationHandler.invoke(RemoteGitImpl.java:132)
                at com.sun.proxy.$Proxy115.execute(Unknown Source)
                at hudson.plugins.git.GitSCM.fetchFrom(GitSCM.java:886)
                at hudson.plugins.git.GitSCM.retrieveChanges(GitSCM.java:1155)
                at hudson.plugins.git.GitSCM.checkout(GitSCM.java:1186)
                at org.jenkinsci.plugins.workflow.steps.scm.SCMStep.checkout(SCMStep.java:120)
                at org.jenkinsci.plugins.workflow.steps.scm.SCMStep$StepExecutionImpl.run(SCMStep.java:90)
                at org.jenkinsci.plugins.workflow.steps.scm.SCMStep$StepExecutionImpl.run(SCMStep.java:77)
                at org.jenkinsci.plugins.workflow.steps.SynchronousNonBlockingStepExecution$1$1.call(SynchronousNonBlockingStepExecution.java:51)
                at hudson.security.ACL.impersonate(ACL.java:290)
                at org.jenkinsci.plugins.workflow.steps.SynchronousNonBlockingStepExecution$1.run(SynchronousNonBlockingStepExecution.java:48)
                at java.util.concurrent.Executors$RunnableAdapter.call(Executors.java:511)
                at java.util.concurrent.FutureTask.run(FutureTask.java:266)
                at java.util.concurrent.ThreadPoolExecutor.runWorker(ThreadPoolExecutor.java:1149)
                at java.util.concurrent.ThreadPoolExecutor$Worker.run(ThreadPoolExecutor.java:624)
                ... 1 more
[Pipeline] }
[Pipeline] // stage
[Pipeline] }
[Pipeline] // dir
[Pipeline] }
[Pipeline] // node
[Pipeline] stage
[Pipeline] { (Notifications)
[Pipeline] echo
Build result: FAILURE
[Pipeline] jiraIssueSelector
[Pipeline] emailext
Reply | Threaded
Open this post in threaded view
|

Build failed in Jenkins: Maven TLP » maven » master #131

Apache Jenkins Server-2
See https://builds.apache.org/job/maven-box/job/maven/job/master/131/

No changes.

No tests ran.

Build log:
[...truncated 107 lines...]
remote: Compressing objects:  34% (43/126)          
remote: Compressing objects:  35% (45/126)          
remote: Compressing objects:  36% (46/126)          
remote: Compressing objects:  37% (47/126)          
remote: Compressing objects:  38% (48/126)          
remote: Compressing objects:  39% (50/126)          
remote: Compressing objects:  40% (51/126)          
remote: Compressing objects:  41% (52/126)          
remote: Compressing objects:  42% (53/126)          
remote: Compressing objects:  43% (55/126)          
remote: Compressing objects:  44% (56/126)          
remote: Compressing objects:  45% (57/126)          
remote: Compressing objects:  46% (58/126)          
remote: Compressing objects:  47% (60/126)          
remote: Compressing objects:  48% (61/126)          
remote: Compressing objects:  49% (62/126)          
remote: Compressing objects:  50% (63/126)          
remote: Compressing objects:  51% (65/126)          
remote: Compressing objects:  52% (66/126)          
remote: Compressing objects:  53% (67/126)          
remote: Compressing objects:  54% (69/126)          
remote: Compressing objects:  55% (70/126)          
remote: Compressing objects:  56% (71/126)          
remote: Compressing objects:  57% (72/126)          
remote: Compressing objects:  58% (74/126)          
remote: Compressing objects:  59% (75/126)          
remote: Compressing objects:  60% (76/126)          
remote: Compressing objects:  61% (77/126)          
remote: Compressing objects:  62% (79/126)          
remote: Compressing objects:  63% (80/126)          
remote: Compressing objects:  64% (81/126)          
remote: Compressing objects:  65% (82/126)          
remote: Compressing objects:  66% (84/126)          
remote: Compressing objects:  67% (85/126)          
remote: Compressing objects:  68% (86/126)          
remote: Compressing objects:  69% (87/126)          
remote: Compressing objects:  70% (89/126)          
remote: Compressing objects:  71% (90/126)          
remote: Compressing objects:  72% (91/126)          
remote: Compressing objects:  73% (92/126)          
remote: Compressing objects:  74% (94/126)          
remote: Compressing objects:  75% (95/126)          
remote: Compressing objects:  76% (96/126)          
remote: Compressing objects:  77% (98/126)          
remote: Compressing objects:  78% (99/126)          
remote: Compressing objects:  79% (100/126)          
remote: Compressing objects:  80% (101/126)          
remote: Compressing objects:  81% (103/126)          
remote: Compressing objects:  82% (104/126)          
remote: Compressing objects:  83% (105/126)          
remote: Compressing objects:  84% (106/126)          
remote: Compressing objects:  85% (108/126)          
remote: Compressing objects:  86% (109/126)          
remote: Compressing objects:  87% (110/126)          
remote: Compressing objects:  88% (111/126)          
remote: Compressing objects:  89% (113/126)          
remote: Compressing objects:  90% (114/126)          
remote: Compressing objects:  91% (115/126)          
remote: Compressing objects:  92% (116/126)          
remote: Compressing objects:  93% (118/126)          
remote: Compressing objects:  94% (119/126)          
remote: Compressing objects:  95% (120/126)          
remote: Compressing objects:  96% (121/126)          
remote: Compressing objects:  97% (123/126)          
remote: Compressing objects:  98% (124/126)          
remote: Compressing objects:  99% (125/126)          
remote: Compressing objects: 100% (126/126)          
remote: Compressing objects: 100% (126/126), done.        
remote: Total 126 (delta 73), reused 0 (delta 0)        
Receiving objects:   0% (1/126)  
Receiving objects:   1% (2/126)  
Receiving objects:   2% (3/126)  
Receiving objects:   3% (4/126)  
Receiving objects:   4% (6/126)  
Receiving objects:   5% (7/126)  
Receiving objects:   6% (8/126)  
Receiving objects:   7% (9/126)  
Receiving objects:   8% (11/126)  
Receiving objects:   9% (12/126)  
Receiving objects:  10% (13/126)  
Receiving objects:  11% (14/126)  
Receiving objects:  12% (16/126)  
Receiving objects:  13% (17/126)  
Receiving objects:  14% (18/126)  
Receiving objects:  15% (19/126)  
Receiving objects:  16% (21/126)  
Receiving objects:  17% (22/126)  
Receiving objects:  18% (23/126)  
Receiving objects:  19% (24/126)  
Receiving objects:  20% (26/126)  
Receiving objects:  21% (27/126)  
Receiving objects:  22% (28/126)  
Receiving objects:  23% (29/126)  
Receiving objects:  24% (31/126)  
Receiving objects:  25% (32/126)  
Receiving objects:  26% (33/126)  
Receiving objects:  27% (35/126)  
Receiving objects:  28% (36/126)  
Receiving objects:  29% (37/126)  
Receiving objects:  30% (38/126)  
Receiving objects:  31% (40/126)  
Receiving objects:  32% (41/126)  
Receiving objects:  33% (42/126)  
Receiving objects:  34% (43/126)  
Receiving objects:  35% (45/126)  
Receiving objects:  36% (46/126)  
Receiving objects:  37% (47/126)  
Receiving objects:  38% (48/126)  
Receiving objects:  39% (50/126)  
Receiving objects:  40% (51/126)  
Receiving objects:  41% (52/126)  
Receiving objects:  42% (53/126)  
Receiving objects:  43% (55/126)  
Receiving objects:  44% (56/126)  
Receiving objects:  45% (57/126)  
Receiving objects:  46% (58/126)  
Receiving objects:  47% (60/126)  
Receiving objects:  48% (61/126)  
Receiving objects:  49% (62/126)  
Receiving objects:  50% (63/126)  
Receiving objects:  51% (65/126)  
Receiving objects:  52% (66/126)  
Receiving objects:  53% (67/126)  
Receiving objects:  54% (69/126)  
Receiving objects:  55% (70/126)  
Receiving objects:  56% (71/126)  
Receiving objects:  57% (72/126)  
Receiving objects:  58% (74/126)  
Receiving objects:  59% (75/126)  
Receiving objects:  60% (76/126)  
Receiving objects:  61% (77/126)  
Receiving objects:  62% (79/126)  
Receiving objects:  63% (80/126)  
Receiving objects:  64% (81/126)  
Receiving objects:  65% (82/126)  
Receiving objects:  66% (84/126)  
Receiving objects:  67% (85/126)  
Receiving objects:  68% (86/126)  
Receiving objects:  69% (87/126)  
Receiving objects:  70% (89/126)  
Receiving objects:  71% (90/126)  
Receiving objects:  72% (91/126)  
Receiving objects:  73% (92/126)  
Receiving objects:  74% (94/126)  
Receiving objects:  75% (95/126)  
Receiving objects:  76% (96/126)  
Receiving objects:  77% (98/126)  
Receiving objects:  78% (99/126)  
Receiving objects:  79% (100/126)  
Receiving objects:  80% (101/126)  
Receiving objects:  81% (103/126)  
Receiving objects:  82% (104/126)  
Receiving objects:  83% (105/126)  
Receiving objects:  84% (106/126)  
Receiving objects:  85% (108/126)  
Receiving objects:  86% (109/126)  
Receiving objects:  87% (110/126)  
Receiving objects:  88% (111/126)  
Receiving objects:  89% (113/126)  
Receiving objects:  90% (114/126)  
Receiving objects:  91% (115/126)  
Receiving objects:  92% (116/126)  
Receiving objects:  93% (118/126)  
Receiving objects:  94% (119/126)  
Receiving objects:  95% (120/126)  
Receiving objects:  96% (121/126)  
Receiving objects:  97% (123/126)  
Receiving objects:  98% (124/126)  
Receiving objects:  99% (125/126)  
Receiving objects: 100% (126/126)  
Receiving objects: 100% (126/126), 9.51 KiB | 0 bytes/s, done.
Resolving deltas:   0% (0/73)  
Resolving deltas:   5% (4/73)  
Resolving deltas:  13% (10/73)  
Resolving deltas:  16% (12/73)  
Resolving deltas:  17% (13/73)  
Resolving deltas:  20% (15/73)  
Resolving deltas:  23% (17/73)  
Resolving deltas:  42% (31/73)  
Resolving deltas:  61% (45/73)  
Resolving deltas:  80% (59/73)  
Resolving deltas: 100% (73/73)  
Resolving deltas: 100% (73/73), completed with 4 local objects.
error: cannot lock ref 'refs/remotes/origin/MNG-6169/MNG-6550': 'refs/remotes/origin/MNG-6169' exists; cannot create 'refs/remotes/origin/MNG-6169/MNG-6550'
From https://gitbox.apache.org/repos/asf/maven
 ! [new branch]      MNG-6169/MNG-6550 -> origin/MNG-6169/MNG-6550  (unable to update local ref)
error: cannot lock ref 'refs/remotes/origin/MNG-6169/MNG-6551': 'refs/remotes/origin/MNG-6169' exists; cannot create 'refs/remotes/origin/MNG-6169/MNG-6551'
 ! [new branch]      MNG-6169/MNG-6551 -> origin/MNG-6169/MNG-6551  (unable to update local ref)
error: cannot lock ref 'refs/remotes/origin/MNG-6169/MNG-6552': 'refs/remotes/origin/MNG-6169' exists; cannot create 'refs/remotes/origin/MNG-6169/MNG-6552'
 ! [new branch]      MNG-6169/MNG-6552 -> origin/MNG-6169/MNG-6552  (unable to update local ref)
error: cannot lock ref 'refs/remotes/origin/MNG-6169/MNG-6553': 'refs/remotes/origin/MNG-6169' exists; cannot create 'refs/remotes/origin/MNG-6169/MNG-6553'
 ! [new branch]      MNG-6169/MNG-6553 -> origin/MNG-6169/MNG-6553  (unable to update local ref)
error: cannot lock ref 'refs/remotes/origin/MNG-6169/MNG-6554': 'refs/remotes/origin/MNG-6169' exists; cannot create 'refs/remotes/origin/MNG-6169/MNG-6554'
 ! [new branch]      MNG-6169/MNG-6554 -> origin/MNG-6169/MNG-6554  (unable to update local ref)
error: cannot lock ref 'refs/remotes/origin/MNG-6169/MNG-6555': 'refs/remotes/origin/MNG-6169' exists; cannot create 'refs/remotes/origin/MNG-6169/MNG-6555'
 ! [new branch]      MNG-6169/MNG-6555 -> origin/MNG-6169/MNG-6555  (unable to update local ref)
error: some local refs could not be updated; try running
 'git remote prune https://gitbox.apache.org/repos/asf/maven.git' to remove any old, conflicting branches

        at org.jenkinsci.plugins.gitclient.CliGitAPIImpl.launchCommandIn(CliGitAPIImpl.java:2038)
        at org.jenkinsci.plugins.gitclient.CliGitAPIImpl.launchCommandWithCredentials(CliGitAPIImpl.java:1757)
        at org.jenkinsci.plugins.gitclient.CliGitAPIImpl.access$300(CliGitAPIImpl.java:72)
        at org.jenkinsci.plugins.gitclient.CliGitAPIImpl$1.execute(CliGitAPIImpl.java:438)
        at org.jenkinsci.plugins.gitclient.RemoteGitImpl$CommandInvocationHandler$1.call(RemoteGitImpl.java:153)
        at org.jenkinsci.plugins.gitclient.RemoteGitImpl$CommandInvocationHandler$1.call(RemoteGitImpl.java:146)
        at hudson.remoting.UserRequest.perform(UserRequest.java:212)
        at hudson.remoting.UserRequest.perform(UserRequest.java:54)
        at hudson.remoting.Request$2.run(Request.java:369)
        at hudson.remoting.InterceptingExecutorService$1.call(InterceptingExecutorService.java:72)
        at java.util.concurrent.FutureTask.run(FutureTask.java:266)
        at java.util.concurrent.ThreadPoolExecutor.runWorker(ThreadPoolExecutor.java:1142)
        at java.util.concurrent.ThreadPoolExecutor$Worker.run(ThreadPoolExecutor.java:617)
        ... 1 more
        Suppressed: hudson.remoting.Channel$CallSiteStackTrace: Remote call to H28
                at hudson.remoting.Channel.attachCallSiteStackTrace(Channel.java:1741)
                at hudson.remoting.UserRequest$ExceptionResponse.retrieve(UserRequest.java:357)
                at hudson.remoting.Channel.call(Channel.java:955)
                at org.jenkinsci.plugins.gitclient.RemoteGitImpl$CommandInvocationHandler.execute(RemoteGitImpl.java:146)
                at sun.reflect.GeneratedMethodAccessor499.invoke(Unknown Source)
                at sun.reflect.DelegatingMethodAccessorImpl.invoke(DelegatingMethodAccessorImpl.java:43)
                at java.lang.reflect.Method.invoke(Method.java:498)
                at org.jenkinsci.plugins.gitclient.RemoteGitImpl$CommandInvocationHandler.invoke(RemoteGitImpl.java:132)
                at com.sun.proxy.$Proxy115.execute(Unknown Source)
                at hudson.plugins.git.GitSCM.fetchFrom(GitSCM.java:886)
                at hudson.plugins.git.GitSCM.retrieveChanges(GitSCM.java:1155)
                at hudson.plugins.git.GitSCM.checkout(GitSCM.java:1186)
                at org.jenkinsci.plugins.workflow.steps.scm.SCMStep.checkout(SCMStep.java:120)
                at org.jenkinsci.plugins.workflow.steps.scm.SCMStep$StepExecutionImpl.run(SCMStep.java:90)
                at org.jenkinsci.plugins.workflow.steps.scm.SCMStep$StepExecutionImpl.run(SCMStep.java:77)
                at org.jenkinsci.plugins.workflow.steps.SynchronousNonBlockingStepExecution$1$1.call(SynchronousNonBlockingStepExecution.java:51)
                at hudson.security.ACL.impersonate(ACL.java:290)
                at org.jenkinsci.plugins.workflow.steps.SynchronousNonBlockingStepExecution$1.run(SynchronousNonBlockingStepExecution.java:48)
                at java.util.concurrent.Executors$RunnableAdapter.call(Executors.java:511)
                at java.util.concurrent.FutureTask.run(FutureTask.java:266)
                at java.util.concurrent.ThreadPoolExecutor.runWorker(ThreadPoolExecutor.java:1149)
                at java.util.concurrent.ThreadPoolExecutor$Worker.run(ThreadPoolExecutor.java:624)
                ... 1 more
[Pipeline] }
[Pipeline] // stage
[Pipeline] }
[Pipeline] // dir
[Pipeline] }
[Pipeline] // node
[Pipeline] stage
[Pipeline] { (Notifications)
[Pipeline] echo
Build result: FAILURE
[Pipeline] jiraIssueSelector
[Pipeline] emailext
Reply | Threaded
Open this post in threaded view
|

Build unstable in Jenkins: Maven TLP » maven » master #132

Apache Jenkins Server-2
See https://builds.apache.org/job/maven-box/job/maven/job/master/132/

Changes:

* [MNG-6256] Surround parameter of echo command with double quotes
* [MNG-6265] Add integration test
* Fix Maven version range for MNG-5965
* Add missing depenencies for MNG-3372 + MNG-6555
* [MNG-6265] Add integration test
* Fix Maven version range for MNG-5965
* Add missing depenencies for MNG-3372 + MNG-6555

1 tests failed.
FAILED:  org.apache.maven.it.MavenITmng4554PluginPrefixMappingUpdateTest.windows-jdk8 / Run ITs Windows Java 8 / testitForcedUpdate

Error Message:
Exit code was non-zero: 1; command line and log =
C:\mvn-it-1.tmp\core-it-suite\target\apache-maven\bin\mvn --global-settings C:\mvn-it-1.tmp\core-it-suite\target\test-classes\settings.xml -U -s settings.xml -e --batch-mode -Dmaven.repo.local=c:\mvn-it-1.tmp\it-local-repo a:touch
[INFO] [jenkins-event-spy] Jenkins Maven Event Spy is disabled
[INFO] Error stacktraces are turned on.
[INFO] Scanning for projects...
[INFO] Downloading from central: http://localhost:-1/repo-1/org/apache/maven/plugins/maven-metadata.xml
[INFO] Downloading from central: http://localhost:-1/repo-1/org/apache/maven/its/mng4554/maven-metadata.xml
[INFO] Downloading from central: http://localhost:-1/repo-1/org/codehaus/mojo/maven-metadata.xml
[WARNING] Could not transfer metadata org.apache.maven.its.mng4554/maven-metadata.xml from/to central (http://localhost:-1/repo-1): Connect to localhost:80 [localhost/127.0.0.1, localhost/0:0:0:0:0:0:0:1] failed: Connection refused: connect
[WARNING] Could not transfer metadata org.apache.maven.plugins/maven-metadata.xml from/to central (http://localhost:-1/repo-1): Connect to localhost:80 [localhost/127.0.0.1, localhost/0:0:0:0:0:0:0:1] failed: Connection refused: connect
[WARNING] Could not transfer metadata org.codehaus.mojo/maven-metadata.xml from/to central (http://localhost:-1/repo-1): Connect to localhost:80 [localhost/127.0.0.1, localhost/0:0:0:0:0:0:0:1] failed: Connection refused: connect
[WARNING] Failure to transfer org.apache.maven.its.mng4554/maven-metadata.xml from http://localhost:-1/repo-1 was cached in the local repository, resolution will not be reattempted until the update interval of central has elapsed or updates are forced. Original error: Could not transfer metadata org.apache.maven.its.mng4554/maven-metadata.xml from/to central (http://localhost:-1/repo-1): Connect to localhost:80 [localhost/127.0.0.1, localhost/0:0:0:0:0:0:0:1] failed: Connection refused: connect
[WARNING] Failure to transfer org.apache.maven.plugins/maven-metadata.xml from http://localhost:-1/repo-1 was cached in the local repository, resolution will not be reattempted until the update interval of central has elapsed or updates are forced. Original error: Could not transfer metadata org.apache.maven.plugins/maven-metadata.xml from/to central (http://localhost:-1/repo-1): Connect to localhost:80 [localhost/127.0.0.1, localhost/0:0:0:0:0:0:0:1] failed: Connection refused: connect
[WARNING] Failure to transfer org.codehaus.mojo/maven-metadata.xml from http://localhost:-1/repo-1 was cached in the local repository, resolution will not be reattempted until the update interval of central has elapsed or updates are forced. Original error: Could not transfer metadata org.codehaus.mojo/maven-metadata.xml from/to central (http://localhost:-1/repo-1): Connect to localhost:80 [localhost/127.0.0.1, localhost/0:0:0:0:0:0:0:1] failed: Connection refused: connect
[INFO] ------------------------------------------------------------------------
[INFO] BUILD FAILURE
[INFO] ------------------------------------------------------------------------
[INFO] Total time:  2.148 s
[INFO] Finished at: 2019-01-10T14:33:21Z
[INFO] ------------------------------------------------------------------------
[ERROR] No plugin found for prefix 'a' in the current project and in the plugin groups [org.apache.maven.its.mng4554, org.apache.maven.plugins, org.codehaus.mojo] available from the repositories [local (c:\mvn-it-1.tmp\it-local-repo), central (http://localhost:-1/repo-1)] -> [Help 1]
org.apache.maven.plugin.prefix.NoPluginFoundForPrefixException: No plugin found for prefix 'a' in the current project and in the plugin groups [org.apache.maven.its.mng4554, org.apache.maven.plugins, org.codehaus.mojo] available from the repositories [local (c:\mvn-it-1.tmp\it-local-repo), central (http://localhost:-1/repo-1)]
    at org.apache.maven.plugin.prefix.internal.DefaultPluginPrefixResolver.resolve (DefaultPluginPrefixResolver.java:95)
    at org.apache.maven.lifecycle.internal.MojoDescriptorCreator.findPluginForPrefix (MojoDescriptorCreator.java:266)
    at org.apache.maven.lifecycle.internal.MojoDescriptorCreator.getMojoDescriptor (MojoDescriptorCreator.java:220)
    at org.apache.maven.lifecycle.internal.DefaultLifecycleTaskSegmentCalculator.calculateTaskSegments (DefaultLifecycleTaskSegmentCalculator.java:104)
    at org.apache.maven.lifecycle.internal.DefaultLifecycleTaskSegmentCalculator.calculateTaskSegments (DefaultLifecycleTaskSegmentCalculator.java:83)
    at org.apache.maven.lifecycle.internal.LifecycleStarter.execute (LifecycleStarter.java:89)
    at org.apache.maven.DefaultMaven.doExecute (DefaultMaven.java:305)
    at org.apache.maven.DefaultMaven.doExecute (DefaultMaven.java:192)
    at org.apache.maven.DefaultMaven.execute (DefaultMaven.java:105)
    at org.apache.maven.cli.MavenCli.execute (MavenCli.java:956)
    at org.apache.maven.cli.MavenCli.doMain (MavenCli.java:288)
    at org.apache.maven.cli.MavenCli.doMain (MavenCli.java:243)
    at sun.reflect.GeneratedMethodAccessor34.invoke (Unknown Source)
    at sun.reflect.DelegatingMethodAccessorImpl.invoke (DelegatingMethodAccessorImpl.java:43)
    at java.lang.reflect.Method.invoke (Method.java:498)
    at org.apache.maven.it.Embedded3xLauncher.run (Embedded3xLauncher.java:247)
    at org.apache.maven.it.Verifier.executeGoals (Verifier.java:1354)
    at org.apache.maven.it.Verifier.executeGoal (Verifier.java:1254)
    at org.apache.maven.it.Verifier.executeGoal (Verifier.java:1248)
    at org.apache.maven.it.MavenITmng4554PluginPrefixMappingUpdateTest.testitForcedUpdate (MavenITmng4554PluginPrefixMappingUpdateTest.java:189)
    at sun.reflect.NativeMethodAccessorImpl.invoke0 (Native Method)
    at sun.reflect.NativeMethodAccessorImpl.invoke (NativeMethodAccessorImpl.java:62)
    at sun.reflect.DelegatingMethodAccessorImpl.invoke (DelegatingMethodAccessorImpl.java:43)
    at java.lang.reflect.Method.invoke (Method.java:498)
    at junit.framework.TestCase.runTest (TestCase.java:176)
    at org.apache.maven.it.AbstractMavenIntegrationTestCase.runTest (AbstractMavenIntegrationTestCase.java:222)
    at junit.framework.TestCase.runBare (TestCase.java:141)
    at junit.framework.TestResult$1.protect (TestResult.java:122)
    at junit.framework.TestResult.runProtected (TestResult.java:142)
    at junit.framework.TestResult.run (TestResult.java:125)
    at junit.framework.TestCase.run (TestCase.java:129)
    at junit.framework.TestSuite.runTest (TestSuite.java:252)
    at junit.framework.TestSuite.run (TestSuite.java:247)
    at junit.framework.TestSuite.runTest (TestSuite.java:252)
    at junit.framework.TestSuite.run (TestSuite.java:247)
    at org.junit.internal.runners.JUnit38ClassRunner.run (JUnit38ClassRunner.java:86)
    at org.apache.maven.surefire.junit4.JUnit4Provider.execute (JUnit4Provider.java:365)
    at org.apache.maven.surefire.junit4.JUnit4Provider.executeWithRerun (JUnit4Provider.java:273)
    at org.apache.maven.surefire.junit4.JUnit4Provider.executeTestSet (JUnit4Provider.java:238)
    at org.apache.maven.surefire.junit4.JUnit4Provider.invoke (JUnit4Provider.java:159)
    at org.apache.maven.surefire.booter.ForkedBooter.invokeProviderInSameClassLoader (ForkedBooter.java:383)
    at org.apache.maven.surefire.booter.ForkedBooter.runSuitesInProcess (ForkedBooter.java:344)
    at org.apache.maven.surefire.booter.ForkedBooter.execute (ForkedBooter.java:125)
    at org.apache.maven.surefire.booter.ForkedBooter.main (ForkedBooter.java:417)
[ERROR]
[ERROR] Re-run Maven using the -X switch to enable full debug logging.
[ERROR]
[ERROR] For more information about the errors and possible solutions, please read the following articles:
[ERROR] [Help 1] http://cwiki.apache.org/confluence/display/MAVEN/NoPluginFoundForPrefixException


Stack Trace:
org.apache.maven.it.VerificationException:
Exit code was non-zero: 1; command line and log =
C:\mvn-it-1.tmp\core-it-suite\target\apache-maven\bin\mvn --global-settings C:\mvn-it-1.tmp\core-it-suite\target\test-classes\settings.xml -U -s settings.xml -e --batch-mode -Dmaven.repo.local=c:\mvn-it-1.tmp\it-local-repo a:touch
[INFO] [jenkins-event-spy] Jenkins Maven Event Spy is disabled
[INFO] Error stacktraces are turned on.
[INFO] Scanning for projects...
[INFO] Downloading from central: http://localhost:-1/repo-1/org/apache/maven/plugins/maven-metadata.xml
[INFO] Downloading from central: http://localhost:-1/repo-1/org/apache/maven/its/mng4554/maven-metadata.xml
[INFO] Downloading from central: http://localhost:-1/repo-1/org/codehaus/mojo/maven-metadata.xml
[WARNING] Could not transfer metadata org.apache.maven.its.mng4554/maven-metadata.xml from/to central (http://localhost:-1/repo-1): Connect to localhost:80 [localhost/127.0.0.1, localhost/0:0:0:0:0:0:0:1] failed: Connection refused: connect
[WARNING] Could not transfer metadata org.apache.maven.plugins/maven-metadata.xml from/to central (http://localhost:-1/repo-1): Connect to localhost:80 [localhost/127.0.0.1, localhost/0:0:0:0:0:0:0:1] failed: Connection refused: connect
[WARNING] Could not transfer metadata org.codehaus.mojo/maven-metadata.xml from/to central (http://localhost:-1/repo-1): Connect to localhost:80 [localhost/127.0.0.1, localhost/0:0:0:0:0:0:0:1] failed: Connection refused: connect
[WARNING] Failure to transfer org.apache.maven.its.mng4554/maven-metadata.xml from http://localhost:-1/repo-1 was cached in the local repository, resolution will not be reattempted until the update interval of central has elapsed or updates are forced. Original error: Could not transfer metadata org.apache.maven.its.mng4554/maven-metadata.xml from/to central (http://localhost:-1/repo-1): Connect to localhost:80 [localhost/127.0.0.1, localhost/0:0:0:0:0:0:0:1] failed: Connection refused: connect
[WARNING] Failure to transfer org.apache.maven.plugins/maven-metadata.xml from http://localhost:-1/repo-1 was cached in the local repository, resolution will not be reattempted until the update interval of central has elapsed or updates are forced. Original error: Could not transfer metadata org.apache.maven.plugins/maven-metadata.xml from/to central (http://localhost:-1/repo-1): Connect to localhost:80 [localhost/127.0.0.1, localhost/0:0:0:0:0:0:0:1] failed: Connection refused: connect
[WARNING] Failure to transfer org.codehaus.mojo/maven-metadata.xml from http://localhost:-1/repo-1 was cached in the local repository, resolution will not be reattempted until the update interval of central has elapsed or updates are forced. Original error: Could not transfer metadata org.codehaus.mojo/maven-metadata.xml from/to central (http://localhost:-1/repo-1): Connect to localhost:80 [localhost/127.0.0.1, localhost/0:0:0:0:0:0:0:1] failed: Connection refused: connect
[INFO] ------------------------------------------------------------------------
[INFO] BUILD FAILURE
[INFO] ------------------------------------------------------------------------
[INFO] Total time:  2.148 s
[INFO] Finished at: 2019-01-10T14:33:21Z
[INFO] ------------------------------------------------------------------------
[ERROR] No plugin found for prefix 'a' in the current project and in the plugin groups [org.apache.maven.its.mng4554, org.apache.maven.plugins, org.codehaus.mojo] available from the repositories [local (c:\mvn-it-1.tmp\it-local-repo), central (http://localhost:-1/repo-1)] -> [Help 1]
org.apache.maven.plugin.prefix.NoPluginFoundForPrefixException: No plugin found for prefix 'a' in the current project and in the plugin groups [org.apache.maven.its.mng4554, org.apache.maven.plugins, org.codehaus.mojo] available from the repositories [local (c:\mvn-it-1.tmp\it-local-repo), central (http://localhost:-1/repo-1)]
    at org.apache.maven.plugin.prefix.internal.DefaultPluginPrefixResolver.resolve (DefaultPluginPrefixResolver.java:95)
    at org.apache.maven.lifecycle.internal.MojoDescriptorCreator.findPluginForPrefix (MojoDescriptorCreator.java:266)
    at org.apache.maven.lifecycle.internal.MojoDescriptorCreator.getMojoDescriptor (MojoDescriptorCreator.java:220)
    at org.apache.maven.lifecycle.internal.DefaultLifecycleTaskSegmentCalculator.calculateTaskSegments (DefaultLifecycleTaskSegmentCalculator.java:104)
    at org.apache.maven.lifecycle.internal.DefaultLifecycleTaskSegmentCalculator.calculateTaskSegments (DefaultLifecycleTaskSegmentCalculator.java:83)
    at org.apache.maven.lifecycle.internal.LifecycleStarter.execute (LifecycleStarter.java:89)
    at org.apache.maven.DefaultMaven.doExecute (DefaultMaven.java:305)
    at org.apache.maven.DefaultMaven.doExecute (DefaultMaven.java:192)
    at org.apache.maven.DefaultMaven.execute (DefaultMaven.java:105)
    at org.apache.maven.cli.MavenCli.execute (MavenCli.java:956)
    at org.apache.maven.cli.MavenCli.doMain (MavenCli.java:288)
    at org.apache.maven.cli.MavenCli.doMain (MavenCli.java:243)
    at sun.reflect.GeneratedMethodAccessor34.invoke (Unknown Source)
    at sun.reflect.DelegatingMethodAccessorImpl.invoke (DelegatingMethodAccessorImpl.java:43)
    at java.lang.reflect.Method.invoke (Method.java:498)
    at org.apache.maven.it.Embedded3xLauncher.run (Embedded3xLauncher.java:247)
    at org.apache.maven.it.Verifier.executeGoals (Verifier.java:1354)
    at org.apache.maven.it.Verifier.executeGoal (Verifier.java:1254)
    at org.apache.maven.it.Verifier.executeGoal (Verifier.java:1248)
    at org.apache.maven.it.MavenITmng4554PluginPrefixMappingUpdateTest.testitForcedUpdate (MavenITmng4554PluginPrefixMappingUpdateTest.java:189)
    at sun.reflect.NativeMethodAccessorImpl.invoke0 (Native Method)
    at sun.reflect.NativeMethodAccessorImpl.invoke (NativeMethodAccessorImpl.java:62)
    at sun.reflect.DelegatingMethodAccessorImpl.invoke (DelegatingMethodAccessorImpl.java:43)
    at java.lang.reflect.Method.invoke (Method.java:498)
    at junit.framework.TestCase.runTest (TestCase.java:176)
    at org.apache.maven.it.AbstractMavenIntegrationTestCase.runTest (AbstractMavenIntegrationTestCase.java:222)
    at junit.framework.TestCase.runBare (TestCase.java:141)
    at junit.framework.TestResult$1.protect (TestResult.java:122)
    at junit.framework.TestResult.runProtected (TestResult.java:142)
    at junit.framework.TestResult.run (TestResult.java:125)
    at junit.framework.TestCase.run (TestCase.java:129)
    at junit.framework.TestSuite.runTest (TestSuite.java:252)
    at junit.framework.TestSuite.run (TestSuite.java:247)
    at junit.framework.TestSuite.runTest (TestSuite.java:252)
    at junit.framework.TestSuite.run (TestSuite.java:247)
    at org.junit.internal.runners.JUnit38ClassRunner.run (JUnit38ClassRunner.java:86)
    at org.apache.maven.surefire.junit4.JUnit4Provider.execute (JUnit4Provider.java:365)
    at org.apache.maven.surefire.junit4.JUnit4Provider.executeWithRerun (JUnit4Provider.java:273)
    at org.apache.maven.surefire.junit4.JUnit4Provider.executeTestSet (JUnit4Provider.java:238)
    at org.apache.maven.surefire.junit4.JUnit4Provider.invoke (JUnit4Provider.java:159)
    at org.apache.maven.surefire.booter.ForkedBooter.invokeProviderInSameClassLoader (ForkedBooter.java:383)
    at org.apache.maven.surefire.booter.ForkedBooter.runSuitesInProcess (ForkedBooter.java:344)
    at org.apache.maven.surefire.booter.ForkedBooter.execute (ForkedBooter.java:125)
    at org.apache.maven.surefire.booter.ForkedBooter.main (ForkedBooter.java:417)
[ERROR]
[ERROR] Re-run Maven using the -X switch to enable full debug logging.
[ERROR]
[ERROR] For more information about the errors and possible solutions, please read the following articles:
[ERROR] [Help 1] http://cwiki.apache.org/confluence/display/MAVEN/NoPluginFoundForPrefixException

        at org.apache.maven.it.MavenITmng4554PluginPrefixMappingUpdateTest.testitForcedUpdate(MavenITmng4554PluginPrefixMappingUpdateTest.java:189)




Build log:
[...truncated 59618 lines...]
Recording test results
None of the test reports contained any result
[withMaven] junitPublisher - Archive test results for Maven artifact org.apache.maven.plugins:maven-plugin-plugin:maven-plugin:0.1-stub-SNAPSHOT generated by maven-surefire-plugin:test (default-test): core-it-support\core-it-plugins\maven-it-plugin-core-stubs\maven-plugin-plugin\target\surefire-reports\*.xml
Recording test results
None of the test reports contained any result
[withMaven] junitPublisher - Archive test results for Maven artifact org.apache.maven.plugins:maven-rar-plugin:maven-plugin:0.1-stub-SNAPSHOT generated by maven-surefire-plugin:test (default-test): core-it-support\core-it-plugins\maven-it-plugin-core-stubs\maven-rar-plugin\target\surefire-reports\*.xml
Recording test results
None of the test reports contained any result
[withMaven] junitPublisher - Archive test results for Maven artifact org.apache.maven.plugins:maven-resources-plugin:maven-plugin:0.1-stub-SNAPSHOT generated by maven-surefire-plugin:test (default-test): core-it-support\core-it-plugins\maven-it-plugin-core-stubs\maven-resources-plugin\target\surefire-reports\*.xml
Recording test results
None of the test reports contained any result
[withMaven] junitPublisher - Archive test results for Maven artifact org.apache.maven.plugins:maven-site-plugin:maven-plugin:0.1-stub-SNAPSHOT generated by maven-surefire-plugin:test (default-test): core-it-support\core-it-plugins\maven-it-plugin-core-stubs\maven-site-plugin\target\surefire-reports\*.xml
Recording test results
None of the test reports contained any result
[withMaven] junitPublisher - Archive test results for Maven artifact org.apache.maven.plugins:maven-source-plugin:maven-plugin:0.1-stub-SNAPSHOT generated by maven-surefire-plugin:test (default-test): core-it-support\core-it-plugins\maven-it-plugin-core-stubs\maven-source-plugin\target\surefire-reports\*.xml
Recording test results
None of the test reports contained any result
[withMaven] junitPublisher - Archive test results for Maven artifact org.apache.maven.plugins:maven-surefire-plugin:maven-plugin:0.1-stub-SNAPSHOT generated by maven-surefire-plugin:test (default-test): core-it-support\core-it-plugins\maven-it-plugin-core-stubs\maven-surefire-plugin\target\surefire-reports\*.xml
Recording test results
None of the test reports contained any result
[withMaven] junitPublisher - Archive test results for Maven artifact org.apache.maven.plugins:maven-war-plugin:maven-plugin:0.1-stub-SNAPSHOT generated by maven-surefire-plugin:test (default-test): core-it-support\core-it-plugins\maven-it-plugin-core-stubs\maven-war-plugin\target\surefire-reports\*.xml
Recording test results
None of the test reports contained any result
[withMaven] junitPublisher - Archive test results for Maven artifact org.apache.maven.its.plugins:maven-it-plugin-dependency-collection:maven-plugin:2.1-SNAPSHOT generated by maven-surefire-plugin:test (default-test): core-it-support\core-it-plugins\maven-it-plugin-dependency-collection\target\surefire-reports\*.xml
Recording test results
None of the test reports contained any result
[withMaven] junitPublisher - Archive test results for Maven artifact org.apache.maven.its.plugins:maven-it-plugin-dependency-resolution:maven-plugin:2.1-SNAPSHOT generated by maven-surefire-plugin:test (default-test): core-it-support\core-it-plugins\maven-it-plugin-dependency-resolution\target\surefire-reports\*.xml
Recording test results
None of the test reports contained any result
[withMaven] junitPublisher - Archive test results for Maven artifact org.apache.maven.its.plugins:maven-it-plugin-expression:maven-plugin:2.1-SNAPSHOT generated by maven-surefire-plugin:test (default-test): core-it-support\core-it-plugins\maven-it-plugin-expression\target\surefire-reports\*.xml
Recording test results
[withMaven] junitPublisher - Archive test results for Maven artifact org.apache.maven.its.plugins:maven-it-plugin-error:maven-plugin:2.1-SNAPSHOT generated by maven-surefire-plugin:test (default-test): core-it-support\core-it-plugins\maven-it-plugin-error\target\surefire-reports\*.xml
Recording test results
None of the test reports contained any result
[withMaven] junitPublisher - Archive test results for Maven artifact org.apache.maven.its:core-it-component:jar:2.1-SNAPSHOT generated by maven-surefire-plugin:test (default-test): core-it-support\core-it-component\target\surefire-reports\*.xml
Recording test results
None of the test reports contained any result
[withMaven] junitPublisher - Archive test results for Maven artifact org.apache.maven.its.plugins:maven-it-plugin-extension-consumer:maven-plugin:2.1-SNAPSHOT generated by maven-surefire-plugin:test (default-test): core-it-support\core-it-plugins\maven-it-plugin-extension-consumer\target\surefire-reports\*.xml
Recording test results
None of the test reports contained any result
[withMaven] junitPublisher - Archive test results for Maven artifact org.apache.maven.its.plugins:maven-it-plugin-extension-provider:maven-plugin:2.1-SNAPSHOT generated by maven-surefire-plugin:test (default-test): core-it-support\core-it-plugins\maven-it-plugin-extension-provider\target\surefire-reports\*.xml
Recording test results
None of the test reports contained any result
[withMaven] junitPublisher - Archive test results for Maven artifact org.apache.maven.its.plugins:maven-it-plugin-fork:maven-plugin:2.1-SNAPSHOT generated by maven-surefire-plugin:test (default-test): core-it-support\core-it-plugins\maven-it-plugin-fork\target\surefire-reports\*.xml
Recording test results
None of the test reports contained any result
[withMaven] junitPublisher - Archive test results for Maven artifact org.apache.maven.its.plugins:maven-it-plugin-invalid-descriptor:maven-plugin:2.1-SNAPSHOT generated by maven-surefire-plugin:test (default-test): core-it-support\core-it-plugins\maven-it-plugin-invalid-descriptor\target\surefire-reports\*.xml
Recording test results
None of the test reports contained any result
[withMaven] junitPublisher - Archive test results for Maven artifact org.apache.maven.its.plugins:maven-it-plugin-log-file:maven-plugin:2.1-SNAPSHOT generated by maven-surefire-plugin:test (default-test): core-it-support\core-it-plugins\maven-it-plugin-log-file\target\surefire-reports\*.xml
Recording test results
None of the test reports contained any result
[withMaven] junitPublisher - Archive test results for Maven artifact org.apache.maven.its:maven-it-helper:jar:2.1-SNAPSHOT generated by maven-surefire-plugin:test (default-test): core-it-support\maven-it-helper\target\surefire-reports\*.xml
Recording test results
[withMaven] junitPublisher - Archive test results for Maven artifact org.apache.maven.its.plugins:maven-it-plugin-model-interpolation:maven-plugin:2.1-SNAPSHOT generated by maven-surefire-plugin:test (default-test): core-it-support\core-it-plugins\maven-it-plugin-model-interpolation\target\surefire-reports\*.xml
Recording test results
None of the test reports contained any result
[withMaven] junitPublisher - Archive test results for Maven artifact org.apache.maven.its.plugins:maven-it-plugin-no-default-comp:maven-plugin:2.1-SNAPSHOT generated by maven-surefire-plugin:test (default-test): core-it-support\core-it-plugins\maven-it-plugin-no-default-comp\target\surefire-reports\*.xml
Recording test results
None of the test reports contained any result
[withMaven] junitPublisher - Archive test results for Maven artifact org.apache.maven.its.plugins:maven-it-plugin-no-project:maven-plugin:2.1-SNAPSHOT generated by maven-surefire-plugin:test (default-test): core-it-support\core-it-plugins\maven-it-plugin-no-project\target\surefire-reports\*.xml
Recording test results
None of the test reports contained any result
[withMaven] junitPublisher - Archive test results for Maven artifact org.apache.maven.its.plugins:maven-it-plugin-online:maven-plugin:2.1-SNAPSHOT generated by maven-surefire-plugin:test (default-test): core-it-support\core-it-plugins\maven-it-plugin-online\target\surefire-reports\*.xml
Recording test results
None of the test reports contained any result
[withMaven] junitPublisher - Archive test results for Maven artifact org.apache.maven.its.plugins:maven-it-plugin-optional-mojos:maven-plugin:2.1-SNAPSHOT generated by maven-surefire-plugin:test (default-test): core-it-support\core-it-plugins\maven-it-plugin-optional-mojos\target\surefire-reports\*.xml
Recording test results
None of the test reports contained any result
[withMaven] junitPublisher - Archive test results for Maven artifact org.apache.maven.its.plugins:maven-it-plugin-packaging:maven-plugin:2.1-SNAPSHOT generated by maven-surefire-plugin:test (default-test): core-it-support\core-it-plugins\maven-it-plugin-packaging\target\surefire-reports\*.xml
Recording test results
None of the test reports contained any result
[withMaven] junitPublisher - Archive test results for Maven artifact org.apache.maven.its.plugins:maven-it-plugin-parameter-implementation:maven-plugin:2.1-SNAPSHOT generated by maven-surefire-plugin:test (default-test): core-it-support\core-it-plugins\maven-it-plugin-parameter-implementation\target\surefire-reports\*.xml
Recording test results
None of the test reports contained any result
[withMaven] junitPublisher - Archive test results for Maven artifact org.apache.maven.its.plugins:maven-it-plugin-plugin-dependency:maven-plugin:2.1-SNAPSHOT generated by maven-surefire-plugin:test (default-test): core-it-support\core-it-plugins\maven-it-plugin-plugin-dependency\target\surefire-reports\*.xml
Recording test results
None of the test reports contained any result
[withMaven] junitPublisher - Archive test results for Maven artifact org.apache.maven.its.plugins:maven-it-plugin-project:maven-plugin:2.1-SNAPSHOT generated by maven-surefire-plugin:test (default-test): core-it-support\core-it-plugins\maven-it-plugin-project\target\surefire-reports\*.xml
Recording test results
None of the test reports contained any result
[withMaven] junitPublisher - Archive test results for Maven artifact org.apache.maven.its.plugins:maven-it-plugin-project-interpolation:maven-plugin:2.1-SNAPSHOT generated by maven-surefire-plugin:test (default-test): core-it-support\core-it-plugins\maven-it-plugin-project-interpolation\target\surefire-reports\*.xml
Recording test results
None of the test reports contained any result
[withMaven] junitPublisher - Archive test results for Maven artifact org.apache.maven.its.plugins:maven-it-plugin-setter:maven-plugin:2.1-SNAPSHOT generated by maven-surefire-plugin:test (default-test): core-it-support\core-it-plugins\maven-it-plugin-setter\target\surefire-reports\*.xml
Recording test results
None of the test reports contained any result
[withMaven] junitPublisher - Archive test results for Maven artifact org.apache.maven.its.plugins:maven-it-plugin-singleton-component:maven-plugin:2.1-SNAPSHOT generated by maven-surefire-plugin:test (default-test): core-it-support\core-it-plugins\maven-it-plugin-singleton-component\target\surefire-reports\*.xml
Recording test results
None of the test reports contained any result
[withMaven] junitPublisher - Archive test results for Maven artifact org.apache.maven.its.plugins:maven-it-plugin-site:maven-plugin:2.1-SNAPSHOT generated by maven-surefire-plugin:test (default-test): core-it-support\core-it-plugins\maven-it-plugin-site\target\surefire-reports\*.xml
Recording test results
None of the test reports contained any result
[withMaven] junitPublisher - Archive test results for Maven artifact org.apache.maven.its.plugins:maven-it-plugin-toolchain:maven-plugin:2.1-SNAPSHOT generated by maven-surefire-plugin:test (default-test): core-it-support\core-it-plugins\maven-it-plugin-toolchain\target\surefire-reports\*.xml
Recording test results
None of the test reports contained any result
[withMaven] junitPublisher - Archive test results for Maven artifact org.apache.maven.its.plugins:maven-it-plugin-touch:maven-plugin:2.1-SNAPSHOT generated by maven-surefire-plugin:test (default-test): core-it-support\core-it-plugins\maven-it-plugin-touch\target\surefire-reports\*.xml
Recording test results
None of the test reports contained any result
[withMaven] junitPublisher - Archive test results for Maven artifact org.apache.maven.its.plugins:maven-it-plugin-uses-properties:maven-plugin:2.1-SNAPSHOT generated by maven-surefire-plugin:test (default-test): core-it-support\core-it-plugins\maven-it-plugin-uses-properties\target\surefire-reports\*.xml
Recording test results
None of the test reports contained any result
[withMaven] junitPublisher - Archive test results for Maven artifact org.apache.maven.its.plugins:maven-it-plugin-uses-wagon:maven-plugin:2.1-SNAPSHOT generated by maven-surefire-plugin:test (default-test): core-it-support\core-it-plugins\maven-it-plugin-uses-wagon\target\surefire-reports\*.xml
Recording test results
None of the test reports contained any result
[withMaven] junitPublisher - Archive test results for Maven artifact org.apache.maven.its.plugins:maven-it-plugin-all:maven-plugin:2.1-SNAPSHOT generated by maven-surefire-plugin:test (default-test): core-it-support\core-it-plugins\maven-it-plugin-all\target\surefire-reports\*.xml
Recording test results
None of the test reports contained any result
[withMaven] junitPublisher - Archive test results for Maven artifact org.apache.maven.its.plugins:maven-it-plugin-plexus-utils-11:maven-plugin:2.1-SNAPSHOT generated by maven-surefire-plugin:test (default-test): core-it-support\core-it-plugins\maven-it-plugin-plexus-utils-11\target\surefire-reports\*.xml
Recording test results
None of the test reports contained any result
[withMaven] junitPublisher - Archive test results for Maven artifact org.apache.maven.its.plugins:maven-it-plugin-plexus-utils-new:maven-plugin:2.1-SNAPSHOT generated by maven-surefire-plugin:test (default-test): core-it-support\core-it-plugins\maven-it-plugin-plexus-utils-new\target\surefire-reports\*.xml
Recording test results
None of the test reports contained any result
[withMaven] junitPublisher - Archive test results for Maven artifact org.apache.maven.its.plugins:maven-it-plugin-plexus-component-api:maven-plugin:2.1-SNAPSHOT generated by maven-surefire-plugin:test (default-test): core-it-support\core-it-plugins\maven-it-plugin-plexus-component-api\target\surefire-reports\*.xml
Recording test results
None of the test reports contained any result
[withMaven] junitPublisher - Archive test results for Maven artifact org.apache.maven.its.plugins:maven-it-plugin-log4j:maven-plugin:2.1-SNAPSHOT generated by maven-surefire-plugin:test (default-test): core-it-support\core-it-plugins\maven-it-plugin-log4j\target\surefire-reports\*.xml
Recording test results
None of the test reports contained any result
[withMaven] junitPublisher - Archive test results for Maven artifact org.apache.maven.its.plugins:maven-it-plugin-extension1:maven-plugin:2.1-SNAPSHOT generated by maven-surefire-plugin:test (default-test): core-it-support\core-it-plugins\maven-it-plugin-extension1\target\surefire-reports\*.xml
Recording test results
None of the test reports contained any result
[withMaven] junitPublisher - Archive test results for Maven artifact org.apache.maven.its.plugins:maven-it-plugin-extension2:maven-plugin:2.1-SNAPSHOT generated by maven-surefire-plugin:test (default-test): core-it-support\core-it-plugins\maven-it-plugin-extension2\target\surefire-reports\*.xml
Recording test results
None of the test reports contained any result
[withMaven] junitPublisher - Archive test results for Maven artifact org.apache.maven.its.plugins:maven-it-plugin-plexus-lifecycle:maven-plugin:2.1-SNAPSHOT generated by maven-surefire-plugin:test (default-test): core-it-support\core-it-plugins\maven-it-plugin-plexus-lifecycle\target\surefire-reports\*.xml
Recording test results
None of the test reports contained any result
[withMaven] junitPublisher - Archive test results for Maven artifact org.apache.maven.its.plugins:maven-it-plugin-settings:maven-plugin:2.1-SNAPSHOT generated by maven-surefire-plugin:test (default-test): core-it-support\core-it-plugins\maven-it-plugin-settings\target\surefire-reports\*.xml
Recording test results
None of the test reports contained any result
[withMaven] junitPublisher - Archive test results for Maven artifact org.apache.maven.its.plugins:mng-5805-pkg-type-mojo-configuration-extension:jar:2.1-SNAPSHOT generated by maven-surefire-plugin:test (default-test): core-it-support\core-it-plugins\mng5805-extension\target\surefire-reports\*.xml
Recording test results
None of the test reports contained any result
[withMaven] junitPublisher - Archive test results for Maven artifact org.apache.maven.its.plugins:mng-5805-pkg-type-mojo-configuration-extension2:jar:2.1-SNAPSHOT generated by maven-surefire-plugin:test (default-test): core-it-support\core-it-plugins\mng5805-extension2\target\surefire-reports\*.xml
Recording test results
None of the test reports contained any result
[withMaven] junitPublisher - Archive test results for Maven artifact org.apache.maven.its.plugins:mng-5805-pkg-type-mojo-configuration-plugin:maven-plugin:2.1-SNAPSHOT generated by maven-surefire-plugin:test (default-test): core-it-support\core-it-plugins\mng5805-plugin\target\surefire-reports\*.xml
Recording test results
None of the test reports contained any result
[withMaven] junitPublisher - Archive test results for Maven artifact org.apache.maven.its.plugins:mng-5805-pkg-type-mojo-configuration-plugin-dep:jar:2.1-SNAPSHOT generated by maven-surefire-plugin:test (default-test): core-it-support\core-it-plugins\mng5805-plugin-dep\target\surefire-reports\*.xml
Recording test results
None of the test reports contained any result
[withMaven] junitPublisher - Archive test results for Maven artifact org.apache.maven.its.plugins:mng-5958-pkg-type-extension:jar:2.1-SNAPSHOT generated by maven-surefire-plugin:test (default-test): core-it-support\core-it-plugins\mng5958-extension\target\surefire-reports\*.xml
Recording test results
None of the test reports contained any result
[withMaven] junitPublisher - Archive test results for Maven artifact org.apache.maven.its:core-it-toolchain:jar:2.1-SNAPSHOT generated by maven-surefire-plugin:test (default-test): core-it-support\core-it-toolchain\target\surefire-reports\*.xml
Recording test results
None of the test reports contained any result
[withMaven] junitPublisher - Archive test results for Maven artifact org.apache.maven.its:core-it-wagon:jar:2.1-SNAPSHOT generated by maven-surefire-plugin:test (default-test): core-it-support\core-it-wagon\target\surefire-reports\*.xml
Recording test results
None of the test reports contained any result
[withMaven] junitPublisher - Archive test results for Maven artifact org.apache.maven.its:core-it-extension:jar:2.1-SNAPSHOT generated by maven-surefire-plugin:test (default-test): core-it-support\core-it-extension\target\surefire-reports\*.xml
Recording test results
None of the test reports contained any result
[withMaven] junitPublisher - Archive test results for Maven artifact org.apache.maven.its:core-it-suite:jar:2.1-SNAPSHOT generated by maven-surefire-plugin:test (default-test): core-it-suite\target\surefire-reports\*.xml
Recording test results
[withMaven] openTasksPublisher - Scan Tasks for Maven artifact org.apache.maven.its.plugins:maven-it-plugin-active-collection:maven-plugin:2.1-SNAPSHOT in source directory core-it-support\core-it-plugins\maven-it-plugin-active-collection\src\main\java
[withMaven] openTasksPublisher - Scan Tasks for Maven artifact org.apache.maven.its.plugins:maven-it-plugin-artifact:maven-plugin:2.1-SNAPSHOT in source directory core-it-support\core-it-plugins\maven-it-plugin-artifact\src\main\java
[withMaven] openTasksPublisher - Scan Tasks for Maven artifact org.apache.maven.its.plugins.class-loader:dep-a:jar:2.1-SNAPSHOT in source directory core-it-support\core-it-plugins\maven-it-plugin-class-loader\dep-a\src\main\java
[withMaven] openTasksPublisher - Scan Tasks for Maven artifact org.apache.maven.its.plugins.class-loader:dep-b:jar:2.1-SNAPSHOT in source directory core-it-support\core-it-plugins\maven-it-plugin-class-loader\dep-b\src\main\java
[withMaven] openTasksPublisher - Scan Tasks for Maven artifact org.apache.maven.its.plugins:maven-it-plugin-class-loader:maven-plugin:2.1-SNAPSHOT in source directory core-it-support\core-it-plugins\maven-it-plugin-class-loader\maven-it-plugin-class-loader\src\main\java
[withMaven] openTasksPublisher - Scan Tasks for Maven artifact org.apache.maven.its.plugins:maven-it-plugin-configuration:maven-plugin:2.1-SNAPSHOT in source directory core-it-support\core-it-plugins\maven-it-plugin-configuration\src\main\java
[withMaven] openTasksPublisher - Scan Tasks for Maven artifact org.apache.maven.its.plugins:maven-it-plugin-context-passing:maven-plugin:2.1-SNAPSHOT in source directory core-it-support\core-it-plugins\maven-it-plugin-context-passing\src\main\java
[withMaven] openTasksPublisher - Scan Tasks for Maven artifact org.apache.maven.plugins:maven-clean-plugin:maven-plugin:0.1-stub-SNAPSHOT in source directory core-it-support\core-it-plugins\maven-it-plugin-core-stubs\maven-clean-plugin\src\main\java
[withMaven] openTasksPublisher - Scan Tasks for Maven artifact org.apache.maven.plugins:maven-compiler-plugin:maven-plugin:0.1-stub-SNAPSHOT in source directory core-it-support\core-it-plugins\maven-it-plugin-core-stubs\maven-compiler-plugin\src\main\java
[withMaven] openTasksPublisher - Scan Tasks for Maven artifact org.apache.maven.plugins:maven-deploy-plugin:maven-plugin:0.1-stub-SNAPSHOT in source directory core-it-support\core-it-plugins\maven-it-plugin-core-stubs\maven-deploy-plugin\src\main\java
[withMaven] openTasksPublisher - Scan Tasks for Maven artifact org.apache.maven.plugins:maven-ear-plugin:maven-plugin:0.1-stub-SNAPSHOT in source directory core-it-support\core-it-plugins\maven-it-plugin-core-stubs\maven-ear-plugin\src\main\java
[withMaven] openTasksPublisher - Scan Tasks for Maven artifact org.apache.maven.plugins:maven-ejb-plugin:maven-plugin:0.1-stub-SNAPSHOT in source directory core-it-support\core-it-plugins\maven-it-plugin-core-stubs\maven-ejb-plugin\src\main\java
[withMaven] openTasksPublisher - Scan Tasks for Maven artifact org.apache.maven.plugins:maven-install-plugin:maven-plugin:0.1-stub-SNAPSHOT in source directory core-it-support\core-it-plugins\maven-it-plugin-core-stubs\maven-install-plugin\src\main\java
[withMaven] openTasksPublisher - Scan Tasks for Maven artifact org.apache.maven.plugins:maven-jar-plugin:maven-plugin:0.1-stub-SNAPSHOT in source directory core-it-support\core-it-plugins\maven-it-plugin-core-stubs\maven-jar-plugin\src\main\java
[withMaven] openTasksPublisher - Scan Tasks for Maven artifact org.apache.maven.plugins:maven-javadoc-plugin:maven-plugin:0.1-stub-SNAPSHOT in source directory core-it-support\core-it-plugins\maven-it-plugin-core-stubs\maven-javadoc-plugin\src\main\java
[withMaven] openTasksPublisher - Scan Tasks for Maven artifact org.apache.maven.plugins:maven-plugin-plugin:maven-plugin:0.1-stub-SNAPSHOT in source directory core-it-support\core-it-plugins\maven-it-plugin-core-stubs\maven-plugin-plugin\src\main\java
[withMaven] openTasksPublisher - Scan Tasks for Maven artifact org.apache.maven.plugins:maven-rar-plugin:maven-plugin:0.1-stub-SNAPSHOT in source directory core-it-support\core-it-plugins\maven-it-plugin-core-stubs\maven-rar-plugin\src\main\java
[withMaven] openTasksPublisher - Scan Tasks for Maven artifact org.apache.maven.plugins:maven-resources-plugin:maven-plugin:0.1-stub-SNAPSHOT in source directory core-it-support\core-it-plugins\maven-it-plugin-core-stubs\maven-resources-plugin\src\main\java
[withMaven] openTasksPublisher - Scan Tasks for Maven artifact org.apache.maven.plugins:maven-site-plugin:maven-plugin:0.1-stub-SNAPSHOT in source directory core-it-support\core-it-plugins\maven-it-plugin-core-stubs\maven-site-plugin\src\main\java
[withMaven] openTasksPublisher - Scan Tasks for Maven artifact org.apache.maven.plugins:maven-source-plugin:maven-plugin:0.1-stub-SNAPSHOT in source directory core-it-support\core-it-plugins\maven-it-plugin-core-stubs\maven-source-plugin\src\main\java
[withMaven] openTasksPublisher - Scan Tasks for Maven artifact org.apache.maven.plugins:maven-surefire-plugin:maven-plugin:0.1-stub-SNAPSHOT in source directory core-it-support\core-it-plugins\maven-it-plugin-core-stubs\maven-surefire-plugin\src\main\java
[withMaven] openTasksPublisher - Scan Tasks for Maven artifact org.apache.maven.plugins:maven-war-plugin:maven-plugin:0.1-stub-SNAPSHOT in source directory core-it-support\core-it-plugins\maven-it-plugin-core-stubs\maven-war-plugin\src\main\java
[withMaven] openTasksPublisher - Scan Tasks for Maven artifact org.apache.maven.its.plugins:maven-it-plugin-dependency-collection:maven-plugin:2.1-SNAPSHOT in source directory core-it-support\core-it-plugins\maven-it-plugin-dependency-collection\src\main\java
[withMaven] openTasksPublisher - Scan Tasks for Maven artifact org.apache.maven.its.plugins:maven-it-plugin-dependency-resolution:maven-plugin:2.1-SNAPSHOT in source directory core-it-support\core-it-plugins\maven-it-plugin-dependency-resolution\src\main\java
[withMaven] openTasksPublisher - Scan Tasks for Maven artifact org.apache.maven.its.plugins:maven-it-plugin-expression:maven-plugin:2.1-SNAPSHOT in source directory core-it-support\core-it-plugins\maven-it-plugin-expression\src\main\java
[withMaven] openTasksPublisher - Scan Tasks for Maven artifact org.apache.maven.its.plugins:maven-it-plugin-error:maven-plugin:2.1-SNAPSHOT in source directory core-it-support\core-it-plugins\maven-it-plugin-error\src\main\java
[withMaven] openTasksPublisher - Scan Tasks for Maven artifact org.apache.maven.its:core-it-component:jar:2.1-SNAPSHOT in source directory core-it-support\core-it-component\src\main\java
[withMaven] openTasksPublisher - Scan Tasks for Maven artifact org.apache.maven.its.plugins:maven-it-plugin-extension-consumer:maven-plugin:2.1-SNAPSHOT in source directory core-it-support\core-it-plugins\maven-it-plugin-extension-consumer\src\main\java
[withMaven] openTasksPublisher - Scan Tasks for Maven artifact org.apache.maven.its.plugins:maven-it-plugin-extension-provider:maven-plugin:2.1-SNAPSHOT in source directory core-it-support\core-it-plugins\maven-it-plugin-extension-provider\src\main\java
[withMaven] openTasksPublisher - Scan Tasks for Maven artifact org.apache.maven.its.plugins:maven-it-plugin-fork:maven-plugin:2.1-SNAPSHOT in source directory core-it-support\core-it-plugins\maven-it-plugin-fork\src\main\java
[withMaven] openTasksPublisher - Scan Tasks for Maven artifact org.apache.maven.its.plugins:maven-it-plugin-invalid-descriptor:maven-plugin:2.1-SNAPSHOT in source directory core-it-support\core-it-plugins\maven-it-plugin-invalid-descriptor\src\main\java
[withMaven] openTasksPublisher - Scan Tasks for Maven artifact org.apache.maven.its.plugins:maven-it-plugin-log-file:maven-plugin:2.1-SNAPSHOT in source directory core-it-support\core-it-plugins\maven-it-plugin-log-file\src\main\java
[withMaven] openTasksPublisher - Scan Tasks for Maven artifact org.apache.maven.its:maven-it-helper:jar:2.1-SNAPSHOT in source directory core-it-support\maven-it-helper\src\main\java
[withMaven] openTasksPublisher - Scan Tasks for Maven artifact org.apache.maven.its.plugins:maven-it-plugin-model-interpolation:maven-plugin:2.1-SNAPSHOT in source directory core-it-support\core-it-plugins\maven-it-plugin-model-interpolation\src\main\java
[withMaven] openTasksPublisher - Scan Tasks for Maven artifact org.apache.maven.its.plugins:maven-it-plugin-no-default-comp:maven-plugin:2.1-SNAPSHOT in source directory core-it-support\core-it-plugins\maven-it-plugin-no-default-comp\src\main\java
[withMaven] openTasksPublisher - Scan Tasks for Maven artifact org.apache.maven.its.plugins:maven-it-plugin-no-project:maven-plugin:2.1-SNAPSHOT in source directory core-it-support\core-it-plugins\maven-it-plugin-no-project\src\main\java
[withMaven] openTasksPublisher - Scan Tasks for Maven artifact org.apache.maven.its.plugins:maven-it-plugin-online:maven-plugin:2.1-SNAPSHOT in source directory core-it-support\core-it-plugins\maven-it-plugin-online\src\main\java
[withMaven] openTasksPublisher - Scan Tasks for Maven artifact org.apache.maven.its.plugins:maven-it-plugin-optional-mojos:maven-plugin:2.1-SNAPSHOT in source directory core-it-support\core-it-plugins\maven-it-plugin-optional-mojos\src\main\java
[withMaven] openTasksPublisher - Scan Tasks for Maven artifact org.apache.maven.its.plugins:maven-it-plugin-packaging:maven-plugin:2.1-SNAPSHOT in source directory core-it-support\core-it-plugins\maven-it-plugin-packaging\src\main\java
[withMaven] openTasksPublisher - Scan Tasks for Maven artifact org.apache.maven.its.plugins:maven-it-plugin-parameter-implementation:maven-plugin:2.1-SNAPSHOT in source directory core-it-support\core-it-plugins\maven-it-plugin-parameter-implementation\src\main\java
[withMaven] openTasksPublisher - Scan Tasks for Maven artifact org.apache.maven.its.plugins:maven-it-plugin-plugin-dependency:maven-plugin:2.1-SNAPSHOT in source directory core-it-support\core-it-plugins\maven-it-plugin-plugin-dependency\src\main\java
[withMaven] openTasksPublisher - Scan Tasks for Maven artifact org.apache.maven.its.plugins:maven-it-plugin-project:maven-plugin:2.1-SNAPSHOT in source directory core-it-support\core-it-plugins\maven-it-plugin-project\src\main\java
[withMaven] openTasksPublisher - Scan Tasks for Maven artifact org.apache.maven.its.plugins:maven-it-plugin-project-interpolation:maven-plugin:2.1-SNAPSHOT in source directory core-it-support\core-it-plugins\maven-it-plugin-project-interpolation\src\main\java
[withMaven] openTasksPublisher - Scan Tasks for Maven artifact org.apache.maven.its.plugins:maven-it-plugin-setter:maven-plugin:2.1-SNAPSHOT in source directory core-it-support\core-it-plugins\maven-it-plugin-setter\src\main\java
[withMaven] openTasksPublisher - Scan Tasks for Maven artifact org.apache.maven.its.plugins:maven-it-plugin-singleton-component:maven-plugin:2.1-SNAPSHOT in source directory core-it-support\core-it-plugins\maven-it-plugin-singleton-component\src\main\java
[withMaven] openTasksPublisher - Scan Tasks for Maven artifact org.apache.maven.its.plugins:maven-it-plugin-site:maven-plugin:2.1-SNAPSHOT in source directory core-it-support\core-it-plugins\maven-it-plugin-site\src\main\java
[withMaven] openTasksPublisher - Scan Tasks for Maven artifact org.apache.maven.its.plugins:maven-it-plugin-toolchain:maven-plugin:2.1-SNAPSHOT in source directory core-it-support\core-it-plugins\maven-it-plugin-toolchain\src\main\java
[withMaven] openTasksPublisher - Scan Tasks for Maven artifact org.apache.maven.its.plugins:maven-it-plugin-touch:maven-plugin:2.1-SNAPSHOT in source directory core-it-support\core-it-plugins\maven-it-plugin-touch\src\main\java
[withMaven] openTasksPublisher - Scan Tasks for Maven artifact org.apache.maven.its.plugins:maven-it-plugin-uses-properties:maven-plugin:2.1-SNAPSHOT in source directory core-it-support\core-it-plugins\maven-it-plugin-uses-properties\src\main\java
[withMaven] openTasksPublisher - Scan Tasks for Maven artifact org.apache.maven.its.plugins:maven-it-plugin-uses-wagon:maven-plugin:2.1-SNAPSHOT in source directory core-it-support\core-it-plugins\maven-it-plugin-uses-wagon\src\main\java
[withMaven] openTasksPublisher - Scan Tasks for Maven artifact org.apache.maven.its.plugins:maven-it-plugin-all:maven-plugin:2.1-SNAPSHOT in source directory core-it-support\core-it-plugins\maven-it-plugin-all\src\main\java
[withMaven] openTasksPublisher - Scan Tasks for Maven artifact org.apache.maven.its.plugins:maven-it-plugin-plexus-utils-11:maven-plugin:2.1-SNAPSHOT in source directory core-it-support\core-it-plugins\maven-it-plugin-plexus-utils-11\src\main\java
[withMaven] openTasksPublisher - Scan Tasks for Maven artifact org.apache.maven.its.plugins:maven-it-plugin-plexus-utils-new:maven-plugin:2.1-SNAPSHOT in source directory core-it-support\core-it-plugins\maven-it-plugin-plexus-utils-new\src\main\java
[withMaven] openTasksPublisher - Scan Tasks for Maven artifact org.apache.maven.its.plugins:maven-it-plugin-plexus-component-api:maven-plugin:2.1-SNAPSHOT in source directory core-it-support\core-it-plugins\maven-it-plugin-plexus-component-api\src\main\java
[withMaven] openTasksPublisher - Scan Tasks for Maven artifact org.apache.maven.its.plugins:maven-it-plugin-log4j:maven-plugin:2.1-SNAPSHOT in source directory core-it-support\core-it-plugins\maven-it-plugin-log4j\src\main\java
[withMaven] openTasksPublisher - Scan Tasks for Maven artifact org.apache.maven.its.plugins:maven-it-plugin-extension1:maven-plugin:2.1-SNAPSHOT in source directory core-it-support\core-it-plugins\maven-it-plugin-extension1\src\main\java
[withMaven] openTasksPublisher - Scan Tasks for Maven artifact org.apache.maven.its.plugins:maven-it-plugin-extension2:maven-plugin:2.1-SNAPSHOT in source directory core-it-support\core-it-plugins\maven-it-plugin-extension2\src\main\java
[withMaven] openTasksPublisher - Scan Tasks for Maven artifact org.apache.maven.its.plugins:maven-it-plugin-plexus-lifecycle:maven-plugin:2.1-SNAPSHOT in source directory core-it-support\core-it-plugins\maven-it-plugin-plexus-lifecycle\src\main\java
[withMaven] openTasksPublisher - Scan Tasks for Maven artifact org.apache.maven.its.plugins:maven-it-plugin-settings:maven-plugin:2.1-SNAPSHOT in source directory core-it-support\core-it-plugins\maven-it-plugin-settings\src\main\java
[withMaven] openTasksPublisher - Scan Tasks for Maven artifact org.apache.maven.its.plugins:mng-5805-pkg-type-mojo-configuration-plugin:maven-plugin:2.1-SNAPSHOT in source directory core-it-support\core-it-plugins\mng5805-plugin\src\main\java
[withMaven] openTasksPublisher - Scan Tasks for Maven artifact org.apache.maven.its.plugins:mng-5805-pkg-type-mojo-configuration-plugin-dep:jar:2.1-SNAPSHOT in source directory core-it-support\core-it-plugins\mng5805-plugin-dep\src\main\java
[withMaven] openTasksPublisher - Scan Tasks for Maven artifact org.apache.maven.its.plugins:mng-5958-pkg-type-extension:jar:2.1-SNAPSHOT in source directory core-it-support\core-it-plugins\mng5958-extension\src\main\java
[withMaven] openTasksPublisher - Scan Tasks for Maven artifact org.apache.maven.its:core-it-toolchain:jar:2.1-SNAPSHOT in source directory core-it-support\core-it-toolchain\src\main\java
[withMaven] openTasksPublisher - Scan Tasks for Maven artifact org.apache.maven.its:core-it-wagon:jar:2.1-SNAPSHOT in source directory core-it-support\core-it-wagon\src\main\java
[TASKS] Scanning folder 'c:\mvn-it-1.tmp' for files matching the pattern 'core-it-support\core-it-plugins\maven-it-plugin-active-collection\src\main\java\**\*,core-it-support\core-it-plugins\maven-it-plugin-artifact\src\main\java\**\*,core-it-support\core-it-plugins\maven-it-plugin-class-loader\dep-a\src\main\java\**\*,core-it-support\core-it-plugins\maven-it-plugin-class-loader\dep-b\src\main\java\**\*,core-it-support\core-it-plugins\maven-it-plugin-class-loader\maven-it-plugin-class-loader\src\main\java\**\*,core-it-support\core-it-plugins\maven-it-plugin-configuration\src\main\java\**\*,core-it-support\core-it-plugins\maven-it-plugin-context-passing\src\main\java\**\*,core-it-support\core-it-plugins\maven-it-plugin-core-stubs\maven-clean-plugin\src\main\java\**\*,core-it-support\core-it-plugins\maven-it-plugin-core-stubs\maven-compiler-plugin\src\main\java\**\*,core-it-support\core-it-plugins\maven-it-plugin-core-stubs\maven-deploy-plugin\src\main\java\**\*,core-it-support\core-it-plugins\maven-it-plugin-core-stubs\maven-ear-plugin\src\main\java\**\*,core-it-support\core-it-plugins\maven-it-plugin-core-stubs\maven-ejb-plugin\src\main\java\**\*,core-it-support\core-it-plugins\maven-it-plugin-core-stubs\maven-install-plugin\src\main\java\**\*,core-it-support\core-it-plugins\maven-it-plugin-core-stubs\maven-jar-plugin\src\main\java\**\*,core-it-support\core-it-plugins\maven-it-plugin-core-stubs\maven-javadoc-plugin\src\main\java\**\*,core-it-support\core-it-plugins\maven-it-plugin-core-stubs\maven-plugin-plugin\src\main\java\**\*,core-it-support\core-it-plugins\maven-it-plugin-core-stubs\maven-rar-plugin\src\main\java\**\*,core-it-support\core-it-plugins\maven-it-plugin-core-stubs\maven-resources-plugin\src\main\java\**\*,core-it-support\core-it-plugins\maven-it-plugin-core-stubs\maven-site-plugin\src\main\java\**\*,core-it-support\core-it-plugins\maven-it-plugin-core-stubs\maven-source-plugin\src\main\java\**\*,core-it-support\core-it-plugins\maven-it-plugin-core-stubs\maven-surefire-plugin\src\main\java\**\*,core-it-support\core-it-plugins\maven-it-plugin-core-stubs\maven-war-plugin\src\main\java\**\*,core-it-support\core-it-plugins\maven-it-plugin-dependency-collection\src\main\java\**\*,core-it-support\core-it-plugins\maven-it-plugin-dependency-resolution\src\main\java\**\*,core-it-support\core-it-plugins\maven-it-plugin-expression\src\main\java\**\*,core-it-support\core-it-plugins\maven-it-plugin-error\src\main\java\**\*,core-it-support\core-it-component\src\main\java\**\*,core-it-support\core-it-plugins\maven-it-plugin-extension-consumer\src\main\java\**\*,core-it-support\core-it-plugins\maven-it-plugin-extension-provider\src\main\java\**\*,core-it-support\core-it-plugins\maven-it-plugin-fork\src\main\java\**\*,core-it-support\core-it-plugins\maven-it-plugin-invalid-descriptor\src\main\java\**\*,core-it-support\core-it-plugins\maven-it-plugin-log-file\src\main\java\**\*,core-it-support\maven-it-helper\src\main\java\**\*,core-it-support\core-it-plugins\maven-it-plugin-model-interpolation\src\main\java\**\*,core-it-support\core-it-plugins\maven-it-plugin-no-default-comp\src\main\java\**\*,core-it-support\core-it-plugins\maven-it-plugin-no-project\src\main\java\**\*,core-it-support\core-it-plugins\maven-it-plugin-online\src\main\java\**\*,core-it-support\core-it-plugins\maven-it-plugin-optional-mojos\src\main\java\**\*,core-it-support\core-it-plugins\maven-it-plugin-packaging\src\main\java\**\*,core-it-support\core-it-plugins\maven-it-plugin-parameter-implementation\src\main\java\**\*,core-it-support\core-it-plugins\maven-it-plugin-plugin-dependency\src\main\java\**\*,core-it-support\core-it-plugins\maven-it-plugin-project\src\main\java\**\*,core-it-support\core-it-plugins\maven-it-plugin-project-interpolation\src\main\java\**\*,core-it-support\core-it-plugins\maven-it-plugin-setter\src\main\java\**\*,core-it-support\core-it-plugins\maven-it-plugin-singleton-component\src\main\java\**\*,core-it-support\core-it-plugins\maven-it-plugin-site\src\main\java\**\*,core-it-support\core-it-plugins\maven-it-plugin-toolchain\src\main\java\**\*,core-it-support\core-it-plugins\maven-it-plugin-touch\src\main\java\**\*,core-it-support\core-it-plugins\maven-it-plugin-uses-properties\src\main\java\**\*,core-it-support\core-it-plugins\maven-it-plugin-uses-wagon\src\main\java\**\*,core-it-support\core-it-plugins\maven-it-plugin-all\src\main\java\**\*,core-it-support\core-it-plugins\maven-it-plugin-plexus-utils-11\src\main\java\**\*,core-it-support\core-it-plugins\maven-it-plugin-plexus-utils-new\src\main\java\**\*,core-it-support\core-it-plugins\maven-it-plugin-plexus-component-api\src\main\java\**\*,core-it-support\core-it-plugins\maven-it-plugin-log4j\src\main\java\**\*,core-it-support\core-it-plugins\maven-it-plugin-extension1\src\main\java\**\*,core-it-support\core-it-plugins\maven-it-plugin-extension2\src\main\java\**\*,core-it-support\core-it-plugins\maven-it-plugin-plexus-lifecycle\src\main\java\**\*,core-it-support\core-it-plugins\maven-it-plugin-settings\src\main\java\**\*,core-it-support\core-it-plugins\mng5805-plugin\src\main\java\**\*,core-it-support\core-it-plugins\mng5805-plugin-dep\src\main\java\**\*,core-it-support\core-it-plugins\mng5958-extension\src\main\java\**\*,core-it-support\core-it-toolchain\src\main\java\**\*,core-it-support\core-it-wagon\src\main\java\**\*' - excludes: null
[TASKS] Found 164 files to scan for tasks
[TASKS] Found 0 open tasks.
Skipping warnings blame since pipelines do not have an SCM link.%n
[TASKS] Computing warning deltas based on reference build #127
[withMaven] Publishers: Pipeline Graph Publisher: 27 ms, Generated Artifacts Publisher: 10552 ms, Invoker Publisher: 8 ms, Junit Publisher: 41777 ms, Concordion Publisher: 7 ms, Dependencies Fingerprint Publisher: 298 ms, Findbugs Publisher: 3 ms, JGiven Publisher: 2 ms, Jacoco Publisher: 3 ms, SpotBugs Publisher: 2 ms, Open Task Scanner Publisher: 1523 ms
[Pipeline] // withMaven
[Pipeline] deleteDir
[Pipeline] }
[Pipeline] // dir
[Pipeline] }
[Pipeline] // stage
[Pipeline] }
[Pipeline] // node
[Pipeline] }
[Pipeline] // parallel
[Pipeline] stage
[Pipeline] { (Notifications)
[Pipeline] echo
Build result: UNSTABLE
[Pipeline] jiraIssueSelector
[Pipeline] jiraComment
[Pipeline] jiraComment
[Pipeline] jiraComment
[Pipeline] jiraComment
[Pipeline] jiraComment
[Pipeline] emailext
Reply | Threaded
Open this post in threaded view
|

Build succeeded in Jenkins: Maven TLP » maven » master #133

Apache Jenkins Server-2
See https://builds.apache.org/job/maven-box/job/maven/job/master/133/

Changes:

* Add JDK 13 (latest)
* [MNG-6522] Prepare to run ITs tests with Java 12-ea
* [MNG-6522] Fix typos
* [MNG-6522] Prepare to run ITs tests with Java 13-ea
* [MNG-6522] Prepare to run ITs tests with Java 12-ea
* [MNG-6522] Fix typos
* [MNG-6522] Prepare to run ITs tests with Java 13-ea
* [MNG-6522] Prepare to run ITs tests with Java 12-ea
* [MNG-6522] Fix typos
* [MNG-6522] Prepare to run ITs tests with Java 13-ea
* [MNG-6522] Prepare to run ITs tests with Java 12-ea
* [MNG-6522] Fix typos
* [MNG-6522] Prepare to run ITs tests with Java 13-ea
* [MNG-6522] Prepare to run ITs tests with Java 12-ea
* [MNG-6522] Fix typos
* [MNG-6522] Prepare to run ITs tests with Java 13-ea
* [MNG-6522] Prepare to run ITs tests with Java 12-ea
* [MNG-6522] Fix typos
* [MNG-6522] Prepare to run ITs tests with Java 13-ea

All tests passed