Build failed in Jenkins: Maven TLP » maven-jlink-plugin » CLEANUP #2

classic Classic list List threaded Threaded
4 messages Options
Reply | Threaded
Open this post in threaded view
|

Build failed in Jenkins: Maven TLP » maven-jlink-plugin » CLEANUP #2

Apache Jenkins Server-2
See https://builds.apache.org/job/maven-box/job/maven-jlink-plugin/job/CLEANUP/2/

No changes.

All tests passed

Build log:
[...truncated 4.55 MB...]
[linux-jdk9-m3.5.x_build] [INFO] Downloading from central: https://repo.maven.apache.org/maven2/com/google/guava/guava/19.0/guava-19.0.pom
[linux-jdk9-m3.5.x_build] [INFO] Downloaded from central: https://repo.maven.apache.org/maven2/com/google/guava/guava/19.0/guava-19.0.pom (6.8 kB at 566 kB/s)
[linux-jdk9-m3.5.x_build] [INFO] Downloading from central: https://repo.maven.apache.org/maven2/com/google/guava/guava-parent/19.0/guava-parent-19.0.pom
[linux-jdk9-m3.5.x_build] [INFO] Downloaded from central: https://repo.maven.apache.org/maven2/com/google/guava/guava-parent/19.0/guava-parent-19.0.pom (9.9 kB at 823 kB/s)
[linux-jdk9-m3.5.x_build] [INFO] Downloading from central: https://repo.maven.apache.org/maven2/org/sonatype/oss/oss-parent/7/oss-parent-7.pom
[linux-jdk9-m3.5.x_build] [INFO] Downloaded from central: https://repo.maven.apache.org/maven2/org/sonatype/oss/oss-parent/7/oss-parent-7.pom (4.8 kB at 402 kB/s)
[linux-jdk9-m3.5.x_build] [INFO] Downloading from central: https://repo.maven.apache.org/maven2/javax/xml/bind/jaxb-api/2.3.0/jaxb-api-2.3.0.pom
[linux-jdk9-m3.5.x_build] [INFO] Downloaded from central: https://repo.maven.apache.org/maven2/javax/xml/bind/jaxb-api/2.3.0/jaxb-api-2.3.0.pom (23 kB at 1.8 MB/s)
[linux-jdk9-m3.5.x_build] [INFO] Downloading from central: https://repo.maven.apache.org/maven2/javax/xml/bind/jaxb-api-parent/2.3.0/jaxb-api-parent-2.3.0.pom
[linux-jdk9-m3.5.x_build] [INFO] Downloaded from central: https://repo.maven.apache.org/maven2/javax/xml/bind/jaxb-api-parent/2.3.0/jaxb-api-parent-2.3.0.pom (5.6 kB at 470 kB/s)
[linux-jdk9-m3.5.x_build] [INFO] Downloading from central: https://repo.maven.apache.org/maven2/net/java/jvnet-parent/5/jvnet-parent-5.pom
[linux-jdk9-m3.5.x_build] [INFO] Downloaded from central: https://repo.maven.apache.org/maven2/net/java/jvnet-parent/5/jvnet-parent-5.pom (8.9 kB at 806 kB/s)
[linux-jdk9-m3.5.x_build] [INFO] Downloading from central: https://repo.maven.apache.org/maven2/org/apache/maven/shared/maven-shared-resources/2/maven-shared-resources-2.jar
[linux-jdk9-m3.5.x_build] [INFO] Downloading from central: https://repo.maven.apache.org/maven2/commons-logging/commons-logging/1.0.4/commons-logging-1.0.4.jar
[linux-jdk9-m3.5.x_build] [INFO] Downloading from central: https://repo.maven.apache.org/maven2/commons-digester/commons-digester/1.6/commons-digester-1.6.jar
[linux-jdk9-m3.5.x_build] [INFO] Downloading from central: https://repo.maven.apache.org/maven2/org/apache/maven/doxia/doxia-core/1.2/doxia-core-1.2.jar
[linux-jdk9-m3.5.x_build] [INFO] Downloading from central: https://repo.maven.apache.org/maven2/org/apache/maven/doxia/doxia-integration-tools/1.6/doxia-integration-tools-1.6.jar
[linux-jdk9-m3.5.x_build] [INFO] Downloaded from central: https://repo.maven.apache.org/maven2/commons-logging/commons-logging/1.0.4/commons-logging-1.0.4.jar (38 kB at 2.1 MB/s)
[linux-jdk9-m3.5.x_build] [INFO] Downloading from central: https://repo.maven.apache.org/maven2/commons-io/commons-io/1.4/commons-io-1.4.jar
[linux-jdk9-m3.5.x_build] [INFO] Downloaded from central: https://repo.maven.apache.org/maven2/org/apache/maven/shared/maven-shared-resources/2/maven-shared-resources-2.jar (13 kB at 396 kB/s)
[linux-jdk9-m3.5.x_build] [INFO] Downloading from central: https://repo.maven.apache.org/maven2/org/codehaus/plexus/plexus-resources/1.1.0/plexus-resources-1.1.0.jar
[linux-jdk9-m3.5.x_build] [INFO] Downloaded from central: https://repo.maven.apache.org/maven2/org/apache/maven/doxia/doxia-integration-tools/1.6/doxia-integration-tools-1.6.jar (45 kB at 1.2 MB/s)
[linux-jdk9-m3.5.x_build] [INFO] Downloading from central: https://repo.maven.apache.org/maven2/com/puppycrawl/tools/checkstyle/6.18/checkstyle-6.18.jar
[linux-jdk9-m3.5.x_build] [INFO] Downloaded from central: https://repo.maven.apache.org/maven2/commons-io/commons-io/1.4/commons-io-1.4.jar (109 kB at 2.9 MB/s)
[linux-jdk9-m3.5.x_build] [INFO] Downloading from central: https://repo.maven.apache.org/maven2/antlr/antlr/2.7.7/antlr-2.7.7.jar
[linux-jdk9-m3.5.x_build] [INFO] Downloaded from central: https://repo.maven.apache.org/maven2/org/codehaus/plexus/plexus-resources/1.1.0/plexus-resources-1.1.0.jar (23 kB at 516 kB/s)
[linux-jdk9-m3.5.x_build] [INFO] Downloading from central: https://repo.maven.apache.org/maven2/org/antlr/antlr4-runtime/4.5.3/antlr4-runtime-4.5.3.jar
[linux-jdk9-m3.5.x_build] [INFO] Downloaded from central: https://repo.maven.apache.org/maven2/org/apache/maven/doxia/doxia-core/1.2/doxia-core-1.2.jar (154 kB at 3.3 MB/s)
[linux-jdk9-m3.5.x_build] [INFO] Downloading from central: https://repo.maven.apache.org/maven2/commons-beanutils/commons-beanutils/1.9.2/commons-beanutils-1.9.2.jar
[linux-jdk9-m3.5.x_build] [INFO] Downloaded from central: https://repo.maven.apache.org/maven2/commons-digester/commons-digester/1.6/commons-digester-1.6.jar (168 kB at 3.4 MB/s)
[linux-jdk9-m3.5.x_build] [INFO] Downloading from central: https://repo.maven.apache.org/maven2/commons-cli/commons-cli/1.3.1/commons-cli-1.3.1.jar
[linux-jdk9-m3.5.x_build] [INFO] Downloaded from central: https://repo.maven.apache.org/maven2/commons-cli/commons-cli/1.3.1/commons-cli-1.3.1.jar (53 kB at 815 kB/s)
[linux-jdk9-m3.5.x_build] [INFO] Downloading from central: https://repo.maven.apache.org/maven2/com/google/guava/guava/19.0/guava-19.0.jar
[linux-jdk9-m3.5.x_build] [INFO] Downloaded from central: https://repo.maven.apache.org/maven2/commons-beanutils/commons-beanutils/1.9.2/commons-beanutils-1.9.2.jar (234 kB at 3.0 MB/s)
[linux-jdk9-m3.5.x_build] [INFO] Downloading from central: https://repo.maven.apache.org/maven2/javax/xml/bind/jaxb-api/2.3.0/jaxb-api-2.3.0.jar
[linux-jdk9-m3.5.x_build] [INFO] Downloaded from central: https://repo.maven.apache.org/maven2/org/antlr/antlr4-runtime/4.5.3/antlr4-runtime-4.5.3.jar (302 kB at 3.8 MB/s)
[linux-jdk9-m3.5.x_build] [INFO] Downloaded from central: https://repo.maven.apache.org/maven2/antlr/antlr/2.7.7/antlr-2.7.7.jar (445 kB at 5.2 MB/s)
[linux-jdk9-m3.5.x_build] [INFO] Downloaded from central: https://repo.maven.apache.org/maven2/javax/xml/bind/jaxb-api/2.3.0/jaxb-api-2.3.0.jar (126 kB at 1.3 MB/s)
[linux-jdk9-m3.5.x_build] [INFO] Downloaded from central: https://repo.maven.apache.org/maven2/com/puppycrawl/tools/checkstyle/6.18/checkstyle-6.18.jar (1.2 MB at 10 MB/s)
[linux-jdk9-m3.5.x_build] [INFO] Downloaded from central: https://repo.maven.apache.org/maven2/com/google/guava/guava/19.0/guava-19.0.jar (2.3 MB at 15 MB/s)
[linux-jdk9-m3.5.x_build] [INFO]
[linux-jdk9-m3.5.x_build] [INFO] --- maven-invoker-plugin:3.1.0:verify (integration-test) @ maven-jlink-plugin ---
[linux-jdk9-m3.5.x_build] [INFO] -------------------------------------------------
[linux-jdk9-m3.5.x_build] [INFO] Build Summary:
[linux-jdk9-m3.5.x_build] [INFO]   Passed: 3, Failed: 12, Errors: 0, Skipped: 0
[linux-jdk9-m3.5.x_build] [INFO] -------------------------------------------------
[linux-jdk9-m3.5.x_build] [ERROR] The following builds failed:
[linux-jdk9-m3.5.x_build] [ERROR] *  cli-options/no-header-files/pom.xml
[linux-jdk9-m3.5.x_build] [ERROR] *  cli-options/no-man-pages/pom.xml
[linux-jdk9-m3.5.x_build] [ERROR] *  cli-options/compress-2/pom.xml
[linux-jdk9-m3.5.x_build] [ERROR] *  cli-options/bind-services/pom.xml
[linux-jdk9-m3.5.x_build] [ERROR] *  setup-jar-module-info/pom.xml
[linux-jdk9-m3.5.x_build] [ERROR] *  cli-options/compress-0/pom.xml
[linux-jdk9-m3.5.x_build] [ERROR] *  cli-options/ignore-signing-information/pom.xml
[linux-jdk9-m3.5.x_build] [ERROR] *  cli-options/endian/pom.xml
[linux-jdk9-m3.5.x_build] [ERROR] *  cli-options/endian-big/pom.xml
[linux-jdk9-m3.5.x_build] [ERROR] *  cli-options/strip-debug/pom.xml
[linux-jdk9-m3.5.x_build] [ERROR] *  cli-options/compress-1/pom.xml
[linux-jdk9-m3.5.x_build] [ERROR] *  cli-options/disable-plugin/pom.xml
[linux-jdk9-m3.5.x_build] [INFO] -------------------------------------------------
[linux-jdk9-m3.5.x_build] [INFO] ------------------------------------------------------------------------
[linux-jdk9-m3.5.x_build] [INFO] BUILD FAILURE
[linux-jdk9-m3.5.x_build] [INFO] ------------------------------------------------------------------------
[linux-jdk9-m3.5.x_build] [INFO] Total time: 01:26 min
[linux-jdk9-m3.5.x_build] [INFO] Finished at: 2018-09-12T10:41:27Z
[linux-jdk9-m3.5.x_build] [INFO] ------------------------------------------------------------------------
[linux-jdk9-m3.5.x_build] [INFO] [jenkins-event-spy] Generated /home/jenkins/jenkins-slave/workspace/_maven-jlink-plugin_CLEANUP-YYRC5VLF7HAIAIEICXGYPF25BOQW6NXDQRTJOEZNHEUF2NVU67EA@tmp/withMaven89c8d90b/maven-spy-20180912-104000-9386467575125721062288.log
[linux-jdk9-m3.5.x_build] [ERROR] Failed to execute goal org.apache.maven.plugins:maven-invoker-plugin:3.1.0:verify (integration-test) on project maven-jlink-plugin: 12 builds failed. See console output above for details. -> [Help 1]
[linux-jdk9-m3.5.x_build] [ERROR]
[linux-jdk9-m3.5.x_build] [ERROR] To see the full stack trace of the errors, re-run Maven with the -e switch.
[linux-jdk9-m3.5.x_build] [ERROR] Re-run Maven using the -X switch to enable full debug logging.
[linux-jdk9-m3.5.x_build] [ERROR]
[linux-jdk9-m3.5.x_build] [ERROR] For more information about the errors and possible solutions, please read the following articles:
[linux-jdk9-m3.5.x_build] [ERROR] [Help 1] http://cwiki.apache.org/confluence/display/MAVEN/MojoFailureException
[linux-jdk10-m3.5.x_build] [INFO] run post-build script verify.groovy
[linux-jdk10-m3.5.x_build] [INFO]           cli-options/compress-0/pom.xml ................... FAILED (3.0 s)
[linux-jdk10-m3.5.x_build] [INFO]   The post-build script returned false.
[linux-jdk10-m3.5.x_build] [INFO] Building: cli-options/compress-1/pom.xml
[Pipeline] [linux-jdk9-m3.5.x_build] }
[Pipeline] [linux-jdk9-m3.5.x_build] // dir
[linux-jdk10-m3.5.x_build] [INFO] run post-build script verify.groovy
[linux-jdk10-m3.5.x_build] [INFO]           cli-options/compress-1/pom.xml ................... FAILED (3.1 s)
[linux-jdk10-m3.5.x_build] [INFO]   The post-build script returned false.
[linux-jdk10-m3.5.x_build] [INFO]
[linux-jdk10-m3.5.x_build] [INFO] --- mrm-maven-plugin:1.1.0:stop (default) @ maven-jlink-plugin ---
[linux-jdk10-m3.5.x_build] [INFO] Stopping Mock Repository Manager on http://localhost:36226
[linux-jdk10-m3.5.x_build] [INFO] Stopped SocketConnector@0.0.0.0:36226
[linux-jdk10-m3.5.x_build] [INFO] Mock Repository Manager http://localhost:36226 is stopped.
[linux-jdk10-m3.5.x_build] [INFO]
[linux-jdk10-m3.5.x_build] [INFO] --- maven-checkstyle-plugin:3.0.0:check (checkstyle-check) @ maven-jlink-plugin ---
[linux-jdk10-m3.5.x_build] [INFO] Downloading from central: https://repo.maven.apache.org/maven2/org/apache/maven/shared/maven-shared-resources/2/maven-shared-resources-2.pom
[linux-jdk10-m3.5.x_build] [INFO] Downloaded from central: https://repo.maven.apache.org/maven2/org/apache/maven/shared/maven-shared-resources/2/maven-shared-resources-2.pom (3.0 kB at 36 kB/s)
[linux-jdk10-m3.5.x_build] [INFO] Downloading from central: https://repo.maven.apache.org/maven2/org/codehaus/plexus/plexus-utils/3.0.10/plexus-utils-3.0.10.pom
[linux-jdk10-m3.5.x_build] [INFO] Downloaded from central: https://repo.maven.apache.org/maven2/org/codehaus/plexus/plexus-utils/3.0.10/plexus-utils-3.0.10.pom (3.1 kB at 262 kB/s)
[linux-jdk10-m3.5.x_build] [INFO] Downloading from central: https://repo.maven.apache.org/maven2/org/codehaus/plexus/plexus/3.3/plexus-3.3.pom
[linux-jdk10-m3.5.x_build] [INFO] Downloaded from central: https://repo.maven.apache.org/maven2/org/codehaus/plexus/plexus/3.3/plexus-3.3.pom (20 kB at 1.2 MB/s)
[linux-jdk10-m3.5.x_build] [INFO] Downloading from central: https://repo.maven.apache.org/maven2/org/apache/maven/doxia/doxia-integration-tools/1.6/doxia-integration-tools-1.6.pom
[linux-jdk10-m3.5.x_build] [INFO] Downloaded from central: https://repo.maven.apache.org/maven2/org/apache/maven/doxia/doxia-integration-tools/1.6/doxia-integration-tools-1.6.pom (7.0 kB at 290 kB/s)
[linux-jdk10-m3.5.x_build] [INFO] Downloading from central: https://repo.maven.apache.org/maven2/org/apache/maven/doxia/doxia-tools/3/doxia-tools-3.pom
[linux-jdk10-m3.5.x_build] [INFO] Downloaded from central: https://repo.maven.apache.org/maven2/org/apache/maven/doxia/doxia-tools/3/doxia-tools-3.pom (9.9 kB at 709 kB/s)
[linux-jdk10-m3.5.x_build] [INFO] Downloading from central: https://repo.maven.apache.org/maven2/org/codehaus/plexus/plexus-resources/1.1.0/plexus-resources-1.1.0.pom
[linux-jdk10-m3.5.x_build] [INFO] Downloaded from central: https://repo.maven.apache.org/maven2/org/codehaus/plexus/plexus-resources/1.1.0/plexus-resources-1.1.0.pom (3.2 kB at 244 kB/s)
[linux-jdk10-m3.5.x_build] [INFO] Downloading from central: https://repo.maven.apache.org/maven2/com/puppycrawl/tools/checkstyle/6.18/checkstyle-6.18.pom
[linux-jdk10-m3.5.x_build] [INFO] Downloaded from central: https://repo.maven.apache.org/maven2/com/puppycrawl/tools/checkstyle/6.18/checkstyle-6.18.pom (71 kB at 2.5 MB/s)
[linux-jdk10-m3.5.x_build] [INFO] Downloading from central: https://repo.maven.apache.org/maven2/antlr/antlr/2.7.7/antlr-2.7.7.pom
[linux-jdk10-m3.5.x_build] [INFO] Downloaded from central: https://repo.maven.apache.org/maven2/antlr/antlr/2.7.7/antlr-2.7.7.pom (632 B at 57 kB/s)
[linux-jdk10-m3.5.x_build] [INFO] Downloading from central: https://repo.maven.apache.org/maven2/org/antlr/antlr4-runtime/4.5.3/antlr4-runtime-4.5.3.pom
[linux-jdk10-m3.5.x_build] [INFO] Downloaded from central: https://repo.maven.apache.org/maven2/org/antlr/antlr4-runtime/4.5.3/antlr4-runtime-4.5.3.pom (2.3 kB at 192 kB/s)
[linux-jdk10-m3.5.x_build] [INFO] Downloading from central: https://repo.maven.apache.org/maven2/org/antlr/antlr4-master/4.5.3/antlr4-master-4.5.3.pom
[linux-jdk10-m3.5.x_build] [INFO] Downloaded from central: https://repo.maven.apache.org/maven2/org/antlr/antlr4-master/4.5.3/antlr4-master-4.5.3.pom (3.7 kB at 307 kB/s)
[linux-jdk10-m3.5.x_build] [INFO] Downloading from central: https://repo.maven.apache.org/maven2/commons-beanutils/commons-beanutils/1.9.2/commons-beanutils-1.9.2.pom
[linux-jdk10-m3.5.x_build] [INFO] Downloaded from central: https://repo.maven.apache.org/maven2/commons-beanutils/commons-beanutils/1.9.2/commons-beanutils-1.9.2.pom (14 kB at 1.1 MB/s)
[linux-jdk10-m3.5.x_build] [INFO] Downloading from central: https://repo.maven.apache.org/maven2/org/apache/commons/commons-parent/33/commons-parent-33.pom
[linux-jdk10-m3.5.x_build] [INFO] Downloaded from central: https://repo.maven.apache.org/maven2/org/apache/commons/commons-parent/33/commons-parent-33.pom (53 kB at 2.7 MB/s)
[linux-jdk10-m3.5.x_build] [INFO] Downloading from central: https://repo.maven.apache.org/maven2/commons-cli/commons-cli/1.3.1/commons-cli-1.3.1.pom
[linux-jdk10-m3.5.x_build] [INFO] Downloaded from central: https://repo.maven.apache.org/maven2/commons-cli/commons-cli/1.3.1/commons-cli-1.3.1.pom (10 kB at 799 kB/s)
[linux-jdk10-m3.5.x_build] [INFO] Downloading from central: https://repo.maven.apache.org/maven2/com/google/guava/guava/19.0/guava-19.0.pom
[linux-jdk10-m3.5.x_build] [INFO] Downloaded from central: https://repo.maven.apache.org/maven2/com/google/guava/guava/19.0/guava-19.0.pom (6.8 kB at 522 kB/s)
[linux-jdk10-m3.5.x_build] [INFO] Downloading from central: https://repo.maven.apache.org/maven2/com/google/guava/guava-parent/19.0/guava-parent-19.0.pom
[linux-jdk10-m3.5.x_build] [INFO] Downloaded from central: https://repo.maven.apache.org/maven2/com/google/guava/guava-parent/19.0/guava-parent-19.0.pom (9.9 kB at 760 kB/s)
[linux-jdk10-m3.5.x_build] [INFO] Downloading from central: https://repo.maven.apache.org/maven2/org/sonatype/oss/oss-parent/7/oss-parent-7.pom
[linux-jdk10-m3.5.x_build] [INFO] Downloaded from central: https://repo.maven.apache.org/maven2/org/sonatype/oss/oss-parent/7/oss-parent-7.pom (4.8 kB at 402 kB/s)
[linux-jdk10-m3.5.x_build] [INFO] Downloading from central: https://repo.maven.apache.org/maven2/javax/xml/bind/jaxb-api/2.3.0/jaxb-api-2.3.0.pom
[linux-jdk10-m3.5.x_build] [INFO] Downloaded from central: https://repo.maven.apache.org/maven2/javax/xml/bind/jaxb-api/2.3.0/jaxb-api-2.3.0.pom (23 kB at 1.4 MB/s)
[linux-jdk10-m3.5.x_build] [INFO] Downloading from central: https://repo.maven.apache.org/maven2/javax/xml/bind/jaxb-api-parent/2.3.0/jaxb-api-parent-2.3.0.pom
[linux-jdk10-m3.5.x_build] [INFO] Downloaded from central: https://repo.maven.apache.org/maven2/javax/xml/bind/jaxb-api-parent/2.3.0/jaxb-api-parent-2.3.0.pom (5.6 kB at 470 kB/s)
[linux-jdk10-m3.5.x_build] [INFO] Downloading from central: https://repo.maven.apache.org/maven2/net/java/jvnet-parent/5/jvnet-parent-5.pom
[linux-jdk10-m3.5.x_build] [INFO] Downloaded from central: https://repo.maven.apache.org/maven2/net/java/jvnet-parent/5/jvnet-parent-5.pom (8.9 kB at 682 kB/s)
[linux-jdk10-m3.5.x_build] [INFO] Downloading from central: https://repo.maven.apache.org/maven2/org/apache/maven/shared/maven-shared-resources/2/maven-shared-resources-2.jar
[linux-jdk10-m3.5.x_build] [INFO] Downloading from central: https://repo.maven.apache.org/maven2/org/apache/maven/doxia/doxia-core/1.2/doxia-core-1.2.jar
[linux-jdk10-m3.5.x_build] [INFO] Downloading from central: https://repo.maven.apache.org/maven2/commons-logging/commons-logging/1.0.4/commons-logging-1.0.4.jar
[linux-jdk10-m3.5.x_build] [INFO] Downloading from central: https://repo.maven.apache.org/maven2/commons-digester/commons-digester/1.6/commons-digester-1.6.jar
[linux-jdk10-m3.5.x_build] [INFO] Downloading from central: https://repo.maven.apache.org/maven2/org/apache/maven/doxia/doxia-integration-tools/1.6/doxia-integration-tools-1.6.jar
[linux-jdk10-m3.5.x_build] [INFO] Downloaded from central: https://repo.maven.apache.org/maven2/org/apache/maven/shared/maven-shared-resources/2/maven-shared-resources-2.jar (13 kB at 568 kB/s)
[linux-jdk10-m3.5.x_build] [INFO] Downloading from central: https://repo.maven.apache.org/maven2/commons-io/commons-io/1.4/commons-io-1.4.jar
[linux-jdk10-m3.5.x_build] [INFO] Downloaded from central: https://repo.maven.apache.org/maven2/commons-logging/commons-logging/1.0.4/commons-logging-1.0.4.jar (38 kB at 1.1 MB/s)
[linux-jdk10-m3.5.x_build] [INFO] Downloading from central: https://repo.maven.apache.org/maven2/org/codehaus/plexus/plexus-resources/1.1.0/plexus-resources-1.1.0.jar
[linux-jdk10-m3.5.x_build] [INFO] Downloaded from central: https://repo.maven.apache.org/maven2/org/apache/maven/doxia/doxia-integration-tools/1.6/doxia-integration-tools-1.6.jar (45 kB at 1.2 MB/s)
[linux-jdk10-m3.5.x_build] [INFO] Downloading from central: https://repo.maven.apache.org/maven2/com/puppycrawl/tools/checkstyle/6.18/checkstyle-6.18.jar
[linux-jdk10-m3.5.x_build] [INFO] Downloaded from central: https://repo.maven.apache.org/maven2/commons-digester/commons-digester/1.6/commons-digester-1.6.jar (168 kB at 3.5 MB/s)
[linux-jdk10-m3.5.x_build] [INFO] Downloading from central: https://repo.maven.apache.org/maven2/antlr/antlr/2.7.7/antlr-2.7.7.jar
[linux-jdk10-m3.5.x_build] [INFO] Downloaded from central: https://repo.maven.apache.org/maven2/org/apache/maven/doxia/doxia-core/1.2/doxia-core-1.2.jar (154 kB at 3.0 MB/s)
[linux-jdk10-m3.5.x_build] [INFO] Downloading from central: https://repo.maven.apache.org/maven2/org/antlr/antlr4-runtime/4.5.3/antlr4-runtime-4.5.3.jar
[linux-jdk10-m3.5.x_build] [INFO] Downloaded from central: https://repo.maven.apache.org/maven2/org/codehaus/plexus/plexus-resources/1.1.0/plexus-resources-1.1.0.jar (23 kB at 494 kB/s)
[linux-jdk10-m3.5.x_build] [INFO] Downloading from central: https://repo.maven.apache.org/maven2/commons-beanutils/commons-beanutils/1.9.2/commons-beanutils-1.9.2.jar
[linux-jdk10-m3.5.x_build] [INFO] Downloaded from central: https://repo.maven.apache.org/maven2/commons-io/commons-io/1.4/commons-io-1.4.jar (109 kB at 2.3 MB/s)
[linux-jdk10-m3.5.x_build] [INFO] Downloading from central: https://repo.maven.apache.org/maven2/commons-cli/commons-cli/1.3.1/commons-cli-1.3.1.jar
[linux-jdk10-m3.5.x_build] [INFO] Downloaded from central: https://repo.maven.apache.org/maven2/commons-cli/commons-cli/1.3.1/commons-cli-1.3.1.jar (53 kB at 815 kB/s)
[linux-jdk10-m3.5.x_build] [INFO] Downloading from central: https://repo.maven.apache.org/maven2/com/google/guava/guava/19.0/guava-19.0.jar
[linux-jdk10-m3.5.x_build] [INFO] Downloaded from central: https://repo.maven.apache.org/maven2/commons-beanutils/commons-beanutils/1.9.2/commons-beanutils-1.9.2.jar (234 kB at 3.3 MB/s)
[linux-jdk10-m3.5.x_build] [INFO] Downloading from central: https://repo.maven.apache.org/maven2/javax/xml/bind/jaxb-api/2.3.0/jaxb-api-2.3.0.jar
[linux-jdk10-m3.5.x_build] [INFO] Downloaded from central: https://repo.maven.apache.org/maven2/org/antlr/antlr4-runtime/4.5.3/antlr4-runtime-4.5.3.jar (302 kB at 3.9 MB/s)
[linux-jdk10-m3.5.x_build] [INFO] Downloaded from central: https://repo.maven.apache.org/maven2/antlr/antlr/2.7.7/antlr-2.7.7.jar (445 kB at 5.2 MB/s)
[linux-jdk10-m3.5.x_build] [INFO] Downloaded from central: https://repo.maven.apache.org/maven2/javax/xml/bind/jaxb-api/2.3.0/jaxb-api-2.3.0.jar (126 kB at 1.4 MB/s)
[linux-jdk10-m3.5.x_build] [INFO] Downloaded from central: https://repo.maven.apache.org/maven2/com/puppycrawl/tools/checkstyle/6.18/checkstyle-6.18.jar (1.2 MB at 9.5 MB/s)
[linux-jdk10-m3.5.x_build] [INFO] Downloaded from central: https://repo.maven.apache.org/maven2/com/google/guava/guava/19.0/guava-19.0.jar (2.3 MB at 11 MB/s)
[linux-jdk10-m3.5.x_build] [INFO]
[linux-jdk10-m3.5.x_build] [INFO] --- maven-invoker-plugin:3.1.0:verify (integration-test) @ maven-jlink-plugin ---
[linux-jdk10-m3.5.x_build] [INFO] -------------------------------------------------
[linux-jdk10-m3.5.x_build] [INFO] Build Summary:
[linux-jdk10-m3.5.x_build] [INFO]   Passed: 3, Failed: 12, Errors: 0, Skipped: 0
[linux-jdk10-m3.5.x_build] [INFO] -------------------------------------------------
[linux-jdk10-m3.5.x_build] [ERROR] The following builds failed:
[linux-jdk10-m3.5.x_build] [ERROR] *  cli-options/no-header-files/pom.xml
[linux-jdk10-m3.5.x_build] [ERROR] *  cli-options/no-man-pages/pom.xml
[linux-jdk10-m3.5.x_build] [ERROR] *  cli-options/compress-2/pom.xml
[linux-jdk10-m3.5.x_build] [ERROR] *  cli-options/bind-services/pom.xml
[linux-jdk10-m3.5.x_build] [ERROR] *  setup-jar-module-info/pom.xml
[linux-jdk10-m3.5.x_build] [ERROR] *  cli-options/compress-0/pom.xml
[linux-jdk10-m3.5.x_build] [ERROR] *  cli-options/ignore-signing-information/pom.xml
[linux-jdk10-m3.5.x_build] [ERROR] *  cli-options/endian/pom.xml
[linux-jdk10-m3.5.x_build] [ERROR] *  cli-options/endian-big/pom.xml
[linux-jdk10-m3.5.x_build] [ERROR] *  cli-options/strip-debug/pom.xml
[linux-jdk10-m3.5.x_build] [ERROR] *  cli-options/compress-1/pom.xml
[linux-jdk10-m3.5.x_build] [ERROR] *  cli-options/disable-plugin/pom.xml
[linux-jdk10-m3.5.x_build] [INFO] -------------------------------------------------
[linux-jdk10-m3.5.x_build] [INFO] ------------------------------------------------------------------------
[linux-jdk10-m3.5.x_build] [INFO] BUILD FAILURE
[linux-jdk10-m3.5.x_build] [INFO] ------------------------------------------------------------------------
[linux-jdk10-m3.5.x_build] [INFO] Total time: 01:25 min
[linux-jdk10-m3.5.x_build] [INFO] Finished at: 2018-09-12T10:41:32Z
[linux-jdk10-m3.5.x_build] [INFO] ------------------------------------------------------------------------
[linux-jdk10-m3.5.x_build] [INFO] [jenkins-event-spy] Generated /home/jenkins/jenkins-slave/workspace/_maven-jlink-plugin_CLEANUP-YYRC5VLF7HAIAIEICXGYPF25BOQW6NXDQRTJOEZNHEUF2NVU67EA@2@tmp/withMaven569089b8/maven-spy-20180912-104007-11316665418773526631390.log
[linux-jdk10-m3.5.x_build] [ERROR] Failed to execute goal org.apache.maven.plugins:maven-invoker-plugin:3.1.0:verify (integration-test) on project maven-jlink-plugin: 12 builds failed. See console output above for details. -> [Help 1]
[linux-jdk10-m3.5.x_build] [ERROR]
[linux-jdk10-m3.5.x_build] [ERROR] To see the full stack trace of the errors, re-run Maven with the -e switch.
[linux-jdk10-m3.5.x_build] [ERROR] Re-run Maven using the -X switch to enable full debug logging.
[linux-jdk10-m3.5.x_build] [ERROR]
[linux-jdk10-m3.5.x_build] [ERROR] For more information about the errors and possible solutions, please read the following articles:
[linux-jdk10-m3.5.x_build] [ERROR] [Help 1] http://cwiki.apache.org/confluence/display/MAVEN/MojoFailureException
[Pipeline] [linux-jdk9-m3.5.x_build] }
[linux-jdk9-m3.5.x_build] [Fast Archiver] No prior successful build to compare, so performing full copy of artifacts
[linux-jdk9-m3.5.x_build] [withMaven] invokerPublisher - Archive invoker results for Maven artifact MavenArtifact{org.apache.maven.plugins:maven-jlink-plugin::3.0.0-alpha-2-SNAPSHOT(version: 3.0.0-alpha-2-SNAPSHOT, snapshot:false) } generated by PluginInvocation{org.apache.maven.plugins:maven-invoker-plugin:3.1.0@integration-test  integration-test}: linux-jdk9-m3.5.x_build/target/invoker-reports/*.xml
[linux-jdk9-m3.5.x_build] performing MavenInvokerRecorder, reportsFilenamePattern:'**/linux-jdk9-m3.5.x_build/target/invoker-reports/BUILD*.xml', invokerBuildDir:'**/linux-jdk9-m3.5.x_build/target/it'
[linux-jdk9-m3.5.x_build] Found reports:[/home/jenkins/jenkins-slave/workspace/_maven-jlink-plugin_CLEANUP-YYRC5VLF7HAIAIEICXGYPF25BOQW6NXDQRTJOEZNHEUF2NVU67EA/linux-jdk9-m3.5.x_build/target/invoker-reports/BUILD-MJLINK-3_improveVerboseOutput.xml, /home/jenkins/jenkins-slave/workspace/_maven-jlink-plugin_CLEANUP-YYRC5VLF7HAIAIEICXGYPF25BOQW6NXDQRTJOEZNHEUF2NVU67EA/linux-jdk9-m3.5.x_build/target/invoker-reports/BUILD-MJLINK-4_dependencyResolution.xml, /home/jenkins/jenkins-slave/workspace/_maven-jlink-plugin_CLEANUP-YYRC5VLF7HAIAIEICXGYPF25BOQW6NXDQRTJOEZNHEUF2NVU67EA/linux-jdk9-m3.5.x_build/target/invoker-reports/BUILD-cli-options_bind-services.xml, /home/jenkins/jenkins-slave/workspace/_maven-jlink-plugin_CLEANUP-YYRC5VLF7HAIAIEICXGYPF25BOQW6NXDQRTJOEZNHEUF2NVU67EA/linux-jdk9-m3.5.x_build/target/invoker-reports/BUILD-cli-options_compress-0.xml, /home/jenkins/jenkins-slave/workspace/_maven-jlink-plugin_CLEANUP-YYRC5VLF7HAIAIEICXGYPF25BOQW6NXDQRTJOEZNHEUF2NVU67EA/linux-jdk9-m3.5.x_build/target/invoker-reports/BUILD-cli-options_compress-1.xml, /home/jenkins/jenkins-slave/workspace/_maven-jlink-plugin_CLEANUP-YYRC5VLF7HAIAIEICXGYPF25BOQW6NXDQRTJOEZNHEUF2NVU67EA/linux-jdk9-m3.5.x_build/target/invoker-reports/BUILD-cli-options_compress-2.xml, /home/jenkins/jenkins-slave/workspace/_maven-jlink-plugin_CLEANUP-YYRC5VLF7HAIAIEICXGYPF25BOQW6NXDQRTJOEZNHEUF2NVU67EA/linux-jdk9-m3.5.x_build/target/invoker-reports/BUILD-cli-options_disable-plugin.xml, /home/jenkins/jenkins-slave/workspace/_maven-jlink-plugin_CLEANUP-YYRC5VLF7HAIAIEICXGYPF25BOQW6NXDQRTJOEZNHEUF2NVU67EA/linux-jdk9-m3.5.x_build/target/invoker-reports/BUILD-cli-options_endian-big.xml, /home/jenkins/jenkins-slave/workspace/_maven-jlink-plugin_CLEANUP-YYRC5VLF7HAIAIEICXGYPF25BOQW6NXDQRTJOEZNHEUF2NVU67EA/linux-jdk9-m3.5.x_build/target/invoker-reports/BUILD-cli-options_endian.xml, /home/jenkins/jenkins-slave/workspace/_maven-jlink-plugin_CLEANUP-YYRC5VLF7HAIAIEICXGYPF25BOQW6NXDQRTJOEZNHEUF2NVU67EA/linux-jdk9-m3.5.x_build/target/invoker-reports/BUILD-cli-options_ignore-signing-information.xml, /home/jenkins/jenkins-slave/workspace/_maven-jlink-plugin_CLEANUP-YYRC5VLF7HAIAIEICXGYPF25BOQW6NXDQRTJOEZNHEUF2NVU67EA/linux-jdk9-m3.5.x_build/target/invoker-reports/BUILD-cli-options_no-header-files.xml, /home/jenkins/jenkins-slave/workspace/_maven-jlink-plugin_CLEANUP-YYRC5VLF7HAIAIEICXGYPF25BOQW6NXDQRTJOEZNHEUF2NVU67EA/linux-jdk9-m3.5.x_build/target/invoker-reports/BUILD-cli-options_no-man-pages.xml, /home/jenkins/jenkins-slave/workspace/_maven-jlink-plugin_CLEANUP-YYRC5VLF7HAIAIEICXGYPF25BOQW6NXDQRTJOEZNHEUF2NVU67EA/linux-jdk9-m3.5.x_build/target/invoker-reports/BUILD-cli-options_strip-debug.xml, /home/jenkins/jenkins-slave/workspace/_maven-jlink-plugin_CLEANUP-YYRC5VLF7HAIAIEICXGYPF25BOQW6NXDQRTJOEZNHEUF2NVU67EA/linux-jdk9-m3.5.x_build/target/invoker-reports/BUILD-setup-jar-module-info.xml, /home/jenkins/jenkins-slave/workspace/_maven-jlink-plugin_CLEANUP-YYRC5VLF7HAIAIEICXGYPF25BOQW6NXDQRTJOEZNHEUF2NVU67EA/linux-jdk9-m3.5.x_build/target/invoker-reports/BUILD-setup-jar.xml]
[linux-jdk9-m3.5.x_build] Found logs:[/home/jenkins/jenkins-slave/workspace/_maven-jlink-plugin_CLEANUP-YYRC5VLF7HAIAIEICXGYPF25BOQW6NXDQRTJOEZNHEUF2NVU67EA/linux-jdk9-m3.5.x_build/target/it/MJLINK-3_improveVerboseOutput/build.log, /home/jenkins/jenkins-slave/workspace/_maven-jlink-plugin_CLEANUP-YYRC5VLF7HAIAIEICXGYPF25BOQW6NXDQRTJOEZNHEUF2NVU67EA/linux-jdk9-m3.5.x_build/target/it/MJLINK-4_dependencyResolution/build.log, /home/jenkins/jenkins-slave/workspace/_maven-jlink-plugin_CLEANUP-YYRC5VLF7HAIAIEICXGYPF25BOQW6NXDQRTJOEZNHEUF2NVU67EA/linux-jdk9-m3.5.x_build/target/it/cli-options/bind-services/build.log, /home/jenkins/jenkins-slave/workspace/_maven-jlink-plugin_CLEANUP-YYRC5VLF7HAIAIEICXGYPF25BOQW6NXDQRTJOEZNHEUF2NVU67EA/linux-jdk9-m3.5.x_build/target/it/cli-options/compress-0/build.log, /home/jenkins/jenkins-slave/workspace/_maven-jlink-plugin_CLEANUP-YYRC5VLF7HAIAIEICXGYPF25BOQW6NXDQRTJOEZNHEUF2NVU67EA/linux-jdk9-m3.5.x_build/target/it/cli-options/compress-1/build.log, /home/jenkins/jenkins-slave/workspace/_maven-jlink-plugin_CLEANUP-YYRC5VLF7HAIAIEICXGYPF25BOQW6NXDQRTJOEZNHEUF2NVU67EA/linux-jdk9-m3.5.x_build/target/it/cli-options/compress-2/build.log, /home/jenkins/jenkins-slave/workspace/_maven-jlink-plugin_CLEANUP-YYRC5VLF7HAIAIEICXGYPF25BOQW6NXDQRTJOEZNHEUF2NVU67EA/linux-jdk9-m3.5.x_build/target/it/cli-options/disable-plugin/build.log, /home/jenkins/jenkins-slave/workspace/_maven-jlink-plugin_CLEANUP-YYRC5VLF7HAIAIEICXGYPF25BOQW6NXDQRTJOEZNHEUF2NVU67EA/linux-jdk9-m3.5.x_build/target/it/cli-options/endian-big/build.log, /home/jenkins/jenkins-slave/workspace/_maven-jlink-plugin_CLEANUP-YYRC5VLF7HAIAIEICXGYPF25BOQW6NXDQRTJOEZNHEUF2NVU67EA/linux-jdk9-m3.5.x_build/target/it/cli-options/endian/build.log, /home/jenkins/jenkins-slave/workspace/_maven-jlink-plugin_CLEANUP-YYRC5VLF7HAIAIEICXGYPF25BOQW6NXDQRTJOEZNHEUF2NVU67EA/linux-jdk9-m3.5.x_build/target/it/cli-options/ignore-signing-information/build.log, /home/jenkins/jenkins-slave/workspace/_maven-jlink-plugin_CLEANUP-YYRC5VLF7HAIAIEICXGYPF25BOQW6NXDQRTJOEZNHEUF2NVU67EA/linux-jdk9-m3.5.x_build/target/it/cli-options/no-header-files/build.log, /home/jenkins/jenkins-slave/workspace/_maven-jlink-plugin_CLEANUP-YYRC5VLF7HAIAIEICXGYPF25BOQW6NXDQRTJOEZNHEUF2NVU67EA/linux-jdk9-m3.5.x_build/target/it/cli-options/no-man-pages/build.log, /home/jenkins/jenkins-slave/workspace/_maven-jlink-plugin_CLEANUP-YYRC5VLF7HAIAIEICXGYPF25BOQW6NXDQRTJOEZNHEUF2NVU67EA/linux-jdk9-m3.5.x_build/target/it/cli-options/strip-debug/build.log, /home/jenkins/jenkins-slave/workspace/_maven-jlink-plugin_CLEANUP-YYRC5VLF7HAIAIEICXGYPF25BOQW6NXDQRTJOEZNHEUF2NVU67EA/linux-jdk9-m3.5.x_build/target/it/setup-jar-module-info/build.log, /home/jenkins/jenkins-slave/workspace/_maven-jlink-plugin_CLEANUP-YYRC5VLF7HAIAIEICXGYPF25BOQW6NXDQRTJOEZNHEUF2NVU67EA/linux-jdk9-m3.5.x_build/target/it/setup-jar/build.log]
[linux-jdk9-m3.5.x_build] Finished parsing Maven Invoker results (found 15)
[linux-jdk9-m3.5.x_build] [withMaven] junitPublisher - Archive test results for Maven artifact org.apache.maven.plugins:maven-jlink-plugin:3.0.0-alpha-2-SNAPSHOT generated by maven-surefire-plugin:test (default-test): linux-jdk9-m3.5.x_build/target/surefire-reports/*.xml
[linux-jdk9-m3.5.x_build] Recording test results
[linux-jdk9-m3.5.x_build] [withMaven] openTasksPublisher - Scan Tasks for Maven artifact org.apache.maven.plugins:maven-jlink-plugin:3.0.0-alpha-2-SNAPSHOT in source directory linux-jdk9-m3.5.x_build/src/main/java
[linux-jdk9-m3.5.x_build] [TASKS] Scanning folder '/home/jenkins/jenkins-slave/workspace/_maven-jlink-plugin_CLEANUP-YYRC5VLF7HAIAIEICXGYPF25BOQW6NXDQRTJOEZNHEUF2NVU67EA' for files matching the pattern 'linux-jdk9-m3.5.x_build/src/main/java/**/*' - excludes: null
[linux-jdk9-m3.5.x_build] [TASKS] Found 2 files to scan for tasks
[linux-jdk9-m3.5.x_build] [TASKS] Found 5 open tasks.
[linux-jdk9-m3.5.x_build] Skipping warnings blame since pipelines do not have an SCM link.%n
[Pipeline] [linux-jdk9-m3.5.x_build] // withMaven
[Pipeline] [linux-jdk9-m3.5.x_build] cleanWs
[Pipeline] [linux-jdk10-m3.5.x_build] }
[Pipeline] [linux-jdk10-m3.5.x_build] // dir
[linux-jdk9-m3.5.x_build] [WS-CLEANUP] Deleting project workspace...[WS-CLEANUP] done
[Pipeline] [linux-jdk10-m3.5.x_build] }
[linux-jdk10-m3.5.x_build] [Fast Archiver] No prior successful build to compare, so performing full copy of artifacts
[linux-jdk10-m3.5.x_build] [withMaven] invokerPublisher - Archive invoker results for Maven artifact MavenArtifact{org.apache.maven.plugins:maven-jlink-plugin::3.0.0-alpha-2-SNAPSHOT(version: 3.0.0-alpha-2-SNAPSHOT, snapshot:false) } generated by PluginInvocation{org.apache.maven.plugins:maven-invoker-plugin:3.1.0@integration-test  integration-test}: linux-jdk10-m3.5.x_build/target/invoker-reports/*.xml
[linux-jdk10-m3.5.x_build] performing MavenInvokerRecorder, reportsFilenamePattern:'**/linux-jdk10-m3.5.x_build/target/invoker-reports/BUILD*.xml', invokerBuildDir:'**/linux-jdk10-m3.5.x_build/target/it'
[linux-jdk10-m3.5.x_build] Found reports:[/home/jenkins/jenkins-slave/workspace/_maven-jlink-plugin_CLEANUP-YYRC5VLF7HAIAIEICXGYPF25BOQW6NXDQRTJOEZNHEUF2NVU67EA@2/linux-jdk10-m3.5.x_build/target/invoker-reports/BUILD-MJLINK-3_improveVerboseOutput.xml, /home/jenkins/jenkins-slave/workspace/_maven-jlink-plugin_CLEANUP-YYRC5VLF7HAIAIEICXGYPF25BOQW6NXDQRTJOEZNHEUF2NVU67EA@2/linux-jdk10-m3.5.x_build/target/invoker-reports/BUILD-MJLINK-4_dependencyResolution.xml, /home/jenkins/jenkins-slave/workspace/_maven-jlink-plugin_CLEANUP-YYRC5VLF7HAIAIEICXGYPF25BOQW6NXDQRTJOEZNHEUF2NVU67EA@2/linux-jdk10-m3.5.x_build/target/invoker-reports/BUILD-cli-options_bind-services.xml, /home/jenkins/jenkins-slave/workspace/_maven-jlink-plugin_CLEANUP-YYRC5VLF7HAIAIEICXGYPF25BOQW6NXDQRTJOEZNHEUF2NVU67EA@2/linux-jdk10-m3.5.x_build/target/invoker-reports/BUILD-cli-options_compress-0.xml, /home/jenkins/jenkins-slave/workspace/_maven-jlink-plugin_CLEANUP-YYRC5VLF7HAIAIEICXGYPF25BOQW6NXDQRTJOEZNHEUF2NVU67EA@2/linux-jdk10-m3.5.x_build/target/invoker-reports/BUILD-cli-options_compress-1.xml, /home/jenkins/jenkins-slave/workspace/_maven-jlink-plugin_CLEANUP-YYRC5VLF7HAIAIEICXGYPF25BOQW6NXDQRTJOEZNHEUF2NVU67EA@2/linux-jdk10-m3.5.x_build/target/invoker-reports/BUILD-cli-options_compress-2.xml, /home/jenkins/jenkins-slave/workspace/_maven-jlink-plugin_CLEANUP-YYRC5VLF7HAIAIEICXGYPF25BOQW6NXDQRTJOEZNHEUF2NVU67EA@2/linux-jdk10-m3.5.x_build/target/invoker-reports/BUILD-cli-options_disable-plugin.xml, /home/jenkins/jenkins-slave/workspace/_maven-jlink-plugin_CLEANUP-YYRC5VLF7HAIAIEICXGYPF25BOQW6NXDQRTJOEZNHEUF2NVU67EA@2/linux-jdk10-m3.5.x_build/target/invoker-reports/BUILD-cli-options_endian-big.xml, /home/jenkins/jenkins-slave/workspace/_maven-jlink-plugin_CLEANUP-YYRC5VLF7HAIAIEICXGYPF25BOQW6NXDQRTJOEZNHEUF2NVU67EA@2/linux-jdk10-m3.5.x_build/target/invoker-reports/BUILD-cli-options_endian.xml, /home/jenkins/jenkins-slave/workspace/_maven-jlink-plugin_CLEANUP-YYRC5VLF7HAIAIEICXGYPF25BOQW6NXDQRTJOEZNHEUF2NVU67EA@2/linux-jdk10-m3.5.x_build/target/invoker-reports/BUILD-cli-options_ignore-signing-information.xml, /home/jenkins/jenkins-slave/workspace/_maven-jlink-plugin_CLEANUP-YYRC5VLF7HAIAIEICXGYPF25BOQW6NXDQRTJOEZNHEUF2NVU67EA@2/linux-jdk10-m3.5.x_build/target/invoker-reports/BUILD-cli-options_no-header-files.xml, /home/jenkins/jenkins-slave/workspace/_maven-jlink-plugin_CLEANUP-YYRC5VLF7HAIAIEICXGYPF25BOQW6NXDQRTJOEZNHEUF2NVU67EA@2/linux-jdk10-m3.5.x_build/target/invoker-reports/BUILD-cli-options_no-man-pages.xml, /home/jenkins/jenkins-slave/workspace/_maven-jlink-plugin_CLEANUP-YYRC5VLF7HAIAIEICXGYPF25BOQW6NXDQRTJOEZNHEUF2NVU67EA@2/linux-jdk10-m3.5.x_build/target/invoker-reports/BUILD-cli-options_strip-debug.xml, /home/jenkins/jenkins-slave/workspace/_maven-jlink-plugin_CLEANUP-YYRC5VLF7HAIAIEICXGYPF25BOQW6NXDQRTJOEZNHEUF2NVU67EA@2/linux-jdk10-m3.5.x_build/target/invoker-reports/BUILD-setup-jar-module-info.xml, /home/jenkins/jenkins-slave/workspace/_maven-jlink-plugin_CLEANUP-YYRC5VLF7HAIAIEICXGYPF25BOQW6NXDQRTJOEZNHEUF2NVU67EA@2/linux-jdk10-m3.5.x_build/target/invoker-reports/BUILD-setup-jar.xml]
[linux-jdk10-m3.5.x_build] Found logs:[/home/jenkins/jenkins-slave/workspace/_maven-jlink-plugin_CLEANUP-YYRC5VLF7HAIAIEICXGYPF25BOQW6NXDQRTJOEZNHEUF2NVU67EA@2/linux-jdk10-m3.5.x_build/target/it/MJLINK-3_improveVerboseOutput/build.log, /home/jenkins/jenkins-slave/workspace/_maven-jlink-plugin_CLEANUP-YYRC5VLF7HAIAIEICXGYPF25BOQW6NXDQRTJOEZNHEUF2NVU67EA@2/linux-jdk10-m3.5.x_build/target/it/MJLINK-4_dependencyResolution/build.log, /home/jenkins/jenkins-slave/workspace/_maven-jlink-plugin_CLEANUP-YYRC5VLF7HAIAIEICXGYPF25BOQW6NXDQRTJOEZNHEUF2NVU67EA@2/linux-jdk10-m3.5.x_build/target/it/cli-options/bind-services/build.log, /home/jenkins/jenkins-slave/workspace/_maven-jlink-plugin_CLEANUP-YYRC5VLF7HAIAIEICXGYPF25BOQW6NXDQRTJOEZNHEUF2NVU67EA@2/linux-jdk10-m3.5.x_build/target/it/cli-options/compress-0/build.log, /home/jenkins/jenkins-slave/workspace/_maven-jlink-plugin_CLEANUP-YYRC5VLF7HAIAIEICXGYPF25BOQW6NXDQRTJOEZNHEUF2NVU67EA@2/linux-jdk10-m3.5.x_build/target/it/cli-options/compress-1/build.log, /home/jenkins/jenkins-slave/workspace/_maven-jlink-plugin_CLEANUP-YYRC5VLF7HAIAIEICXGYPF25BOQW6NXDQRTJOEZNHEUF2NVU67EA@2/linux-jdk10-m3.5.x_build/target/it/cli-options/compress-2/build.log, /home/jenkins/jenkins-slave/workspace/_maven-jlink-plugin_CLEANUP-YYRC5VLF7HAIAIEICXGYPF25BOQW6NXDQRTJOEZNHEUF2NVU67EA@2/linux-jdk10-m3.5.x_build/target/it/cli-options/disable-plugin/build.log, /home/jenkins/jenkins-slave/workspace/_maven-jlink-plugin_CLEANUP-YYRC5VLF7HAIAIEICXGYPF25BOQW6NXDQRTJOEZNHEUF2NVU67EA@2/linux-jdk10-m3.5.x_build/target/it/cli-options/endian-big/build.log, /home/jenkins/jenkins-slave/workspace/_maven-jlink-plugin_CLEANUP-YYRC5VLF7HAIAIEICXGYPF25BOQW6NXDQRTJOEZNHEUF2NVU67EA@2/linux-jdk10-m3.5.x_build/target/it/cli-options/endian/build.log, /home/jenkins/jenkins-slave/workspace/_maven-jlink-plugin_CLEANUP-YYRC5VLF7HAIAIEICXGYPF25BOQW6NXDQRTJOEZNHEUF2NVU67EA@2/linux-jdk10-m3.5.x_build/target/it/cli-options/ignore-signing-information/build.log, /home/jenkins/jenkins-slave/workspace/_maven-jlink-plugin_CLEANUP-YYRC5VLF7HAIAIEICXGYPF25BOQW6NXDQRTJOEZNHEUF2NVU67EA@2/linux-jdk10-m3.5.x_build/target/it/cli-options/no-header-files/build.log, /home/jenkins/jenkins-slave/workspace/_maven-jlink-plugin_CLEANUP-YYRC5VLF7HAIAIEICXGYPF25BOQW6NXDQRTJOEZNHEUF2NVU67EA@2/linux-jdk10-m3.5.x_build/target/it/cli-options/no-man-pages/build.log, /home/jenkins/jenkins-slave/workspace/_maven-jlink-plugin_CLEANUP-YYRC5VLF7HAIAIEICXGYPF25BOQW6NXDQRTJOEZNHEUF2NVU67EA@2/linux-jdk10-m3.5.x_build/target/it/cli-options/strip-debug/build.log, /home/jenkins/jenkins-slave/workspace/_maven-jlink-plugin_CLEANUP-YYRC5VLF7HAIAIEICXGYPF25BOQW6NXDQRTJOEZNHEUF2NVU67EA@2/linux-jdk10-m3.5.x_build/target/it/setup-jar-module-info/build.log, /home/jenkins/jenkins-slave/workspace/_maven-jlink-plugin_CLEANUP-YYRC5VLF7HAIAIEICXGYPF25BOQW6NXDQRTJOEZNHEUF2NVU67EA@2/linux-jdk10-m3.5.x_build/target/it/setup-jar/build.log]
[linux-jdk10-m3.5.x_build] Finished parsing Maven Invoker results (found 15)
[linux-jdk10-m3.5.x_build] [withMaven] junitPublisher - Archive test results for Maven artifact org.apache.maven.plugins:maven-jlink-plugin:3.0.0-alpha-2-SNAPSHOT generated by maven-surefire-plugin:test (default-test): linux-jdk10-m3.5.x_build/target/surefire-reports/*.xml
[linux-jdk10-m3.5.x_build] Recording test results
[linux-jdk10-m3.5.x_build] [withMaven] openTasksPublisher - Scan Tasks for Maven artifact org.apache.maven.plugins:maven-jlink-plugin:3.0.0-alpha-2-SNAPSHOT in source directory linux-jdk10-m3.5.x_build/src/main/java
[linux-jdk10-m3.5.x_build] [TASKS] Scanning folder '/home/jenkins/jenkins-slave/workspace/_maven-jlink-plugin_CLEANUP-YYRC5VLF7HAIAIEICXGYPF25BOQW6NXDQRTJOEZNHEUF2NVU67EA@2' for files matching the pattern 'linux-jdk10-m3.5.x_build/src/main/java/**/*' - excludes: null
[linux-jdk10-m3.5.x_build] [TASKS] Found 2 files to scan for tasks
[linux-jdk10-m3.5.x_build] [TASKS] Found 5 open tasks.
[linux-jdk10-m3.5.x_build] Skipping warnings blame since pipelines do not have an SCM link.%n
[Pipeline] [linux-jdk10-m3.5.x_build] // withMaven
[Pipeline] [linux-jdk9-m3.5.x_build] cleanWs
[Pipeline] [linux-jdk10-m3.5.x_build] cleanWs
[linux-jdk9-m3.5.x_build] [WS-CLEANUP] Deleting project workspace...[WS-CLEANUP] done
[linux-jdk10-m3.5.x_build] [WS-CLEANUP] Deleting project workspace...[WS-CLEANUP] done
[Pipeline] [linux-jdk9-m3.5.x_build] }
[Pipeline] [linux-jdk9-m3.5.x_build] // stage
[Pipeline] [linux-jdk9-m3.5.x_build] }
[Pipeline] [linux-jdk10-m3.5.x_build] cleanWs
[Pipeline] [linux-jdk9-m3.5.x_build] // node
[Pipeline] [linux-jdk9-m3.5.x_build] }
[linux-jdk9-m3.5.x_build] Failed in branch linux-jdk9-m3.5.x_build
[linux-jdk10-m3.5.x_build] [WS-CLEANUP] Deleting project workspace...[WS-CLEANUP] done
[Pipeline] [linux-jdk10-m3.5.x_build] }
[Pipeline] [linux-jdk10-m3.5.x_build] // stage
[Pipeline] [linux-jdk10-m3.5.x_build] }
[Pipeline] [linux-jdk10-m3.5.x_build] // node
[Pipeline] [linux-jdk10-m3.5.x_build] }
[linux-jdk10-m3.5.x_build] Failed in branch linux-jdk10-m3.5.x_build
[Pipeline] // parallel
[Pipeline] stage
[Pipeline] { (Notifications)
[Pipeline] echo
Build result: FAILURE
[Pipeline] jiraIssueSelector
[Pipeline] emailext
Reply | Threaded
Open this post in threaded view
|

Build failed in Jenkins: Maven TLP » maven-jlink-plugin » CLEANUP #3

Apache Jenkins Server-2
See https://builds.apache.org/job/maven-box/job/maven-jlink-plugin/job/CLEANUP/3/

No changes.

All tests passed

Build log:
[...truncated 4.56 MB...]
[windows-jdk9-m3.5.x_build] [INFO] Downloading from central: https://repo.maven.apache.org/maven2/com/google/guava/guava-parent/19.0/guava-parent-19.0.pom
[windows-jdk9-m3.5.x_build] [INFO] Downloaded from central: https://repo.maven.apache.org/maven2/com/google/guava/guava-parent/19.0/guava-parent-19.0.pom (9.9 kB at 1.4 MB/s)
[windows-jdk9-m3.5.x_build] [INFO] Downloading from central: https://repo.maven.apache.org/maven2/org/sonatype/oss/oss-parent/7/oss-parent-7.pom
[windows-jdk9-m3.5.x_build] [INFO] Downloaded from central: https://repo.maven.apache.org/maven2/org/sonatype/oss/oss-parent/7/oss-parent-7.pom (4.8 kB at 804 kB/s)
[windows-jdk9-m3.5.x_build] [INFO] Downloading from central: https://repo.maven.apache.org/maven2/javax/xml/bind/jaxb-api/2.3.0/jaxb-api-2.3.0.pom
[windows-jdk9-m3.5.x_build] [INFO] Downloaded from central: https://repo.maven.apache.org/maven2/javax/xml/bind/jaxb-api/2.3.0/jaxb-api-2.3.0.pom (23 kB at 2.9 MB/s)
[windows-jdk9-m3.5.x_build] [INFO] Downloading from central: https://repo.maven.apache.org/maven2/javax/xml/bind/jaxb-api-parent/2.3.0/jaxb-api-parent-2.3.0.pom
[windows-jdk9-m3.5.x_build] [INFO] Downloaded from central: https://repo.maven.apache.org/maven2/javax/xml/bind/jaxb-api-parent/2.3.0/jaxb-api-parent-2.3.0.pom (5.6 kB at 806 kB/s)
[windows-jdk9-m3.5.x_build] [INFO] Downloading from central: https://repo.maven.apache.org/maven2/net/java/jvnet-parent/5/jvnet-parent-5.pom
[windows-jdk9-m3.5.x_build] [INFO] Downloaded from central: https://repo.maven.apache.org/maven2/net/java/jvnet-parent/5/jvnet-parent-5.pom (8.9 kB at 985 kB/s)
[windows-jdk9-m3.5.x_build] [INFO] Downloading from central: https://repo.maven.apache.org/maven2/org/apache/maven/shared/maven-shared-resources/2/maven-shared-resources-2.jar
[windows-jdk9-m3.5.x_build] [INFO] Downloading from central: https://repo.maven.apache.org/maven2/org/apache/maven/doxia/doxia-core/1.2/doxia-core-1.2.jar
[windows-jdk9-m3.5.x_build] [INFO] Downloading from central: https://repo.maven.apache.org/maven2/commons-digester/commons-digester/1.6/commons-digester-1.6.jar
[windows-jdk9-m3.5.x_build] [INFO] Downloading from central: https://repo.maven.apache.org/maven2/org/apache/maven/doxia/doxia-integration-tools/1.6/doxia-integration-tools-1.6.jar
[windows-jdk9-m3.5.x_build] [INFO] Downloading from central: https://repo.maven.apache.org/maven2/commons-logging/commons-logging/1.0.4/commons-logging-1.0.4.jar
[windows-jdk9-m3.5.x_build] [INFO] Downloaded from central: https://repo.maven.apache.org/maven2/org/apache/maven/doxia/doxia-integration-tools/1.6/doxia-integration-tools-1.6.jar (45 kB at 2.3 MB/s)
[windows-jdk9-m3.5.x_build] [INFO] Downloading from central: https://repo.maven.apache.org/maven2/commons-io/commons-io/1.4/commons-io-1.4.jar
[windows-jdk9-m3.5.x_build] [INFO] Downloaded from central: https://repo.maven.apache.org/maven2/org/apache/maven/doxia/doxia-core/1.2/doxia-core-1.2.jar (154 kB at 6.4 MB/s)
[windows-jdk9-m3.5.x_build] [INFO] Downloading from central: https://repo.maven.apache.org/maven2/org/codehaus/plexus/plexus-resources/1.1.0/plexus-resources-1.1.0.jar
[windows-jdk9-m3.5.x_build] [INFO] Downloaded from central: https://repo.maven.apache.org/maven2/commons-logging/commons-logging/1.0.4/commons-logging-1.0.4.jar (38 kB at 1.5 MB/s)
[windows-jdk9-m3.5.x_build] [INFO] Downloading from central: https://repo.maven.apache.org/maven2/com/puppycrawl/tools/checkstyle/6.18/checkstyle-6.18.jar
[windows-jdk9-m3.5.x_build] [INFO] Downloaded from central: https://repo.maven.apache.org/maven2/org/apache/maven/shared/maven-shared-resources/2/maven-shared-resources-2.jar (13 kB at 466 kB/s)
[windows-jdk9-m3.5.x_build] [INFO] Downloading from central: https://repo.maven.apache.org/maven2/antlr/antlr/2.7.7/antlr-2.7.7.jar
[windows-jdk9-m3.5.x_build] [INFO] Downloaded from central: https://repo.maven.apache.org/maven2/commons-digester/commons-digester/1.6/commons-digester-1.6.jar (168 kB at 4.2 MB/s)
[windows-jdk9-m3.5.x_build] [INFO] Downloading from central: https://repo.maven.apache.org/maven2/org/antlr/antlr4-runtime/4.5.3/antlr4-runtime-4.5.3.jar
[windows-jdk9-m3.5.x_build] [INFO] Downloaded from central: https://repo.maven.apache.org/maven2/org/codehaus/plexus/plexus-resources/1.1.0/plexus-resources-1.1.0.jar (23 kB at 553 kB/s)
[windows-jdk9-m3.5.x_build] [INFO] Downloading from central: https://repo.maven.apache.org/maven2/commons-beanutils/commons-beanutils/1.9.2/commons-beanutils-1.9.2.jar
[windows-jdk9-m3.5.x_build] [INFO] Downloaded from central: https://repo.maven.apache.org/maven2/commons-io/commons-io/1.4/commons-io-1.4.jar (109 kB at 1.9 MB/s)
[windows-jdk9-m3.5.x_build] [INFO] Downloading from central: https://repo.maven.apache.org/maven2/commons-cli/commons-cli/1.3.1/commons-cli-1.3.1.jar
[windows-jdk9-m3.5.x_build] [INFO] Downloaded from central: https://repo.maven.apache.org/maven2/org/antlr/antlr4-runtime/4.5.3/antlr4-runtime-4.5.3.jar (302 kB at 3.8 MB/s)
[windows-jdk9-m3.5.x_build] [INFO] Downloading from central: https://repo.maven.apache.org/maven2/com/google/guava/guava/19.0/guava-19.0.jar
[windows-jdk9-m3.5.x_build] [INFO] Downloaded from central: https://repo.maven.apache.org/maven2/antlr/antlr/2.7.7/antlr-2.7.7.jar (445 kB at 5.4 MB/s)
[windows-jdk9-m3.5.x_build] [INFO] Downloading from central: https://repo.maven.apache.org/maven2/javax/xml/bind/jaxb-api/2.3.0/jaxb-api-2.3.0.jar
[windows-jdk9-m3.5.x_build] [INFO] Downloaded from central: https://repo.maven.apache.org/maven2/commons-beanutils/commons-beanutils/1.9.2/commons-beanutils-1.9.2.jar (234 kB at 2.5 MB/s)
[windows-jdk9-m3.5.x_build] [INFO] Downloaded from central: https://repo.maven.apache.org/maven2/commons-cli/commons-cli/1.3.1/commons-cli-1.3.1.jar (53 kB at 558 kB/s)
[windows-jdk9-m3.5.x_build] [INFO] Downloaded from central: https://repo.maven.apache.org/maven2/javax/xml/bind/jaxb-api/2.3.0/jaxb-api-2.3.0.jar (126 kB at 1.2 MB/s)
[windows-jdk9-m3.5.x_build] [INFO] Downloaded from central: https://repo.maven.apache.org/maven2/com/puppycrawl/tools/checkstyle/6.18/checkstyle-6.18.jar (1.2 MB at 11 MB/s)
[windows-jdk9-m3.5.x_build] [INFO] Downloaded from central: https://repo.maven.apache.org/maven2/com/google/guava/guava/19.0/guava-19.0.jar (2.3 MB at 13 MB/s)
[windows-jdk10-m3.5.x_build] [INFO] run post-build script verify.groovy
[windows-jdk10-m3.5.x_build] [INFO]           cli-options\strip-debug\pom.xml .................. FAILED (4.2 s)
[windows-jdk10-m3.5.x_build] [INFO]   The post-build script returned false.
[windows-jdk10-m3.5.x_build] [INFO] Building: MJLINK-3_improveVerboseOutput\pom.xml
[windows-jdk9-m3.5.x_build] [INFO]
[windows-jdk9-m3.5.x_build] [INFO] --- maven-invoker-plugin:3.1.0:verify (integration-test) @ maven-jlink-plugin ---
[windows-jdk9-m3.5.x_build] [INFO] -------------------------------------------------
[windows-jdk9-m3.5.x_build] [INFO] Build Summary:
[windows-jdk9-m3.5.x_build] [INFO]   Passed: 3, Failed: 12, Errors: 0, Skipped: 0
[windows-jdk9-m3.5.x_build] [INFO] -------------------------------------------------
[windows-jdk9-m3.5.x_build] [ERROR] The following builds failed:
[windows-jdk9-m3.5.x_build] [ERROR] *  cli-options\bind-services\pom.xml
[windows-jdk9-m3.5.x_build] [ERROR] *  cli-options\compress-0\pom.xml
[windows-jdk9-m3.5.x_build] [ERROR] *  cli-options\compress-1\pom.xml
[windows-jdk9-m3.5.x_build] [ERROR] *  cli-options\compress-2\pom.xml
[windows-jdk9-m3.5.x_build] [ERROR] *  cli-options\disable-plugin\pom.xml
[windows-jdk9-m3.5.x_build] [ERROR] *  cli-options\endian-big\pom.xml
[windows-jdk9-m3.5.x_build] [ERROR] *  cli-options\endian\pom.xml
[windows-jdk9-m3.5.x_build] [ERROR] *  cli-options\ignore-signing-information\pom.xml
[windows-jdk9-m3.5.x_build] [ERROR] *  cli-options\no-header-files\pom.xml
[windows-jdk9-m3.5.x_build] [ERROR] *  cli-options\no-man-pages\pom.xml
[windows-jdk9-m3.5.x_build] [ERROR] *  cli-options\strip-debug\pom.xml
[windows-jdk9-m3.5.x_build] [ERROR] *  setup-jar-module-info\pom.xml
[windows-jdk9-m3.5.x_build] [INFO] -------------------------------------------------
[windows-jdk9-m3.5.x_build] [INFO] ------------------------------------------------------------------------
[windows-jdk9-m3.5.x_build] [INFO] BUILD FAILURE
[windows-jdk9-m3.5.x_build] [INFO] ------------------------------------------------------------------------
[windows-jdk9-m3.5.x_build] [INFO] Total time: 02:04 min
[windows-jdk9-m3.5.x_build] [INFO] Finished at: 2018-09-14T10:39:55Z
[windows-jdk9-m3.5.x_build] [INFO] Final Memory: 53M/176M
[windows-jdk9-m3.5.x_build] [INFO] ------------------------------------------------------------------------
[windows-jdk9-m3.5.x_build] [INFO] [jenkins-event-spy] Generated F:\jenkins\jenkins-slave\workspace\_maven-jlink-plugin_CLEANUP-YYRC5VLF7HAIAIEICXGYPF25BOQW6NXDQRTJOEZNHEUF2NVU67EA@tmp\withMaven7fd51143\maven-spy-20180914-103750-918394148544685123628.log
[windows-jdk9-m3.5.x_build] [ERROR] Failed to execute goal org.apache.maven.plugins:maven-invoker-plugin:3.1.0:verify (integration-test) on project maven-jlink-plugin: 12 builds failed. See console output above for details. -> [Help 1]
[windows-jdk9-m3.5.x_build] [ERROR]
[windows-jdk9-m3.5.x_build] [ERROR] To see the full stack trace of the errors, re-run Maven with the -e switch.
[windows-jdk9-m3.5.x_build] [ERROR] Re-run Maven using the -X switch to enable full debug logging.
[windows-jdk9-m3.5.x_build] [ERROR]
[windows-jdk9-m3.5.x_build] [ERROR] For more information about the errors and possible solutions, please read the following articles:
[windows-jdk9-m3.5.x_build] [ERROR] [Help 1] http://cwiki.apache.org/confluence/display/MAVEN/MojoFailureException
[Pipeline] [windows-jdk9-m3.5.x_build] }
[Pipeline] [windows-jdk9-m3.5.x_build] // dir
[Pipeline] [windows-jdk9-m3.5.x_build] }
[windows-jdk9-m3.5.x_build] [Fast Archiver] No prior successful build to compare, so performing full copy of artifacts
[windows-jdk9-m3.5.x_build] [withMaven] invokerPublisher - Archive invoker results for Maven artifact MavenArtifact{org.apache.maven.plugins:maven-jlink-plugin::3.0.0-alpha-2-SNAPSHOT(version: 3.0.0-alpha-2-SNAPSHOT, snapshot:false) } generated by PluginInvocation{org.apache.maven.plugins:maven-invoker-plugin:3.1.0@integration-test  integration-test}: windows-jdk9-m3.5.x_build\target\invoker-reports\*.xml
[windows-jdk9-m3.5.x_build] performing MavenInvokerRecorder, reportsFilenamePattern:'**/windows-jdk9-m3.5.x_build\target\invoker-reports/BUILD*.xml', invokerBuildDir:'**/windows-jdk9-m3.5.x_build\target\it'
[windows-jdk9-m3.5.x_build] Found reports:[f:\jenkins\jenkins-slave\workspace\_maven-jlink-plugin_CLEANUP-YYRC5VLF7HAIAIEICXGYPF25BOQW6NXDQRTJOEZNHEUF2NVU67EA\windows-jdk9-m3.5.x_build\target\invoker-reports\BUILD-MJLINK-3_improveVerboseOutput.xml, f:\jenkins\jenkins-slave\workspace\_maven-jlink-plugin_CLEANUP-YYRC5VLF7HAIAIEICXGYPF25BOQW6NXDQRTJOEZNHEUF2NVU67EA\windows-jdk9-m3.5.x_build\target\invoker-reports\BUILD-MJLINK-4_dependencyResolution.xml, f:\jenkins\jenkins-slave\workspace\_maven-jlink-plugin_CLEANUP-YYRC5VLF7HAIAIEICXGYPF25BOQW6NXDQRTJOEZNHEUF2NVU67EA\windows-jdk9-m3.5.x_build\target\invoker-reports\BUILD-cli-options_bind-services.xml, f:\jenkins\jenkins-slave\workspace\_maven-jlink-plugin_CLEANUP-YYRC5VLF7HAIAIEICXGYPF25BOQW6NXDQRTJOEZNHEUF2NVU67EA\windows-jdk9-m3.5.x_build\target\invoker-reports\BUILD-cli-options_compress-0.xml, f:\jenkins\jenkins-slave\workspace\_maven-jlink-plugin_CLEANUP-YYRC5VLF7HAIAIEICXGYPF25BOQW6NXDQRTJOEZNHEUF2NVU67EA\windows-jdk9-m3.5.x_build\target\invoker-reports\BUILD-cli-options_compress-1.xml, f:\jenkins\jenkins-slave\workspace\_maven-jlink-plugin_CLEANUP-YYRC5VLF7HAIAIEICXGYPF25BOQW6NXDQRTJOEZNHEUF2NVU67EA\windows-jdk9-m3.5.x_build\target\invoker-reports\BUILD-cli-options_compress-2.xml, f:\jenkins\jenkins-slave\workspace\_maven-jlink-plugin_CLEANUP-YYRC5VLF7HAIAIEICXGYPF25BOQW6NXDQRTJOEZNHEUF2NVU67EA\windows-jdk9-m3.5.x_build\target\invoker-reports\BUILD-cli-options_disable-plugin.xml, f:\jenkins\jenkins-slave\workspace\_maven-jlink-plugin_CLEANUP-YYRC5VLF7HAIAIEICXGYPF25BOQW6NXDQRTJOEZNHEUF2NVU67EA\windows-jdk9-m3.5.x_build\target\invoker-reports\BUILD-cli-options_endian-big.xml, f:\jenkins\jenkins-slave\workspace\_maven-jlink-plugin_CLEANUP-YYRC5VLF7HAIAIEICXGYPF25BOQW6NXDQRTJOEZNHEUF2NVU67EA\windows-jdk9-m3.5.x_build\target\invoker-reports\BUILD-cli-options_endian.xml, f:\jenkins\jenkins-slave\workspace\_maven-jlink-plugin_CLEANUP-YYRC5VLF7HAIAIEICXGYPF25BOQW6NXDQRTJOEZNHEUF2NVU67EA\windows-jdk9-m3.5.x_build\target\invoker-reports\BUILD-cli-options_ignore-signing-information.xml, f:\jenkins\jenkins-slave\workspace\_maven-jlink-plugin_CLEANUP-YYRC5VLF7HAIAIEICXGYPF25BOQW6NXDQRTJOEZNHEUF2NVU67EA\windows-jdk9-m3.5.x_build\target\invoker-reports\BUILD-cli-options_no-header-files.xml, f:\jenkins\jenkins-slave\workspace\_maven-jlink-plugin_CLEANUP-YYRC5VLF7HAIAIEICXGYPF25BOQW6NXDQRTJOEZNHEUF2NVU67EA\windows-jdk9-m3.5.x_build\target\invoker-reports\BUILD-cli-options_no-man-pages.xml, f:\jenkins\jenkins-slave\workspace\_maven-jlink-plugin_CLEANUP-YYRC5VLF7HAIAIEICXGYPF25BOQW6NXDQRTJOEZNHEUF2NVU67EA\windows-jdk9-m3.5.x_build\target\invoker-reports\BUILD-cli-options_strip-debug.xml, f:\jenkins\jenkins-slave\workspace\_maven-jlink-plugin_CLEANUP-YYRC5VLF7HAIAIEICXGYPF25BOQW6NXDQRTJOEZNHEUF2NVU67EA\windows-jdk9-m3.5.x_build\target\invoker-reports\BUILD-setup-jar-module-info.xml, f:\jenkins\jenkins-slave\workspace\_maven-jlink-plugin_CLEANUP-YYRC5VLF7HAIAIEICXGYPF25BOQW6NXDQRTJOEZNHEUF2NVU67EA\windows-jdk9-m3.5.x_build\target\invoker-reports\BUILD-setup-jar.xml]
[windows-jdk9-m3.5.x_build] Found logs:[f:\jenkins\jenkins-slave\workspace\_maven-jlink-plugin_CLEANUP-YYRC5VLF7HAIAIEICXGYPF25BOQW6NXDQRTJOEZNHEUF2NVU67EA\windows-jdk9-m3.5.x_build\target\it\MJLINK-3_improveVerboseOutput\build.log, f:\jenkins\jenkins-slave\workspace\_maven-jlink-plugin_CLEANUP-YYRC5VLF7HAIAIEICXGYPF25BOQW6NXDQRTJOEZNHEUF2NVU67EA\windows-jdk9-m3.5.x_build\target\it\MJLINK-4_dependencyResolution\build.log, f:\jenkins\jenkins-slave\workspace\_maven-jlink-plugin_CLEANUP-YYRC5VLF7HAIAIEICXGYPF25BOQW6NXDQRTJOEZNHEUF2NVU67EA\windows-jdk9-m3.5.x_build\target\it\cli-options\bind-services\build.log, f:\jenkins\jenkins-slave\workspace\_maven-jlink-plugin_CLEANUP-YYRC5VLF7HAIAIEICXGYPF25BOQW6NXDQRTJOEZNHEUF2NVU67EA\windows-jdk9-m3.5.x_build\target\it\cli-options\compress-0\build.log, f:\jenkins\jenkins-slave\workspace\_maven-jlink-plugin_CLEANUP-YYRC5VLF7HAIAIEICXGYPF25BOQW6NXDQRTJOEZNHEUF2NVU67EA\windows-jdk9-m3.5.x_build\target\it\cli-options\compress-1\build.log, f:\jenkins\jenkins-slave\workspace\_maven-jlink-plugin_CLEANUP-YYRC5VLF7HAIAIEICXGYPF25BOQW6NXDQRTJOEZNHEUF2NVU67EA\windows-jdk9-m3.5.x_build\target\it\cli-options\compress-2\build.log, f:\jenkins\jenkins-slave\workspace\_maven-jlink-plugin_CLEANUP-YYRC5VLF7HAIAIEICXGYPF25BOQW6NXDQRTJOEZNHEUF2NVU67EA\windows-jdk9-m3.5.x_build\target\it\cli-options\disable-plugin\build.log, f:\jenkins\jenkins-slave\workspace\_maven-jlink-plugin_CLEANUP-YYRC5VLF7HAIAIEICXGYPF25BOQW6NXDQRTJOEZNHEUF2NVU67EA\windows-jdk9-m3.5.x_build\target\it\cli-options\endian-big\build.log, f:\jenkins\jenkins-slave\workspace\_maven-jlink-plugin_CLEANUP-YYRC5VLF7HAIAIEICXGYPF25BOQW6NXDQRTJOEZNHEUF2NVU67EA\windows-jdk9-m3.5.x_build\target\it\cli-options\endian\build.log, f:\jenkins\jenkins-slave\workspace\_maven-jlink-plugin_CLEANUP-YYRC5VLF7HAIAIEICXGYPF25BOQW6NXDQRTJOEZNHEUF2NVU67EA\windows-jdk9-m3.5.x_build\target\it\cli-options\ignore-signing-information\build.log, f:\jenkins\jenkins-slave\workspace\_maven-jlink-plugin_CLEANUP-YYRC5VLF7HAIAIEICXGYPF25BOQW6NXDQRTJOEZNHEUF2NVU67EA\windows-jdk9-m3.5.x_build\target\it\cli-options\no-header-files\build.log, f:\jenkins\jenkins-slave\workspace\_maven-jlink-plugin_CLEANUP-YYRC5VLF7HAIAIEICXGYPF25BOQW6NXDQRTJOEZNHEUF2NVU67EA\windows-jdk9-m3.5.x_build\target\it\cli-options\no-man-pages\build.log, f:\jenkins\jenkins-slave\workspace\_maven-jlink-plugin_CLEANUP-YYRC5VLF7HAIAIEICXGYPF25BOQW6NXDQRTJOEZNHEUF2NVU67EA\windows-jdk9-m3.5.x_build\target\it\cli-options\strip-debug\build.log, f:\jenkins\jenkins-slave\workspace\_maven-jlink-plugin_CLEANUP-YYRC5VLF7HAIAIEICXGYPF25BOQW6NXDQRTJOEZNHEUF2NVU67EA\windows-jdk9-m3.5.x_build\target\it\setup-jar-module-info\build.log, f:\jenkins\jenkins-slave\workspace\_maven-jlink-plugin_CLEANUP-YYRC5VLF7HAIAIEICXGYPF25BOQW6NXDQRTJOEZNHEUF2NVU67EA\windows-jdk9-m3.5.x_build\target\it\setup-jar\build.log]
[windows-jdk9-m3.5.x_build] Finished parsing Maven Invoker results (found 15)
[windows-jdk9-m3.5.x_build] [withMaven] junitPublisher - Archive test results for Maven artifact org.apache.maven.plugins:maven-jlink-plugin:3.0.0-alpha-2-SNAPSHOT generated by maven-surefire-plugin:test (default-test): windows-jdk9-m3.5.x_build\target\surefire-reports\*.xml
[windows-jdk9-m3.5.x_build] Recording test results
[windows-jdk9-m3.5.x_build] [withMaven] openTasksPublisher - Scan Tasks for Maven artifact org.apache.maven.plugins:maven-jlink-plugin:3.0.0-alpha-2-SNAPSHOT in source directory windows-jdk9-m3.5.x_build\src\main\java
[windows-jdk9-m3.5.x_build] [TASKS] Scanning folder 'f:\jenkins\jenkins-slave\workspace\_maven-jlink-plugin_CLEANUP-YYRC5VLF7HAIAIEICXGYPF25BOQW6NXDQRTJOEZNHEUF2NVU67EA' for files matching the pattern 'windows-jdk9-m3.5.x_build\src\main\java\**\*' - excludes: null
[windows-jdk9-m3.5.x_build] [TASKS] Found 2 files to scan for tasks
[windows-jdk9-m3.5.x_build] [TASKS] Found 5 open tasks.
[windows-jdk9-m3.5.x_build] Skipping warnings blame since pipelines do not have an SCM link.%n
[Pipeline] [windows-jdk9-m3.5.x_build] // withMaven
[Pipeline] [windows-jdk9-m3.5.x_build] cleanWs
[windows-jdk9-m3.5.x_build] [WS-CLEANUP] Deleting project workspace...[WS-CLEANUP] done
[Pipeline] [windows-jdk9-m3.5.x_build] cleanWs
[windows-jdk9-m3.5.x_build] [WS-CLEANUP] Deleting project workspace...[WS-CLEANUP] done
[Pipeline] [windows-jdk9-m3.5.x_build] }
[Pipeline] [windows-jdk9-m3.5.x_build] // stage
[Pipeline] [windows-jdk9-m3.5.x_build] }
[Pipeline] [windows-jdk9-m3.5.x_build] // node
[Pipeline] [windows-jdk9-m3.5.x_build] }
[windows-jdk9-m3.5.x_build] Failed in branch windows-jdk9-m3.5.x_build
[windows-jdk10-m3.5.x_build] [INFO]           MJLINK-3_improveVerboseOutput\pom.xml ............ SUCCESS (13.9 s)
[windows-jdk10-m3.5.x_build] [INFO] Building: MJLINK-4_dependencyResolution\pom.xml
[windows-jdk10-m3.5.x_build] [INFO]           MJLINK-4_dependencyResolution\pom.xml ............ SUCCESS (9.2 s)
[windows-jdk10-m3.5.x_build] [INFO]
[windows-jdk10-m3.5.x_build] [INFO] --- mrm-maven-plugin:1.1.0:stop (default) @ maven-jlink-plugin ---
[windows-jdk10-m3.5.x_build] [INFO] Stopping Mock Repository Manager on http://localhost:58127
[windows-jdk10-m3.5.x_build] [INFO] Stopped SocketConnector@0.0.0.0:58127
[windows-jdk10-m3.5.x_build] [INFO] Mock Repository Manager http://localhost:58127 is stopped.
[windows-jdk10-m3.5.x_build] [INFO]
[windows-jdk10-m3.5.x_build] [INFO] --- maven-checkstyle-plugin:3.0.0:check (checkstyle-check) @ maven-jlink-plugin ---
[windows-jdk10-m3.5.x_build] [INFO] Downloading from central: https://repo.maven.apache.org/maven2/org/apache/maven/shared/maven-shared-resources/2/maven-shared-resources-2.pom
[windows-jdk10-m3.5.x_build] [INFO] Downloaded from central: https://repo.maven.apache.org/maven2/org/apache/maven/shared/maven-shared-resources/2/maven-shared-resources-2.pom (3.0 kB at 109 kB/s)
[windows-jdk10-m3.5.x_build] [INFO] Downloading from central: https://repo.maven.apache.org/maven2/org/codehaus/plexus/plexus-utils/3.0.10/plexus-utils-3.0.10.pom
[windows-jdk10-m3.5.x_build] [INFO] Downloaded from central: https://repo.maven.apache.org/maven2/org/codehaus/plexus/plexus-utils/3.0.10/plexus-utils-3.0.10.pom (3.1 kB at 157 kB/s)
[windows-jdk10-m3.5.x_build] [INFO] Downloading from central: https://repo.maven.apache.org/maven2/org/codehaus/plexus/plexus/3.3/plexus-3.3.pom
[windows-jdk10-m3.5.x_build] [INFO] Downloaded from central: https://repo.maven.apache.org/maven2/org/codehaus/plexus/plexus/3.3/plexus-3.3.pom (20 kB at 796 kB/s)
[windows-jdk10-m3.5.x_build] [INFO] Downloading from central: https://repo.maven.apache.org/maven2/org/apache/maven/doxia/doxia-integration-tools/1.6/doxia-integration-tools-1.6.pom
[windows-jdk10-m3.5.x_build] [INFO] Downloaded from central: https://repo.maven.apache.org/maven2/org/apache/maven/doxia/doxia-integration-tools/1.6/doxia-integration-tools-1.6.pom (7.0 kB at 348 kB/s)
[windows-jdk10-m3.5.x_build] [INFO] Downloading from central: https://repo.maven.apache.org/maven2/org/apache/maven/doxia/doxia-tools/3/doxia-tools-3.pom
[windows-jdk10-m3.5.x_build] [INFO] Downloaded from central: https://repo.maven.apache.org/maven2/org/apache/maven/doxia/doxia-tools/3/doxia-tools-3.pom (9.9 kB at 496 kB/s)
[windows-jdk10-m3.5.x_build] [INFO] Downloading from central: https://repo.maven.apache.org/maven2/org/codehaus/plexus/plexus-resources/1.1.0/plexus-resources-1.1.0.pom
[windows-jdk10-m3.5.x_build] [INFO] Downloaded from central: https://repo.maven.apache.org/maven2/org/codehaus/plexus/plexus-resources/1.1.0/plexus-resources-1.1.0.pom (3.2 kB at 167 kB/s)
[windows-jdk10-m3.5.x_build] [INFO] Downloading from central: https://repo.maven.apache.org/maven2/com/puppycrawl/tools/checkstyle/6.18/checkstyle-6.18.pom
[windows-jdk10-m3.5.x_build] [INFO] Downloaded from central: https://repo.maven.apache.org/maven2/com/puppycrawl/tools/checkstyle/6.18/checkstyle-6.18.pom (71 kB at 2.2 MB/s)
[windows-jdk10-m3.5.x_build] [INFO] Downloading from central: https://repo.maven.apache.org/maven2/antlr/antlr/2.7.7/antlr-2.7.7.pom
[windows-jdk10-m3.5.x_build] [INFO] Downloaded from central: https://repo.maven.apache.org/maven2/antlr/antlr/2.7.7/antlr-2.7.7.pom (632 B at 30 kB/s)
[windows-jdk10-m3.5.x_build] [INFO] Downloading from central: https://repo.maven.apache.org/maven2/org/antlr/antlr4-runtime/4.5.3/antlr4-runtime-4.5.3.pom
[windows-jdk10-m3.5.x_build] [INFO] Downloaded from central: https://repo.maven.apache.org/maven2/org/antlr/antlr4-runtime/4.5.3/antlr4-runtime-4.5.3.pom (2.3 kB at 122 kB/s)
[windows-jdk10-m3.5.x_build] [INFO] Downloading from central: https://repo.maven.apache.org/maven2/org/antlr/antlr4-master/4.5.3/antlr4-master-4.5.3.pom
[windows-jdk10-m3.5.x_build] [INFO] Downloaded from central: https://repo.maven.apache.org/maven2/org/antlr/antlr4-master/4.5.3/antlr4-master-4.5.3.pom (3.7 kB at 160 kB/s)
[windows-jdk10-m3.5.x_build] [INFO] Downloading from central: https://repo.maven.apache.org/maven2/commons-beanutils/commons-beanutils/1.9.2/commons-beanutils-1.9.2.pom
[windows-jdk10-m3.5.x_build] [INFO] Downloaded from central: https://repo.maven.apache.org/maven2/commons-beanutils/commons-beanutils/1.9.2/commons-beanutils-1.9.2.pom (14 kB at 753 kB/s)
[windows-jdk10-m3.5.x_build] [INFO] Downloading from central: https://repo.maven.apache.org/maven2/org/apache/commons/commons-parent/33/commons-parent-33.pom
[windows-jdk10-m3.5.x_build] [INFO] Downloaded from central: https://repo.maven.apache.org/maven2/org/apache/commons/commons-parent/33/commons-parent-33.pom (53 kB at 1.8 MB/s)
[windows-jdk10-m3.5.x_build] [INFO] Downloading from central: https://repo.maven.apache.org/maven2/commons-cli/commons-cli/1.3.1/commons-cli-1.3.1.pom
[windows-jdk10-m3.5.x_build] [INFO] Downloaded from central: https://repo.maven.apache.org/maven2/commons-cli/commons-cli/1.3.1/commons-cli-1.3.1.pom (10 kB at 400 kB/s)
[windows-jdk10-m3.5.x_build] [INFO] Downloading from central: https://repo.maven.apache.org/maven2/com/google/guava/guava/19.0/guava-19.0.pom
[windows-jdk10-m3.5.x_build] [INFO] Downloaded from central: https://repo.maven.apache.org/maven2/com/google/guava/guava/19.0/guava-19.0.pom (6.8 kB at 522 kB/s)
[windows-jdk10-m3.5.x_build] [INFO] Downloading from central: https://repo.maven.apache.org/maven2/com/google/guava/guava-parent/19.0/guava-parent-19.0.pom
[windows-jdk10-m3.5.x_build] [INFO] Downloaded from central: https://repo.maven.apache.org/maven2/com/google/guava/guava-parent/19.0/guava-parent-19.0.pom (9.9 kB at 282 kB/s)
[windows-jdk10-m3.5.x_build] [INFO] Downloading from central: https://repo.maven.apache.org/maven2/org/sonatype/oss/oss-parent/7/oss-parent-7.pom
[windows-jdk10-m3.5.x_build] [INFO] Downloaded from central: https://repo.maven.apache.org/maven2/org/sonatype/oss/oss-parent/7/oss-parent-7.pom (4.8 kB at 254 kB/s)
[windows-jdk10-m3.5.x_build] [INFO] Downloading from central: https://repo.maven.apache.org/maven2/javax/xml/bind/jaxb-api/2.3.0/jaxb-api-2.3.0.pom
[windows-jdk10-m3.5.x_build] [INFO] Downloaded from central: https://repo.maven.apache.org/maven2/javax/xml/bind/jaxb-api/2.3.0/jaxb-api-2.3.0.pom (23 kB at 920 kB/s)
[windows-jdk10-m3.5.x_build] [INFO] Downloading from central: https://repo.maven.apache.org/maven2/javax/xml/bind/jaxb-api-parent/2.3.0/jaxb-api-parent-2.3.0.pom
[windows-jdk10-m3.5.x_build] [INFO] Downloaded from central: https://repo.maven.apache.org/maven2/javax/xml/bind/jaxb-api-parent/2.3.0/jaxb-api-parent-2.3.0.pom (5.6 kB at 226 kB/s)
[windows-jdk10-m3.5.x_build] [INFO] Downloading from central: https://repo.maven.apache.org/maven2/net/java/jvnet-parent/5/jvnet-parent-5.pom
[windows-jdk10-m3.5.x_build] [INFO] Downloaded from central: https://repo.maven.apache.org/maven2/net/java/jvnet-parent/5/jvnet-parent-5.pom (8.9 kB at 385 kB/s)
[windows-jdk10-m3.5.x_build] [INFO] Downloading from central: https://repo.maven.apache.org/maven2/org/apache/maven/shared/maven-shared-resources/2/maven-shared-resources-2.jar
[windows-jdk10-m3.5.x_build] [INFO] Downloading from central: https://repo.maven.apache.org/maven2/org/apache/maven/doxia/doxia-core/1.2/doxia-core-1.2.jar
[windows-jdk10-m3.5.x_build] [INFO] Downloading from central: https://repo.maven.apache.org/maven2/commons-logging/commons-logging/1.0.4/commons-logging-1.0.4.jar
[windows-jdk10-m3.5.x_build] [INFO] Downloading from central: https://repo.maven.apache.org/maven2/commons-digester/commons-digester/1.6/commons-digester-1.6.jar
[windows-jdk10-m3.5.x_build] [INFO] Downloading from central: https://repo.maven.apache.org/maven2/org/apache/maven/doxia/doxia-integration-tools/1.6/doxia-integration-tools-1.6.jar
[windows-jdk10-m3.5.x_build] [INFO] Downloaded from central: https://repo.maven.apache.org/maven2/commons-logging/commons-logging/1.0.4/commons-logging-1.0.4.jar (38 kB at 1.1 MB/s)
[windows-jdk10-m3.5.x_build] [INFO] Downloading from central: https://repo.maven.apache.org/maven2/commons-io/commons-io/1.4/commons-io-1.4.jar
[windows-jdk10-m3.5.x_build] [INFO] Downloaded from central: https://repo.maven.apache.org/maven2/commons-digester/commons-digester/1.6/commons-digester-1.6.jar (168 kB at 3.8 MB/s)
[windows-jdk10-m3.5.x_build] [INFO] Downloading from central: https://repo.maven.apache.org/maven2/org/codehaus/plexus/plexus-resources/1.1.0/plexus-resources-1.1.0.jar
[windows-jdk10-m3.5.x_build] [INFO] Downloaded from central: https://repo.maven.apache.org/maven2/org/apache/maven/doxia/doxia-core/1.2/doxia-core-1.2.jar (154 kB at 2.4 MB/s)
[windows-jdk10-m3.5.x_build] [INFO] Downloading from central: https://repo.maven.apache.org/maven2/com/puppycrawl/tools/checkstyle/6.18/checkstyle-6.18.jar
[windows-jdk10-m3.5.x_build] [INFO] Downloaded from central: https://repo.maven.apache.org/maven2/commons-io/commons-io/1.4/commons-io-1.4.jar (109 kB at 752 kB/s)
[windows-jdk10-m3.5.x_build] [INFO] Downloading from central: https://repo.maven.apache.org/maven2/antlr/antlr/2.7.7/antlr-2.7.7.jar
[windows-jdk10-m3.5.x_build] [INFO] Downloaded from central: https://repo.maven.apache.org/maven2/com/puppycrawl/tools/checkstyle/6.18/checkstyle-6.18.jar (1.2 MB at 7.6 MB/s)
[windows-jdk10-m3.5.x_build] [INFO] Downloading from central: https://repo.maven.apache.org/maven2/org/antlr/antlr4-runtime/4.5.3/antlr4-runtime-4.5.3.jar
[windows-jdk10-m3.5.x_build] [INFO] Downloaded from central: https://repo.maven.apache.org/maven2/org/antlr/antlr4-runtime/4.5.3/antlr4-runtime-4.5.3.jar (302 kB at 1.6 MB/s)
[windows-jdk10-m3.5.x_build] [INFO] Downloading from central: https://repo.maven.apache.org/maven2/commons-beanutils/commons-beanutils/1.9.2/commons-beanutils-1.9.2.jar
[windows-jdk10-m3.5.x_build] [INFO] Downloaded from central: https://repo.maven.apache.org/maven2/org/apache/maven/shared/maven-shared-resources/2/maven-shared-resources-2.jar (13 kB at 69 kB/s)
[windows-jdk10-m3.5.x_build] [INFO] Downloading from central: https://repo.maven.apache.org/maven2/commons-cli/commons-cli/1.3.1/commons-cli-1.3.1.jar
[windows-jdk10-m3.5.x_build] [INFO] Downloaded from central: https://repo.maven.apache.org/maven2/antlr/antlr/2.7.7/antlr-2.7.7.jar (445 kB at 2.4 MB/s)
[windows-jdk10-m3.5.x_build] [INFO] Downloading from central: https://repo.maven.apache.org/maven2/com/google/guava/guava/19.0/guava-19.0.jar
[windows-jdk10-m3.5.x_build] [INFO] Downloaded from central: https://repo.maven.apache.org/maven2/org/codehaus/plexus/plexus-resources/1.1.0/plexus-resources-1.1.0.jar (23 kB at 121 kB/s)
[windows-jdk10-m3.5.x_build] [INFO] Downloading from central: https://repo.maven.apache.org/maven2/javax/xml/bind/jaxb-api/2.3.0/jaxb-api-2.3.0.jar
[windows-jdk10-m3.5.x_build] [INFO] Downloaded from central: https://repo.maven.apache.org/maven2/commons-cli/commons-cli/1.3.1/commons-cli-1.3.1.jar (53 kB at 232 kB/s)
[windows-jdk10-m3.5.x_build] [INFO] Downloaded from central: https://repo.maven.apache.org/maven2/javax/xml/bind/jaxb-api/2.3.0/jaxb-api-2.3.0.jar (126 kB at 521 kB/s)
[windows-jdk10-m3.5.x_build] [INFO] Downloaded from central: https://repo.maven.apache.org/maven2/commons-beanutils/commons-beanutils/1.9.2/commons-beanutils-1.9.2.jar (234 kB at 935 kB/s)
[windows-jdk10-m3.5.x_build] [INFO] Downloaded from central: https://repo.maven.apache.org/maven2/org/apache/maven/doxia/doxia-integration-tools/1.6/doxia-integration-tools-1.6.jar (45 kB at 172 kB/s)
[windows-jdk10-m3.5.x_build] [INFO] Downloaded from central: https://repo.maven.apache.org/maven2/com/google/guava/guava/19.0/guava-19.0.jar (2.3 MB at 8.1 MB/s)
[windows-jdk10-m3.5.x_build] [INFO]
[windows-jdk10-m3.5.x_build] [INFO] --- maven-invoker-plugin:3.1.0:verify (integration-test) @ maven-jlink-plugin ---
[windows-jdk10-m3.5.x_build] [INFO] -------------------------------------------------
[windows-jdk10-m3.5.x_build] [INFO] Build Summary:
[windows-jdk10-m3.5.x_build] [INFO]   Passed: 3, Failed: 12, Errors: 0, Skipped: 0
[windows-jdk10-m3.5.x_build] [INFO] -------------------------------------------------
[windows-jdk10-m3.5.x_build] [ERROR] The following builds failed:
[windows-jdk10-m3.5.x_build] [ERROR] *  cli-options\bind-services\pom.xml
[windows-jdk10-m3.5.x_build] [ERROR] *  cli-options\compress-0\pom.xml
[windows-jdk10-m3.5.x_build] [ERROR] *  cli-options\compress-1\pom.xml
[windows-jdk10-m3.5.x_build] [ERROR] *  cli-options\compress-2\pom.xml
[windows-jdk10-m3.5.x_build] [ERROR] *  cli-options\disable-plugin\pom.xml
[windows-jdk10-m3.5.x_build] [ERROR] *  cli-options\endian-big\pom.xml
[windows-jdk10-m3.5.x_build] [ERROR] *  cli-options\endian\pom.xml
[windows-jdk10-m3.5.x_build] [ERROR] *  cli-options\ignore-signing-information\pom.xml
[windows-jdk10-m3.5.x_build] [ERROR] *  cli-options\no-header-files\pom.xml
[windows-jdk10-m3.5.x_build] [ERROR] *  cli-options\no-man-pages\pom.xml
[windows-jdk10-m3.5.x_build] [ERROR] *  cli-options\strip-debug\pom.xml
[windows-jdk10-m3.5.x_build] [ERROR] *  setup-jar-module-info\pom.xml
[windows-jdk10-m3.5.x_build] [INFO] -------------------------------------------------
[windows-jdk10-m3.5.x_build] [INFO] ------------------------------------------------------------------------
[windows-jdk10-m3.5.x_build] [INFO] BUILD FAILURE
[windows-jdk10-m3.5.x_build] [INFO] ------------------------------------------------------------------------
[windows-jdk10-m3.5.x_build] [INFO] Total time: 02:27 min
[windows-jdk10-m3.5.x_build] [INFO] Finished at: 2018-09-14T03:40:20-07:00
[windows-jdk10-m3.5.x_build] [INFO] Final Memory: 49M/174M
[windows-jdk10-m3.5.x_build] [INFO] ------------------------------------------------------------------------
[windows-jdk10-m3.5.x_build] [INFO] [jenkins-event-spy] Generated F:\jenkins\jenkins-slave\workspace\_maven-jlink-plugin_CLEANUP-YYRC5VLF7HAIAIEICXGYPF25BOQW6NXDQRTJOEZNHEUF2NVU67EA@tmp\withMaven9a725ca3\maven-spy-20180914-033752-872314599782584495449.log
[windows-jdk10-m3.5.x_build] [ERROR] Failed to execute goal org.apache.maven.plugins:maven-invoker-plugin:3.1.0:verify (integration-test) on project maven-jlink-plugin: 12 builds failed. See console output above for details. -> [Help 1]
[windows-jdk10-m3.5.x_build] [ERROR]
[windows-jdk10-m3.5.x_build] [ERROR] To see the full stack trace of the errors, re-run Maven with the -e switch.
[windows-jdk10-m3.5.x_build] [ERROR] Re-run Maven using the -X switch to enable full debug logging.
[windows-jdk10-m3.5.x_build] [ERROR]
[windows-jdk10-m3.5.x_build] [ERROR] For more information about the errors and possible solutions, please read the following articles:
[windows-jdk10-m3.5.x_build] [ERROR] [Help 1] http://cwiki.apache.org/confluence/display/MAVEN/MojoFailureException
[Pipeline] [windows-jdk10-m3.5.x_build] }
[Pipeline] [windows-jdk10-m3.5.x_build] // dir
[Pipeline] [windows-jdk10-m3.5.x_build] }
[windows-jdk10-m3.5.x_build] [Fast Archiver] No prior successful build to compare, so performing full copy of artifacts
[windows-jdk10-m3.5.x_build] [withMaven] invokerPublisher - Archive invoker results for Maven artifact MavenArtifact{org.apache.maven.plugins:maven-jlink-plugin::3.0.0-alpha-2-SNAPSHOT(version: 3.0.0-alpha-2-SNAPSHOT, snapshot:false) } generated by PluginInvocation{org.apache.maven.plugins:maven-invoker-plugin:3.1.0@integration-test  integration-test}: windows-jdk10-m3.5.x_build\target\invoker-reports\*.xml
[windows-jdk10-m3.5.x_build] performing MavenInvokerRecorder, reportsFilenamePattern:'**/windows-jdk10-m3.5.x_build\target\invoker-reports/BUILD*.xml', invokerBuildDir:'**/windows-jdk10-m3.5.x_build\target\it'
[windows-jdk10-m3.5.x_build] Found reports:[f:\jenkins\jenkins-slave\workspace\_maven-jlink-plugin_CLEANUP-YYRC5VLF7HAIAIEICXGYPF25BOQW6NXDQRTJOEZNHEUF2NVU67EA\windows-jdk10-m3.5.x_build\target\invoker-reports\BUILD-MJLINK-3_improveVerboseOutput.xml, f:\jenkins\jenkins-slave\workspace\_maven-jlink-plugin_CLEANUP-YYRC5VLF7HAIAIEICXGYPF25BOQW6NXDQRTJOEZNHEUF2NVU67EA\windows-jdk10-m3.5.x_build\target\invoker-reports\BUILD-MJLINK-4_dependencyResolution.xml, f:\jenkins\jenkins-slave\workspace\_maven-jlink-plugin_CLEANUP-YYRC5VLF7HAIAIEICXGYPF25BOQW6NXDQRTJOEZNHEUF2NVU67EA\windows-jdk10-m3.5.x_build\target\invoker-reports\BUILD-cli-options_bind-services.xml, f:\jenkins\jenkins-slave\workspace\_maven-jlink-plugin_CLEANUP-YYRC5VLF7HAIAIEICXGYPF25BOQW6NXDQRTJOEZNHEUF2NVU67EA\windows-jdk10-m3.5.x_build\target\invoker-reports\BUILD-cli-options_compress-0.xml, f:\jenkins\jenkins-slave\workspace\_maven-jlink-plugin_CLEANUP-YYRC5VLF7HAIAIEICXGYPF25BOQW6NXDQRTJOEZNHEUF2NVU67EA\windows-jdk10-m3.5.x_build\target\invoker-reports\BUILD-cli-options_compress-1.xml, f:\jenkins\jenkins-slave\workspace\_maven-jlink-plugin_CLEANUP-YYRC5VLF7HAIAIEICXGYPF25BOQW6NXDQRTJOEZNHEUF2NVU67EA\windows-jdk10-m3.5.x_build\target\invoker-reports\BUILD-cli-options_compress-2.xml, f:\jenkins\jenkins-slave\workspace\_maven-jlink-plugin_CLEANUP-YYRC5VLF7HAIAIEICXGYPF25BOQW6NXDQRTJOEZNHEUF2NVU67EA\windows-jdk10-m3.5.x_build\target\invoker-reports\BUILD-cli-options_disable-plugin.xml, f:\jenkins\jenkins-slave\workspace\_maven-jlink-plugin_CLEANUP-YYRC5VLF7HAIAIEICXGYPF25BOQW6NXDQRTJOEZNHEUF2NVU67EA\windows-jdk10-m3.5.x_build\target\invoker-reports\BUILD-cli-options_endian-big.xml, f:\jenkins\jenkins-slave\workspace\_maven-jlink-plugin_CLEANUP-YYRC5VLF7HAIAIEICXGYPF25BOQW6NXDQRTJOEZNHEUF2NVU67EA\windows-jdk10-m3.5.x_build\target\invoker-reports\BUILD-cli-options_endian.xml, f:\jenkins\jenkins-slave\workspace\_maven-jlink-plugin_CLEANUP-YYRC5VLF7HAIAIEICXGYPF25BOQW6NXDQRTJOEZNHEUF2NVU67EA\windows-jdk10-m3.5.x_build\target\invoker-reports\BUILD-cli-options_ignore-signing-information.xml, f:\jenkins\jenkins-slave\workspace\_maven-jlink-plugin_CLEANUP-YYRC5VLF7HAIAIEICXGYPF25BOQW6NXDQRTJOEZNHEUF2NVU67EA\windows-jdk10-m3.5.x_build\target\invoker-reports\BUILD-cli-options_no-header-files.xml, f:\jenkins\jenkins-slave\workspace\_maven-jlink-plugin_CLEANUP-YYRC5VLF7HAIAIEICXGYPF25BOQW6NXDQRTJOEZNHEUF2NVU67EA\windows-jdk10-m3.5.x_build\target\invoker-reports\BUILD-cli-options_no-man-pages.xml, f:\jenkins\jenkins-slave\workspace\_maven-jlink-plugin_CLEANUP-YYRC5VLF7HAIAIEICXGYPF25BOQW6NXDQRTJOEZNHEUF2NVU67EA\windows-jdk10-m3.5.x_build\target\invoker-reports\BUILD-cli-options_strip-debug.xml, f:\jenkins\jenkins-slave\workspace\_maven-jlink-plugin_CLEANUP-YYRC5VLF7HAIAIEICXGYPF25BOQW6NXDQRTJOEZNHEUF2NVU67EA\windows-jdk10-m3.5.x_build\target\invoker-reports\BUILD-setup-jar-module-info.xml, f:\jenkins\jenkins-slave\workspace\_maven-jlink-plugin_CLEANUP-YYRC5VLF7HAIAIEICXGYPF25BOQW6NXDQRTJOEZNHEUF2NVU67EA\windows-jdk10-m3.5.x_build\target\invoker-reports\BUILD-setup-jar.xml]
[windows-jdk10-m3.5.x_build] Found logs:[f:\jenkins\jenkins-slave\workspace\_maven-jlink-plugin_CLEANUP-YYRC5VLF7HAIAIEICXGYPF25BOQW6NXDQRTJOEZNHEUF2NVU67EA\windows-jdk10-m3.5.x_build\target\it\MJLINK-3_improveVerboseOutput\build.log, f:\jenkins\jenkins-slave\workspace\_maven-jlink-plugin_CLEANUP-YYRC5VLF7HAIAIEICXGYPF25BOQW6NXDQRTJOEZNHEUF2NVU67EA\windows-jdk10-m3.5.x_build\target\it\MJLINK-4_dependencyResolution\build.log, f:\jenkins\jenkins-slave\workspace\_maven-jlink-plugin_CLEANUP-YYRC5VLF7HAIAIEICXGYPF25BOQW6NXDQRTJOEZNHEUF2NVU67EA\windows-jdk10-m3.5.x_build\target\it\cli-options\bind-services\build.log, f:\jenkins\jenkins-slave\workspace\_maven-jlink-plugin_CLEANUP-YYRC5VLF7HAIAIEICXGYPF25BOQW6NXDQRTJOEZNHEUF2NVU67EA\windows-jdk10-m3.5.x_build\target\it\cli-options\compress-0\build.log, f:\jenkins\jenkins-slave\workspace\_maven-jlink-plugin_CLEANUP-YYRC5VLF7HAIAIEICXGYPF25BOQW6NXDQRTJOEZNHEUF2NVU67EA\windows-jdk10-m3.5.x_build\target\it\cli-options\compress-1\build.log, f:\jenkins\jenkins-slave\workspace\_maven-jlink-plugin_CLEANUP-YYRC5VLF7HAIAIEICXGYPF25BOQW6NXDQRTJOEZNHEUF2NVU67EA\windows-jdk10-m3.5.x_build\target\it\cli-options\compress-2\build.log, f:\jenkins\jenkins-slave\workspace\_maven-jlink-plugin_CLEANUP-YYRC5VLF7HAIAIEICXGYPF25BOQW6NXDQRTJOEZNHEUF2NVU67EA\windows-jdk10-m3.5.x_build\target\it\cli-options\disable-plugin\build.log, f:\jenkins\jenkins-slave\workspace\_maven-jlink-plugin_CLEANUP-YYRC5VLF7HAIAIEICXGYPF25BOQW6NXDQRTJOEZNHEUF2NVU67EA\windows-jdk10-m3.5.x_build\target\it\cli-options\endian-big\build.log, f:\jenkins\jenkins-slave\workspace\_maven-jlink-plugin_CLEANUP-YYRC5VLF7HAIAIEICXGYPF25BOQW6NXDQRTJOEZNHEUF2NVU67EA\windows-jdk10-m3.5.x_build\target\it\cli-options\endian\build.log, f:\jenkins\jenkins-slave\workspace\_maven-jlink-plugin_CLEANUP-YYRC5VLF7HAIAIEICXGYPF25BOQW6NXDQRTJOEZNHEUF2NVU67EA\windows-jdk10-m3.5.x_build\target\it\cli-options\ignore-signing-information\build.log, f:\jenkins\jenkins-slave\workspace\_maven-jlink-plugin_CLEANUP-YYRC5VLF7HAIAIEICXGYPF25BOQW6NXDQRTJOEZNHEUF2NVU67EA\windows-jdk10-m3.5.x_build\target\it\cli-options\no-header-files\build.log, f:\jenkins\jenkins-slave\workspace\_maven-jlink-plugin_CLEANUP-YYRC5VLF7HAIAIEICXGYPF25BOQW6NXDQRTJOEZNHEUF2NVU67EA\windows-jdk10-m3.5.x_build\target\it\cli-options\no-man-pages\build.log, f:\jenkins\jenkins-slave\workspace\_maven-jlink-plugin_CLEANUP-YYRC5VLF7HAIAIEICXGYPF25BOQW6NXDQRTJOEZNHEUF2NVU67EA\windows-jdk10-m3.5.x_build\target\it\cli-options\strip-debug\build.log, f:\jenkins\jenkins-slave\workspace\_maven-jlink-plugin_CLEANUP-YYRC5VLF7HAIAIEICXGYPF25BOQW6NXDQRTJOEZNHEUF2NVU67EA\windows-jdk10-m3.5.x_build\target\it\setup-jar-module-info\build.log, f:\jenkins\jenkins-slave\workspace\_maven-jlink-plugin_CLEANUP-YYRC5VLF7HAIAIEICXGYPF25BOQW6NXDQRTJOEZNHEUF2NVU67EA\windows-jdk10-m3.5.x_build\target\it\setup-jar\build.log]
[windows-jdk10-m3.5.x_build] Finished parsing Maven Invoker results (found 15)
[windows-jdk10-m3.5.x_build] [withMaven] junitPublisher - Archive test results for Maven artifact org.apache.maven.plugins:maven-jlink-plugin:3.0.0-alpha-2-SNAPSHOT generated by maven-surefire-plugin:test (default-test): windows-jdk10-m3.5.x_build\target\surefire-reports\*.xml
[windows-jdk10-m3.5.x_build] Recording test results
[windows-jdk10-m3.5.x_build] [withMaven] openTasksPublisher - Scan Tasks for Maven artifact org.apache.maven.plugins:maven-jlink-plugin:3.0.0-alpha-2-SNAPSHOT in source directory windows-jdk10-m3.5.x_build\src\main\java
[windows-jdk10-m3.5.x_build] [TASKS] Scanning folder 'f:\jenkins\jenkins-slave\workspace\_maven-jlink-plugin_CLEANUP-YYRC5VLF7HAIAIEICXGYPF25BOQW6NXDQRTJOEZNHEUF2NVU67EA' for files matching the pattern 'windows-jdk10-m3.5.x_build\src\main\java\**\*' - excludes: null
[windows-jdk10-m3.5.x_build] [TASKS] Found 2 files to scan for tasks
[windows-jdk10-m3.5.x_build] [TASKS] Found 5 open tasks.
[windows-jdk10-m3.5.x_build] Skipping warnings blame since pipelines do not have an SCM link.%n
[Pipeline] [windows-jdk10-m3.5.x_build] // withMaven
[Pipeline] [windows-jdk10-m3.5.x_build] cleanWs
[windows-jdk10-m3.5.x_build] [WS-CLEANUP] Deleting project workspace...[WS-CLEANUP] done
[Pipeline] [windows-jdk10-m3.5.x_build] cleanWs
[windows-jdk10-m3.5.x_build] [WS-CLEANUP] Deleting project workspace...[WS-CLEANUP] done
[Pipeline] [windows-jdk10-m3.5.x_build] }
[Pipeline] [windows-jdk10-m3.5.x_build] // stage
[Pipeline] [windows-jdk10-m3.5.x_build] }
[Pipeline] [windows-jdk10-m3.5.x_build] // node
[Pipeline] [windows-jdk10-m3.5.x_build] }
[windows-jdk10-m3.5.x_build] Failed in branch windows-jdk10-m3.5.x_build
[Pipeline] // parallel
[Pipeline] stage
[Pipeline] { (Notifications)
[Pipeline] echo
Build result: FAILURE
[Pipeline] jiraIssueSelector
[Pipeline] emailext
Reply | Threaded
Open this post in threaded view
|

Build failed in Jenkins: Maven TLP » maven-jlink-plugin » CLEANUP #4

Apache Jenkins Server-2
See https://builds.apache.org/job/maven-box/job/maven-jlink-plugin/job/CLEANUP/4/

Changes:

* Exclude H25
* Exclude H31 cause master is failing constantly.
* no need to test anymore with '3.0.x'
* Add Java 11 to defaults
* Try to shorten path for Windows by using tempDir
* Fix arguments
* Add option for temp workspace
* disable tmpWs
* enable tmpWs
* Use def
* Try to shorten wsDir

All tests passed

Build log:
[...truncated 4.68 MB...]
[linux-jdk10-m3.5.x_build] [INFO] Downloading from central: https://repo.maven.apache.org/maven2/commons-beanutils/commons-beanutils/1.9.2/commons-beanutils-1.9.2.jar
[linux-jdk10-m3.5.x_build] [INFO] Downloading from central: https://repo.maven.apache.org/maven2/commons-cli/commons-cli/1.3.1/commons-cli-1.3.1.jar
[linux-jdk10-m3.5.x_build] [INFO] Downloaded from central: https://repo.maven.apache.org/maven2/commons-cli/commons-cli/1.3.1/commons-cli-1.3.1.jar (53 kB at 442 kB/s)
[linux-jdk10-m3.5.x_build] [INFO] Downloading from central: https://repo.maven.apache.org/maven2/com/google/guava/guava/19.0/guava-19.0.jar
[linux-jdk10-m3.5.x_build] [INFO] Downloaded from central: https://repo.maven.apache.org/maven2/commons-beanutils/commons-beanutils/1.9.2/commons-beanutils-1.9.2.jar (234 kB at 1.5 MB/s)
[linux-jdk10-m3.5.x_build] [INFO] Downloading from central: https://repo.maven.apache.org/maven2/javax/xml/bind/jaxb-api/2.3.0/jaxb-api-2.3.0.jar
[linux-jdk10-m3.5.x_build] [INFO] Downloaded from central: https://repo.maven.apache.org/maven2/org/antlr/antlr4-runtime/4.5.3/antlr4-runtime-4.5.3.jar (302 kB at 1.8 MB/s)
[linux-jdk10-m3.5.x_build] [INFO] Downloaded from central: https://repo.maven.apache.org/maven2/com/puppycrawl/tools/checkstyle/6.18/checkstyle-6.18.jar (1.2 MB at 6.7 MB/s)
[linux-jdk10-m3.5.x_build] [INFO] Downloaded from central: https://repo.maven.apache.org/maven2/antlr/antlr/2.7.7/antlr-2.7.7.jar (445 kB at 2.5 MB/s)
[linux-jdk10-m3.5.x_build] [INFO] Downloaded from central: https://repo.maven.apache.org/maven2/javax/xml/bind/jaxb-api/2.3.0/jaxb-api-2.3.0.jar (126 kB at 668 kB/s)
[linux-jdk10-m3.5.x_build] [INFO] Downloaded from central: https://repo.maven.apache.org/maven2/com/google/guava/guava/19.0/guava-19.0.jar (2.3 MB at 6.3 MB/s)
[windows-jdk11-m3.5.x_build] [INFO] run post-build script verify.groovy
[windows-jdk11-m3.5.x_build] [INFO]           cli-options\disable-plugin\pom.xml ............... FAILED (4.7 s)
[windows-jdk11-m3.5.x_build] [INFO]   The post-build script returned false.
[windows-jdk11-m3.5.x_build] [INFO] Building: cli-options\endian\pom.xml
[linux-jdk10-m3.5.x_build] [INFO]
[linux-jdk10-m3.5.x_build] [INFO] --- maven-invoker-plugin:3.1.0:verify (integration-test) @ maven-jlink-plugin ---
[linux-jdk10-m3.5.x_build] [INFO] -------------------------------------------------
[linux-jdk10-m3.5.x_build] [INFO] Build Summary:
[linux-jdk10-m3.5.x_build] [INFO]   Passed: 3, Failed: 12, Errors: 0, Skipped: 0
[linux-jdk10-m3.5.x_build] [INFO] -------------------------------------------------
[linux-jdk10-m3.5.x_build] [ERROR] The following builds failed:
[linux-jdk10-m3.5.x_build] [ERROR] *  cli-options/compress-2/pom.xml
[linux-jdk10-m3.5.x_build] [ERROR] *  cli-options/endian/pom.xml
[linux-jdk10-m3.5.x_build] [ERROR] *  cli-options/no-header-files/pom.xml
[linux-jdk10-m3.5.x_build] [ERROR] *  cli-options/strip-debug/pom.xml
[linux-jdk10-m3.5.x_build] [ERROR] *  setup-jar-module-info/pom.xml
[linux-jdk10-m3.5.x_build] [ERROR] *  cli-options/no-man-pages/pom.xml
[linux-jdk10-m3.5.x_build] [ERROR] *  cli-options/bind-services/pom.xml
[linux-jdk10-m3.5.x_build] [ERROR] *  cli-options/ignore-signing-information/pom.xml
[linux-jdk10-m3.5.x_build] [ERROR] *  cli-options/disable-plugin/pom.xml
[linux-jdk10-m3.5.x_build] [ERROR] *  cli-options/endian-big/pom.xml
[linux-jdk10-m3.5.x_build] [ERROR] *  cli-options/compress-0/pom.xml
[linux-jdk10-m3.5.x_build] [ERROR] *  cli-options/compress-1/pom.xml
[linux-jdk10-m3.5.x_build] [INFO] -------------------------------------------------
[linux-jdk10-m3.5.x_build] [INFO] ------------------------------------------------------------------------
[linux-jdk10-m3.5.x_build] [INFO] BUILD FAILURE
[linux-jdk10-m3.5.x_build] [INFO] ------------------------------------------------------------------------
[linux-jdk10-m3.5.x_build] [INFO] Total time: 04:14 min
[linux-jdk10-m3.5.x_build] [INFO] Finished at: 2018-10-10T10:41:51Z
[linux-jdk10-m3.5.x_build] [INFO] ------------------------------------------------------------------------
[linux-jdk10-m3.5.x_build] [INFO] [jenkins-event-spy] Generated /home/jenkins/jenkins-slave/workspace/_maven-jlink-plugin_CLEANUP-YYRC5VLF7HAIAIEICXGYPF25BOQW6NXDQRTJOEZNHEUF2NVU67EA@2@tmp/withMaven0131f498/maven-spy-20181010-103736-3068426164130123586902.log
[linux-jdk10-m3.5.x_build] [ERROR] Failed to execute goal org.apache.maven.plugins:maven-invoker-plugin:3.1.0:verify (integration-test) on project maven-jlink-plugin: 12 builds failed. See console output above for details. -> [Help 1]
[linux-jdk10-m3.5.x_build] [ERROR]
[linux-jdk10-m3.5.x_build] [ERROR] To see the full stack trace of the errors, re-run Maven with the -e switch.
[linux-jdk10-m3.5.x_build] [ERROR] Re-run Maven using the -X switch to enable full debug logging.
[linux-jdk10-m3.5.x_build] [ERROR]
[linux-jdk10-m3.5.x_build] [ERROR] For more information about the errors and possible solutions, please read the following articles:
[linux-jdk10-m3.5.x_build] [ERROR] [Help 1] http://cwiki.apache.org/confluence/display/MAVEN/MojoFailureException
[Pipeline] [linux-jdk10-m3.5.x_build] }
[Pipeline] [linux-jdk10-m3.5.x_build] // dir
[Pipeline] [linux-jdk10-m3.5.x_build] }
[linux-jdk10-m3.5.x_build] [Fast Archiver] No prior successful build to compare, so performing full copy of artifacts
[linux-jdk10-m3.5.x_build] [withMaven] invokerPublisher - Archive invoker results for Maven artifact MavenArtifact{org.apache.maven.plugins:maven-jlink-plugin::3.0.0-alpha-2-SNAPSHOT(version: 3.0.0-alpha-2-SNAPSHOT, snapshot:false) } generated by PluginInvocation{org.apache.maven.plugins:maven-invoker-plugin:3.1.0@integration-test  integration-test}: linux-jdk10-m3.5.x_build/target/invoker-reports/*.xml
[linux-jdk10-m3.5.x_build] performing MavenInvokerRecorder, reportsFilenamePattern:'**/linux-jdk10-m3.5.x_build/target/invoker-reports/BUILD*.xml', invokerBuildDir:'**/linux-jdk10-m3.5.x_build/target/it'
[linux-jdk10-m3.5.x_build] Found reports:[/home/jenkins/jenkins-slave/workspace/_maven-jlink-plugin_CLEANUP-YYRC5VLF7HAIAIEICXGYPF25BOQW6NXDQRTJOEZNHEUF2NVU67EA@2/linux-jdk10-m3.5.x_build/target/invoker-reports/BUILD-MJLINK-3_improveVerboseOutput.xml, /home/jenkins/jenkins-slave/workspace/_maven-jlink-plugin_CLEANUP-YYRC5VLF7HAIAIEICXGYPF25BOQW6NXDQRTJOEZNHEUF2NVU67EA@2/linux-jdk10-m3.5.x_build/target/invoker-reports/BUILD-MJLINK-4_dependencyResolution.xml, /home/jenkins/jenkins-slave/workspace/_maven-jlink-plugin_CLEANUP-YYRC5VLF7HAIAIEICXGYPF25BOQW6NXDQRTJOEZNHEUF2NVU67EA@2/linux-jdk10-m3.5.x_build/target/invoker-reports/BUILD-cli-options_bind-services.xml, /home/jenkins/jenkins-slave/workspace/_maven-jlink-plugin_CLEANUP-YYRC5VLF7HAIAIEICXGYPF25BOQW6NXDQRTJOEZNHEUF2NVU67EA@2/linux-jdk10-m3.5.x_build/target/invoker-reports/BUILD-cli-options_compress-0.xml, /home/jenkins/jenkins-slave/workspace/_maven-jlink-plugin_CLEANUP-YYRC5VLF7HAIAIEICXGYPF25BOQW6NXDQRTJOEZNHEUF2NVU67EA@2/linux-jdk10-m3.5.x_build/target/invoker-reports/BUILD-cli-options_compress-1.xml, /home/jenkins/jenkins-slave/workspace/_maven-jlink-plugin_CLEANUP-YYRC5VLF7HAIAIEICXGYPF25BOQW6NXDQRTJOEZNHEUF2NVU67EA@2/linux-jdk10-m3.5.x_build/target/invoker-reports/BUILD-cli-options_compress-2.xml, /home/jenkins/jenkins-slave/workspace/_maven-jlink-plugin_CLEANUP-YYRC5VLF7HAIAIEICXGYPF25BOQW6NXDQRTJOEZNHEUF2NVU67EA@2/linux-jdk10-m3.5.x_build/target/invoker-reports/BUILD-cli-options_disable-plugin.xml, /home/jenkins/jenkins-slave/workspace/_maven-jlink-plugin_CLEANUP-YYRC5VLF7HAIAIEICXGYPF25BOQW6NXDQRTJOEZNHEUF2NVU67EA@2/linux-jdk10-m3.5.x_build/target/invoker-reports/BUILD-cli-options_endian-big.xml, /home/jenkins/jenkins-slave/workspace/_maven-jlink-plugin_CLEANUP-YYRC5VLF7HAIAIEICXGYPF25BOQW6NXDQRTJOEZNHEUF2NVU67EA@2/linux-jdk10-m3.5.x_build/target/invoker-reports/BUILD-cli-options_endian.xml, /home/jenkins/jenkins-slave/workspace/_maven-jlink-plugin_CLEANUP-YYRC5VLF7HAIAIEICXGYPF25BOQW6NXDQRTJOEZNHEUF2NVU67EA@2/linux-jdk10-m3.5.x_build/target/invoker-reports/BUILD-cli-options_ignore-signing-information.xml, /home/jenkins/jenkins-slave/workspace/_maven-jlink-plugin_CLEANUP-YYRC5VLF7HAIAIEICXGYPF25BOQW6NXDQRTJOEZNHEUF2NVU67EA@2/linux-jdk10-m3.5.x_build/target/invoker-reports/BUILD-cli-options_no-header-files.xml, /home/jenkins/jenkins-slave/workspace/_maven-jlink-plugin_CLEANUP-YYRC5VLF7HAIAIEICXGYPF25BOQW6NXDQRTJOEZNHEUF2NVU67EA@2/linux-jdk10-m3.5.x_build/target/invoker-reports/BUILD-cli-options_no-man-pages.xml, /home/jenkins/jenkins-slave/workspace/_maven-jlink-plugin_CLEANUP-YYRC5VLF7HAIAIEICXGYPF25BOQW6NXDQRTJOEZNHEUF2NVU67EA@2/linux-jdk10-m3.5.x_build/target/invoker-reports/BUILD-cli-options_strip-debug.xml, /home/jenkins/jenkins-slave/workspace/_maven-jlink-plugin_CLEANUP-YYRC5VLF7HAIAIEICXGYPF25BOQW6NXDQRTJOEZNHEUF2NVU67EA@2/linux-jdk10-m3.5.x_build/target/invoker-reports/BUILD-setup-jar-module-info.xml, /home/jenkins/jenkins-slave/workspace/_maven-jlink-plugin_CLEANUP-YYRC5VLF7HAIAIEICXGYPF25BOQW6NXDQRTJOEZNHEUF2NVU67EA@2/linux-jdk10-m3.5.x_build/target/invoker-reports/BUILD-setup-jar.xml]
[linux-jdk10-m3.5.x_build] Found logs:[/home/jenkins/jenkins-slave/workspace/_maven-jlink-plugin_CLEANUP-YYRC5VLF7HAIAIEICXGYPF25BOQW6NXDQRTJOEZNHEUF2NVU67EA@2/linux-jdk10-m3.5.x_build/target/it/MJLINK-3_improveVerboseOutput/build.log, /home/jenkins/jenkins-slave/workspace/_maven-jlink-plugin_CLEANUP-YYRC5VLF7HAIAIEICXGYPF25BOQW6NXDQRTJOEZNHEUF2NVU67EA@2/linux-jdk10-m3.5.x_build/target/it/MJLINK-4_dependencyResolution/build.log, /home/jenkins/jenkins-slave/workspace/_maven-jlink-plugin_CLEANUP-YYRC5VLF7HAIAIEICXGYPF25BOQW6NXDQRTJOEZNHEUF2NVU67EA@2/linux-jdk10-m3.5.x_build/target/it/cli-options/bind-services/build.log, /home/jenkins/jenkins-slave/workspace/_maven-jlink-plugin_CLEANUP-YYRC5VLF7HAIAIEICXGYPF25BOQW6NXDQRTJOEZNHEUF2NVU67EA@2/linux-jdk10-m3.5.x_build/target/it/cli-options/compress-0/build.log, /home/jenkins/jenkins-slave/workspace/_maven-jlink-plugin_CLEANUP-YYRC5VLF7HAIAIEICXGYPF25BOQW6NXDQRTJOEZNHEUF2NVU67EA@2/linux-jdk10-m3.5.x_build/target/it/cli-options/compress-1/build.log, /home/jenkins/jenkins-slave/workspace/_maven-jlink-plugin_CLEANUP-YYRC5VLF7HAIAIEICXGYPF25BOQW6NXDQRTJOEZNHEUF2NVU67EA@2/linux-jdk10-m3.5.x_build/target/it/cli-options/compress-2/build.log, /home/jenkins/jenkins-slave/workspace/_maven-jlink-plugin_CLEANUP-YYRC5VLF7HAIAIEICXGYPF25BOQW6NXDQRTJOEZNHEUF2NVU67EA@2/linux-jdk10-m3.5.x_build/target/it/cli-options/disable-plugin/build.log, /home/jenkins/jenkins-slave/workspace/_maven-jlink-plugin_CLEANUP-YYRC5VLF7HAIAIEICXGYPF25BOQW6NXDQRTJOEZNHEUF2NVU67EA@2/linux-jdk10-m3.5.x_build/target/it/cli-options/endian-big/build.log, /home/jenkins/jenkins-slave/workspace/_maven-jlink-plugin_CLEANUP-YYRC5VLF7HAIAIEICXGYPF25BOQW6NXDQRTJOEZNHEUF2NVU67EA@2/linux-jdk10-m3.5.x_build/target/it/cli-options/endian/build.log, /home/jenkins/jenkins-slave/workspace/_maven-jlink-plugin_CLEANUP-YYRC5VLF7HAIAIEICXGYPF25BOQW6NXDQRTJOEZNHEUF2NVU67EA@2/linux-jdk10-m3.5.x_build/target/it/cli-options/ignore-signing-information/build.log, /home/jenkins/jenkins-slave/workspace/_maven-jlink-plugin_CLEANUP-YYRC5VLF7HAIAIEICXGYPF25BOQW6NXDQRTJOEZNHEUF2NVU67EA@2/linux-jdk10-m3.5.x_build/target/it/cli-options/no-header-files/build.log, /home/jenkins/jenkins-slave/workspace/_maven-jlink-plugin_CLEANUP-YYRC5VLF7HAIAIEICXGYPF25BOQW6NXDQRTJOEZNHEUF2NVU67EA@2/linux-jdk10-m3.5.x_build/target/it/cli-options/no-man-pages/build.log, /home/jenkins/jenkins-slave/workspace/_maven-jlink-plugin_CLEANUP-YYRC5VLF7HAIAIEICXGYPF25BOQW6NXDQRTJOEZNHEUF2NVU67EA@2/linux-jdk10-m3.5.x_build/target/it/cli-options/strip-debug/build.log, /home/jenkins/jenkins-slave/workspace/_maven-jlink-plugin_CLEANUP-YYRC5VLF7HAIAIEICXGYPF25BOQW6NXDQRTJOEZNHEUF2NVU67EA@2/linux-jdk10-m3.5.x_build/target/it/setup-jar-module-info/build.log, /home/jenkins/jenkins-slave/workspace/_maven-jlink-plugin_CLEANUP-YYRC5VLF7HAIAIEICXGYPF25BOQW6NXDQRTJOEZNHEUF2NVU67EA@2/linux-jdk10-m3.5.x_build/target/it/setup-jar/build.log]
[linux-jdk10-m3.5.x_build] Finished parsing Maven Invoker results (found 15)
[linux-jdk10-m3.5.x_build] [withMaven] junitPublisher - Archive test results for Maven artifact org.apache.maven.plugins:maven-jlink-plugin:3.0.0-alpha-2-SNAPSHOT generated by maven-surefire-plugin:test (default-test): linux-jdk10-m3.5.x_build/target/surefire-reports/*.xml
[linux-jdk10-m3.5.x_build] Recording test results
[linux-jdk10-m3.5.x_build] [withMaven] openTasksPublisher - Scan Tasks for Maven artifact org.apache.maven.plugins:maven-jlink-plugin:3.0.0-alpha-2-SNAPSHOT in source directory linux-jdk10-m3.5.x_build/src/main/java
[linux-jdk10-m3.5.x_build] [TASKS] Scanning folder '/home/jenkins/jenkins-slave/workspace/_maven-jlink-plugin_CLEANUP-YYRC5VLF7HAIAIEICXGYPF25BOQW6NXDQRTJOEZNHEUF2NVU67EA@2' for files matching the pattern 'linux-jdk10-m3.5.x_build/src/main/java/**/*' - excludes: null
[linux-jdk10-m3.5.x_build] [TASKS] Found 2 files to scan for tasks
[linux-jdk10-m3.5.x_build] [TASKS] Found 5 open tasks.
[linux-jdk10-m3.5.x_build] Skipping warnings blame since pipelines do not have an SCM link.%n
[Pipeline] [linux-jdk10-m3.5.x_build] // withMaven
[Pipeline] [linux-jdk10-m3.5.x_build] cleanWs
[linux-jdk10-m3.5.x_build] [WS-CLEANUP] Deleting project workspace...[WS-CLEANUP] done
[Pipeline] [linux-jdk10-m3.5.x_build] cleanWs
[linux-jdk10-m3.5.x_build] [WS-CLEANUP] Deleting project workspace...[WS-CLEANUP] done
[Pipeline] [linux-jdk10-m3.5.x_build] }
[Pipeline] [linux-jdk10-m3.5.x_build] // stage
[Pipeline] [linux-jdk10-m3.5.x_build] }
[Pipeline] [linux-jdk10-m3.5.x_build] // ws
[Pipeline] [linux-jdk10-m3.5.x_build] }
[Pipeline] [linux-jdk10-m3.5.x_build] // node
[Pipeline] [linux-jdk10-m3.5.x_build] }
[linux-jdk10-m3.5.x_build] Failed in branch linux-jdk10-m3.5.x_build
[windows-jdk11-m3.5.x_build] [INFO] run post-build script verify.groovy
[windows-jdk11-m3.5.x_build] [INFO]           cli-options\endian\pom.xml ....................... FAILED (5.4 s)
[windows-jdk11-m3.5.x_build] [INFO]   The post-build script returned false.
[windows-jdk11-m3.5.x_build] [INFO] Building: cli-options\endian-big\pom.xml
[windows-jdk11-m3.5.x_build] [INFO] run post-build script verify.groovy
[windows-jdk11-m3.5.x_build] [INFO]           cli-options\endian-big\pom.xml ................... FAILED (4.8 s)
[windows-jdk11-m3.5.x_build] [INFO]   The post-build script returned false.
[windows-jdk11-m3.5.x_build] [INFO] Building: cli-options\ignore-signing-information\pom.xml
[windows-jdk11-m3.5.x_build] [INFO] run post-build script verify.groovy
[windows-jdk11-m3.5.x_build] [INFO]           cli-options\ignore-signing-information\pom.xml ... FAILED (4.5 s)
[windows-jdk11-m3.5.x_build] [INFO]   The post-build script returned false.
[windows-jdk11-m3.5.x_build] [INFO] Building: cli-options\no-header-files\pom.xml
[windows-jdk11-m3.5.x_build] [INFO] run post-build script verify.groovy
[windows-jdk11-m3.5.x_build] [INFO]           cli-options\no-header-files\pom.xml .............. FAILED (4.8 s)
[windows-jdk11-m3.5.x_build] [INFO]   The post-build script returned false.
[windows-jdk11-m3.5.x_build] [INFO] Building: cli-options\no-man-pages\pom.xml
[windows-jdk11-m3.5.x_build] [INFO] run post-build script verify.groovy
[windows-jdk11-m3.5.x_build] [INFO]           cli-options\no-man-pages\pom.xml ................. FAILED (4.6 s)
[windows-jdk11-m3.5.x_build] [INFO]   The post-build script returned false.
[windows-jdk11-m3.5.x_build] [INFO] Building: cli-options\strip-debug\pom.xml
[windows-jdk11-m3.5.x_build] [INFO] run post-build script verify.groovy
[windows-jdk11-m3.5.x_build] [INFO]           cli-options\strip-debug\pom.xml .................. FAILED (5.1 s)
[windows-jdk11-m3.5.x_build] [INFO]   The post-build script returned false.
[windows-jdk11-m3.5.x_build] [INFO] Building: MJLINK-3_improveVerboseOutput\pom.xml
[windows-jdk11-m3.5.x_build] [INFO]           MJLINK-3_improveVerboseOutput\pom.xml ............ SUCCESS (12.1 s)
[windows-jdk11-m3.5.x_build] [INFO] Building: MJLINK-4_dependencyResolution\pom.xml
[windows-jdk11-m3.5.x_build] [INFO]           MJLINK-4_dependencyResolution\pom.xml ............ SUCCESS (11.3 s)
[windows-jdk11-m3.5.x_build] [INFO]
[windows-jdk11-m3.5.x_build] [INFO] --- mrm-maven-plugin:1.1.0:stop (default) @ maven-jlink-plugin ---
[windows-jdk11-m3.5.x_build] [INFO] Stopping Mock Repository Manager on http://localhost:64712
[windows-jdk11-m3.5.x_build] [INFO] Stopped SocketConnector@0.0.0.0:64712
[windows-jdk11-m3.5.x_build] [INFO] Mock Repository Manager http://localhost:64712 is stopped.
[windows-jdk11-m3.5.x_build] [INFO]
[windows-jdk11-m3.5.x_build] [INFO] --- maven-checkstyle-plugin:3.0.0:check (checkstyle-check) @ maven-jlink-plugin ---
[windows-jdk11-m3.5.x_build] [INFO] Downloading from central: https://repo.maven.apache.org/maven2/org/apache/maven/shared/maven-shared-resources/2/maven-shared-resources-2.pom
[windows-jdk11-m3.5.x_build] [INFO] Downloaded from central: https://repo.maven.apache.org/maven2/org/apache/maven/shared/maven-shared-resources/2/maven-shared-resources-2.pom (3.0 kB at 197 kB/s)
[windows-jdk11-m3.5.x_build] [INFO] Downloading from central: https://repo.maven.apache.org/maven2/org/codehaus/plexus/plexus-utils/3.0.10/plexus-utils-3.0.10.pom
[windows-jdk11-m3.5.x_build] [INFO] Downloaded from central: https://repo.maven.apache.org/maven2/org/codehaus/plexus/plexus-utils/3.0.10/plexus-utils-3.0.10.pom (3.1 kB at 196 kB/s)
[windows-jdk11-m3.5.x_build] [INFO] Downloading from central: https://repo.maven.apache.org/maven2/org/codehaus/plexus/plexus/3.3/plexus-3.3.pom
[windows-jdk11-m3.5.x_build] [INFO] Downloaded from central: https://repo.maven.apache.org/maven2/org/codehaus/plexus/plexus/3.3/plexus-3.3.pom (20 kB at 1.3 MB/s)
[windows-jdk11-m3.5.x_build] [INFO] Downloading from central: https://repo.maven.apache.org/maven2/org/apache/maven/doxia/doxia-integration-tools/1.6/doxia-integration-tools-1.6.pom
[windows-jdk11-m3.5.x_build] [INFO] Downloaded from central: https://repo.maven.apache.org/maven2/org/apache/maven/doxia/doxia-integration-tools/1.6/doxia-integration-tools-1.6.pom (7.0 kB)
[windows-jdk11-m3.5.x_build] [INFO] Downloading from central: https://repo.maven.apache.org/maven2/org/apache/maven/doxia/doxia-tools/3/doxia-tools-3.pom
[windows-jdk11-m3.5.x_build] [INFO] Downloaded from central: https://repo.maven.apache.org/maven2/org/apache/maven/doxia/doxia-tools/3/doxia-tools-3.pom (9.9 kB at 620 kB/s)
[windows-jdk11-m3.5.x_build] [INFO] Downloading from central: https://repo.maven.apache.org/maven2/org/codehaus/plexus/plexus-resources/1.1.0/plexus-resources-1.1.0.pom
[windows-jdk11-m3.5.x_build] [INFO] Downloaded from central: https://repo.maven.apache.org/maven2/org/codehaus/plexus/plexus-resources/1.1.0/plexus-resources-1.1.0.pom (3.2 kB at 199 kB/s)
[windows-jdk11-m3.5.x_build] [INFO] Downloading from central: https://repo.maven.apache.org/maven2/com/puppycrawl/tools/checkstyle/6.18/checkstyle-6.18.pom
[windows-jdk11-m3.5.x_build] [INFO] Downloaded from central: https://repo.maven.apache.org/maven2/com/puppycrawl/tools/checkstyle/6.18/checkstyle-6.18.pom (71 kB at 4.7 MB/s)
[windows-jdk11-m3.5.x_build] [INFO] Downloading from central: https://repo.maven.apache.org/maven2/antlr/antlr/2.7.7/antlr-2.7.7.pom
[windows-jdk11-m3.5.x_build] [INFO] Downloaded from central: https://repo.maven.apache.org/maven2/antlr/antlr/2.7.7/antlr-2.7.7.pom (632 B)
[windows-jdk11-m3.5.x_build] [INFO] Downloading from central: https://repo.maven.apache.org/maven2/org/antlr/antlr4-runtime/4.5.3/antlr4-runtime-4.5.3.pom
[windows-jdk11-m3.5.x_build] [INFO] Downloaded from central: https://repo.maven.apache.org/maven2/org/antlr/antlr4-runtime/4.5.3/antlr4-runtime-4.5.3.pom (2.3 kB at 144 kB/s)
[windows-jdk11-m3.5.x_build] [INFO] Downloading from central: https://repo.maven.apache.org/maven2/org/antlr/antlr4-master/4.5.3/antlr4-master-4.5.3.pom
[windows-jdk11-m3.5.x_build] [INFO] Downloaded from central: https://repo.maven.apache.org/maven2/org/antlr/antlr4-master/4.5.3/antlr4-master-4.5.3.pom (3.7 kB)
[windows-jdk11-m3.5.x_build] [INFO] Downloading from central: https://repo.maven.apache.org/maven2/commons-beanutils/commons-beanutils/1.9.2/commons-beanutils-1.9.2.pom
[windows-jdk11-m3.5.x_build] [INFO] Downloaded from central: https://repo.maven.apache.org/maven2/commons-beanutils/commons-beanutils/1.9.2/commons-beanutils-1.9.2.pom (14 kB)
[windows-jdk11-m3.5.x_build] [INFO] Downloading from central: https://repo.maven.apache.org/maven2/org/apache/commons/commons-parent/33/commons-parent-33.pom
[windows-jdk11-m3.5.x_build] [INFO] Downloaded from central: https://repo.maven.apache.org/maven2/org/apache/commons/commons-parent/33/commons-parent-33.pom (53 kB at 3.5 MB/s)
[windows-jdk11-m3.5.x_build] [INFO] Downloading from central: https://repo.maven.apache.org/maven2/commons-cli/commons-cli/1.3.1/commons-cli-1.3.1.pom
[windows-jdk11-m3.5.x_build] [INFO] Downloaded from central: https://repo.maven.apache.org/maven2/commons-cli/commons-cli/1.3.1/commons-cli-1.3.1.pom (10 kB at 650 kB/s)
[windows-jdk11-m3.5.x_build] [INFO] Downloading from central: https://repo.maven.apache.org/maven2/com/google/guava/guava/19.0/guava-19.0.pom
[windows-jdk11-m3.5.x_build] [INFO] Downloaded from central: https://repo.maven.apache.org/maven2/com/google/guava/guava/19.0/guava-19.0.pom (6.8 kB at 424 kB/s)
[windows-jdk11-m3.5.x_build] [INFO] Downloading from central: https://repo.maven.apache.org/maven2/com/google/guava/guava-parent/19.0/guava-parent-19.0.pom
[windows-jdk11-m3.5.x_build] [INFO] Downloaded from central: https://repo.maven.apache.org/maven2/com/google/guava/guava-parent/19.0/guava-parent-19.0.pom (9.9 kB)
[windows-jdk11-m3.5.x_build] [INFO] Downloading from central: https://repo.maven.apache.org/maven2/org/sonatype/oss/oss-parent/7/oss-parent-7.pom
[windows-jdk11-m3.5.x_build] [INFO] Downloaded from central: https://repo.maven.apache.org/maven2/org/sonatype/oss/oss-parent/7/oss-parent-7.pom (4.8 kB at 322 kB/s)
[windows-jdk11-m3.5.x_build] [INFO] Downloading from central: https://repo.maven.apache.org/maven2/javax/xml/bind/jaxb-api/2.3.0/jaxb-api-2.3.0.pom
[windows-jdk11-m3.5.x_build] [INFO] Downloaded from central: https://repo.maven.apache.org/maven2/javax/xml/bind/jaxb-api/2.3.0/jaxb-api-2.3.0.pom (23 kB)
[windows-jdk11-m3.5.x_build] [INFO] Downloading from central: https://repo.maven.apache.org/maven2/javax/xml/bind/jaxb-api-parent/2.3.0/jaxb-api-parent-2.3.0.pom
[windows-jdk11-m3.5.x_build] [INFO] Downloaded from central: https://repo.maven.apache.org/maven2/javax/xml/bind/jaxb-api-parent/2.3.0/jaxb-api-parent-2.3.0.pom (5.6 kB)
[windows-jdk11-m3.5.x_build] [INFO] Downloading from central: https://repo.maven.apache.org/maven2/net/java/jvnet-parent/5/jvnet-parent-5.pom
[windows-jdk11-m3.5.x_build] [INFO] Downloaded from central: https://repo.maven.apache.org/maven2/net/java/jvnet-parent/5/jvnet-parent-5.pom (8.9 kB at 591 kB/s)
[windows-jdk11-m3.5.x_build] [INFO] Downloading from central: https://repo.maven.apache.org/maven2/commons-digester/commons-digester/1.6/commons-digester-1.6.jar
[windows-jdk11-m3.5.x_build] [INFO] Downloading from central: https://repo.maven.apache.org/maven2/commons-logging/commons-logging/1.0.4/commons-logging-1.0.4.jar
[windows-jdk11-m3.5.x_build] [INFO] Downloading from central: https://repo.maven.apache.org/maven2/org/apache/maven/shared/maven-shared-resources/2/maven-shared-resources-2.jar
[windows-jdk11-m3.5.x_build] [INFO] Downloading from central: https://repo.maven.apache.org/maven2/org/apache/maven/doxia/doxia-integration-tools/1.6/doxia-integration-tools-1.6.jar
[windows-jdk11-m3.5.x_build] [INFO] Downloading from central: https://repo.maven.apache.org/maven2/org/apache/maven/doxia/doxia-core/1.2/doxia-core-1.2.jar
[windows-jdk11-m3.5.x_build] [INFO] Downloaded from central: https://repo.maven.apache.org/maven2/org/apache/maven/shared/maven-shared-resources/2/maven-shared-resources-2.jar (13 kB at 278 kB/s)
[windows-jdk11-m3.5.x_build] [INFO] Downloaded from central: https://repo.maven.apache.org/maven2/org/apache/maven/doxia/doxia-integration-tools/1.6/doxia-integration-tools-1.6.jar (45 kB at 950 kB/s)
[windows-jdk11-m3.5.x_build] [INFO] Downloading from central: https://repo.maven.apache.org/maven2/commons-io/commons-io/1.4/commons-io-1.4.jar
[windows-jdk11-m3.5.x_build] [INFO] Downloading from central: https://repo.maven.apache.org/maven2/org/codehaus/plexus/plexus-resources/1.1.0/plexus-resources-1.1.0.jar
[windows-jdk11-m3.5.x_build] [INFO] Downloaded from central: https://repo.maven.apache.org/maven2/commons-digester/commons-digester/1.6/commons-digester-1.6.jar (168 kB at 3.6 MB/s)
[windows-jdk11-m3.5.x_build] [INFO] Downloading from central: https://repo.maven.apache.org/maven2/com/puppycrawl/tools/checkstyle/6.18/checkstyle-6.18.jar
[windows-jdk11-m3.5.x_build] [INFO] Downloaded from central: https://repo.maven.apache.org/maven2/org/apache/maven/doxia/doxia-core/1.2/doxia-core-1.2.jar (154 kB at 2.5 MB/s)
[windows-jdk11-m3.5.x_build] [INFO] Downloading from central: https://repo.maven.apache.org/maven2/antlr/antlr/2.7.7/antlr-2.7.7.jar
[windows-jdk11-m3.5.x_build] [INFO] Downloaded from central: https://repo.maven.apache.org/maven2/org/codehaus/plexus/plexus-resources/1.1.0/plexus-resources-1.1.0.jar (23 kB at 374 kB/s)
[windows-jdk11-m3.5.x_build] [INFO] Downloading from central: https://repo.maven.apache.org/maven2/org/antlr/antlr4-runtime/4.5.3/antlr4-runtime-4.5.3.jar
[windows-jdk11-m3.5.x_build] [INFO] Downloaded from central: https://repo.maven.apache.org/maven2/commons-logging/commons-logging/1.0.4/commons-logging-1.0.4.jar (38 kB at 613 kB/s)
[windows-jdk11-m3.5.x_build] [INFO] Downloading from central: https://repo.maven.apache.org/maven2/commons-beanutils/commons-beanutils/1.9.2/commons-beanutils-1.9.2.jar
[windows-jdk11-m3.5.x_build] [INFO] Downloaded from central: https://repo.maven.apache.org/maven2/commons-io/commons-io/1.4/commons-io-1.4.jar (109 kB at 1.8 MB/s)
[windows-jdk11-m3.5.x_build] [INFO] Downloading from central: https://repo.maven.apache.org/maven2/commons-cli/commons-cli/1.3.1/commons-cli-1.3.1.jar
[windows-jdk11-m3.5.x_build] [INFO] Downloaded from central: https://repo.maven.apache.org/maven2/commons-cli/commons-cli/1.3.1/commons-cli-1.3.1.jar (53 kB at 570 kB/s)
[windows-jdk11-m3.5.x_build] [INFO] Downloading from central: https://repo.maven.apache.org/maven2/com/google/guava/guava/19.0/guava-19.0.jar
[windows-jdk11-m3.5.x_build] [INFO] Downloaded from central: https://repo.maven.apache.org/maven2/commons-beanutils/commons-beanutils/1.9.2/commons-beanutils-1.9.2.jar (234 kB at 2.5 MB/s)
[windows-jdk11-m3.5.x_build] [INFO] Downloading from central: https://repo.maven.apache.org/maven2/javax/xml/bind/jaxb-api/2.3.0/jaxb-api-2.3.0.jar
[windows-jdk11-m3.5.x_build] [INFO] Downloaded from central: https://repo.maven.apache.org/maven2/org/antlr/antlr4-runtime/4.5.3/antlr4-runtime-4.5.3.jar (302 kB at 3.2 MB/s)
[windows-jdk11-m3.5.x_build] [INFO] Downloaded from central: https://repo.maven.apache.org/maven2/javax/xml/bind/jaxb-api/2.3.0/jaxb-api-2.3.0.jar (126 kB at 1.2 MB/s)
[windows-jdk11-m3.5.x_build] [INFO] Downloaded from central: https://repo.maven.apache.org/maven2/antlr/antlr/2.7.7/antlr-2.7.7.jar (445 kB at 3.6 MB/s)
[windows-jdk11-m3.5.x_build] [INFO] Downloaded from central: https://repo.maven.apache.org/maven2/com/puppycrawl/tools/checkstyle/6.18/checkstyle-6.18.jar (1.2 MB at 9.3 MB/s)
[windows-jdk11-m3.5.x_build] [INFO] Downloaded from central: https://repo.maven.apache.org/maven2/com/google/guava/guava/19.0/guava-19.0.jar (2.3 MB at 15 MB/s)
[windows-jdk11-m3.5.x_build] [INFO]
[windows-jdk11-m3.5.x_build] [INFO] --- maven-invoker-plugin:3.1.0:verify (integration-test) @ maven-jlink-plugin ---
[windows-jdk11-m3.5.x_build] [INFO] -------------------------------------------------
[windows-jdk11-m3.5.x_build] [INFO] Build Summary:
[windows-jdk11-m3.5.x_build] [INFO]   Passed: 3, Failed: 12, Errors: 0, Skipped: 0
[windows-jdk11-m3.5.x_build] [INFO] -------------------------------------------------
[windows-jdk11-m3.5.x_build] [ERROR] The following builds failed:
[windows-jdk11-m3.5.x_build] [ERROR] *  cli-options\bind-services\pom.xml
[windows-jdk11-m3.5.x_build] [ERROR] *  cli-options\compress-0\pom.xml
[windows-jdk11-m3.5.x_build] [ERROR] *  cli-options\compress-1\pom.xml
[windows-jdk11-m3.5.x_build] [ERROR] *  cli-options\compress-2\pom.xml
[windows-jdk11-m3.5.x_build] [ERROR] *  cli-options\disable-plugin\pom.xml
[windows-jdk11-m3.5.x_build] [ERROR] *  cli-options\endian-big\pom.xml
[windows-jdk11-m3.5.x_build] [ERROR] *  cli-options\endian\pom.xml
[windows-jdk11-m3.5.x_build] [ERROR] *  cli-options\ignore-signing-information\pom.xml
[windows-jdk11-m3.5.x_build] [ERROR] *  cli-options\no-header-files\pom.xml
[windows-jdk11-m3.5.x_build] [ERROR] *  cli-options\no-man-pages\pom.xml
[windows-jdk11-m3.5.x_build] [ERROR] *  cli-options\strip-debug\pom.xml
[windows-jdk11-m3.5.x_build] [ERROR] *  setup-jar-module-info\pom.xml
[windows-jdk11-m3.5.x_build] [INFO] -------------------------------------------------
[windows-jdk11-m3.5.x_build] [INFO] ------------------------------------------------------------------------
[windows-jdk11-m3.5.x_build] [INFO] BUILD FAILURE
[windows-jdk11-m3.5.x_build] [INFO] ------------------------------------------------------------------------
[windows-jdk11-m3.5.x_build] [INFO] Total time: 02:03 min
[windows-jdk11-m3.5.x_build] [INFO] Finished at: 2018-10-10T10:42:43Z
[windows-jdk11-m3.5.x_build] [INFO] Final Memory: 48M/170M
[windows-jdk11-m3.5.x_build] [INFO] ------------------------------------------------------------------------
[windows-jdk11-m3.5.x_build] [INFO] [jenkins-event-spy] Generated F:\jenkins\jenkins-slave\workspace\_maven-jlink-plugin_CLEANUP-YYRC5VLF7HAIAIEICXGYPF25BOQW6NXDQRTJOEZNHEUF2NVU67EA@2@tmp\withMavenc52f4e80\maven-spy-20181010-104039-4786656353218139652058.log
[windows-jdk11-m3.5.x_build] [ERROR] Failed to execute goal org.apache.maven.plugins:maven-invoker-plugin:3.1.0:verify (integration-test) on project maven-jlink-plugin: 12 builds failed. See console output above for details. -> [Help 1]
[windows-jdk11-m3.5.x_build] [ERROR]
[windows-jdk11-m3.5.x_build] [ERROR] To see the full stack trace of the errors, re-run Maven with the -e switch.
[windows-jdk11-m3.5.x_build] [ERROR] Re-run Maven using the -X switch to enable full debug logging.
[windows-jdk11-m3.5.x_build] [ERROR]
[windows-jdk11-m3.5.x_build] [ERROR] For more information about the errors and possible solutions, please read the following articles:
[windows-jdk11-m3.5.x_build] [ERROR] [Help 1] http://cwiki.apache.org/confluence/display/MAVEN/MojoFailureException
[Pipeline] [windows-jdk11-m3.5.x_build] }
[Pipeline] [windows-jdk11-m3.5.x_build] // dir
[Pipeline] [windows-jdk11-m3.5.x_build] }
[windows-jdk11-m3.5.x_build] [Fast Archiver] No prior successful build to compare, so performing full copy of artifacts
[windows-jdk11-m3.5.x_build] [withMaven] invokerPublisher - Archive invoker results for Maven artifact MavenArtifact{org.apache.maven.plugins:maven-jlink-plugin::3.0.0-alpha-2-SNAPSHOT(version: 3.0.0-alpha-2-SNAPSHOT, snapshot:false) } generated by PluginInvocation{org.apache.maven.plugins:maven-invoker-plugin:3.1.0@integration-test  integration-test}: windows-jdk11-m3.5.x_build\target\invoker-reports\*.xml
[windows-jdk11-m3.5.x_build] performing MavenInvokerRecorder, reportsFilenamePattern:'**/windows-jdk11-m3.5.x_build\target\invoker-reports/BUILD*.xml', invokerBuildDir:'**/windows-jdk11-m3.5.x_build\target\it'
[windows-jdk11-m3.5.x_build] Found reports:[f:\jenkins\jenkins-slave\workspace\_maven-jlink-plugin_CLEANUP-YYRC5VLF7HAIAIEICXGYPF25BOQW6NXDQRTJOEZNHEUF2NVU67EA@2\windows-jdk11-m3.5.x_build\target\invoker-reports\BUILD-MJLINK-3_improveVerboseOutput.xml, f:\jenkins\jenkins-slave\workspace\_maven-jlink-plugin_CLEANUP-YYRC5VLF7HAIAIEICXGYPF25BOQW6NXDQRTJOEZNHEUF2NVU67EA@2\windows-jdk11-m3.5.x_build\target\invoker-reports\BUILD-MJLINK-4_dependencyResolution.xml, f:\jenkins\jenkins-slave\workspace\_maven-jlink-plugin_CLEANUP-YYRC5VLF7HAIAIEICXGYPF25BOQW6NXDQRTJOEZNHEUF2NVU67EA@2\windows-jdk11-m3.5.x_build\target\invoker-reports\BUILD-cli-options_bind-services.xml, f:\jenkins\jenkins-slave\workspace\_maven-jlink-plugin_CLEANUP-YYRC5VLF7HAIAIEICXGYPF25BOQW6NXDQRTJOEZNHEUF2NVU67EA@2\windows-jdk11-m3.5.x_build\target\invoker-reports\BUILD-cli-options_compress-0.xml, f:\jenkins\jenkins-slave\workspace\_maven-jlink-plugin_CLEANUP-YYRC5VLF7HAIAIEICXGYPF25BOQW6NXDQRTJOEZNHEUF2NVU67EA@2\windows-jdk11-m3.5.x_build\target\invoker-reports\BUILD-cli-options_compress-1.xml, f:\jenkins\jenkins-slave\workspace\_maven-jlink-plugin_CLEANUP-YYRC5VLF7HAIAIEICXGYPF25BOQW6NXDQRTJOEZNHEUF2NVU67EA@2\windows-jdk11-m3.5.x_build\target\invoker-reports\BUILD-cli-options_compress-2.xml, f:\jenkins\jenkins-slave\workspace\_maven-jlink-plugin_CLEANUP-YYRC5VLF7HAIAIEICXGYPF25BOQW6NXDQRTJOEZNHEUF2NVU67EA@2\windows-jdk11-m3.5.x_build\target\invoker-reports\BUILD-cli-options_disable-plugin.xml, f:\jenkins\jenkins-slave\workspace\_maven-jlink-plugin_CLEANUP-YYRC5VLF7HAIAIEICXGYPF25BOQW6NXDQRTJOEZNHEUF2NVU67EA@2\windows-jdk11-m3.5.x_build\target\invoker-reports\BUILD-cli-options_endian-big.xml, f:\jenkins\jenkins-slave\workspace\_maven-jlink-plugin_CLEANUP-YYRC5VLF7HAIAIEICXGYPF25BOQW6NXDQRTJOEZNHEUF2NVU67EA@2\windows-jdk11-m3.5.x_build\target\invoker-reports\BUILD-cli-options_endian.xml, f:\jenkins\jenkins-slave\workspace\_maven-jlink-plugin_CLEANUP-YYRC5VLF7HAIAIEICXGYPF25BOQW6NXDQRTJOEZNHEUF2NVU67EA@2\windows-jdk11-m3.5.x_build\target\invoker-reports\BUILD-cli-options_ignore-signing-information.xml, f:\jenkins\jenkins-slave\workspace\_maven-jlink-plugin_CLEANUP-YYRC5VLF7HAIAIEICXGYPF25BOQW6NXDQRTJOEZNHEUF2NVU67EA@2\windows-jdk11-m3.5.x_build\target\invoker-reports\BUILD-cli-options_no-header-files.xml, f:\jenkins\jenkins-slave\workspace\_maven-jlink-plugin_CLEANUP-YYRC5VLF7HAIAIEICXGYPF25BOQW6NXDQRTJOEZNHEUF2NVU67EA@2\windows-jdk11-m3.5.x_build\target\invoker-reports\BUILD-cli-options_no-man-pages.xml, f:\jenkins\jenkins-slave\workspace\_maven-jlink-plugin_CLEANUP-YYRC5VLF7HAIAIEICXGYPF25BOQW6NXDQRTJOEZNHEUF2NVU67EA@2\windows-jdk11-m3.5.x_build\target\invoker-reports\BUILD-cli-options_strip-debug.xml, f:\jenkins\jenkins-slave\workspace\_maven-jlink-plugin_CLEANUP-YYRC5VLF7HAIAIEICXGYPF25BOQW6NXDQRTJOEZNHEUF2NVU67EA@2\windows-jdk11-m3.5.x_build\target\invoker-reports\BUILD-setup-jar-module-info.xml, f:\jenkins\jenkins-slave\workspace\_maven-jlink-plugin_CLEANUP-YYRC5VLF7HAIAIEICXGYPF25BOQW6NXDQRTJOEZNHEUF2NVU67EA@2\windows-jdk11-m3.5.x_build\target\invoker-reports\BUILD-setup-jar.xml]
[windows-jdk11-m3.5.x_build] Found logs:[f:\jenkins\jenkins-slave\workspace\_maven-jlink-plugin_CLEANUP-YYRC5VLF7HAIAIEICXGYPF25BOQW6NXDQRTJOEZNHEUF2NVU67EA@2\windows-jdk11-m3.5.x_build\target\it\MJLINK-3_improveVerboseOutput\build.log, f:\jenkins\jenkins-slave\workspace\_maven-jlink-plugin_CLEANUP-YYRC5VLF7HAIAIEICXGYPF25BOQW6NXDQRTJOEZNHEUF2NVU67EA@2\windows-jdk11-m3.5.x_build\target\it\MJLINK-4_dependencyResolution\build.log, f:\jenkins\jenkins-slave\workspace\_maven-jlink-plugin_CLEANUP-YYRC5VLF7HAIAIEICXGYPF25BOQW6NXDQRTJOEZNHEUF2NVU67EA@2\windows-jdk11-m3.5.x_build\target\it\cli-options\bind-services\build.log, f:\jenkins\jenkins-slave\workspace\_maven-jlink-plugin_CLEANUP-YYRC5VLF7HAIAIEICXGYPF25BOQW6NXDQRTJOEZNHEUF2NVU67EA@2\windows-jdk11-m3.5.x_build\target\it\cli-options\compress-0\build.log, f:\jenkins\jenkins-slave\workspace\_maven-jlink-plugin_CLEANUP-YYRC5VLF7HAIAIEICXGYPF25BOQW6NXDQRTJOEZNHEUF2NVU67EA@2\windows-jdk11-m3.5.x_build\target\it\cli-options\compress-1\build.log, f:\jenkins\jenkins-slave\workspace\_maven-jlink-plugin_CLEANUP-YYRC5VLF7HAIAIEICXGYPF25BOQW6NXDQRTJOEZNHEUF2NVU67EA@2\windows-jdk11-m3.5.x_build\target\it\cli-options\compress-2\build.log, f:\jenkins\jenkins-slave\workspace\_maven-jlink-plugin_CLEANUP-YYRC5VLF7HAIAIEICXGYPF25BOQW6NXDQRTJOEZNHEUF2NVU67EA@2\windows-jdk11-m3.5.x_build\target\it\cli-options\disable-plugin\build.log, f:\jenkins\jenkins-slave\workspace\_maven-jlink-plugin_CLEANUP-YYRC5VLF7HAIAIEICXGYPF25BOQW6NXDQRTJOEZNHEUF2NVU67EA@2\windows-jdk11-m3.5.x_build\target\it\cli-options\endian-big\build.log, f:\jenkins\jenkins-slave\workspace\_maven-jlink-plugin_CLEANUP-YYRC5VLF7HAIAIEICXGYPF25BOQW6NXDQRTJOEZNHEUF2NVU67EA@2\windows-jdk11-m3.5.x_build\target\it\cli-options\endian\build.log, f:\jenkins\jenkins-slave\workspace\_maven-jlink-plugin_CLEANUP-YYRC5VLF7HAIAIEICXGYPF25BOQW6NXDQRTJOEZNHEUF2NVU67EA@2\windows-jdk11-m3.5.x_build\target\it\cli-options\ignore-signing-information\build.log, f:\jenkins\jenkins-slave\workspace\_maven-jlink-plugin_CLEANUP-YYRC5VLF7HAIAIEICXGYPF25BOQW6NXDQRTJOEZNHEUF2NVU67EA@2\windows-jdk11-m3.5.x_build\target\it\cli-options\no-header-files\build.log, f:\jenkins\jenkins-slave\workspace\_maven-jlink-plugin_CLEANUP-YYRC5VLF7HAIAIEICXGYPF25BOQW6NXDQRTJOEZNHEUF2NVU67EA@2\windows-jdk11-m3.5.x_build\target\it\cli-options\no-man-pages\build.log, f:\jenkins\jenkins-slave\workspace\_maven-jlink-plugin_CLEANUP-YYRC5VLF7HAIAIEICXGYPF25BOQW6NXDQRTJOEZNHEUF2NVU67EA@2\windows-jdk11-m3.5.x_build\target\it\cli-options\strip-debug\build.log, f:\jenkins\jenkins-slave\workspace\_maven-jlink-plugin_CLEANUP-YYRC5VLF7HAIAIEICXGYPF25BOQW6NXDQRTJOEZNHEUF2NVU67EA@2\windows-jdk11-m3.5.x_build\target\it\setup-jar-module-info\build.log, f:\jenkins\jenkins-slave\workspace\_maven-jlink-plugin_CLEANUP-YYRC5VLF7HAIAIEICXGYPF25BOQW6NXDQRTJOEZNHEUF2NVU67EA@2\windows-jdk11-m3.5.x_build\target\it\setup-jar\build.log]
[windows-jdk11-m3.5.x_build] Finished parsing Maven Invoker results (found 15)
[windows-jdk11-m3.5.x_build] [withMaven] junitPublisher - Archive test results for Maven artifact org.apache.maven.plugins:maven-jlink-plugin:3.0.0-alpha-2-SNAPSHOT generated by maven-surefire-plugin:test (default-test): windows-jdk11-m3.5.x_build\target\surefire-reports\*.xml
[windows-jdk11-m3.5.x_build] Recording test results
[windows-jdk11-m3.5.x_build] [withMaven] openTasksPublisher - Scan Tasks for Maven artifact org.apache.maven.plugins:maven-jlink-plugin:3.0.0-alpha-2-SNAPSHOT in source directory windows-jdk11-m3.5.x_build\src\main\java
[windows-jdk11-m3.5.x_build] [TASKS] Scanning folder 'f:\jenkins\jenkins-slave\workspace\_maven-jlink-plugin_CLEANUP-YYRC5VLF7HAIAIEICXGYPF25BOQW6NXDQRTJOEZNHEUF2NVU67EA@2' for files matching the pattern 'windows-jdk11-m3.5.x_build\src\main\java\**\*' - excludes: null
[windows-jdk11-m3.5.x_build] [TASKS] Found 2 files to scan for tasks
[windows-jdk11-m3.5.x_build] [TASKS] Found 5 open tasks.
[windows-jdk11-m3.5.x_build] Skipping warnings blame since pipelines do not have an SCM link.%n
[Pipeline] [windows-jdk11-m3.5.x_build] // withMaven
[Pipeline] [windows-jdk11-m3.5.x_build] cleanWs
[windows-jdk11-m3.5.x_build] [WS-CLEANUP] Deleting project workspace...[WS-CLEANUP] done
[Pipeline] [windows-jdk11-m3.5.x_build] cleanWs
[windows-jdk11-m3.5.x_build] [WS-CLEANUP] Deleting project workspace...[WS-CLEANUP] done
[Pipeline] [windows-jdk11-m3.5.x_build] }
[Pipeline] [windows-jdk11-m3.5.x_build] // stage
[Pipeline] [windows-jdk11-m3.5.x_build] }
[Pipeline] [windows-jdk11-m3.5.x_build] // ws
[Pipeline] [windows-jdk11-m3.5.x_build] }
[Pipeline] [windows-jdk11-m3.5.x_build] // node
[Pipeline] [windows-jdk11-m3.5.x_build] }
[windows-jdk11-m3.5.x_build] Failed in branch windows-jdk11-m3.5.x_build
[Pipeline] // parallel
[Pipeline] stage
[Pipeline] { (Notifications)
[Pipeline] echo
Build result: FAILURE
[Pipeline] jiraIssueSelector
[Pipeline] emailext
Reply | Threaded
Open this post in threaded view
|

Build failed in Jenkins: Maven TLP » maven-jlink-plugin » CLEANUP #5

Apache Jenkins Server-2
See https://builds.apache.org/job/maven-box/job/maven-jlink-plugin/job/CLEANUP/5/

No changes.

All tests passed

Build log:
[...truncated 4.68 MB...]
[windows-jdk11-m3.5.x_build] [ERROR] *  cli-options\endian-big\pom.xml
[windows-jdk11-m3.5.x_build] [ERROR] *  cli-options\endian\pom.xml
[windows-jdk11-m3.5.x_build] [ERROR] *  cli-options\ignore-signing-information\pom.xml
[windows-jdk11-m3.5.x_build] [ERROR] *  cli-options\no-header-files\pom.xml
[windows-jdk11-m3.5.x_build] [ERROR] *  cli-options\no-man-pages\pom.xml
[windows-jdk11-m3.5.x_build] [ERROR] *  cli-options\strip-debug\pom.xml
[windows-jdk11-m3.5.x_build] [ERROR] *  setup-jar-module-info\pom.xml
[windows-jdk11-m3.5.x_build] [INFO] -------------------------------------------------
[windows-jdk11-m3.5.x_build] [INFO] ------------------------------------------------------------------------
[windows-jdk11-m3.5.x_build] [INFO] BUILD FAILURE
[windows-jdk11-m3.5.x_build] [INFO] ------------------------------------------------------------------------
[windows-jdk11-m3.5.x_build] [INFO] Total time: 01:37 min
[windows-jdk11-m3.5.x_build] [INFO] Finished at: 2018-11-03T10:55:37Z
[windows-jdk11-m3.5.x_build] [INFO] Final Memory: 49M/170M
[windows-jdk11-m3.5.x_build] [INFO] ------------------------------------------------------------------------
[windows-jdk11-m3.5.x_build] [INFO] [jenkins-event-spy] Generated F:\jenkins\jenkins-slave\workspace\_maven-jlink-plugin_CLEANUP-YYRC5VLF7HAIAIEICXGYPF25BOQW6NXDQRTJOEZNHEUF2NVU67EA@2@tmp\withMavencba1b54b\maven-spy-20181103-105359-8947089082455996335493.log
[windows-jdk11-m3.5.x_build] [ERROR] Failed to execute goal org.apache.maven.plugins:maven-invoker-plugin:3.1.0:verify (integration-test) on project maven-jlink-plugin: 12 builds failed. See console output above for details. -> [Help 1]
[windows-jdk11-m3.5.x_build] [ERROR]
[windows-jdk11-m3.5.x_build] [ERROR] To see the full stack trace of the errors, re-run Maven with the -e switch.
[windows-jdk11-m3.5.x_build] [ERROR] Re-run Maven using the -X switch to enable full debug logging.
[windows-jdk11-m3.5.x_build] [ERROR]
[windows-jdk11-m3.5.x_build] [ERROR] For more information about the errors and possible solutions, please read the following articles:
[windows-jdk11-m3.5.x_build] [ERROR] [Help 1] http://cwiki.apache.org/confluence/display/MAVEN/MojoFailureException
[Pipeline] [windows-jdk11-m3.5.x_build] }
[Pipeline] [windows-jdk11-m3.5.x_build] // dir
[windows-jdk9-m3.5.x_build] [INFO] artifact localhost.first-jar-module-info:99.0: checking for updates from central
[windows-jdk9-m3.5.x_build] [INFO] localhost.first-jar-module-info.99.0: checking for updates from central
[windows-jdk9-m3.5.x_build] [INFO] run post-build script verify.groovy
[windows-jdk9-m3.5.x_build] WARNING: An illegal reflective access operation has occurred
[windows-jdk9-m3.5.x_build] WARNING: Illegal reflective access by org.codehaus.groovy.reflection.CachedClass (file:/f:/jenkins/jenkins-slave/workspace/_maven-jlink-plugin_CLEANUP-YYRC5VLF7HAIAIEICXGYPF25BOQW6NXDQRTJOEZNHEUF2NVU67EA@2/.repository/org/codehaus/groovy/groovy-all/2.4.8/groovy-all-2.4.8.jar) to method java.lang.Object.finalize()
[windows-jdk9-m3.5.x_build] WARNING: Please consider reporting this to the maintainers of org.codehaus.groovy.reflection.CachedClass
[windows-jdk9-m3.5.x_build] WARNING: Use --illegal-access=warn to enable warnings of further illegal reflective access operations
[windows-jdk9-m3.5.x_build] WARNING: All illegal access operations will be denied in a future release
[windows-jdk9-m3.5.x_build] [INFO]           cli-options\bind-services\pom.xml ................ FAILED (9.2 s)
[windows-jdk9-m3.5.x_build] [INFO]   The post-build script returned false.
[windows-jdk9-m3.5.x_build] [INFO] Building: cli-options\compress-0\pom.xml
[Pipeline] [windows-jdk11-m3.5.x_build] }
[windows-jdk11-m3.5.x_build] [Fast Archiver] No prior successful build to compare, so performing full copy of artifacts
[windows-jdk11-m3.5.x_build] [withMaven] invokerPublisher - Archive invoker results for Maven artifact MavenArtifact{org.apache.maven.plugins:maven-jlink-plugin::3.0.0-alpha-2-SNAPSHOT(version: 3.0.0-alpha-2-SNAPSHOT, snapshot:false) } generated by PluginInvocation{org.apache.maven.plugins:maven-invoker-plugin:3.1.0@integration-test  integration-test}: windows-jdk11-m3.5.x_build\target\invoker-reports\*.xml
[windows-jdk11-m3.5.x_build] performing MavenInvokerRecorder, reportsFilenamePattern:'**/windows-jdk11-m3.5.x_build\target\invoker-reports/BUILD*.xml', invokerBuildDir:'**/windows-jdk11-m3.5.x_build\target\it'
[windows-jdk11-m3.5.x_build] Found reports:[f:\jenkins\jenkins-slave\workspace\_maven-jlink-plugin_CLEANUP-YYRC5VLF7HAIAIEICXGYPF25BOQW6NXDQRTJOEZNHEUF2NVU67EA@2\windows-jdk11-m3.5.x_build\target\invoker-reports\BUILD-MJLINK-3_improveVerboseOutput.xml, f:\jenkins\jenkins-slave\workspace\_maven-jlink-plugin_CLEANUP-YYRC5VLF7HAIAIEICXGYPF25BOQW6NXDQRTJOEZNHEUF2NVU67EA@2\windows-jdk11-m3.5.x_build\target\invoker-reports\BUILD-MJLINK-4_dependencyResolution.xml, f:\jenkins\jenkins-slave\workspace\_maven-jlink-plugin_CLEANUP-YYRC5VLF7HAIAIEICXGYPF25BOQW6NXDQRTJOEZNHEUF2NVU67EA@2\windows-jdk11-m3.5.x_build\target\invoker-reports\BUILD-cli-options_bind-services.xml, f:\jenkins\jenkins-slave\workspace\_maven-jlink-plugin_CLEANUP-YYRC5VLF7HAIAIEICXGYPF25BOQW6NXDQRTJOEZNHEUF2NVU67EA@2\windows-jdk11-m3.5.x_build\target\invoker-reports\BUILD-cli-options_compress-0.xml, f:\jenkins\jenkins-slave\workspace\_maven-jlink-plugin_CLEANUP-YYRC5VLF7HAIAIEICXGYPF25BOQW6NXDQRTJOEZNHEUF2NVU67EA@2\windows-jdk11-m3.5.x_build\target\invoker-reports\BUILD-cli-options_compress-1.xml, f:\jenkins\jenkins-slave\workspace\_maven-jlink-plugin_CLEANUP-YYRC5VLF7HAIAIEICXGYPF25BOQW6NXDQRTJOEZNHEUF2NVU67EA@2\windows-jdk11-m3.5.x_build\target\invoker-reports\BUILD-cli-options_compress-2.xml, f:\jenkins\jenkins-slave\workspace\_maven-jlink-plugin_CLEANUP-YYRC5VLF7HAIAIEICXGYPF25BOQW6NXDQRTJOEZNHEUF2NVU67EA@2\windows-jdk11-m3.5.x_build\target\invoker-reports\BUILD-cli-options_disable-plugin.xml, f:\jenkins\jenkins-slave\workspace\_maven-jlink-plugin_CLEANUP-YYRC5VLF7HAIAIEICXGYPF25BOQW6NXDQRTJOEZNHEUF2NVU67EA@2\windows-jdk11-m3.5.x_build\target\invoker-reports\BUILD-cli-options_endian-big.xml, f:\jenkins\jenkins-slave\workspace\_maven-jlink-plugin_CLEANUP-YYRC5VLF7HAIAIEICXGYPF25BOQW6NXDQRTJOEZNHEUF2NVU67EA@2\windows-jdk11-m3.5.x_build\target\invoker-reports\BUILD-cli-options_endian.xml, f:\jenkins\jenkins-slave\workspace\_maven-jlink-plugin_CLEANUP-YYRC5VLF7HAIAIEICXGYPF25BOQW6NXDQRTJOEZNHEUF2NVU67EA@2\windows-jdk11-m3.5.x_build\target\invoker-reports\BUILD-cli-options_ignore-signing-information.xml, f:\jenkins\jenkins-slave\workspace\_maven-jlink-plugin_CLEANUP-YYRC5VLF7HAIAIEICXGYPF25BOQW6NXDQRTJOEZNHEUF2NVU67EA@2\windows-jdk11-m3.5.x_build\target\invoker-reports\BUILD-cli-options_no-header-files.xml, f:\jenkins\jenkins-slave\workspace\_maven-jlink-plugin_CLEANUP-YYRC5VLF7HAIAIEICXGYPF25BOQW6NXDQRTJOEZNHEUF2NVU67EA@2\windows-jdk11-m3.5.x_build\target\invoker-reports\BUILD-cli-options_no-man-pages.xml, f:\jenkins\jenkins-slave\workspace\_maven-jlink-plugin_CLEANUP-YYRC5VLF7HAIAIEICXGYPF25BOQW6NXDQRTJOEZNHEUF2NVU67EA@2\windows-jdk11-m3.5.x_build\target\invoker-reports\BUILD-cli-options_strip-debug.xml, f:\jenkins\jenkins-slave\workspace\_maven-jlink-plugin_CLEANUP-YYRC5VLF7HAIAIEICXGYPF25BOQW6NXDQRTJOEZNHEUF2NVU67EA@2\windows-jdk11-m3.5.x_build\target\invoker-reports\BUILD-setup-jar-module-info.xml, f:\jenkins\jenkins-slave\workspace\_maven-jlink-plugin_CLEANUP-YYRC5VLF7HAIAIEICXGYPF25BOQW6NXDQRTJOEZNHEUF2NVU67EA@2\windows-jdk11-m3.5.x_build\target\invoker-reports\BUILD-setup-jar.xml]
[windows-jdk11-m3.5.x_build] Found logs:[f:\jenkins\jenkins-slave\workspace\_maven-jlink-plugin_CLEANUP-YYRC5VLF7HAIAIEICXGYPF25BOQW6NXDQRTJOEZNHEUF2NVU67EA@2\windows-jdk11-m3.5.x_build\target\it\MJLINK-3_improveVerboseOutput\build.log, f:\jenkins\jenkins-slave\workspace\_maven-jlink-plugin_CLEANUP-YYRC5VLF7HAIAIEICXGYPF25BOQW6NXDQRTJOEZNHEUF2NVU67EA@2\windows-jdk11-m3.5.x_build\target\it\MJLINK-4_dependencyResolution\build.log, f:\jenkins\jenkins-slave\workspace\_maven-jlink-plugin_CLEANUP-YYRC5VLF7HAIAIEICXGYPF25BOQW6NXDQRTJOEZNHEUF2NVU67EA@2\windows-jdk11-m3.5.x_build\target\it\cli-options\bind-services\build.log, f:\jenkins\jenkins-slave\workspace\_maven-jlink-plugin_CLEANUP-YYRC5VLF7HAIAIEICXGYPF25BOQW6NXDQRTJOEZNHEUF2NVU67EA@2\windows-jdk11-m3.5.x_build\target\it\cli-options\compress-0\build.log, f:\jenkins\jenkins-slave\workspace\_maven-jlink-plugin_CLEANUP-YYRC5VLF7HAIAIEICXGYPF25BOQW6NXDQRTJOEZNHEUF2NVU67EA@2\windows-jdk11-m3.5.x_build\target\it\cli-options\compress-1\build.log, f:\jenkins\jenkins-slave\workspace\_maven-jlink-plugin_CLEANUP-YYRC5VLF7HAIAIEICXGYPF25BOQW6NXDQRTJOEZNHEUF2NVU67EA@2\windows-jdk11-m3.5.x_build\target\it\cli-options\compress-2\build.log, f:\jenkins\jenkins-slave\workspace\_maven-jlink-plugin_CLEANUP-YYRC5VLF7HAIAIEICXGYPF25BOQW6NXDQRTJOEZNHEUF2NVU67EA@2\windows-jdk11-m3.5.x_build\target\it\cli-options\disable-plugin\build.log, f:\jenkins\jenkins-slave\workspace\_maven-jlink-plugin_CLEANUP-YYRC5VLF7HAIAIEICXGYPF25BOQW6NXDQRTJOEZNHEUF2NVU67EA@2\windows-jdk11-m3.5.x_build\target\it\cli-options\endian-big\build.log, f:\jenkins\jenkins-slave\workspace\_maven-jlink-plugin_CLEANUP-YYRC5VLF7HAIAIEICXGYPF25BOQW6NXDQRTJOEZNHEUF2NVU67EA@2\windows-jdk11-m3.5.x_build\target\it\cli-options\endian\build.log, f:\jenkins\jenkins-slave\workspace\_maven-jlink-plugin_CLEANUP-YYRC5VLF7HAIAIEICXGYPF25BOQW6NXDQRTJOEZNHEUF2NVU67EA@2\windows-jdk11-m3.5.x_build\target\it\cli-options\ignore-signing-information\build.log, f:\jenkins\jenkins-slave\workspace\_maven-jlink-plugin_CLEANUP-YYRC5VLF7HAIAIEICXGYPF25BOQW6NXDQRTJOEZNHEUF2NVU67EA@2\windows-jdk11-m3.5.x_build\target\it\cli-options\no-header-files\build.log, f:\jenkins\jenkins-slave\workspace\_maven-jlink-plugin_CLEANUP-YYRC5VLF7HAIAIEICXGYPF25BOQW6NXDQRTJOEZNHEUF2NVU67EA@2\windows-jdk11-m3.5.x_build\target\it\cli-options\no-man-pages\build.log, f:\jenkins\jenkins-slave\workspace\_maven-jlink-plugin_CLEANUP-YYRC5VLF7HAIAIEICXGYPF25BOQW6NXDQRTJOEZNHEUF2NVU67EA@2\windows-jdk11-m3.5.x_build\target\it\cli-options\strip-debug\build.log, f:\jenkins\jenkins-slave\workspace\_maven-jlink-plugin_CLEANUP-YYRC5VLF7HAIAIEICXGYPF25BOQW6NXDQRTJOEZNHEUF2NVU67EA@2\windows-jdk11-m3.5.x_build\target\it\setup-jar-module-info\build.log, f:\jenkins\jenkins-slave\workspace\_maven-jlink-plugin_CLEANUP-YYRC5VLF7HAIAIEICXGYPF25BOQW6NXDQRTJOEZNHEUF2NVU67EA@2\windows-jdk11-m3.5.x_build\target\it\setup-jar\build.log]
[windows-jdk11-m3.5.x_build] Finished parsing Maven Invoker results (found 15)
[windows-jdk11-m3.5.x_build] [withMaven] junitPublisher - Archive test results for Maven artifact org.apache.maven.plugins:maven-jlink-plugin:3.0.0-alpha-2-SNAPSHOT generated by maven-surefire-plugin:test (default-test): windows-jdk11-m3.5.x_build\target\surefire-reports\*.xml
[windows-jdk11-m3.5.x_build] Recording test results
[windows-jdk11-m3.5.x_build] [withMaven] openTasksPublisher - Scan Tasks for Maven artifact org.apache.maven.plugins:maven-jlink-plugin:3.0.0-alpha-2-SNAPSHOT in source directory windows-jdk11-m3.5.x_build\src\main\java
[windows-jdk11-m3.5.x_build] [TASKS] Scanning folder 'f:\jenkins\jenkins-slave\workspace\_maven-jlink-plugin_CLEANUP-YYRC5VLF7HAIAIEICXGYPF25BOQW6NXDQRTJOEZNHEUF2NVU67EA@2' for files matching the pattern 'windows-jdk11-m3.5.x_build\src\main\java\**\*' - excludes: null
[windows-jdk11-m3.5.x_build] [TASKS] Found 2 files to scan for tasks
[windows-jdk11-m3.5.x_build] [TASKS] Found 5 open tasks.
[windows-jdk11-m3.5.x_build] Skipping warnings blame since pipelines do not have an SCM link.%n
[Pipeline] [windows-jdk11-m3.5.x_build] // withMaven
[Pipeline] [windows-jdk11-m3.5.x_build] cleanWs
[windows-jdk11-m3.5.x_build] [WS-CLEANUP] Deleting project workspace...[WS-CLEANUP] done
[Pipeline] [windows-jdk11-m3.5.x_build] cleanWs
[windows-jdk11-m3.5.x_build] [WS-CLEANUP] Deleting project workspace...[WS-CLEANUP] done
[Pipeline] [windows-jdk11-m3.5.x_build] }
[Pipeline] [windows-jdk11-m3.5.x_build] // stage
[Pipeline] [windows-jdk11-m3.5.x_build] }
[Pipeline] [windows-jdk11-m3.5.x_build] // ws
[Pipeline] [windows-jdk11-m3.5.x_build] }
[Pipeline] [windows-jdk11-m3.5.x_build] // node
[Pipeline] [windows-jdk11-m3.5.x_build] }
[windows-jdk11-m3.5.x_build] Failed in branch windows-jdk11-m3.5.x_build
[windows-jdk9-m3.5.x_build] [INFO] run post-build script verify.groovy
[windows-jdk9-m3.5.x_build] [INFO]           cli-options\compress-0\pom.xml ................... FAILED (6.0 s)
[windows-jdk9-m3.5.x_build] [INFO]   The post-build script returned false.
[windows-jdk9-m3.5.x_build] [INFO] Building: cli-options\compress-1\pom.xml
[windows-jdk9-m3.5.x_build] [INFO] run post-build script verify.groovy
[windows-jdk9-m3.5.x_build] [INFO]           cli-options\compress-1\pom.xml ................... FAILED (6.0 s)
[windows-jdk9-m3.5.x_build] [INFO]   The post-build script returned false.
[windows-jdk9-m3.5.x_build] [INFO] Building: cli-options\compress-2\pom.xml
[windows-jdk9-m3.5.x_build] [INFO] run post-build script verify.groovy
[windows-jdk9-m3.5.x_build] [INFO]           cli-options\compress-2\pom.xml ................... FAILED (6.5 s)
[windows-jdk9-m3.5.x_build] [INFO]   The post-build script returned false.
[windows-jdk9-m3.5.x_build] [INFO] Building: cli-options\disable-plugin\pom.xml
[windows-jdk9-m3.5.x_build] [INFO] run post-build script verify.groovy
[windows-jdk9-m3.5.x_build] [INFO]           cli-options\disable-plugin\pom.xml ............... FAILED (6.4 s)
[windows-jdk9-m3.5.x_build] [INFO]   The post-build script returned false.
[windows-jdk9-m3.5.x_build] [INFO] Building: cli-options\endian\pom.xml
[windows-jdk9-m3.5.x_build] [INFO] run post-build script verify.groovy
[windows-jdk9-m3.5.x_build] [INFO]           cli-options\endian\pom.xml ....................... FAILED (6.0 s)
[windows-jdk9-m3.5.x_build] [INFO]   The post-build script returned false.
[windows-jdk9-m3.5.x_build] [INFO] Building: cli-options\endian-big\pom.xml
[windows-jdk9-m3.5.x_build] [INFO] run post-build script verify.groovy
[windows-jdk9-m3.5.x_build] [INFO]           cli-options\endian-big\pom.xml ................... FAILED (5.8 s)
[windows-jdk9-m3.5.x_build] [INFO]   The post-build script returned false.
[windows-jdk9-m3.5.x_build] [INFO] Building: cli-options\ignore-signing-information\pom.xml
[windows-jdk9-m3.5.x_build] [INFO] run post-build script verify.groovy
[windows-jdk9-m3.5.x_build] [INFO]           cli-options\ignore-signing-information\pom.xml ... FAILED (5.7 s)
[windows-jdk9-m3.5.x_build] [INFO]   The post-build script returned false.
[windows-jdk9-m3.5.x_build] [INFO] Building: cli-options\no-header-files\pom.xml
[windows-jdk9-m3.5.x_build] [INFO] run post-build script verify.groovy
[windows-jdk9-m3.5.x_build] [INFO]           cli-options\no-header-files\pom.xml .............. FAILED (6.1 s)
[windows-jdk9-m3.5.x_build] [INFO]   The post-build script returned false.
[windows-jdk9-m3.5.x_build] [INFO] Building: cli-options\no-man-pages\pom.xml
[windows-jdk9-m3.5.x_build] [INFO] run post-build script verify.groovy
[windows-jdk9-m3.5.x_build] [INFO]           cli-options\no-man-pages\pom.xml ................. FAILED (5.8 s)
[windows-jdk9-m3.5.x_build] [INFO]   The post-build script returned false.
[windows-jdk9-m3.5.x_build] [INFO] Building: cli-options\strip-debug\pom.xml
[windows-jdk9-m3.5.x_build] [INFO] run post-build script verify.groovy
[windows-jdk9-m3.5.x_build] [INFO]           cli-options\strip-debug\pom.xml .................. FAILED (5.8 s)
[windows-jdk9-m3.5.x_build] [INFO]   The post-build script returned false.
[windows-jdk9-m3.5.x_build] [INFO] Building: MJLINK-3_improveVerboseOutput\pom.xml
[windows-jdk9-m3.5.x_build] [INFO]           MJLINK-3_improveVerboseOutput\pom.xml ............ SUCCESS (17.5 s)
[windows-jdk9-m3.5.x_build] [INFO] Building: MJLINK-4_dependencyResolution\pom.xml
[windows-jdk9-m3.5.x_build] [INFO]           MJLINK-4_dependencyResolution\pom.xml ............ SUCCESS (13.2 s)
[windows-jdk9-m3.5.x_build] [INFO]
[windows-jdk9-m3.5.x_build] [INFO] --- mrm-maven-plugin:1.1.0:stop (default) @ maven-jlink-plugin ---
[windows-jdk9-m3.5.x_build] [INFO] Stopping Mock Repository Manager on http://localhost:49504
[windows-jdk9-m3.5.x_build] [INFO] Stopped SocketConnector@0.0.0.0:49504
[windows-jdk9-m3.5.x_build] [INFO] Mock Repository Manager http://localhost:49504 is stopped.
[windows-jdk9-m3.5.x_build] [INFO]
[windows-jdk9-m3.5.x_build] [INFO] --- maven-checkstyle-plugin:3.0.0:check (checkstyle-check) @ maven-jlink-plugin ---
[windows-jdk9-m3.5.x_build] [INFO] Downloading from central: https://repo.maven.apache.org/maven2/org/apache/maven/shared/maven-shared-resources/2/maven-shared-resources-2.pom
[windows-jdk9-m3.5.x_build] [INFO] Downloaded from central: https://repo.maven.apache.org/maven2/org/apache/maven/shared/maven-shared-resources/2/maven-shared-resources-2.pom (3.0 kB at 164 kB/s)
[windows-jdk9-m3.5.x_build] [INFO] Downloading from central: https://repo.maven.apache.org/maven2/org/codehaus/plexus/plexus-utils/3.0.10/plexus-utils-3.0.10.pom
[windows-jdk9-m3.5.x_build] [INFO] Downloaded from central: https://repo.maven.apache.org/maven2/org/codehaus/plexus/plexus-utils/3.0.10/plexus-utils-3.0.10.pom (3.1 kB at 126 kB/s)
[windows-jdk9-m3.5.x_build] [INFO] Downloading from central: https://repo.maven.apache.org/maven2/org/codehaus/plexus/plexus/3.3/plexus-3.3.pom
[windows-jdk9-m3.5.x_build] [INFO] Downloaded from central: https://repo.maven.apache.org/maven2/org/codehaus/plexus/plexus/3.3/plexus-3.3.pom (20 kB at 829 kB/s)
[windows-jdk9-m3.5.x_build] [INFO] Downloading from central: https://repo.maven.apache.org/maven2/org/apache/maven/doxia/doxia-integration-tools/1.6/doxia-integration-tools-1.6.pom
[windows-jdk9-m3.5.x_build] [INFO] Downloaded from central: https://repo.maven.apache.org/maven2/org/apache/maven/doxia/doxia-integration-tools/1.6/doxia-integration-tools-1.6.pom (7.0 kB at 409 kB/s)
[windows-jdk9-m3.5.x_build] [INFO] Downloading from central: https://repo.maven.apache.org/maven2/org/apache/maven/doxia/doxia-tools/3/doxia-tools-3.pom
[windows-jdk9-m3.5.x_build] [INFO] Downloaded from central: https://repo.maven.apache.org/maven2/org/apache/maven/doxia/doxia-tools/3/doxia-tools-3.pom (9.9 kB at 301 kB/s)
[windows-jdk9-m3.5.x_build] [INFO] Downloading from central: https://repo.maven.apache.org/maven2/org/codehaus/plexus/plexus-resources/1.1.0/plexus-resources-1.1.0.pom
[windows-jdk9-m3.5.x_build] [INFO] Downloaded from central: https://repo.maven.apache.org/maven2/org/codehaus/plexus/plexus-resources/1.1.0/plexus-resources-1.1.0.pom (3.2 kB at 138 kB/s)
[windows-jdk9-m3.5.x_build] [INFO] Downloading from central: https://repo.maven.apache.org/maven2/com/puppycrawl/tools/checkstyle/6.18/checkstyle-6.18.pom
[windows-jdk9-m3.5.x_build] [INFO] Downloaded from central: https://repo.maven.apache.org/maven2/com/puppycrawl/tools/checkstyle/6.18/checkstyle-6.18.pom (71 kB at 2.1 MB/s)
[windows-jdk9-m3.5.x_build] [INFO] Downloading from central: https://repo.maven.apache.org/maven2/antlr/antlr/2.7.7/antlr-2.7.7.pom
[windows-jdk9-m3.5.x_build] [INFO] Downloaded from central: https://repo.maven.apache.org/maven2/antlr/antlr/2.7.7/antlr-2.7.7.pom (632 B at 42 kB/s)
[windows-jdk9-m3.5.x_build] [INFO] Downloading from central: https://repo.maven.apache.org/maven2/org/antlr/antlr4-runtime/4.5.3/antlr4-runtime-4.5.3.pom
[windows-jdk9-m3.5.x_build] [INFO] Downloaded from central: https://repo.maven.apache.org/maven2/org/antlr/antlr4-runtime/4.5.3/antlr4-runtime-4.5.3.pom (2.3 kB at 110 kB/s)
[windows-jdk9-m3.5.x_build] [INFO] Downloading from central: https://repo.maven.apache.org/maven2/org/antlr/antlr4-master/4.5.3/antlr4-master-4.5.3.pom
[windows-jdk9-m3.5.x_build] [INFO] Downloaded from central: https://repo.maven.apache.org/maven2/org/antlr/antlr4-master/4.5.3/antlr4-master-4.5.3.pom (3.7 kB at 335 kB/s)
[windows-jdk9-m3.5.x_build] [INFO] Downloading from central: https://repo.maven.apache.org/maven2/commons-beanutils/commons-beanutils/1.9.2/commons-beanutils-1.9.2.pom
[windows-jdk9-m3.5.x_build] [INFO] Downloaded from central: https://repo.maven.apache.org/maven2/commons-beanutils/commons-beanutils/1.9.2/commons-beanutils-1.9.2.pom (14 kB at 530 kB/s)
[windows-jdk9-m3.5.x_build] [INFO] Downloading from central: https://repo.maven.apache.org/maven2/org/apache/commons/commons-parent/33/commons-parent-33.pom
[windows-jdk9-m3.5.x_build] [INFO] Downloaded from central: https://repo.maven.apache.org/maven2/org/apache/commons/commons-parent/33/commons-parent-33.pom (53 kB at 1.5 MB/s)
[windows-jdk9-m3.5.x_build] [INFO] Downloading from central: https://repo.maven.apache.org/maven2/commons-cli/commons-cli/1.3.1/commons-cli-1.3.1.pom
[windows-jdk9-m3.5.x_build] [INFO] Downloaded from central: https://repo.maven.apache.org/maven2/commons-cli/commons-cli/1.3.1/commons-cli-1.3.1.pom (10 kB at 520 kB/s)
[windows-jdk9-m3.5.x_build] [INFO] Downloading from central: https://repo.maven.apache.org/maven2/com/google/guava/guava/19.0/guava-19.0.pom
[windows-jdk9-m3.5.x_build] [INFO] Downloaded from central: https://repo.maven.apache.org/maven2/com/google/guava/guava/19.0/guava-19.0.pom (6.8 kB at 309 kB/s)
[windows-jdk9-m3.5.x_build] [INFO] Downloading from central: https://repo.maven.apache.org/maven2/com/google/guava/guava-parent/19.0/guava-parent-19.0.pom
[windows-jdk9-m3.5.x_build] [INFO] Downloaded from central: https://repo.maven.apache.org/maven2/com/google/guava/guava-parent/19.0/guava-parent-19.0.pom (9.9 kB at 380 kB/s)
[windows-jdk9-m3.5.x_build] [INFO] Downloading from central: https://repo.maven.apache.org/maven2/org/sonatype/oss/oss-parent/7/oss-parent-7.pom
[windows-jdk9-m3.5.x_build] [INFO] Downloaded from central: https://repo.maven.apache.org/maven2/org/sonatype/oss/oss-parent/7/oss-parent-7.pom (4.8 kB at 241 kB/s)
[windows-jdk9-m3.5.x_build] [INFO] Downloading from central: https://repo.maven.apache.org/maven2/javax/xml/bind/jaxb-api/2.3.0/jaxb-api-2.3.0.pom
[windows-jdk9-m3.5.x_build] [INFO] Downloaded from central: https://repo.maven.apache.org/maven2/javax/xml/bind/jaxb-api/2.3.0/jaxb-api-2.3.0.pom (23 kB at 958 kB/s)
[windows-jdk9-m3.5.x_build] [INFO] Downloading from central: https://repo.maven.apache.org/maven2/javax/xml/bind/jaxb-api-parent/2.3.0/jaxb-api-parent-2.3.0.pom
[windows-jdk9-m3.5.x_build] [INFO] Downloaded from central: https://repo.maven.apache.org/maven2/javax/xml/bind/jaxb-api-parent/2.3.0/jaxb-api-parent-2.3.0.pom (5.6 kB at 282 kB/s)
[windows-jdk9-m3.5.x_build] [INFO] Downloading from central: https://repo.maven.apache.org/maven2/net/java/jvnet-parent/5/jvnet-parent-5.pom
[windows-jdk9-m3.5.x_build] [INFO] Downloaded from central: https://repo.maven.apache.org/maven2/net/java/jvnet-parent/5/jvnet-parent-5.pom (8.9 kB at 369 kB/s)
[windows-jdk9-m3.5.x_build] [INFO] Downloading from central: https://repo.maven.apache.org/maven2/org/apache/maven/doxia/doxia-core/1.2/doxia-core-1.2.jar
[windows-jdk9-m3.5.x_build] [INFO] Downloading from central: https://repo.maven.apache.org/maven2/org/apache/maven/shared/maven-shared-resources/2/maven-shared-resources-2.jar
[windows-jdk9-m3.5.x_build] [INFO] Downloading from central: https://repo.maven.apache.org/maven2/commons-logging/commons-logging/1.0.4/commons-logging-1.0.4.jar
[windows-jdk9-m3.5.x_build] [INFO] Downloading from central: https://repo.maven.apache.org/maven2/org/apache/maven/doxia/doxia-integration-tools/1.6/doxia-integration-tools-1.6.jar
[windows-jdk9-m3.5.x_build] [INFO] Downloading from central: https://repo.maven.apache.org/maven2/commons-digester/commons-digester/1.6/commons-digester-1.6.jar
[windows-jdk9-m3.5.x_build] [INFO] Downloaded from central: https://repo.maven.apache.org/maven2/org/apache/maven/doxia/doxia-core/1.2/doxia-core-1.2.jar (154 kB at 3.9 MB/s)
[windows-jdk9-m3.5.x_build] [INFO] Downloading from central: https://repo.maven.apache.org/maven2/commons-io/commons-io/1.4/commons-io-1.4.jar
[windows-jdk9-m3.5.x_build] [INFO] Downloaded from central: https://repo.maven.apache.org/maven2/org/apache/maven/shared/maven-shared-resources/2/maven-shared-resources-2.jar (13 kB at 143 kB/s)
[windows-jdk9-m3.5.x_build] [INFO] Downloading from central: https://repo.maven.apache.org/maven2/org/codehaus/plexus/plexus-resources/1.1.0/plexus-resources-1.1.0.jar
[windows-jdk9-m3.5.x_build] [INFO] Downloaded from central: https://repo.maven.apache.org/maven2/commons-logging/commons-logging/1.0.4/commons-logging-1.0.4.jar (38 kB at 309 kB/s)
[windows-jdk9-m3.5.x_build] [INFO] Downloading from central: https://repo.maven.apache.org/maven2/com/puppycrawl/tools/checkstyle/6.18/checkstyle-6.18.jar
[windows-jdk9-m3.5.x_build] [INFO] Downloaded from central: https://repo.maven.apache.org/maven2/org/apache/maven/doxia/doxia-integration-tools/1.6/doxia-integration-tools-1.6.jar (45 kB at 151 kB/s)
[windows-jdk9-m3.5.x_build] [INFO] Downloading from central: https://repo.maven.apache.org/maven2/antlr/antlr/2.7.7/antlr-2.7.7.jar
[windows-jdk9-m3.5.x_build] [INFO] Downloaded from central: https://repo.maven.apache.org/maven2/com/puppycrawl/tools/checkstyle/6.18/checkstyle-6.18.jar (1.2 MB at 3.4 MB/s)
[windows-jdk9-m3.5.x_build] [INFO] Downloaded from central: https://repo.maven.apache.org/maven2/org/codehaus/plexus/plexus-resources/1.1.0/plexus-resources-1.1.0.jar (23 kB at 67 kB/s)
[windows-jdk9-m3.5.x_build] [INFO] Downloading from central: https://repo.maven.apache.org/maven2/commons-beanutils/commons-beanutils/1.9.2/commons-beanutils-1.9.2.jar
[windows-jdk9-m3.5.x_build] [INFO] Downloaded from central: https://repo.maven.apache.org/maven2/antlr/antlr/2.7.7/antlr-2.7.7.jar (445 kB at 1.3 MB/s)
[windows-jdk9-m3.5.x_build] [INFO] Downloading from central: https://repo.maven.apache.org/maven2/commons-cli/commons-cli/1.3.1/commons-cli-1.3.1.jar
[windows-jdk9-m3.5.x_build] [INFO] Downloading from central: https://repo.maven.apache.org/maven2/org/antlr/antlr4-runtime/4.5.3/antlr4-runtime-4.5.3.jar
[windows-jdk9-m3.5.x_build] [INFO] Downloaded from central: https://repo.maven.apache.org/maven2/commons-cli/commons-cli/1.3.1/commons-cli-1.3.1.jar (53 kB at 133 kB/s)
[windows-jdk9-m3.5.x_build] [INFO] Downloading from central: https://repo.maven.apache.org/maven2/com/google/guava/guava/19.0/guava-19.0.jar
[windows-jdk9-m3.5.x_build] [INFO] Downloaded from central: https://repo.maven.apache.org/maven2/commons-io/commons-io/1.4/commons-io-1.4.jar (109 kB at 265 kB/s)
[windows-jdk9-m3.5.x_build] [INFO] Downloading from central: https://repo.maven.apache.org/maven2/javax/xml/bind/jaxb-api/2.3.0/jaxb-api-2.3.0.jar
[windows-jdk9-m3.5.x_build] [INFO] Downloaded from central: https://repo.maven.apache.org/maven2/commons-beanutils/commons-beanutils/1.9.2/commons-beanutils-1.9.2.jar (234 kB at 552 kB/s)
[windows-jdk9-m3.5.x_build] [INFO] Downloaded from central: https://repo.maven.apache.org/maven2/org/antlr/antlr4-runtime/4.5.3/antlr4-runtime-4.5.3.jar (302 kB at 676 kB/s)
[windows-jdk9-m3.5.x_build] [INFO] Downloaded from central: https://repo.maven.apache.org/maven2/commons-digester/commons-digester/1.6/commons-digester-1.6.jar (168 kB at 370 kB/s)
[windows-jdk9-m3.5.x_build] [INFO] Downloaded from central: https://repo.maven.apache.org/maven2/javax/xml/bind/jaxb-api/2.3.0/jaxb-api-2.3.0.jar (126 kB at 274 kB/s)
[windows-jdk9-m3.5.x_build] [INFO] Downloaded from central: https://repo.maven.apache.org/maven2/com/google/guava/guava/19.0/guava-19.0.jar (2.3 MB at 4.4 MB/s)
[windows-jdk9-m3.5.x_build] [INFO]
[windows-jdk9-m3.5.x_build] [INFO] --- maven-invoker-plugin:3.1.0:verify (integration-test) @ maven-jlink-plugin ---
[windows-jdk9-m3.5.x_build] [INFO] -------------------------------------------------
[windows-jdk9-m3.5.x_build] [INFO] Build Summary:
[windows-jdk9-m3.5.x_build] [INFO]   Passed: 3, Failed: 12, Errors: 0, Skipped: 0
[windows-jdk9-m3.5.x_build] [INFO] -------------------------------------------------
[windows-jdk9-m3.5.x_build] [ERROR] The following builds failed:
[windows-jdk9-m3.5.x_build] [ERROR] *  cli-options\bind-services\pom.xml
[windows-jdk9-m3.5.x_build] [ERROR] *  cli-options\compress-0\pom.xml
[windows-jdk9-m3.5.x_build] [ERROR] *  cli-options\compress-1\pom.xml
[windows-jdk9-m3.5.x_build] [ERROR] *  cli-options\compress-2\pom.xml
[windows-jdk9-m3.5.x_build] [ERROR] *  cli-options\disable-plugin\pom.xml
[windows-jdk9-m3.5.x_build] [ERROR] *  cli-options\endian-big\pom.xml
[windows-jdk9-m3.5.x_build] [ERROR] *  cli-options\endian\pom.xml
[windows-jdk9-m3.5.x_build] [ERROR] *  cli-options\ignore-signing-information\pom.xml
[windows-jdk9-m3.5.x_build] [ERROR] *  cli-options\no-header-files\pom.xml
[windows-jdk9-m3.5.x_build] [ERROR] *  cli-options\no-man-pages\pom.xml
[windows-jdk9-m3.5.x_build] [ERROR] *  cli-options\strip-debug\pom.xml
[windows-jdk9-m3.5.x_build] [ERROR] *  setup-jar-module-info\pom.xml
[windows-jdk9-m3.5.x_build] [INFO] -------------------------------------------------
[windows-jdk9-m3.5.x_build] [INFO] ------------------------------------------------------------------------
[windows-jdk9-m3.5.x_build] [INFO] BUILD FAILURE
[windows-jdk9-m3.5.x_build] [INFO] ------------------------------------------------------------------------
[windows-jdk9-m3.5.x_build] [INFO] Total time: 03:41 min
[windows-jdk9-m3.5.x_build] [INFO] Finished at: 2018-11-03T03:57:16-07:00
[windows-jdk9-m3.5.x_build] [INFO] Final Memory: 50M/166M
[windows-jdk9-m3.5.x_build] [INFO] ------------------------------------------------------------------------
[windows-jdk9-m3.5.x_build] [INFO] [jenkins-event-spy] Generated F:\jenkins\jenkins-slave\workspace\_maven-jlink-plugin_CLEANUP-YYRC5VLF7HAIAIEICXGYPF25BOQW6NXDQRTJOEZNHEUF2NVU67EA@2@tmp\withMavenee504e8c\maven-spy-20181103-035334-2988605619141112524872.log
[windows-jdk9-m3.5.x_build] [ERROR] Failed to execute goal org.apache.maven.plugins:maven-invoker-plugin:3.1.0:verify (integration-test) on project maven-jlink-plugin: 12 builds failed. See console output above for details. -> [Help 1]
[windows-jdk9-m3.5.x_build] [ERROR]
[windows-jdk9-m3.5.x_build] [ERROR] To see the full stack trace of the errors, re-run Maven with the -e switch.
[windows-jdk9-m3.5.x_build] [ERROR] Re-run Maven using the -X switch to enable full debug logging.
[windows-jdk9-m3.5.x_build] [ERROR]
[windows-jdk9-m3.5.x_build] [ERROR] For more information about the errors and possible solutions, please read the following articles:
[windows-jdk9-m3.5.x_build] [ERROR] [Help 1] http://cwiki.apache.org/confluence/display/MAVEN/MojoFailureException
[Pipeline] [windows-jdk9-m3.5.x_build] }
[Pipeline] [windows-jdk9-m3.5.x_build] // dir
[Pipeline] [windows-jdk9-m3.5.x_build] }
[windows-jdk9-m3.5.x_build] [Fast Archiver] No prior successful build to compare, so performing full copy of artifacts
[windows-jdk9-m3.5.x_build] [withMaven] invokerPublisher - Archive invoker results for Maven artifact MavenArtifact{org.apache.maven.plugins:maven-jlink-plugin::3.0.0-alpha-2-SNAPSHOT(version: 3.0.0-alpha-2-SNAPSHOT, snapshot:false) } generated by PluginInvocation{org.apache.maven.plugins:maven-invoker-plugin:3.1.0@integration-test  integration-test}: windows-jdk9-m3.5.x_build\target\invoker-reports\*.xml
[windows-jdk9-m3.5.x_build] performing MavenInvokerRecorder, reportsFilenamePattern:'**/windows-jdk9-m3.5.x_build\target\invoker-reports/BUILD*.xml', invokerBuildDir:'**/windows-jdk9-m3.5.x_build\target\it'
[windows-jdk9-m3.5.x_build] Found reports:[f:\jenkins\jenkins-slave\workspace\_maven-jlink-plugin_CLEANUP-YYRC5VLF7HAIAIEICXGYPF25BOQW6NXDQRTJOEZNHEUF2NVU67EA@2\windows-jdk9-m3.5.x_build\target\invoker-reports\BUILD-MJLINK-3_improveVerboseOutput.xml, f:\jenkins\jenkins-slave\workspace\_maven-jlink-plugin_CLEANUP-YYRC5VLF7HAIAIEICXGYPF25BOQW6NXDQRTJOEZNHEUF2NVU67EA@2\windows-jdk9-m3.5.x_build\target\invoker-reports\BUILD-MJLINK-4_dependencyResolution.xml, f:\jenkins\jenkins-slave\workspace\_maven-jlink-plugin_CLEANUP-YYRC5VLF7HAIAIEICXGYPF25BOQW6NXDQRTJOEZNHEUF2NVU67EA@2\windows-jdk9-m3.5.x_build\target\invoker-reports\BUILD-cli-options_bind-services.xml, f:\jenkins\jenkins-slave\workspace\_maven-jlink-plugin_CLEANUP-YYRC5VLF7HAIAIEICXGYPF25BOQW6NXDQRTJOEZNHEUF2NVU67EA@2\windows-jdk9-m3.5.x_build\target\invoker-reports\BUILD-cli-options_compress-0.xml, f:\jenkins\jenkins-slave\workspace\_maven-jlink-plugin_CLEANUP-YYRC5VLF7HAIAIEICXGYPF25BOQW6NXDQRTJOEZNHEUF2NVU67EA@2\windows-jdk9-m3.5.x_build\target\invoker-reports\BUILD-cli-options_compress-1.xml, f:\jenkins\jenkins-slave\workspace\_maven-jlink-plugin_CLEANUP-YYRC5VLF7HAIAIEICXGYPF25BOQW6NXDQRTJOEZNHEUF2NVU67EA@2\windows-jdk9-m3.5.x_build\target\invoker-reports\BUILD-cli-options_compress-2.xml, f:\jenkins\jenkins-slave\workspace\_maven-jlink-plugin_CLEANUP-YYRC5VLF7HAIAIEICXGYPF25BOQW6NXDQRTJOEZNHEUF2NVU67EA@2\windows-jdk9-m3.5.x_build\target\invoker-reports\BUILD-cli-options_disable-plugin.xml, f:\jenkins\jenkins-slave\workspace\_maven-jlink-plugin_CLEANUP-YYRC5VLF7HAIAIEICXGYPF25BOQW6NXDQRTJOEZNHEUF2NVU67EA@2\windows-jdk9-m3.5.x_build\target\invoker-reports\BUILD-cli-options_endian-big.xml, f:\jenkins\jenkins-slave\workspace\_maven-jlink-plugin_CLEANUP-YYRC5VLF7HAIAIEICXGYPF25BOQW6NXDQRTJOEZNHEUF2NVU67EA@2\windows-jdk9-m3.5.x_build\target\invoker-reports\BUILD-cli-options_endian.xml, f:\jenkins\jenkins-slave\workspace\_maven-jlink-plugin_CLEANUP-YYRC5VLF7HAIAIEICXGYPF25BOQW6NXDQRTJOEZNHEUF2NVU67EA@2\windows-jdk9-m3.5.x_build\target\invoker-reports\BUILD-cli-options_ignore-signing-information.xml, f:\jenkins\jenkins-slave\workspace\_maven-jlink-plugin_CLEANUP-YYRC5VLF7HAIAIEICXGYPF25BOQW6NXDQRTJOEZNHEUF2NVU67EA@2\windows-jdk9-m3.5.x_build\target\invoker-reports\BUILD-cli-options_no-header-files.xml, f:\jenkins\jenkins-slave\workspace\_maven-jlink-plugin_CLEANUP-YYRC5VLF7HAIAIEICXGYPF25BOQW6NXDQRTJOEZNHEUF2NVU67EA@2\windows-jdk9-m3.5.x_build\target\invoker-reports\BUILD-cli-options_no-man-pages.xml, f:\jenkins\jenkins-slave\workspace\_maven-jlink-plugin_CLEANUP-YYRC5VLF7HAIAIEICXGYPF25BOQW6NXDQRTJOEZNHEUF2NVU67EA@2\windows-jdk9-m3.5.x_build\target\invoker-reports\BUILD-cli-options_strip-debug.xml, f:\jenkins\jenkins-slave\workspace\_maven-jlink-plugin_CLEANUP-YYRC5VLF7HAIAIEICXGYPF25BOQW6NXDQRTJOEZNHEUF2NVU67EA@2\windows-jdk9-m3.5.x_build\target\invoker-reports\BUILD-setup-jar-module-info.xml, f:\jenkins\jenkins-slave\workspace\_maven-jlink-plugin_CLEANUP-YYRC5VLF7HAIAIEICXGYPF25BOQW6NXDQRTJOEZNHEUF2NVU67EA@2\windows-jdk9-m3.5.x_build\target\invoker-reports\BUILD-setup-jar.xml]
[windows-jdk9-m3.5.x_build] Found logs:[f:\jenkins\jenkins-slave\workspace\_maven-jlink-plugin_CLEANUP-YYRC5VLF7HAIAIEICXGYPF25BOQW6NXDQRTJOEZNHEUF2NVU67EA@2\windows-jdk9-m3.5.x_build\target\it\MJLINK-3_improveVerboseOutput\build.log, f:\jenkins\jenkins-slave\workspace\_maven-jlink-plugin_CLEANUP-YYRC5VLF7HAIAIEICXGYPF25BOQW6NXDQRTJOEZNHEUF2NVU67EA@2\windows-jdk9-m3.5.x_build\target\it\MJLINK-4_dependencyResolution\build.log, f:\jenkins\jenkins-slave\workspace\_maven-jlink-plugin_CLEANUP-YYRC5VLF7HAIAIEICXGYPF25BOQW6NXDQRTJOEZNHEUF2NVU67EA@2\windows-jdk9-m3.5.x_build\target\it\cli-options\bind-services\build.log, f:\jenkins\jenkins-slave\workspace\_maven-jlink-plugin_CLEANUP-YYRC5VLF7HAIAIEICXGYPF25BOQW6NXDQRTJOEZNHEUF2NVU67EA@2\windows-jdk9-m3.5.x_build\target\it\cli-options\compress-0\build.log, f:\jenkins\jenkins-slave\workspace\_maven-jlink-plugin_CLEANUP-YYRC5VLF7HAIAIEICXGYPF25BOQW6NXDQRTJOEZNHEUF2NVU67EA@2\windows-jdk9-m3.5.x_build\target\it\cli-options\compress-1\build.log, f:\jenkins\jenkins-slave\workspace\_maven-jlink-plugin_CLEANUP-YYRC5VLF7HAIAIEICXGYPF25BOQW6NXDQRTJOEZNHEUF2NVU67EA@2\windows-jdk9-m3.5.x_build\target\it\cli-options\compress-2\build.log, f:\jenkins\jenkins-slave\workspace\_maven-jlink-plugin_CLEANUP-YYRC5VLF7HAIAIEICXGYPF25BOQW6NXDQRTJOEZNHEUF2NVU67EA@2\windows-jdk9-m3.5.x_build\target\it\cli-options\disable-plugin\build.log, f:\jenkins\jenkins-slave\workspace\_maven-jlink-plugin_CLEANUP-YYRC5VLF7HAIAIEICXGYPF25BOQW6NXDQRTJOEZNHEUF2NVU67EA@2\windows-jdk9-m3.5.x_build\target\it\cli-options\endian-big\build.log, f:\jenkins\jenkins-slave\workspace\_maven-jlink-plugin_CLEANUP-YYRC5VLF7HAIAIEICXGYPF25BOQW6NXDQRTJOEZNHEUF2NVU67EA@2\windows-jdk9-m3.5.x_build\target\it\cli-options\endian\build.log, f:\jenkins\jenkins-slave\workspace\_maven-jlink-plugin_CLEANUP-YYRC5VLF7HAIAIEICXGYPF25BOQW6NXDQRTJOEZNHEUF2NVU67EA@2\windows-jdk9-m3.5.x_build\target\it\cli-options\ignore-signing-information\build.log, f:\jenkins\jenkins-slave\workspace\_maven-jlink-plugin_CLEANUP-YYRC5VLF7HAIAIEICXGYPF25BOQW6NXDQRTJOEZNHEUF2NVU67EA@2\windows-jdk9-m3.5.x_build\target\it\cli-options\no-header-files\build.log, f:\jenkins\jenkins-slave\workspace\_maven-jlink-plugin_CLEANUP-YYRC5VLF7HAIAIEICXGYPF25BOQW6NXDQRTJOEZNHEUF2NVU67EA@2\windows-jdk9-m3.5.x_build\target\it\cli-options\no-man-pages\build.log, f:\jenkins\jenkins-slave\workspace\_maven-jlink-plugin_CLEANUP-YYRC5VLF7HAIAIEICXGYPF25BOQW6NXDQRTJOEZNHEUF2NVU67EA@2\windows-jdk9-m3.5.x_build\target\it\cli-options\strip-debug\build.log, f:\jenkins\jenkins-slave\workspace\_maven-jlink-plugin_CLEANUP-YYRC5VLF7HAIAIEICXGYPF25BOQW6NXDQRTJOEZNHEUF2NVU67EA@2\windows-jdk9-m3.5.x_build\target\it\setup-jar-module-info\build.log, f:\jenkins\jenkins-slave\workspace\_maven-jlink-plugin_CLEANUP-YYRC5VLF7HAIAIEICXGYPF25BOQW6NXDQRTJOEZNHEUF2NVU67EA@2\windows-jdk9-m3.5.x_build\target\it\setup-jar\build.log]
[windows-jdk9-m3.5.x_build] Finished parsing Maven Invoker results (found 15)
[windows-jdk9-m3.5.x_build] [withMaven] junitPublisher - Archive test results for Maven artifact org.apache.maven.plugins:maven-jlink-plugin:3.0.0-alpha-2-SNAPSHOT generated by maven-surefire-plugin:test (default-test): windows-jdk9-m3.5.x_build\target\surefire-reports\*.xml
[windows-jdk9-m3.5.x_build] Recording test results
[windows-jdk9-m3.5.x_build] [withMaven] openTasksPublisher - Scan Tasks for Maven artifact org.apache.maven.plugins:maven-jlink-plugin:3.0.0-alpha-2-SNAPSHOT in source directory windows-jdk9-m3.5.x_build\src\main\java
[windows-jdk9-m3.5.x_build] [TASKS] Scanning folder 'f:\jenkins\jenkins-slave\workspace\_maven-jlink-plugin_CLEANUP-YYRC5VLF7HAIAIEICXGYPF25BOQW6NXDQRTJOEZNHEUF2NVU67EA@2' for files matching the pattern 'windows-jdk9-m3.5.x_build\src\main\java\**\*' - excludes: null
[windows-jdk9-m3.5.x_build] [TASKS] Found 2 files to scan for tasks
[windows-jdk9-m3.5.x_build] [TASKS] Found 5 open tasks.
[windows-jdk9-m3.5.x_build] Skipping warnings blame since pipelines do not have an SCM link.%n
[Pipeline] [windows-jdk9-m3.5.x_build] // withMaven
[Pipeline] [windows-jdk9-m3.5.x_build] cleanWs
[windows-jdk9-m3.5.x_build] [WS-CLEANUP] Deleting project workspace...[WS-CLEANUP] done
[Pipeline] [windows-jdk9-m3.5.x_build] cleanWs
[windows-jdk9-m3.5.x_build] [WS-CLEANUP] Deleting project workspace...[WS-CLEANUP] done
[Pipeline] [windows-jdk9-m3.5.x_build] }
[Pipeline] [windows-jdk9-m3.5.x_build] // stage
[Pipeline] [windows-jdk9-m3.5.x_build] }
[Pipeline] [windows-jdk9-m3.5.x_build] // ws
[Pipeline] [windows-jdk9-m3.5.x_build] }
[Pipeline] [windows-jdk9-m3.5.x_build] // node
[Pipeline] [windows-jdk9-m3.5.x_build] }
[windows-jdk9-m3.5.x_build] Failed in branch windows-jdk9-m3.5.x_build
[Pipeline] // parallel
[Pipeline] stage
[Pipeline] { (Notifications)
[Pipeline] echo
Build result: FAILURE
[Pipeline] jiraIssueSelector