Build failed in Jenkins: Maven TLP » maven-jdeps-plugin » master #49

classic Classic list List threaded Threaded
5 messages Options
Reply | Threaded
Open this post in threaded view
|

Build failed in Jenkins: Maven TLP » maven-jdeps-plugin » master #49

Apache Jenkins Server-2
See https://builds.apache.org/job/maven-box/job/maven-jdeps-plugin/job/master/49/

Changes:

* Add JDK 13 (latest)
* INFRA-17514, lock to 1 Windows node
* Cause found, back to all Windows nodes
* INFRA-17514 testing if this invoker keeps locks on the files.
* INFRA-17514 disable invokerPublisher() This is the root cause for the

All tests passed

Build log:
[...truncated 14707 lines...]
[INFO]
[INFO] Tests run: 3, Failures: 0, Errors: 0, Skipped: 0
[INFO]
[INFO]
[INFO] --- maven-jar-plugin:3.1.0:jar (default-jar) @ maven-jdeps-plugin ---
[INFO] Building jar: f:\jenkins\jenkins-slave\workspace\en-box_maven-jdeps-plugin_master@2\windows-jdk11-m3.5.x_build\target\maven-jdeps-plugin-3.1.2-SNAPSHOT.jar
[INFO]           module\pom.xml ................................... SUCCESS (8.3 s)
[INFO] Building: multirelease\pom.xml
[INFO] run post-build script verify.groovy
[INFO]           unsupported-api_main\pom.xml ..................... SUCCESS (8.3 s)
[INFO] Building: unsupported-api_test\pom.xml
[INFO]
[INFO] --- maven-plugin-plugin:3.5.2:addPluginArtifactMetadata (default-addPluginArtifactMetadata) @ maven-jdeps-plugin ---
[INFO]
[INFO] --- maven-site-plugin:3.7.1:attach-descriptor (attach-descriptor) @ maven-jdeps-plugin ---
[INFO] Skipping because packaging 'maven-plugin' is not pom.
[INFO]
[INFO] --- maven-invoker-plugin:3.1.0:install (integration-test) @ maven-jdeps-plugin ---
[INFO]           basic\pom.xml .................................... SUCCESS (11.8 s)
[INFO] Building: dependenciesToAnalyze\pom.xml
[INFO] Installing f:\jenkins\jenkins-slave\workspace\en-box_maven-jdeps-plugin_master@2\windows-jdk11-m3.5.x_build\pom.xml to f:\jenkins\jenkins-slave\workspace\en-box_maven-jdeps-plugin_master@2\windows-jdk11-m3.5.x_build\target\local-repo\org\apache\maven\plugins\maven-jdeps-plugin\3.1.2-SNAPSHOT\maven-jdeps-plugin-3.1.2-SNAPSHOT.pom
[INFO] Installing f:\jenkins\jenkins-slave\workspace\en-box_maven-jdeps-plugin_master@2\windows-jdk11-m3.5.x_build\target\maven-jdeps-plugin-3.1.2-SNAPSHOT.jar to f:\jenkins\jenkins-slave\workspace\en-box_maven-jdeps-plugin_master@2\windows-jdk11-m3.5.x_build\target\local-repo\org\apache\maven\plugins\maven-jdeps-plugin\3.1.2-SNAPSHOT\maven-jdeps-plugin-3.1.2-SNAPSHOT.jar
[INFO]
[INFO] --- maven-invoker-plugin:3.1.0:integration-test (integration-test) @ maven-jdeps-plugin ---
[INFO] Building: basic\pom.xml
[INFO] run post-build script verify.groovy
WARNING: An illegal reflective access operation has occurred
WARNING: Illegal reflective access by org.codehaus.groovy.reflection.CachedClass (file:/f:/jenkins/jenkins-slave/workspace/.maven_repositories/null/org/codehaus/groovy/groovy-all/2.4.8/groovy-all-2.4.8.jar) to method java.lang.Object.finalize()
WARNING: Please consider reporting this to the maintainers of org.codehaus.groovy.reflection.CachedClass
WARNING: Use --illegal-access=warn to enable warnings of further illegal reflective access operations
WARNING: All illegal access operations will be denied in a future release
[INFO]           dependenciesToAnalyze\pom.xml .................... SUCCESS (4.8 s)
[INFO] Building: module\pom.xml
[INFO]           multirelease\pom.xml ............................. SUCCESS (8.7 s)
[INFO] Building: package\pom.xml
[INFO]           module\pom.xml ................................... SUCCESS (5.8 s)
[INFO] Building: multirelease\pom.xml
[INFO] run post-build script verify.groovy
[INFO]           package\pom.xml .................................. SUCCESS (7.3 s)
[INFO] Building: unsupported-api_main\pom.xml
[INFO]           unsupported-api_main\pom.xml ..................... SKIPPED due to JRE version
[INFO] Building: unsupported-api_test\pom.xml
[INFO]           unsupported-api_test\pom.xml ..................... SKIPPED due to JRE version
[INFO]
[INFO] --- maven-checkstyle-plugin:3.0.0:check (checkstyle-check) @ maven-jdeps-plugin ---
[INFO]           multirelease\pom.xml ............................. SUCCESS (4.9 s)
[INFO] Building: package\pom.xml
[INFO]           basic\pom.xml .................................... SUCCESS (14.5 s)
[INFO] Building: dependenciesToAnalyze\pom.xml
[INFO]
[INFO] --- maven-invoker-plugin:3.1.0:verify (integration-test) @ maven-jdeps-plugin ---
[INFO] -------------------------------------------------
[INFO] Build Summary:
[INFO]   Passed: 5, Failed: 0, Errors: 0, Skipped: 2
[INFO] -------------------------------------------------
[INFO] ------------------------------------------------------------------------
[INFO] BUILD SUCCESS
[INFO] ------------------------------------------------------------------------
[INFO] Total time: 01:04 min
[INFO] Finished at: 2019-01-20T07:30:50Z
[INFO] Final Memory: 41M/139M
[INFO] ------------------------------------------------------------------------
[INFO] [jenkins-event-spy] Generated F:\jenkins\jenkins-slave\workspace\en-box_maven-jdeps-plugin_master@3@2@tmp\withMavenc9f111c7\maven-spy-20190120-072945-75215011717859597151889.log
[Pipeline] }
[Pipeline] // dir
[Pipeline] }
[withMaven] artifactsPublisher - Archive artifact windows-jdk9-m3.5.x_build\pom.xml under org\apache\maven\plugins\maven-jdeps-plugin\3.1.2-SNAPSHOT\maven-jdeps-plugin-3.1.2-SNAPSHOT.pom
[withMaven] artifactsPublisher - Archive artifact windows-jdk9-m3.5.x_build\target\maven-jdeps-plugin-3.1.2-SNAPSHOT.jar under org\apache\maven\plugins\maven-jdeps-plugin\3.1.2-SNAPSHOT\maven-jdeps-plugin-3.1.2-SNAPSHOT.jar
[withMaven] junitPublisher - Archive test results for Maven artifact org.apache.maven.plugins:maven-jdeps-plugin:maven-plugin:3.1.2-SNAPSHOT generated by maven-surefire-plugin:test (default-test): windows-jdk9-m3.5.x_build\target\surefire-reports\*.xml
Recording test results
[withMaven] openTasksPublisher - Scan Tasks for Maven artifact org.apache.maven.plugins:maven-jdeps-plugin:maven-plugin:3.1.2-SNAPSHOT in source directory windows-jdk9-m3.5.x_build\src\main\java
[INFO] run post-build script verify.groovy
[INFO]           unsupported-api_test\pom.xml ..................... SUCCESS (17.6 s)
[INFO]
[INFO] --- maven-checkstyle-plugin:3.0.0:check (checkstyle-check) @ maven-jdeps-plugin ---
[TASKS] Scanning folder 'f:\jenkins\jenkins-slave\workspace\en-box_maven-jdeps-plugin_master@3@2' for files matching the pattern 'windows-jdk9-m3.5.x_build\src\main\java\**\*' - excludes: null
[TASKS] Found 5 files to scan for tasks
[TASKS] Found 1 open tasks.
Skipping warnings blame since pipelines do not have an SCM link.%n
[TASKS] Computing warning deltas based on reference build #48
[withMaven] Publishers: Generated Artifacts Publisher: 114 ms, Junit Publisher: 82 ms, Open Task Scanner Publisher: 80 ms, Pipeline Graph Publisher: 1 ms
[Pipeline] // withMaven
[Pipeline] cleanWs
[WS-CLEANUP] Deleting project workspace...
[WS-CLEANUP] Deferred wipeout is used...
[WS-CLEANUP] done
[Pipeline] }
[Pipeline] // stage
[Pipeline] }
[Pipeline] // ws
[Pipeline] }
[Pipeline] // node
[Pipeline] }
[INFO]
[INFO] --- maven-invoker-plugin:3.1.0:verify (integration-test) @ maven-jdeps-plugin ---
[INFO] -------------------------------------------------
[INFO] Build Summary:
[INFO]   Passed: 5, Failed: 0, Errors: 0, Skipped: 2
[INFO] -------------------------------------------------
[INFO] ------------------------------------------------------------------------
[INFO] BUILD SUCCESS
[INFO] ------------------------------------------------------------------------
[INFO] Total time: 01:12 min
[INFO] Finished at: 2019-01-20T07:30:51Z
[INFO] Final Memory: 52M/556M
[INFO] ------------------------------------------------------------------------
[INFO] [jenkins-event-spy] Generated F:\jenkins\jenkins-slave\workspace\en-box_maven-jdeps-plugin_master@2@tmp\withMaven7fe3a8f6\maven-spy-20190120-072938-7583877397755752407729.log
Picked up JAVA_TOOL_OPTIONS: -Dmaven.ext.class.path="f:\jenkins\jenkins-slave\workspace\en-box_maven-jdeps-plugin_master@2@tmp\withMaven7fe3a8f6\pipeline-maven-spy.jar" -Dorg.jenkinsci.plugins.pipeline.maven.reportsFolder="f:\jenkins\jenkins-slave\workspace\en-box_maven-jdeps-plugin_master@2@tmp\withMaven7fe3a8f6"
[Pipeline] }
[Pipeline] // dir
[Pipeline] }
[withMaven] artifactsPublisher - Archive artifact windows-jdk8-m3.5.x_build\pom.xml under org\apache\maven\plugins\maven-jdeps-plugin\3.1.2-SNAPSHOT\maven-jdeps-plugin-3.1.2-SNAPSHOT.pom
[withMaven] artifactsPublisher - Archive artifact windows-jdk8-m3.5.x_build\target\maven-jdeps-plugin-3.1.2-SNAPSHOT.jar under org\apache\maven\plugins\maven-jdeps-plugin\3.1.2-SNAPSHOT\maven-jdeps-plugin-3.1.2-SNAPSHOT.jar
[withMaven] junitPublisher - Archive test results for Maven artifact org.apache.maven.plugins:maven-jdeps-plugin:maven-plugin:3.1.2-SNAPSHOT generated by maven-surefire-plugin:test (default-test): windows-jdk8-m3.5.x_build\target\surefire-reports\*.xml
Recording test results
[withMaven] openTasksPublisher - Scan Tasks for Maven artifact org.apache.maven.plugins:maven-jdeps-plugin:maven-plugin:3.1.2-SNAPSHOT in source directory windows-jdk8-m3.5.x_build\src\main\java
[TASKS] Scanning folder 'f:\jenkins\jenkins-slave\workspace\en-box_maven-jdeps-plugin_master@2' for files matching the pattern 'windows-jdk8-m3.5.x_build\src\main\java\**\*' - excludes: null
[TASKS] Found 5 files to scan for tasks
[TASKS] Found 1 open tasks.
Skipping warnings blame since pipelines do not have an SCM link.%n
[TASKS] Computing warning deltas based on reference build #48
[withMaven] Publishers: Generated Artifacts Publisher: 113 ms, Junit Publisher: 78 ms, Open Task Scanner Publisher: 68 ms
[Pipeline] // withMaven
[Pipeline] cleanWs
[WS-CLEANUP] Deleting project workspace...
[WS-CLEANUP] Deferred wipeout is used...
[WS-CLEANUP] done
[Pipeline] }
[Pipeline] // stage
[Pipeline] }
[Pipeline] // ws
[Pipeline] }
[Pipeline] // node
[Pipeline] }
[INFO] run post-build script verify.groovy
[INFO]           package\pom.xml .................................. SUCCESS (3.8 s)
[INFO] Building: unsupported-api_main\pom.xml
[INFO]           unsupported-api_main\pom.xml ..................... SKIPPED due to JRE version
[INFO] Building: unsupported-api_test\pom.xml
[INFO]           unsupported-api_test\pom.xml ..................... SKIPPED due to JRE version
[INFO]
[INFO] --- maven-checkstyle-plugin:3.0.0:check (checkstyle-check) @ maven-jdeps-plugin ---
[INFO]
[INFO] --- maven-invoker-plugin:3.1.0:verify (integration-test) @ maven-jdeps-plugin ---
[INFO] -------------------------------------------------
[INFO] Build Summary:
[INFO]   Passed: 5, Failed: 0, Errors: 0, Skipped: 2
[INFO] -------------------------------------------------
[INFO] ------------------------------------------------------------------------
[INFO] BUILD SUCCESS
[INFO] ------------------------------------------------------------------------
[INFO] Total time: 41.957 s
[INFO] Finished at: 2019-01-20T07:30:54Z
[INFO] Final Memory: 41M/144M
[INFO] ------------------------------------------------------------------------
[INFO] [jenkins-event-spy] Generated F:\jenkins\jenkins-slave\workspace\en-box_maven-jdeps-plugin_master@2@tmp\withMavene5b8e0fd\maven-spy-20190120-073012-542508298287149847406.log
[Pipeline] }
[Pipeline] // dir
[Pipeline] }
[withMaven] artifactsPublisher - Archive artifact windows-jdk10-m3.5.x_build\pom.xml under org\apache\maven\plugins\maven-jdeps-plugin\3.1.2-SNAPSHOT\maven-jdeps-plugin-3.1.2-SNAPSHOT.pom
[withMaven] artifactsPublisher - Archive artifact windows-jdk10-m3.5.x_build\target\maven-jdeps-plugin-3.1.2-SNAPSHOT.jar under org\apache\maven\plugins\maven-jdeps-plugin\3.1.2-SNAPSHOT\maven-jdeps-plugin-3.1.2-SNAPSHOT.jar
[withMaven] junitPublisher - Archive test results for Maven artifact org.apache.maven.plugins:maven-jdeps-plugin:maven-plugin:3.1.2-SNAPSHOT generated by maven-surefire-plugin:test (default-test): windows-jdk10-m3.5.x_build\target\surefire-reports\*.xml
Recording test results
[withMaven] openTasksPublisher - Scan Tasks for Maven artifact org.apache.maven.plugins:maven-jdeps-plugin:maven-plugin:3.1.2-SNAPSHOT in source directory windows-jdk10-m3.5.x_build\src\main\java
[TASKS] Scanning folder 'f:\jenkins\jenkins-slave\workspace\en-box_maven-jdeps-plugin_master@2' for files matching the pattern 'windows-jdk10-m3.5.x_build\src\main\java\**\*' - excludes: null
[TASKS] Found 5 files to scan for tasks
[TASKS] Found 1 open tasks.
Skipping warnings blame since pipelines do not have an SCM link.%n
[TASKS] Computing warning deltas based on reference build #48
[withMaven] Publishers: Generated Artifacts Publisher: 619 ms, Junit Publisher: 373 ms, Open Task Scanner Publisher: 284 ms
[Pipeline] // withMaven
[Pipeline] cleanWs
[WS-CLEANUP] Deleting project workspace...
[WS-CLEANUP] Deferred wipeout is used...
[WS-CLEANUP] done
[Pipeline] }
[Pipeline] // stage
[Pipeline] }
[Pipeline] // ws
[Pipeline] }
[Pipeline] // node
[Pipeline] }
[INFO] run post-build script verify.groovy
WARNING: An illegal reflective access operation has occurred
WARNING: Illegal reflective access by org.codehaus.groovy.reflection.CachedClass (file:/f:/jenkins/jenkins-slave/workspace/.maven_repositories/null/org/codehaus/groovy/groovy-all/2.4.8/groovy-all-2.4.8.jar) to method java.lang.Object.finalize()
WARNING: Please consider reporting this to the maintainers of org.codehaus.groovy.reflection.CachedClass
WARNING: Use --illegal-access=warn to enable warnings of further illegal reflective access operations
WARNING: All illegal access operations will be denied in a future release
[INFO]           dependenciesToAnalyze\pom.xml .................... SUCCESS (9.3 s)
[INFO] Building: module\pom.xml
[INFO]           module\pom.xml ................................... SUCCESS (9.0 s)
[INFO] Building: multirelease\pom.xml
[INFO]           multirelease\pom.xml ............................. SUCCESS (9.1 s)
[INFO] Building: package\pom.xml
[INFO] run post-build script verify.groovy
[INFO]           package\pom.xml .................................. SUCCESS (7.8 s)
[INFO] Building: unsupported-api_main\pom.xml
[INFO]           unsupported-api_main\pom.xml ..................... SKIPPED due to JRE version
[INFO] Building: unsupported-api_test\pom.xml
[INFO]           unsupported-api_test\pom.xml ..................... SKIPPED due to JRE version
[INFO]
[INFO] --- maven-checkstyle-plugin:3.0.0:check (checkstyle-check) @ maven-jdeps-plugin ---
[INFO]
[INFO] --- maven-invoker-plugin:3.1.0:verify (integration-test) @ maven-jdeps-plugin ---
[INFO] -------------------------------------------------
[INFO] Build Summary:
[INFO]   Passed: 5, Failed: 0, Errors: 0, Skipped: 2
[INFO] -------------------------------------------------
[INFO] ------------------------------------------------------------------------
[INFO] BUILD SUCCESS
[INFO] ------------------------------------------------------------------------
[INFO] Total time: 01:07 min
[INFO] Finished at: 2019-01-19T23:31:26-08:00
[INFO] Final Memory: 40M/140M
[INFO] ------------------------------------------------------------------------
[INFO] [jenkins-event-spy] Generated F:\jenkins\jenkins-slave\workspace\en-box_maven-jdeps-plugin_master@2@tmp\withMaven3e4c4d48\maven-spy-20190119-233018-63610193413877584361477.log
[Pipeline] }
[Pipeline] // dir
[Pipeline] }
[withMaven] artifactsPublisher - Archive artifact windows-jdk11-m3.5.x_build\pom.xml under org\apache\maven\plugins\maven-jdeps-plugin\3.1.2-SNAPSHOT\maven-jdeps-plugin-3.1.2-SNAPSHOT.pom
[withMaven] artifactsPublisher - Archive artifact windows-jdk11-m3.5.x_build\target\maven-jdeps-plugin-3.1.2-SNAPSHOT.jar under org\apache\maven\plugins\maven-jdeps-plugin\3.1.2-SNAPSHOT\maven-jdeps-plugin-3.1.2-SNAPSHOT.jar
[withMaven] junitPublisher - Archive test results for Maven artifact org.apache.maven.plugins:maven-jdeps-plugin:maven-plugin:3.1.2-SNAPSHOT generated by maven-surefire-plugin:test (default-test): windows-jdk11-m3.5.x_build\target\surefire-reports\*.xml
Recording test results
[withMaven] openTasksPublisher - Scan Tasks for Maven artifact org.apache.maven.plugins:maven-jdeps-plugin:maven-plugin:3.1.2-SNAPSHOT in source directory windows-jdk11-m3.5.x_build\src\main\java
[TASKS] Scanning folder 'f:\jenkins\jenkins-slave\workspace\en-box_maven-jdeps-plugin_master@2' for files matching the pattern 'windows-jdk11-m3.5.x_build\src\main\java\**\*' - excludes: null
[TASKS] Found 5 files to scan for tasks
[TASKS] Found 1 open tasks.
Skipping warnings blame since pipelines do not have an SCM link.%n
[TASKS] Computing warning deltas based on reference build #48
[withMaven] Publishers: Generated Artifacts Publisher: 118 ms, Junit Publisher: 82 ms, Open Task Scanner Publisher: 99 ms, Pipeline Graph Publisher: 1 ms
[Pipeline] // withMaven
[Pipeline] cleanWs
[WS-CLEANUP] Deleting project workspace...
[WS-CLEANUP] Deferred wipeout is used...
[WS-CLEANUP] done
[Pipeline] }
[Pipeline] // stage
[Pipeline] }
[Pipeline] // ws
[Pipeline] }
[Pipeline] // node
[Pipeline] }
[Pipeline] // parallel
[Pipeline] stage
[Pipeline] { (Notifications)
[Pipeline] echo
Build result: FAILURE
[Pipeline] jiraIssueSelector
[Pipeline] emailext
Reply | Threaded
Open this post in threaded view
|

Build failed in Jenkins: Maven TLP » maven-jdeps-plugin » master #50

Apache Jenkins Server-2
See https://builds.apache.org/job/maven-box/job/maven-jdeps-plugin/job/master/50/

Changes:

* Add support for Maven 3.6.x/3.6.0
* More verbose info about build exceptions
* Verbose info about failure - add bit more
* Revert: no access to currntBuild.rawBuild

All tests passed

Build log:
[...truncated 11707 lines...]
[INFO] -------------------------------------------------
[INFO] ------------------------------------------------------------------------
[INFO] BUILD SUCCESS
[INFO] ------------------------------------------------------------------------
[INFO] Total time: 01:21 min
[INFO] Finished at: 2019-01-25T14:46:26Z
[INFO] Final Memory: 52M/560M
[INFO] ------------------------------------------------------------------------
[INFO] [jenkins-event-spy] Generated F:\jenkins\jenkins-slave\workspace\en-box_maven-jdeps-plugin_master@3@tmp\withMaven1808edc7\maven-spy-20190125-144504-1533550684117151191928.log
Picked up JAVA_TOOL_OPTIONS: -Dmaven.ext.class.path="f:\jenkins\jenkins-slave\workspace\en-box_maven-jdeps-plugin_master@3@tmp\withMaven1808edc7\pipeline-maven-spy.jar" -Dorg.jenkinsci.plugins.pipeline.maven.reportsFolder="f:\jenkins\jenkins-slave\workspace\en-box_maven-jdeps-plugin_master@3@tmp\withMaven1808edc7"
[Pipeline] }
[Pipeline] // dir
[Pipeline] }
[withMaven] artifactsPublisher - Archive artifact windows-jdk8-m3.5.x_build\pom.xml under org\apache\maven\plugins\maven-jdeps-plugin\3.1.2-SNAPSHOT\maven-jdeps-plugin-3.1.2-SNAPSHOT.pom
[withMaven] artifactsPublisher - Archive artifact windows-jdk8-m3.5.x_build\target\maven-jdeps-plugin-3.1.2-SNAPSHOT.jar under org\apache\maven\plugins\maven-jdeps-plugin\3.1.2-SNAPSHOT\maven-jdeps-plugin-3.1.2-SNAPSHOT.jar
[withMaven] junitPublisher - Archive test results for Maven artifact org.apache.maven.plugins:maven-jdeps-plugin:maven-plugin:3.1.2-SNAPSHOT generated by maven-surefire-plugin:test (default-test): windows-jdk8-m3.5.x_build\target\surefire-reports\*.xml
Recording test results
[withMaven] openTasksPublisher - Scan Tasks for Maven artifact org.apache.maven.plugins:maven-jdeps-plugin:maven-plugin:3.1.2-SNAPSHOT in source directory windows-jdk8-m3.5.x_build\src\main\java
[TASKS] Scanning folder 'f:\jenkins\jenkins-slave\workspace\en-box_maven-jdeps-plugin_master@3' for files matching the pattern 'windows-jdk8-m3.5.x_build\src\main\java\**\*' - excludes: null
[TASKS] Found 5 files to scan for tasks
[TASKS] Found 1 open tasks.
Skipping warnings blame since pipelines do not have an SCM link.%n
[TASKS] Computing warning deltas based on reference build #48
[withMaven] Publishers: Generated Artifacts Publisher: 119 ms, Junit Publisher: 81 ms, Open Task Scanner Publisher: 83 ms, Pipeline Graph Publisher: 1 ms
[Pipeline] // withMaven
[Pipeline] cleanWs
[WS-CLEANUP] Deleting project workspace...
[WS-CLEANUP] Deferred wipeout is used...
[WS-CLEANUP] done
[Pipeline] }
[Pipeline] // stage
[Pipeline] }
[Pipeline] // ws
[Pipeline] }
[Pipeline] // node
[Pipeline] }
[INFO] run post-build script verify.groovy
[INFO]           package\pom.xml .................................. SUCCESS (8.2 s)
[INFO] Building: unsupported-api_main\pom.xml
[INFO] run post-build script verify.groovy
[INFO]           package\pom.xml .................................. SUCCESS (8.8 s)
[INFO] Building: unsupported-api_main\pom.xml
[INFO]           module\pom.xml ................................... SUCCESS (9.6 s)
[INFO] Building: multirelease\pom.xml
[INFO]           module\pom.xml ................................... SUCCESS (9.6 s)
[INFO] Building: multirelease\pom.xml
[INFO] run post-build script verify.groovy
[INFO]           unsupported-api_main\pom.xml ..................... SUCCESS (8.6 s)
[INFO] Building: unsupported-api_test\pom.xml
[INFO] run post-build script verify.groovy
[INFO]           unsupported-api_main\pom.xml ..................... SUCCESS (8.9 s)
[INFO] Building: unsupported-api_test\pom.xml
[INFO]           multirelease\pom.xml ............................. SUCCESS (9.5 s)
[INFO] Building: package\pom.xml
[INFO]           multirelease\pom.xml ............................. SUCCESS (10.8 s)
[INFO] Building: package\pom.xml
[INFO] run post-build script verify.groovy
[INFO]           package\pom.xml .................................. SUCCESS (7.0 s)
[INFO] Building: unsupported-api_main\pom.xml
[INFO]           unsupported-api_main\pom.xml ..................... SKIPPED due to JRE version
[INFO] Building: unsupported-api_test\pom.xml
[INFO]           unsupported-api_test\pom.xml ..................... SKIPPED due to JRE version
[INFO]
[INFO] --- maven-checkstyle-plugin:3.0.0:check (checkstyle-check) @ maven-jdeps-plugin ---
[INFO] run post-build script verify.groovy
[INFO]           package\pom.xml .................................. SUCCESS (8.3 s)
[INFO] Building: unsupported-api_main\pom.xml
[INFO]           unsupported-api_main\pom.xml ..................... SKIPPED due to JRE version
[INFO] Building: unsupported-api_test\pom.xml
[INFO]           unsupported-api_test\pom.xml ..................... SKIPPED due to JRE version
[INFO]
[INFO] --- maven-checkstyle-plugin:3.0.0:check (checkstyle-check) @ maven-jdeps-plugin ---
[INFO]
[INFO] --- maven-invoker-plugin:3.1.0:verify (integration-test) @ maven-jdeps-plugin ---
[INFO] -------------------------------------------------
[INFO] Build Summary:
[INFO]   Passed: 5, Failed: 0, Errors: 0, Skipped: 2
[INFO] -------------------------------------------------
[INFO] ------------------------------------------------------------------------
[INFO] BUILD SUCCESS
[INFO] ------------------------------------------------------------------------
[INFO] Total time: 01:41 min
[INFO] Finished at: 2019-01-25T06:46:56-08:00
[INFO] Final Memory: 41M/144M
[INFO] ------------------------------------------------------------------------
[INFO] [jenkins-event-spy] Generated F:\jenkins\jenkins-slave\workspace\en-box_maven-jdeps-plugin_master@3@tmp\withMavene439ac0f\maven-spy-20190125-064514-47017845553044209309453.log
[Pipeline] }
[Pipeline] // dir
[Pipeline] }
[withMaven] artifactsPublisher - Archive artifact windows-jdk10-m3.5.x_build\pom.xml under org\apache\maven\plugins\maven-jdeps-plugin\3.1.2-SNAPSHOT\maven-jdeps-plugin-3.1.2-SNAPSHOT.pom
[INFO]
[INFO] --- maven-invoker-plugin:3.1.0:verify (integration-test) @ maven-jdeps-plugin ---
[INFO] -------------------------------------------------
[INFO] Build Summary:
[INFO]   Passed: 5, Failed: 0, Errors: 0, Skipped: 2
[INFO] -------------------------------------------------
[INFO] ------------------------------------------------------------------------
[INFO] BUILD SUCCESS
[INFO] ------------------------------------------------------------------------
[INFO] Total time: 01:44 min
[INFO] Finished at: 2019-01-25T06:46:56-08:00
[INFO] Final Memory: 40M/140M
[INFO] ------------------------------------------------------------------------
[INFO] [jenkins-event-spy] Generated F:\jenkins\jenkins-slave\workspace\en-box_maven-jdeps-plugin_master@2@2@tmp\withMaven63fc1990\maven-spy-20190125-064512-27414133910765905312949.log
[withMaven] artifactsPublisher - Archive artifact windows-jdk10-m3.5.x_build\target\maven-jdeps-plugin-3.1.2-SNAPSHOT.jar under org\apache\maven\plugins\maven-jdeps-plugin\3.1.2-SNAPSHOT\maven-jdeps-plugin-3.1.2-SNAPSHOT.jar
[Pipeline] }
[Pipeline] // dir
[withMaven] junitPublisher - Archive test results for Maven artifact org.apache.maven.plugins:maven-jdeps-plugin:maven-plugin:3.1.2-SNAPSHOT generated by maven-surefire-plugin:test (default-test): windows-jdk10-m3.5.x_build\target\surefire-reports\*.xml
Recording test results
[Pipeline] }
[withMaven] artifactsPublisher - Archive artifact windows-jdk11-m3.5.x_build\pom.xml under org\apache\maven\plugins\maven-jdeps-plugin\3.1.2-SNAPSHOT\maven-jdeps-plugin-3.1.2-SNAPSHOT.pom
[withMaven] openTasksPublisher - Scan Tasks for Maven artifact org.apache.maven.plugins:maven-jdeps-plugin:maven-plugin:3.1.2-SNAPSHOT in source directory windows-jdk10-m3.5.x_build\src\main\java
[withMaven] artifactsPublisher - Archive artifact windows-jdk11-m3.5.x_build\target\maven-jdeps-plugin-3.1.2-SNAPSHOT.jar under org\apache\maven\plugins\maven-jdeps-plugin\3.1.2-SNAPSHOT\maven-jdeps-plugin-3.1.2-SNAPSHOT.jar
[TASKS] Scanning folder 'f:\jenkins\jenkins-slave\workspace\en-box_maven-jdeps-plugin_master@3' for files matching the pattern 'windows-jdk10-m3.5.x_build\src\main\java\**\*' - excludes: null
[TASKS] Found 5 files to scan for tasks
[TASKS] Found 1 open tasks.
Skipping warnings blame since pipelines do not have an SCM link.%n
[TASKS] Computing warning deltas based on reference build #48
[withMaven] junitPublisher - Archive test results for Maven artifact org.apache.maven.plugins:maven-jdeps-plugin:maven-plugin:3.1.2-SNAPSHOT generated by maven-surefire-plugin:test (default-test): windows-jdk11-m3.5.x_build\target\surefire-reports\*.xml
Recording test results
[withMaven] Publishers: Generated Artifacts Publisher: 131 ms, Junit Publisher: 97 ms, Open Task Scanner Publisher: 82 ms, Pipeline Graph Publisher: 1 ms
[Pipeline] // withMaven
[Pipeline] cleanWs
[withMaven] openTasksPublisher - Scan Tasks for Maven artifact org.apache.maven.plugins:maven-jdeps-plugin:maven-plugin:3.1.2-SNAPSHOT in source directory windows-jdk11-m3.5.x_build\src\main\java
[WS-CLEANUP] Deleting project workspace...
[WS-CLEANUP] Deferred wipeout is used...
[TASKS] Scanning folder 'f:\jenkins\jenkins-slave\workspace\en-box_maven-jdeps-plugin_master@2@2' for files matching the pattern 'windows-jdk11-m3.5.x_build\src\main\java\**\*' - excludes: null
[TASKS] Found 5 files to scan for tasks
[TASKS] Found 1 open tasks.
Skipping warnings blame since pipelines do not have an SCM link.%n
[TASKS] Computing warning deltas based on reference build #48
[WS-CLEANUP] done
[Pipeline] }
[Pipeline] // stage
[Pipeline] }
[withMaven] Publishers: Generated Artifacts Publisher: 144 ms, Junit Publisher: 98 ms, Open Task Scanner Publisher: 75 ms, Pipeline Graph Publisher: 27 ms
[Pipeline] // ws
[Pipeline] // withMaven
[Pipeline] }
[Pipeline] cleanWs
[Pipeline] // node
[Pipeline] }
[WS-CLEANUP] Deleting project workspace...
[WS-CLEANUP] Deferred wipeout is used...
[WS-CLEANUP] done
[Pipeline] }
[Pipeline] // stage
[Pipeline] }
[Pipeline] // ws
[Pipeline] }
[Pipeline] // node
[Pipeline] }
[INFO] run post-build script verify.groovy
[INFO]           unsupported-api_test\pom.xml ..................... SUCCESS (18.5 s)
[INFO]
[INFO] --- maven-checkstyle-plugin:3.0.0:check (checkstyle-check) @ maven-jdeps-plugin ---
[INFO] run post-build script verify.groovy
[INFO]           unsupported-api_test\pom.xml ..................... SUCCESS (19.1 s)
[INFO]
[INFO] --- maven-checkstyle-plugin:3.0.0:check (checkstyle-check) @ maven-jdeps-plugin ---
[INFO]
[INFO] --- maven-invoker-plugin:3.1.0:verify (integration-test) @ maven-jdeps-plugin ---
[INFO] -------------------------------------------------
[INFO] Build Summary:
[INFO]   Passed: 5, Failed: 0, Errors: 0, Skipped: 2
[INFO] -------------------------------------------------
[INFO] ------------------------------------------------------------------------
[INFO] BUILD SUCCESS
[INFO] ------------------------------------------------------------------------
[INFO] Total time: 01:52 min
[INFO] Finished at: 2019-01-25T06:47:01-08:00
[INFO]
[INFO] --- maven-invoker-plugin:3.1.0:verify (integration-test) @ maven-jdeps-plugin ---
[INFO] -------------------------------------------------
[INFO] Build Summary:
[INFO]   Passed: 5, Failed: 0, Errors: 0, Skipped: 2
[INFO] -------------------------------------------------
[INFO] ------------------------------------------------------------------------
[INFO] BUILD SUCCESS
[INFO] ------------------------------------------------------------------------
[INFO] Total time: 01:51 min
[INFO] Finished at: 2019-01-25T06:47:01-08:00
[INFO] Final Memory: 49M/472M
[INFO] ------------------------------------------------------------------------
[INFO] [jenkins-event-spy] Generated F:\jenkins\jenkins-slave\workspace\en-box_maven-jdeps-plugin_master@3@tmp\withMaven38d69609\maven-spy-20190125-064509-848446403941353421465.log
Picked up JAVA_TOOL_OPTIONS: -Dmaven.ext.class.path="f:\jenkins\jenkins-slave\workspace\en-box_maven-jdeps-plugin_master@3@tmp\withMaven38d69609\pipeline-maven-spy.jar" -Dorg.jenkinsci.plugins.pipeline.maven.reportsFolder="f:\jenkins\jenkins-slave\workspace\en-box_maven-jdeps-plugin_master@3@tmp\withMaven38d69609"
[Pipeline] }
[Pipeline] // dir
[Pipeline] }
[withMaven] artifactsPublisher - Archive artifact windows-jdk8-m3.2.x_build\pom.xml under org\apache\maven\plugins\maven-jdeps-plugin\3.1.2-SNAPSHOT\maven-jdeps-plugin-3.1.2-SNAPSHOT.pom
[INFO] Final Memory: 44M/444M
[INFO] ------------------------------------------------------------------------
[INFO] [jenkins-event-spy] Generated F:\jenkins\jenkins-slave\workspace\en-box_maven-jdeps-plugin_master@2@2@tmp\withMaven5ebe669d\maven-spy-20190125-064509-1317098254203262265021.log
Picked up JAVA_TOOL_OPTIONS: -Dmaven.ext.class.path="f:\jenkins\jenkins-slave\workspace\en-box_maven-jdeps-plugin_master@2@2@tmp\withMaven5ebe669d\pipeline-maven-spy.jar" -Dorg.jenkinsci.plugins.pipeline.maven.reportsFolder="f:\jenkins\jenkins-slave\workspace\en-box_maven-jdeps-plugin_master@2@2@tmp\withMaven5ebe669d"
[withMaven] artifactsPublisher - Archive artifact windows-jdk8-m3.2.x_build\target\maven-jdeps-plugin-3.1.2-SNAPSHOT.jar under org\apache\maven\plugins\maven-jdeps-plugin\3.1.2-SNAPSHOT\maven-jdeps-plugin-3.1.2-SNAPSHOT.jar
[Pipeline] }
[Pipeline] // dir
[Pipeline] }
[withMaven] junitPublisher - Archive test results for Maven artifact org.apache.maven.plugins:maven-jdeps-plugin:maven-plugin:3.1.2-SNAPSHOT generated by maven-surefire-plugin:test (default-test): windows-jdk8-m3.2.x_build\target\surefire-reports\*.xml
Recording test results
[withMaven] artifactsPublisher - Archive artifact windows-jdk8-m3.3.x_build\pom.xml under org\apache\maven\plugins\maven-jdeps-plugin\3.1.2-SNAPSHOT\maven-jdeps-plugin-3.1.2-SNAPSHOT.pom
[withMaven] artifactsPublisher - Archive artifact windows-jdk8-m3.3.x_build\target\maven-jdeps-plugin-3.1.2-SNAPSHOT.jar under org\apache\maven\plugins\maven-jdeps-plugin\3.1.2-SNAPSHOT\maven-jdeps-plugin-3.1.2-SNAPSHOT.jar
[withMaven] junitPublisher - Archive test results for Maven artifact org.apache.maven.plugins:maven-jdeps-plugin:maven-plugin:3.1.2-SNAPSHOT generated by maven-surefire-plugin:test (default-test): windows-jdk8-m3.3.x_build\target\surefire-reports\*.xml
Recording test results
[withMaven] openTasksPublisher - Scan Tasks for Maven artifact org.apache.maven.plugins:maven-jdeps-plugin:maven-plugin:3.1.2-SNAPSHOT in source directory windows-jdk8-m3.2.x_build\src\main\java
[TASKS] Scanning folder 'f:\jenkins\jenkins-slave\workspace\en-box_maven-jdeps-plugin_master@3' for files matching the pattern 'windows-jdk8-m3.2.x_build\src\main\java\**\*' - excludes: null
[TASKS] Found 5 files to scan for tasks
[TASKS] Found 1 open tasks.
Skipping warnings blame since pipelines do not have an SCM link.%n
[TASKS] Computing warning deltas based on reference build #48
[withMaven] Publishers: Generated Artifacts Publisher: 173 ms, Junit Publisher: 84 ms, Open Task Scanner Publisher: 84 ms, Pipeline Graph Publisher: 1 ms
[withMaven] openTasksPublisher - Scan Tasks for Maven artifact org.apache.maven.plugins:maven-jdeps-plugin:maven-plugin:3.1.2-SNAPSHOT in source directory windows-jdk8-m3.3.x_build\src\main\java
[TASKS] Scanning folder 'f:\jenkins\jenkins-slave\workspace\en-box_maven-jdeps-plugin_master@2@2' for files matching the pattern 'windows-jdk8-m3.3.x_build\src\main\java\**\*' - excludes: null
[TASKS] Found 5 files to scan for tasks
[TASKS] Found 1 open tasks.
Skipping warnings blame since pipelines do not have an SCM link.%n
[Pipeline] // withMaven
[TASKS] Computing warning deltas based on reference build #48
[Pipeline] cleanWs
[WS-CLEANUP] Deleting project workspace...
[WS-CLEANUP] Deferred wipeout is used...
[withMaven] Publishers: Generated Artifacts Publisher: 114 ms, Junit Publisher: 97 ms, Open Task Scanner Publisher: 86 ms, Pipeline Graph Publisher: 1 ms
[WS-CLEANUP] done
[Pipeline] }
[Pipeline] // stage
[Pipeline] // withMaven
[Pipeline] }
[Pipeline] cleanWs
[Pipeline] // ws
[WS-CLEANUP] Deleting project workspace...
[WS-CLEANUP] Deferred wipeout is used...
[Pipeline] }
[Pipeline] // node
[Pipeline] }
[WS-CLEANUP] done
[Pipeline] }
[Pipeline] // stage
[Pipeline] }
[Pipeline] // ws
[Pipeline] }
[Pipeline] // node
[Pipeline] }
[Pipeline] // parallel
[Pipeline] stage
[Pipeline] { (Notifications)
[Pipeline] echo
Build result: FAILURE
[Pipeline] jiraIssueSelector
[Pipeline] emailext
Reply | Threaded
Open this post in threaded view
|

Build failed in Jenkins: Maven TLP » maven-jdeps-plugin » master #51

Apache Jenkins Server-2
See https://builds.apache.org/job/maven-box/job/maven-jdeps-plugin/job/master/51/

No changes.

All tests passed

Build log:
[...truncated 11731 lines...]
[INFO] run post-build script verify.groovy
WARNING: An illegal reflective access operation has occurred
WARNING: Illegal reflective access by org.codehaus.groovy.reflection.CachedClass (file:/f:/jenkins/jenkins-slave/workspace/.maven_repositories/null/org/codehaus/groovy/groovy-all/2.4.8/groovy-all-2.4.8.jar) to method java.lang.Object.finalize()
WARNING: Please consider reporting this to the maintainers of org.codehaus.groovy.reflection.CachedClass
WARNING: Use --illegal-access=warn to enable warnings of further illegal reflective access operations
WARNING: All illegal access operations will be denied in a future release
[INFO]           dependenciesToAnalyze\pom.xml .................... SUCCESS (9.6 s)
[INFO] Building: module\pom.xml
[INFO]           basic\pom.xml .................................... SUCCESS (18.6 s)
[INFO] Building: dependenciesToAnalyze\pom.xml
[INFO] run post-build script verify.groovy
WARNING: An illegal reflective access operation has occurred
WARNING: Illegal reflective access by org.codehaus.groovy.reflection.CachedClass (file:/f:/jenkins/jenkins-slave/workspace/.maven_repositories/null/org/codehaus/groovy/groovy-all/2.4.8/groovy-all-2.4.8.jar) to method java.lang.Object.finalize()
WARNING: Please consider reporting this to the maintainers of org.codehaus.groovy.reflection.CachedClass
WARNING: Use --illegal-access=warn to enable warnings of further illegal reflective access operations
WARNING: All illegal access operations will be denied in a future release
[INFO]           dependenciesToAnalyze\pom.xml .................... SUCCESS (9.5 s)
[INFO] Building: module\pom.xml
[INFO]           basic\pom.xml .................................... SUCCESS (8.9 s)
[INFO] Building: dependenciesToAnalyze\pom.xml
[INFO]           module\pom.xml ................................... SUCCESS (8.1 s)
[INFO] Building: multirelease\pom.xml
[INFO] run post-build script verify.groovy
[INFO]           dependenciesToAnalyze\pom.xml .................... SUCCESS (11.9 s)
[INFO] Building: module\pom.xml
[INFO]           module\pom.xml ................................... SKIPPED due to JRE version
[INFO] Building: multirelease\pom.xml
[INFO]           multirelease\pom.xml ............................. SKIPPED due to JRE version
[INFO] Building: package\pom.xml
[INFO]           module\pom.xml ................................... SUCCESS (9.2 s)
[INFO] Building: multirelease\pom.xml
[INFO] run post-build script verify.groovy
WARNING: An illegal reflective access operation has occurred
WARNING: Illegal reflective access by org.codehaus.groovy.reflection.CachedClass (file:/f:/jenkins/jenkins-slave/workspace/.maven_repositories/null/org/codehaus/groovy/groovy-all/2.4.8/groovy-all-2.4.8.jar) to method java.lang.Object.finalize()
WARNING: Please consider reporting this to the maintainers of org.codehaus.groovy.reflection.CachedClass
WARNING: Use --illegal-access=warn to enable warnings of further illegal reflective access operations
WARNING: All illegal access operations will be denied in a future release
[INFO]           dependenciesToAnalyze\pom.xml .................... SUCCESS (11.5 s)
[INFO] Building: module\pom.xml
[INFO]           multirelease\pom.xml ............................. SUCCESS (9.2 s)
[INFO] Building: package\pom.xml
[INFO] run post-build script verify.groovy
[INFO]           package\pom.xml .................................. SUCCESS (8.7 s)
[INFO] Building: unsupported-api_main\pom.xml
[INFO] run post-build script verify.groovy
[INFO]           package\pom.xml .................................. SUCCESS (5.9 s)
[INFO] Building: unsupported-api_main\pom.xml
[INFO]           unsupported-api_main\pom.xml ..................... SKIPPED due to JRE version
[INFO] Building: unsupported-api_test\pom.xml
[INFO]           unsupported-api_test\pom.xml ..................... SKIPPED due to JRE version
[INFO]
[INFO] --- maven-checkstyle-plugin:3.0.0:check (checkstyle-check) @ maven-jdeps-plugin ---
[INFO]
[INFO] --- maven-invoker-plugin:3.1.0:verify (integration-test) @ maven-jdeps-plugin ---
[INFO] -------------------------------------------------
[INFO] Build Summary:
[INFO]   Passed: 5, Failed: 0, Errors: 0, Skipped: 2
[INFO] -------------------------------------------------
[INFO] ------------------------------------------------------------------------
[INFO] BUILD SUCCESS
[INFO] ------------------------------------------------------------------------
[INFO] Total time: 59.205 s
[INFO] Finished at: 2019-01-31T07:25:46Z
[INFO] Final Memory: 41M/147M
[INFO] ------------------------------------------------------------------------
[INFO] [jenkins-event-spy] Generated F:\jenkins\jenkins-slave\workspace\en-box_maven-jdeps-plugin_master@2@tmp\withMaven7193797b\maven-spy-20190131-072446-6973762016714178937395.log
[Pipeline] }
[Pipeline] // dir
[Pipeline] }
[INFO]           multirelease\pom.xml ............................. SUCCESS (8.6 s)
[INFO] Building: package\pom.xml
[withMaven] artifactsPublisher - Archive artifact windows-jdk10-m3.5.x_build\pom.xml under org\apache\maven\plugins\maven-jdeps-plugin\3.1.2-SNAPSHOT\maven-jdeps-plugin-3.1.2-SNAPSHOT.pom
[withMaven] artifactsPublisher - Archive artifact windows-jdk10-m3.5.x_build\target\maven-jdeps-plugin-3.1.2-SNAPSHOT.jar under org\apache\maven\plugins\maven-jdeps-plugin\3.1.2-SNAPSHOT\maven-jdeps-plugin-3.1.2-SNAPSHOT.jar
[withMaven] junitPublisher - Archive test results for Maven artifact org.apache.maven.plugins:maven-jdeps-plugin:maven-plugin:3.1.2-SNAPSHOT generated by maven-surefire-plugin:test (default-test): windows-jdk10-m3.5.x_build\target\surefire-reports\*.xml
Recording test results
[withMaven] openTasksPublisher - Scan Tasks for Maven artifact org.apache.maven.plugins:maven-jdeps-plugin:maven-plugin:3.1.2-SNAPSHOT in source directory windows-jdk10-m3.5.x_build\src\main\java
[TASKS] Scanning folder 'f:\jenkins\jenkins-slave\workspace\en-box_maven-jdeps-plugin_master@2' for files matching the pattern 'windows-jdk10-m3.5.x_build\src\main\java\**\*' - excludes: null
[TASKS] Found 5 files to scan for tasks
[TASKS] Found 1 open tasks.
Skipping warnings blame since pipelines do not have an SCM link.%n
[TASKS] Computing warning deltas based on reference build #48
[withMaven] Publishers: Generated Artifacts Publisher: 119 ms, Junit Publisher: 85 ms, Open Task Scanner Publisher: 81 ms, Pipeline Graph Publisher: 1 ms
[Pipeline] // withMaven
[Pipeline] cleanWs
[WS-CLEANUP] Deleting project workspace...
[WS-CLEANUP] Deferred wipeout is used...
[WS-CLEANUP] done
[Pipeline] }
[Pipeline] // stage
[Pipeline] }
[Pipeline] // ws
[Pipeline] }
[Pipeline] // node
[Pipeline] }
[INFO]           module\pom.xml ................................... SUCCESS (10.6 s)
[INFO] Building: multirelease\pom.xml
[INFO] run post-build script verify.groovy
[INFO]           unsupported-api_main\pom.xml ..................... SUCCESS (8.8 s)
[INFO] Building: unsupported-api_test\pom.xml
[INFO] run post-build script verify.groovy
[INFO]           package\pom.xml .................................. SUCCESS (7.5 s)
[INFO] Building: unsupported-api_main\pom.xml
[INFO]           unsupported-api_main\pom.xml ..................... SKIPPED due to JRE version
[INFO] Building: unsupported-api_test\pom.xml
[INFO]           unsupported-api_test\pom.xml ..................... SKIPPED due to JRE version
[INFO]
[INFO] --- maven-checkstyle-plugin:3.0.0:check (checkstyle-check) @ maven-jdeps-plugin ---
[INFO]
[INFO] --- maven-invoker-plugin:3.1.0:verify (integration-test) @ maven-jdeps-plugin ---
[INFO] -------------------------------------------------
[INFO] Build Summary:
[INFO]   Passed: 5, Failed: 0, Errors: 0, Skipped: 2
[INFO] -------------------------------------------------
[INFO] ------------------------------------------------------------------------
[INFO] BUILD SUCCESS
[INFO] ------------------------------------------------------------------------
[INFO] Total time: 01:11 min
[INFO] Finished at: 2019-01-30T23:25:55-08:00
[INFO] Final Memory: 41M/138M
[INFO] ------------------------------------------------------------------------
[INFO] [jenkins-event-spy] Generated F:\jenkins\jenkins-slave\workspace\en-box_maven-jdeps-plugin_master@2@tmp\withMavenaca60c35\maven-spy-20190130-232443-71517119777624958750016.log
[Pipeline] }
[Pipeline] // dir
[Pipeline] }
[withMaven] artifactsPublisher - Archive artifact windows-jdk9-m3.5.x_build\pom.xml under org\apache\maven\plugins\maven-jdeps-plugin\3.1.2-SNAPSHOT\maven-jdeps-plugin-3.1.2-SNAPSHOT.pom
[withMaven] artifactsPublisher - Archive artifact windows-jdk9-m3.5.x_build\target\maven-jdeps-plugin-3.1.2-SNAPSHOT.jar under org\apache\maven\plugins\maven-jdeps-plugin\3.1.2-SNAPSHOT\maven-jdeps-plugin-3.1.2-SNAPSHOT.jar
[withMaven] junitPublisher - Archive test results for Maven artifact org.apache.maven.plugins:maven-jdeps-plugin:maven-plugin:3.1.2-SNAPSHOT generated by maven-surefire-plugin:test (default-test): windows-jdk9-m3.5.x_build\target\surefire-reports\*.xml
Recording test results
[withMaven] openTasksPublisher - Scan Tasks for Maven artifact org.apache.maven.plugins:maven-jdeps-plugin:maven-plugin:3.1.2-SNAPSHOT in source directory windows-jdk9-m3.5.x_build\src\main\java
[TASKS] Scanning folder 'f:\jenkins\jenkins-slave\workspace\en-box_maven-jdeps-plugin_master@2' for files matching the pattern 'windows-jdk9-m3.5.x_build\src\main\java\**\*' - excludes: null
[TASKS] Found 5 files to scan for tasks
[TASKS] Found 1 open tasks.
Skipping warnings blame since pipelines do not have an SCM link.%n
[TASKS] Computing warning deltas based on reference build #48
[withMaven] Publishers: Generated Artifacts Publisher: 115 ms, Junit Publisher: 80 ms, Open Task Scanner Publisher: 75 ms
[Pipeline] // withMaven
[Pipeline] cleanWs
[WS-CLEANUP] Deleting project workspace...
[WS-CLEANUP] Deferred wipeout is used...
[WS-CLEANUP] done
[Pipeline] }
[Pipeline] // stage
[Pipeline] }
[Pipeline] // ws
[Pipeline] }
[Pipeline] // node
[Pipeline] }
[INFO]           multirelease\pom.xml ............................. SUCCESS (11.0 s)
[INFO] Building: package\pom.xml
[INFO] run post-build script verify.groovy
[INFO]           package\pom.xml .................................. SUCCESS (9.5 s)
[INFO] Building: unsupported-api_main\pom.xml
[INFO]           unsupported-api_main\pom.xml ..................... SKIPPED due to JRE version
[INFO] Building: unsupported-api_test\pom.xml
[INFO]           unsupported-api_test\pom.xml ..................... SKIPPED due to JRE version
[INFO]
[INFO] --- maven-checkstyle-plugin:3.0.0:check (checkstyle-check) @ maven-jdeps-plugin ---
[INFO] run post-build script verify.groovy
[INFO]           unsupported-api_test\pom.xml ..................... SUCCESS (19.8 s)
[INFO]
[INFO] --- maven-checkstyle-plugin:3.0.0:check (checkstyle-check) @ maven-jdeps-plugin ---
[INFO]
[INFO] --- maven-invoker-plugin:3.1.0:verify (integration-test) @ maven-jdeps-plugin ---
[INFO] -------------------------------------------------
[INFO] Build Summary:
[INFO]   Passed: 5, Failed: 0, Errors: 0, Skipped: 2
[INFO] -------------------------------------------------
[INFO] ------------------------------------------------------------------------
[INFO] BUILD SUCCESS
[INFO] ------------------------------------------------------------------------
[INFO] Total time: 01:29 min
[INFO] Finished at: 2019-01-30T23:26:13-08:00
[INFO] Final Memory: 53M/615M
[INFO] ------------------------------------------------------------------------
[INFO] [jenkins-event-spy] Generated F:\jenkins\jenkins-slave\workspace\en-box_maven-jdeps-plugin_master@2@tmp\withMavenedff7cfe\maven-spy-20190130-232443-9054434905702778166727.log
Picked up JAVA_TOOL_OPTIONS: -Dmaven.ext.class.path="f:\jenkins\jenkins-slave\workspace\en-box_maven-jdeps-plugin_master@2@tmp\withMavenedff7cfe\pipeline-maven-spy.jar" -Dorg.jenkinsci.plugins.pipeline.maven.reportsFolder="f:\jenkins\jenkins-slave\workspace\en-box_maven-jdeps-plugin_master@2@tmp\withMavenedff7cfe"
[Pipeline] }
[Pipeline] // dir
[Pipeline] }
[withMaven] artifactsPublisher - Archive artifact windows-jdk8-m3.5.x_build\pom.xml under org\apache\maven\plugins\maven-jdeps-plugin\3.1.2-SNAPSHOT\maven-jdeps-plugin-3.1.2-SNAPSHOT.pom
[withMaven] artifactsPublisher - Archive artifact windows-jdk8-m3.5.x_build\target\maven-jdeps-plugin-3.1.2-SNAPSHOT.jar under org\apache\maven\plugins\maven-jdeps-plugin\3.1.2-SNAPSHOT\maven-jdeps-plugin-3.1.2-SNAPSHOT.jar
[withMaven] junitPublisher - Archive test results for Maven artifact org.apache.maven.plugins:maven-jdeps-plugin:maven-plugin:3.1.2-SNAPSHOT generated by maven-surefire-plugin:test (default-test): windows-jdk8-m3.5.x_build\target\surefire-reports\*.xml
Recording test results
[withMaven] openTasksPublisher - Scan Tasks for Maven artifact org.apache.maven.plugins:maven-jdeps-plugin:maven-plugin:3.1.2-SNAPSHOT in source directory windows-jdk8-m3.5.x_build\src\main\java
[TASKS] Scanning folder 'f:\jenkins\jenkins-slave\workspace\en-box_maven-jdeps-plugin_master@2' for files matching the pattern 'windows-jdk8-m3.5.x_build\src\main\java\**\*' - excludes: null
[TASKS] Found 5 files to scan for tasks
[TASKS] Found 1 open tasks.
Skipping warnings blame since pipelines do not have an SCM link.%n
[TASKS] Computing warning deltas based on reference build #48
[withMaven] Publishers: Generated Artifacts Publisher: 136 ms, Junit Publisher: 85 ms, Open Task Scanner Publisher: 105 ms
[Pipeline] // withMaven
[Pipeline] cleanWs
[WS-CLEANUP] Deleting project workspace...
[WS-CLEANUP] Deferred wipeout is used...
[WS-CLEANUP] done
[Pipeline] }
[INFO]
[INFO] --- maven-invoker-plugin:3.1.0:verify (integration-test) @ maven-jdeps-plugin ---
[Pipeline] // stage
[Pipeline] }
[Pipeline] // ws
[Pipeline] }
[Pipeline] // node
[Pipeline] }
[INFO] -------------------------------------------------
[INFO] Build Summary:
[INFO]   Passed: 5, Failed: 0, Errors: 0, Skipped: 2
[INFO] -------------------------------------------------
[INFO] ------------------------------------------------------------------------
[INFO] BUILD SUCCESS
[INFO] ------------------------------------------------------------------------
[INFO] Total time: 01:12 min
[INFO] Finished at: 2019-01-31T07:26:15Z
[INFO] Final Memory: 40M/140M
[INFO] ------------------------------------------------------------------------
[INFO] [jenkins-event-spy] Generated F:\jenkins\jenkins-slave\workspace\en-box_maven-jdeps-plugin_master@3@2@tmp\withMavenfc294bf7\maven-spy-20190131-072501-85313091432249141766002.log
[Pipeline] }
[Pipeline] // dir
[Pipeline] }
[withMaven] artifactsPublisher - Archive artifact windows-jdk11-m3.5.x_build\pom.xml under org\apache\maven\plugins\maven-jdeps-plugin\3.1.2-SNAPSHOT\maven-jdeps-plugin-3.1.2-SNAPSHOT.pom
[withMaven] artifactsPublisher - Archive artifact windows-jdk11-m3.5.x_build\target\maven-jdeps-plugin-3.1.2-SNAPSHOT.jar under org\apache\maven\plugins\maven-jdeps-plugin\3.1.2-SNAPSHOT\maven-jdeps-plugin-3.1.2-SNAPSHOT.jar
[withMaven] junitPublisher - Archive test results for Maven artifact org.apache.maven.plugins:maven-jdeps-plugin:maven-plugin:3.1.2-SNAPSHOT generated by maven-surefire-plugin:test (default-test): windows-jdk11-m3.5.x_build\target\surefire-reports\*.xml
Recording test results
[withMaven] openTasksPublisher - Scan Tasks for Maven artifact org.apache.maven.plugins:maven-jdeps-plugin:maven-plugin:3.1.2-SNAPSHOT in source directory windows-jdk11-m3.5.x_build\src\main\java
[TASKS] Scanning folder 'f:\jenkins\jenkins-slave\workspace\en-box_maven-jdeps-plugin_master@3@2' for files matching the pattern 'windows-jdk11-m3.5.x_build\src\main\java\**\*' - excludes: null
[TASKS] Found 5 files to scan for tasks
[TASKS] Found 1 open tasks.
Skipping warnings blame since pipelines do not have an SCM link.%n
[TASKS] Computing warning deltas based on reference build #48
[withMaven] Publishers: Generated Artifacts Publisher: 112 ms, Junit Publisher: 80 ms, Open Task Scanner Publisher: 74 ms, Pipeline Graph Publisher: 1 ms
[Pipeline] // withMaven
[Pipeline] cleanWs
[WS-CLEANUP] Deleting project workspace...
[WS-CLEANUP] Deferred wipeout is used...
[WS-CLEANUP] done
[Pipeline] }
[Pipeline] // stage
[Pipeline] }
[Pipeline] // ws
[Pipeline] }
[Pipeline] // node
[Pipeline] }
[Pipeline] // parallel
[Pipeline] stage
[Pipeline] { (Notifications)
[Pipeline] echo
Build result: FAILURE
[Pipeline] jiraIssueSelector
[Pipeline] emailext
Reply | Threaded
Open this post in threaded view
|

Build failed in Jenkins: Maven TLP » maven-jdeps-plugin » master #52

Apache Jenkins Server-2
See https://builds.apache.org/job/maven-box/job/maven-jdeps-plugin/job/master/52/

Changes:

* JDK 12 is now in the Release Candidate Phase

All tests passed

Build log:
[...truncated 11731 lines...]
[INFO]
[INFO] --- maven-site-plugin:3.7.1:attach-descriptor (attach-descriptor) @ maven-jdeps-plugin ---
[INFO] Skipping because packaging 'maven-plugin' is not pom.
[INFO]
[INFO] --- maven-invoker-plugin:3.1.0:install (integration-test) @ maven-jdeps-plugin ---
[INFO] Installing /home/jenkins/jenkins-slave/workspace/en-box_maven-jdeps-plugin_master@2/linux-jdk11-m3.5.x_build/pom.xml to /home/jenkins/jenkins-slave/workspace/en-box_maven-jdeps-plugin_master@2/linux-jdk11-m3.5.x_build/target/local-repo/org/apache/maven/plugins/maven-jdeps-plugin/3.1.2-SNAPSHOT/maven-jdeps-plugin-3.1.2-SNAPSHOT.pom
[INFO] Installing /home/jenkins/jenkins-slave/workspace/en-box_maven-jdeps-plugin_master@2/linux-jdk11-m3.5.x_build/target/maven-jdeps-plugin-3.1.2-SNAPSHOT.jar to /home/jenkins/jenkins-slave/workspace/en-box_maven-jdeps-plugin_master@2/linux-jdk11-m3.5.x_build/target/local-repo/org/apache/maven/plugins/maven-jdeps-plugin/3.1.2-SNAPSHOT/maven-jdeps-plugin-3.1.2-SNAPSHOT.jar
[INFO]
[INFO] --- maven-invoker-plugin:3.1.0:integration-test (integration-test) @ maven-jdeps-plugin ---
[INFO] Building: dependenciesToAnalyze/pom.xml
[INFO]           basic/pom.xml .................................... SUCCESS (5.5 s)
[INFO] Building: module/pom.xml
[INFO]           multirelease\pom.xml ............................. SUCCESS (7.8 s)
[INFO] Building: package\pom.xml
[INFO] run post-build script verify.groovy
WARNING: An illegal reflective access operation has occurred
WARNING: Illegal reflective access by org.codehaus.groovy.reflection.CachedClass (file:/home/jenkins/jenkins-slave/workspace/.maven_repositories/null/org/codehaus/groovy/groovy-all/2.4.8/groovy-all-2.4.8.jar) to method java.lang.Object.finalize()
WARNING: Please consider reporting this to the maintainers of org.codehaus.groovy.reflection.CachedClass
WARNING: Use --illegal-access=warn to enable warnings of further illegal reflective access operations
WARNING: All illegal access operations will be denied in a future release
[INFO]           dependenciesToAnalyze/pom.xml .................... SUCCESS (5.7 s)
[INFO] Building: package/pom.xml
[INFO]           module/pom.xml ................................... SUCCESS (4.9 s)
[INFO] Building: unsupported-api_test/pom.xml
[INFO]           unsupported-api_test/pom.xml ..................... SKIPPED due to JRE version
[INFO] Building: dependenciesToAnalyze/pom.xml
[INFO] run post-build script verify.groovy
[INFO]           package/pom.xml .................................. SUCCESS (3.8 s)
[INFO] Building: basic/pom.xml
[INFO] run post-build script verify.groovy
[INFO]           package\pom.xml .................................. SUCCESS (6.5 s)
[INFO] Building: unsupported-api_main\pom.xml
[INFO]           unsupported-api_main\pom.xml ..................... SKIPPED due to JRE version
[INFO] Building: unsupported-api_test\pom.xml
[INFO]           unsupported-api_test\pom.xml ..................... SKIPPED due to JRE version
[INFO] run post-build script verify.groovy
WARNING: An illegal reflective access operation has occurred
WARNING: Illegal reflective access by org.codehaus.groovy.reflection.CachedClass (file:/home/jenkins/jenkins-slave/workspace/.maven_repositories/null/org/codehaus/groovy/groovy-all/2.4.8/groovy-all-2.4.8.jar) to method java.lang.Object.finalize()
WARNING: Please consider reporting this to the maintainers of org.codehaus.groovy.reflection.CachedClass
WARNING: Use --illegal-access=warn to enable warnings of further illegal reflective access operations
WARNING: All illegal access operations will be denied in a future release
[INFO]
[INFO] --- maven-checkstyle-plugin:3.0.0:check (checkstyle-check) @ maven-jdeps-plugin ---
[INFO]           basic\pom.xml .................................... SUCCESS (17.2 s)
[INFO] Building: dependenciesToAnalyze\pom.xml
[INFO]           dependenciesToAnalyze/pom.xml .................... SUCCESS (5.3 s)
[INFO] Building: package/pom.xml
[INFO]
[INFO] --- maven-invoker-plugin:3.1.0:verify (integration-test) @ maven-jdeps-plugin ---
[INFO] -------------------------------------------------
[INFO] Build Summary:
[INFO]   Passed: 5, Failed: 0, Errors: 0, Skipped: 2
[INFO] -------------------------------------------------
[INFO] ------------------------------------------------------------------------
[INFO] BUILD SUCCESS
[INFO] ------------------------------------------------------------------------
[INFO] Total time: 01:08 min
[INFO] Finished at: 2019-02-11T11:09:29-08:00
[INFO] Final Memory: 41M/147M
[INFO] ------------------------------------------------------------------------
[INFO] [jenkins-event-spy] Generated F:\jenkins\jenkins-slave\workspace\en-box_maven-jdeps-plugin_master@2@tmp\withMavenf68008e3\maven-spy-20190211-110820-4421525591676342845464.log
[Pipeline] }
[Pipeline] // dir
[Pipeline] }
[withMaven] artifactsPublisher - Archive artifact windows-jdk10-m3.5.x_build\pom.xml under org\apache\maven\plugins\maven-jdeps-plugin\3.1.2-SNAPSHOT\maven-jdeps-plugin-3.1.2-SNAPSHOT.pom
[withMaven] artifactsPublisher - Archive artifact windows-jdk10-m3.5.x_build\target\maven-jdeps-plugin-3.1.2-SNAPSHOT.jar under org\apache\maven\plugins\maven-jdeps-plugin\3.1.2-SNAPSHOT\maven-jdeps-plugin-3.1.2-SNAPSHOT.jar
[withMaven] junitPublisher - Archive test results for Maven artifact org.apache.maven.plugins:maven-jdeps-plugin:maven-plugin:3.1.2-SNAPSHOT generated by maven-surefire-plugin:test (default-test): windows-jdk10-m3.5.x_build\target\surefire-reports\*.xml
Recording test results
[withMaven] openTasksPublisher - Scan Tasks for Maven artifact org.apache.maven.plugins:maven-jdeps-plugin:maven-plugin:3.1.2-SNAPSHOT in source directory windows-jdk10-m3.5.x_build\src\main\java
[TASKS] Scanning folder 'f:\jenkins\jenkins-slave\workspace\en-box_maven-jdeps-plugin_master@2' for files matching the pattern 'windows-jdk10-m3.5.x_build\src\main\java\**\*' - excludes: null
[TASKS] Found 5 files to scan for tasks
[TASKS] Found 1 open tasks.
Skipping warnings blame since pipelines do not have an SCM link.%n
[TASKS] Computing warning deltas based on reference build #48
[withMaven] Publishers: Generated Artifacts Publisher: 140 ms, Junit Publisher: 134 ms, Open Task Scanner Publisher: 103 ms, Pipeline Graph Publisher: 3 ms
[Pipeline] // withMaven
[Pipeline] cleanWs
[INFO]           basic/pom.xml .................................... SUCCESS (4.4 s)
[INFO] Building: multirelease/pom.xml
[WS-CLEANUP] Deleting project workspace...
[WS-CLEANUP] Deferred wipeout is used...
[WS-CLEANUP] done
[Pipeline] }
[Pipeline] // stage
[Pipeline] }
[Pipeline] // ws
[Pipeline] }
[Pipeline] // node
[Pipeline] }
[INFO] run post-build script verify.groovy
[INFO]           package/pom.xml .................................. SUCCESS (4.3 s)
[INFO] Building: multirelease/pom.xml
[INFO] run post-build script verify.groovy
WARNING: An illegal reflective access operation has occurred
WARNING: Illegal reflective access by org.codehaus.groovy.reflection.CachedClass (file:/f:/jenkins/jenkins-slave/workspace/.maven_repositories/null/org/codehaus/groovy/groovy-all/2.4.8/groovy-all-2.4.8.jar) to method java.lang.Object.finalize()
WARNING: Please consider reporting this to the maintainers of org.codehaus.groovy.reflection.CachedClass
WARNING: Use --illegal-access=warn to enable warnings of further illegal reflective access operations
WARNING: All illegal access operations will be denied in a future release
[INFO]           dependenciesToAnalyze\pom.xml .................... SUCCESS (8.7 s)
[INFO] Building: module\pom.xml
[INFO]           multirelease/pom.xml ............................. SUCCESS (4.7 s)
[INFO] Building: unsupported-api_test/pom.xml
[INFO]           unsupported-api_test/pom.xml ..................... SKIPPED due to JRE version
[INFO] Building: unsupported-api_main/pom.xml
[INFO]           unsupported-api_main/pom.xml ..................... SKIPPED due to JRE version
[INFO] Building: module/pom.xml
[INFO]           multirelease/pom.xml ............................. SUCCESS (5.2 s)
[INFO]
[INFO] --- maven-checkstyle-plugin:3.0.0:check (checkstyle-check) @ maven-jdeps-plugin ---
[INFO]
[INFO] --- maven-invoker-plugin:3.1.0:verify (integration-test) @ maven-jdeps-plugin ---
[INFO] -------------------------------------------------
[INFO] Build Summary:
[INFO]   Passed: 5, Failed: 0, Errors: 0, Skipped: 2
[INFO] -------------------------------------------------
[INFO] ------------------------------------------------------------------------
[INFO] BUILD SUCCESS
[INFO] ------------------------------------------------------------------------
[INFO] Total time: 35.987 s
[INFO] Finished at: 2019-02-11T19:09:38Z
[INFO] ------------------------------------------------------------------------
[INFO] [jenkins-event-spy] Generated /home/jenkins/jenkins-slave/workspace/en-box_maven-jdeps-plugin_master@2@tmp/withMaven506cd394/maven-spy-20190211-190901-61018066148474968097331.log
[Pipeline] }
[Pipeline] // dir
[Pipeline] }
[withMaven] artifactsPublisher - Archive artifact linux-jdk10-m3.5.x_build/pom.xml under org/apache/maven/plugins/maven-jdeps-plugin/3.1.2-SNAPSHOT/maven-jdeps-plugin-3.1.2-SNAPSHOT.pom
[INFO]           module/pom.xml ................................... SUCCESS (4.8 s)
[INFO]
[INFO] --- maven-checkstyle-plugin:3.0.0:check (checkstyle-check) @ maven-jdeps-plugin ---
[withMaven] artifactsPublisher - Archive artifact linux-jdk10-m3.5.x_build/target/maven-jdeps-plugin-3.1.2-SNAPSHOT.jar under org/apache/maven/plugins/maven-jdeps-plugin/3.1.2-SNAPSHOT/maven-jdeps-plugin-3.1.2-SNAPSHOT.jar
[INFO]
[INFO] --- maven-invoker-plugin:3.1.0:verify (integration-test) @ maven-jdeps-plugin ---
[INFO] -------------------------------------------------
[INFO] Build Summary:
[INFO]   Passed: 5, Failed: 0, Errors: 0, Skipped: 2
[INFO] -------------------------------------------------
[INFO] ------------------------------------------------------------------------
[INFO] BUILD SUCCESS
[INFO] ------------------------------------------------------------------------
[INFO] Total time: 32.758 s
[INFO] Finished at: 2019-02-11T19:09:41Z
[INFO] ------------------------------------------------------------------------
[INFO] [jenkins-event-spy] Generated /home/jenkins/jenkins-slave/workspace/en-box_maven-jdeps-plugin_master@2@tmp/withMavenee597a6f/maven-spy-20190211-190908-142799389008634176504.log
[withMaven] junitPublisher - Archive test results for Maven artifact org.apache.maven.plugins:maven-jdeps-plugin:maven-plugin:3.1.2-SNAPSHOT generated by maven-surefire-plugin:test (default-test): linux-jdk10-m3.5.x_build/target/surefire-reports/*.xml
Recording test results
[Pipeline] }
[Pipeline] // dir
[Pipeline] }
[withMaven] openTasksPublisher - Scan Tasks for Maven artifact org.apache.maven.plugins:maven-jdeps-plugin:maven-plugin:3.1.2-SNAPSHOT in source directory linux-jdk10-m3.5.x_build/src/main/java
[TASKS] Scanning folder '/home/jenkins/jenkins-slave/workspace/en-box_maven-jdeps-plugin_master@2' for files matching the pattern 'linux-jdk10-m3.5.x_build/src/main/java/**/*' - excludes: null
[TASKS] Found 5 files to scan for tasks
[TASKS] Found 1 open tasks.
Skipping warnings blame since pipelines do not have an SCM link.%n
[TASKS] Computing warning deltas based on reference build #48
[withMaven] artifactsPublisher - Archive artifact linux-jdk11-m3.5.x_build/pom.xml under org/apache/maven/plugins/maven-jdeps-plugin/3.1.2-SNAPSHOT/maven-jdeps-plugin-3.1.2-SNAPSHOT.pom
[withMaven] Publishers: Generated Artifacts Publisher: 1099 ms, Junit Publisher: 654 ms, Open Task Scanner Publisher: 505 ms, Pipeline Graph Publisher: 3 ms
[withMaven] artifactsPublisher - Archive artifact linux-jdk11-m3.5.x_build/target/maven-jdeps-plugin-3.1.2-SNAPSHOT.jar under org/apache/maven/plugins/maven-jdeps-plugin/3.1.2-SNAPSHOT/maven-jdeps-plugin-3.1.2-SNAPSHOT.jar
[Pipeline] // withMaven
[Pipeline] cleanWs
[WS-CLEANUP] Deleting project workspace...
[WS-CLEANUP] Deferred wipeout is used...
[withMaven] junitPublisher - Archive test results for Maven artifact org.apache.maven.plugins:maven-jdeps-plugin:maven-plugin:3.1.2-SNAPSHOT generated by maven-surefire-plugin:test (default-test): linux-jdk11-m3.5.x_build/target/surefire-reports/*.xml
Recording test results
[WS-CLEANUP] done
[Pipeline] }
[Pipeline] // stage
[Pipeline] }
[Pipeline] // ws
[Pipeline] }
[Pipeline] // node
[Pipeline] }
[INFO]           module\pom.xml ................................... SUCCESS (9.3 s)
[INFO] Building: multirelease\pom.xml
[withMaven] openTasksPublisher - Scan Tasks for Maven artifact org.apache.maven.plugins:maven-jdeps-plugin:maven-plugin:3.1.2-SNAPSHOT in source directory linux-jdk11-m3.5.x_build/src/main/java
[TASKS] Scanning folder '/home/jenkins/jenkins-slave/workspace/en-box_maven-jdeps-plugin_master@2' for files matching the pattern 'linux-jdk11-m3.5.x_build/src/main/java/**/*' - excludes: null
[TASKS] Found 5 files to scan for tasks
[TASKS] Found 1 open tasks.
Skipping warnings blame since pipelines do not have an SCM link.%n
[TASKS] Computing warning deltas based on reference build #48
[withMaven] Publishers: Generated Artifacts Publisher: 1109 ms, Junit Publisher: 647 ms, Open Task Scanner Publisher: 507 ms, Pipeline Graph Publisher: 2 ms
[Pipeline] // withMaven
[Pipeline] cleanWs
[WS-CLEANUP] Deleting project workspace...
[WS-CLEANUP] Deferred wipeout is used...
[WS-CLEANUP] done
[Pipeline] }
[Pipeline] // stage
[Pipeline] }
[Pipeline] // ws
[Pipeline] }
[Pipeline] // node
[Pipeline] }
[INFO]           multirelease\pom.xml ............................. SUCCESS (9.8 s)
[INFO] Building: package\pom.xml
[INFO] run post-build script verify.groovy
[INFO]           package\pom.xml .................................. SUCCESS (7.0 s)
[INFO] Building: unsupported-api_main\pom.xml
[INFO]           unsupported-api_main\pom.xml ..................... SKIPPED due to JRE version
[INFO] Building: unsupported-api_test\pom.xml
[INFO]           unsupported-api_test\pom.xml ..................... SKIPPED due to JRE version
[INFO]
[INFO] --- maven-checkstyle-plugin:3.0.0:check (checkstyle-check) @ maven-jdeps-plugin ---
[INFO]
[INFO] --- maven-invoker-plugin:3.1.0:verify (integration-test) @ maven-jdeps-plugin ---
[INFO] -------------------------------------------------
[INFO] Build Summary:
[INFO]   Passed: 5, Failed: 0, Errors: 0, Skipped: 2
[INFO] -------------------------------------------------
[INFO] ------------------------------------------------------------------------
[INFO] BUILD SUCCESS
[INFO] ------------------------------------------------------------------------
[INFO] Total time: 01:12 min
[INFO] Finished at: 2019-02-11T11:10:02-08:00
[INFO] Final Memory: 40M/144M
[INFO] ------------------------------------------------------------------------
[INFO] [jenkins-event-spy] Generated F:\jenkins\jenkins-slave\workspace\en-box_maven-jdeps-plugin_master@3@2@tmp\withMaven24530944\maven-spy-20190211-110849-89012668579668914200855.log
[Pipeline] }
[Pipeline] // dir
[Pipeline] }
[withMaven] artifactsPublisher - Archive artifact windows-jdk11-m3.5.x_build\pom.xml under org\apache\maven\plugins\maven-jdeps-plugin\3.1.2-SNAPSHOT\maven-jdeps-plugin-3.1.2-SNAPSHOT.pom
[withMaven] artifactsPublisher - Archive artifact windows-jdk11-m3.5.x_build\target\maven-jdeps-plugin-3.1.2-SNAPSHOT.jar under org\apache\maven\plugins\maven-jdeps-plugin\3.1.2-SNAPSHOT\maven-jdeps-plugin-3.1.2-SNAPSHOT.jar
[withMaven] junitPublisher - Archive test results for Maven artifact org.apache.maven.plugins:maven-jdeps-plugin:maven-plugin:3.1.2-SNAPSHOT generated by maven-surefire-plugin:test (default-test): windows-jdk11-m3.5.x_build\target\surefire-reports\*.xml
Recording test results
[withMaven] openTasksPublisher - Scan Tasks for Maven artifact org.apache.maven.plugins:maven-jdeps-plugin:maven-plugin:3.1.2-SNAPSHOT in source directory windows-jdk11-m3.5.x_build\src\main\java
[TASKS] Scanning folder 'f:\jenkins\jenkins-slave\workspace\en-box_maven-jdeps-plugin_master@3@2' for files matching the pattern 'windows-jdk11-m3.5.x_build\src\main\java\**\*' - excludes: null
[TASKS] Found 5 files to scan for tasks
[TASKS] Found 1 open tasks.
Skipping warnings blame since pipelines do not have an SCM link.%n
[TASKS] Computing warning deltas based on reference build #48
[withMaven] Publishers: Generated Artifacts Publisher: 123 ms, Junit Publisher: 86 ms, Open Task Scanner Publisher: 81 ms, Pipeline Graph Publisher: 3 ms
[Pipeline] // withMaven
[Pipeline] cleanWs
[WS-CLEANUP] Deleting project workspace...
[WS-CLEANUP] Deferred wipeout is used...
[WS-CLEANUP] done
[Pipeline] }
[Pipeline] // stage
[Pipeline] }
[Pipeline] // ws
[Pipeline] }
[Pipeline] // node
[Pipeline] }
[Pipeline] // parallel
[Pipeline] stage
[Pipeline] { (Notifications)
[Pipeline] echo
Build result: FAILURE
[Pipeline] jiraIssueSelector
[Pipeline] emailext
Reply | Threaded
Open this post in threaded view
|

Build failed in Jenkins: Maven TLP » maven-jdeps-plugin » master #53

Apache Jenkins Server-2
See https://builds.apache.org/job/maven-box/job/maven-jdeps-plugin/job/master/53/

Changes:

* [INFRA-17514] Jenkins invoker-plugin updated by INFRA

All tests passed

Build log:
[...truncated 11719 lines...]
[Pipeline] }
[Pipeline] // stage
[Pipeline] }
[Pipeline] // ws
[Pipeline] }
[Pipeline] // node
[Pipeline] }
[withMaven] invokerPublisher - Archive invoker results for Maven artifact MavenArtifact{org.apache.maven.plugins:maven-jdeps-plugin:maven-plugin:3.1.2-SNAPSHOT(version: 3.1.2-SNAPSHOT, snapshot:false) } generated by PluginInvocation{org.apache.maven.plugins:maven-invoker-plugin:3.1.0@integration-test  integration-test}: linux-jdk10-m3.5.x_build/target/invoker-reports/*.xml
[withMaven] Publishers: Generated Artifacts Publisher: 617 ms, Junit Publisher: 630 ms, Open Task Scanner Publisher: 283 ms, Invoker Publisher: 4282 ms
[Pipeline] // withMaven
[Pipeline] cleanWs
[WS-CLEANUP] Deleting project workspace...
[WS-CLEANUP] Deferred wipeout is used...
[WS-CLEANUP] done
[Pipeline] }
[Pipeline] // stage
[Pipeline] }
[Pipeline] // ws
[Pipeline] }
[Pipeline] // node
[Pipeline] }
[INFO]           module\pom.xml ................................... SUCCESS (11.4 s)
[INFO] Building: multirelease\pom.xml
[withMaven] Publishers: Generated Artifacts Publisher: 1088 ms, Junit Publisher: 641 ms, Open Task Scanner Publisher: 489 ms, Invoker Publisher: 6450 ms, Pipeline Graph Publisher: 1 ms
[INFO]           module\pom.xml ................................... SUCCESS (9.6 s)
[INFO] Building: multirelease\pom.xml
[Pipeline] // withMaven
[Pipeline] cleanWs
[WS-CLEANUP] Deleting project workspace...
[WS-CLEANUP] Deferred wipeout is used...
[INFO]           module\pom.xml ................................... SUCCESS (10.8 s)
[INFO] Building: multirelease\pom.xml
[WS-CLEANUP] done
[Pipeline] }
[Pipeline] // stage
[Pipeline] }
[Pipeline] // ws
[Pipeline] }
[Pipeline] // node
[Pipeline] }
[INFO] run post-build script verify.groovy
[INFO]           unsupported-api_main\pom.xml ..................... SUCCESS (8.5 s)
[INFO] Building: unsupported-api_test\pom.xml
[INFO]           multirelease\pom.xml ............................. SUCCESS (9.8 s)
[INFO] Building: package\pom.xml
[INFO]           multirelease\pom.xml ............................. SUCCESS (13.9 s)
[INFO] Building: package\pom.xml
[INFO]           multirelease\pom.xml ............................. SUCCESS (12.1 s)
[INFO] Building: package\pom.xml
[INFO] run post-build script verify.groovy
[INFO]           package\pom.xml .................................. SUCCESS (8.1 s)
[INFO] Building: unsupported-api_main\pom.xml
[INFO]           unsupported-api_main\pom.xml ..................... SKIPPED due to JRE version
[INFO] Building: unsupported-api_test\pom.xml
[INFO]           unsupported-api_test\pom.xml ..................... SKIPPED due to JRE version
[INFO]
[INFO] --- maven-checkstyle-plugin:3.0.0:check (checkstyle-check) @ maven-jdeps-plugin ---
[INFO]
[INFO] --- maven-invoker-plugin:3.1.0:verify (integration-test) @ maven-jdeps-plugin ---
[INFO] -------------------------------------------------
[INFO] Build Summary:
[INFO]   Passed: 5, Failed: 0, Errors: 0, Skipped: 2
[INFO] -------------------------------------------------
[INFO] ------------------------------------------------------------------------
[INFO] BUILD SUCCESS
[INFO] ------------------------------------------------------------------------
[INFO] Total time: 01:16 min
[INFO] Finished at: 2019-02-12T21:32:44-08:00
[INFO] Final Memory: 41M/140M
[INFO] ------------------------------------------------------------------------
[INFO] [jenkins-event-spy] Generated F:\jenkins\jenkins-slave\workspace\en-box_maven-jdeps-plugin_master@3@2@tmp\withMaven9adc1a97\maven-spy-20190212-213127-3613496367008435061041.log
[Pipeline] }
[Pipeline] // dir
[Pipeline] }
[withMaven] artifactsPublisher - Archive artifact windows-jdk10-m3.5.x_build\pom.xml under org\apache\maven\plugins\maven-jdeps-plugin\3.1.2-SNAPSHOT\maven-jdeps-plugin-3.1.2-SNAPSHOT.pom
[withMaven] artifactsPublisher - Archive artifact windows-jdk10-m3.5.x_build\target\maven-jdeps-plugin-3.1.2-SNAPSHOT.jar under org\apache\maven\plugins\maven-jdeps-plugin\3.1.2-SNAPSHOT\maven-jdeps-plugin-3.1.2-SNAPSHOT.jar
[withMaven] junitPublisher - Archive test results for Maven artifact org.apache.maven.plugins:maven-jdeps-plugin:maven-plugin:3.1.2-SNAPSHOT generated by maven-surefire-plugin:test (default-test): windows-jdk10-m3.5.x_build\target\surefire-reports\*.xml
Recording test results
[withMaven] openTasksPublisher - Scan Tasks for Maven artifact org.apache.maven.plugins:maven-jdeps-plugin:maven-plugin:3.1.2-SNAPSHOT in source directory windows-jdk10-m3.5.x_build\src\main\java
[TASKS] Scanning folder 'f:\jenkins\jenkins-slave\workspace\en-box_maven-jdeps-plugin_master@3@2' for files matching the pattern 'windows-jdk10-m3.5.x_build\src\main\java\**\*' - excludes: null
[TASKS] Found 5 files to scan for tasks
[TASKS] Found 1 open tasks.
Skipping warnings blame since pipelines do not have an SCM link.%n
[TASKS] Computing warning deltas based on reference build #48
[withMaven] invokerPublisher - Archive invoker results for Maven artifact MavenArtifact{org.apache.maven.plugins:maven-jdeps-plugin:maven-plugin:3.1.2-SNAPSHOT(version: 3.1.2-SNAPSHOT, snapshot:false) } generated by PluginInvocation{org.apache.maven.plugins:maven-invoker-plugin:3.1.0@integration-test  integration-test}: windows-jdk10-m3.5.x_build\target\invoker-reports\*.xml
[INFO] run post-build script verify.groovy
[INFO]           unsupported-api_test\pom.xml ..................... SUCCESS (18.6 s)
[INFO]
[INFO] --- maven-checkstyle-plugin:3.0.0:check (checkstyle-check) @ maven-jdeps-plugin ---
[INFO] run post-build script verify.groovy
[INFO]           package\pom.xml .................................. SUCCESS (9.0 s)
[INFO] Building: unsupported-api_main\pom.xml
[INFO]           unsupported-api_main\pom.xml ..................... SKIPPED due to JRE version
[INFO] Building: unsupported-api_test\pom.xml
[INFO]           unsupported-api_test\pom.xml ..................... SKIPPED due to JRE version
[INFO]
[INFO] --- maven-checkstyle-plugin:3.0.0:check (checkstyle-check) @ maven-jdeps-plugin ---
[INFO]
[INFO] --- maven-invoker-plugin:3.1.0:verify (integration-test) @ maven-jdeps-plugin ---
[INFO] -------------------------------------------------
[INFO] Build Summary:
[INFO]   Passed: 5, Failed: 0, Errors: 0, Skipped: 2
[INFO] -------------------------------------------------
[INFO] ------------------------------------------------------------------------
[INFO] BUILD SUCCESS
[INFO] ------------------------------------------------------------------------
[INFO] Total time: 01:30 min
[INFO] Finished at: 2019-02-12T21:32:46-08:00
[INFO] Final Memory: 48M/563M
[INFO] ------------------------------------------------------------------------
[INFO] [jenkins-event-spy] Generated F:\jenkins\jenkins-slave\workspace\en-box_maven-jdeps-plugin_master@2@tmp\withMavenf73dc3db\maven-spy-20190212-213116-386065868269603039977.log
Picked up JAVA_TOOL_OPTIONS: -Dmaven.ext.class.path="f:\jenkins\jenkins-slave\workspace\en-box_maven-jdeps-plugin_master@2@tmp\withMavenf73dc3db\pipeline-maven-spy.jar" -Dorg.jenkinsci.plugins.pipeline.maven.reportsFolder="f:\jenkins\jenkins-slave\workspace\en-box_maven-jdeps-plugin_master@2@tmp\withMavenf73dc3db"
[Pipeline] }
[INFO] run post-build script verify.groovy
[INFO]           package\pom.xml .................................. SUCCESS (11.7 s)
[INFO] Building: unsupported-api_main\pom.xml
[INFO]           unsupported-api_main\pom.xml ..................... SKIPPED due to JRE version
[INFO] Building: unsupported-api_test\pom.xml
[INFO]           unsupported-api_test\pom.xml ..................... SKIPPED due to JRE version
[INFO]
[INFO] --- maven-checkstyle-plugin:3.0.0:check (checkstyle-check) @ maven-jdeps-plugin ---
[Pipeline] // dir
[Pipeline] }
[withMaven] artifactsPublisher - Archive artifact windows-jdk8-m3.2.x_build\pom.xml under org\apache\maven\plugins\maven-jdeps-plugin\3.1.2-SNAPSHOT\maven-jdeps-plugin-3.1.2-SNAPSHOT.pom
[withMaven] artifactsPublisher - Archive artifact windows-jdk8-m3.2.x_build\target\maven-jdeps-plugin-3.1.2-SNAPSHOT.jar under org\apache\maven\plugins\maven-jdeps-plugin\3.1.2-SNAPSHOT\maven-jdeps-plugin-3.1.2-SNAPSHOT.jar
[withMaven] junitPublisher - Archive test results for Maven artifact org.apache.maven.plugins:maven-jdeps-plugin:maven-plugin:3.1.2-SNAPSHOT generated by maven-surefire-plugin:test (default-test): windows-jdk8-m3.2.x_build\target\surefire-reports\*.xml
Recording test results
[withMaven] openTasksPublisher - Scan Tasks for Maven artifact org.apache.maven.plugins:maven-jdeps-plugin:maven-plugin:3.1.2-SNAPSHOT in source directory windows-jdk8-m3.2.x_build\src\main\java
[TASKS] Scanning folder 'f:\jenkins\jenkins-slave\workspace\en-box_maven-jdeps-plugin_master@2' for files matching the pattern 'windows-jdk8-m3.2.x_build\src\main\java\**\*' - excludes: null
[TASKS] Found 5 files to scan for tasks
[TASKS] Found 1 open tasks.
Skipping warnings blame since pipelines do not have an SCM link.%n
[TASKS] Computing warning deltas based on reference build #48
[withMaven] invokerPublisher - Archive invoker results for Maven artifact MavenArtifact{org.apache.maven.plugins:maven-jdeps-plugin:maven-plugin:3.1.2-SNAPSHOT(version: 3.1.2-SNAPSHOT, snapshot:false) } generated by PluginInvocation{org.apache.maven.plugins:maven-invoker-plugin:3.1.0@integration-test  integration-test}: windows-jdk8-m3.2.x_build\target\invoker-reports\*.xml
[withMaven] Publishers: Generated Artifacts Publisher: 111 ms, Junit Publisher: 101 ms, Open Task Scanner Publisher: 79 ms, Invoker Publisher: 1381 ms, Pipeline Graph Publisher: 1 ms
[Pipeline] // withMaven
[Pipeline] cleanWs
[WS-CLEANUP] Deleting project workspace...
[WS-CLEANUP] Deferred wipeout is used...
[WS-CLEANUP] done
[Pipeline] }
[INFO]
[INFO] --- maven-invoker-plugin:3.1.0:verify (integration-test) @ maven-jdeps-plugin ---
[INFO] -------------------------------------------------
[INFO] Build Summary:
[INFO]   Passed: 5, Failed: 0, Errors: 0, Skipped: 2
[INFO] -------------------------------------------------
[INFO] ------------------------------------------------------------------------
[INFO] BUILD SUCCESS
[INFO] ------------------------------------------------------------------------
[INFO] Total time: 01:27 min
[INFO] Finished at: 2019-02-12T21:32:48-08:00
[INFO] Final Memory: 41M/138M
[INFO] ------------------------------------------------------------------------
[INFO] [jenkins-event-spy] Generated F:\jenkins\jenkins-slave\workspace\en-box_maven-jdeps-plugin_master@2@tmp\withMaven5f2cc46e\maven-spy-20190212-213120-2656918026000741569605.log
[Pipeline] // stage
[Pipeline] }
[Pipeline] // ws
[Pipeline] }
[Pipeline] }
[Pipeline] // node
[Pipeline] // dir
[Pipeline] }
[Pipeline] }
[withMaven] Publishers: Generated Artifacts Publisher: 121 ms, Junit Publisher: 140 ms, Open Task Scanner Publisher: 99 ms, Invoker Publisher: 4048 ms
[Pipeline] // withMaven
[Pipeline] cleanWs
[withMaven] artifactsPublisher - Archive artifact windows-jdk9-m3.5.x_build\pom.xml under org\apache\maven\plugins\maven-jdeps-plugin\3.1.2-SNAPSHOT\maven-jdeps-plugin-3.1.2-SNAPSHOT.pom
[WS-CLEANUP] Deleting project workspace...
[WS-CLEANUP] Deferred wipeout is used...
[withMaven] artifactsPublisher - Archive artifact windows-jdk9-m3.5.x_build\target\maven-jdeps-plugin-3.1.2-SNAPSHOT.jar under org\apache\maven\plugins\maven-jdeps-plugin\3.1.2-SNAPSHOT\maven-jdeps-plugin-3.1.2-SNAPSHOT.jar
[INFO]
[INFO] --- maven-invoker-plugin:3.1.0:verify (integration-test) @ maven-jdeps-plugin ---
[INFO] -------------------------------------------------
[INFO] Build Summary:
[INFO]   Passed: 5, Failed: 0, Errors: 0, Skipped: 2
[INFO] -------------------------------------------------
[INFO] ------------------------------------------------------------------------
[INFO] BUILD SUCCESS
[INFO] ------------------------------------------------------------------------
[INFO] Total time: 01:20 min
[INFO] Finished at: 2019-02-13T05:32:49Z
[INFO] Final Memory: 40M/137M
[INFO] ------------------------------------------------------------------------
[INFO] [jenkins-event-spy] Generated F:\jenkins\jenkins-slave\workspace\en-box_maven-jdeps-plugin_master@2@tmp\withMavence9476bb\maven-spy-20190213-053127-91515740887373044990579.log
[WS-CLEANUP] done
[Pipeline] }
[Pipeline] // stage
[withMaven] junitPublisher - Archive test results for Maven artifact org.apache.maven.plugins:maven-jdeps-plugin:maven-plugin:3.1.2-SNAPSHOT generated by maven-surefire-plugin:test (default-test): windows-jdk9-m3.5.x_build\target\surefire-reports\*.xml
Recording test results
[Pipeline] }
[Pipeline] }
[Pipeline] // ws
[Pipeline] // dir
[Pipeline] }
[Pipeline] }
[withMaven] openTasksPublisher - Scan Tasks for Maven artifact org.apache.maven.plugins:maven-jdeps-plugin:maven-plugin:3.1.2-SNAPSHOT in source directory windows-jdk9-m3.5.x_build\src\main\java
[Pipeline] // node
[Pipeline] }
[withMaven] artifactsPublisher - Archive artifact windows-jdk11-m3.5.x_build\pom.xml under org\apache\maven\plugins\maven-jdeps-plugin\3.1.2-SNAPSHOT\maven-jdeps-plugin-3.1.2-SNAPSHOT.pom
[withMaven] artifactsPublisher - Archive artifact windows-jdk11-m3.5.x_build\target\maven-jdeps-plugin-3.1.2-SNAPSHOT.jar under org\apache\maven\plugins\maven-jdeps-plugin\3.1.2-SNAPSHOT\maven-jdeps-plugin-3.1.2-SNAPSHOT.jar
[TASKS] Scanning folder 'f:\jenkins\jenkins-slave\workspace\en-box_maven-jdeps-plugin_master@2' for files matching the pattern 'windows-jdk9-m3.5.x_build\src\main\java\**\*' - excludes: null
[TASKS] Found 5 files to scan for tasks
[TASKS] Found 1 open tasks.
Skipping warnings blame since pipelines do not have an SCM link.%n
[TASKS] Computing warning deltas based on reference build #48
[withMaven] junitPublisher - Archive test results for Maven artifact org.apache.maven.plugins:maven-jdeps-plugin:maven-plugin:3.1.2-SNAPSHOT generated by maven-surefire-plugin:test (default-test): windows-jdk11-m3.5.x_build\target\surefire-reports\*.xml
Recording test results
[withMaven] invokerPublisher - Archive invoker results for Maven artifact MavenArtifact{org.apache.maven.plugins:maven-jdeps-plugin:maven-plugin:3.1.2-SNAPSHOT(version: 3.1.2-SNAPSHOT, snapshot:false) } generated by PluginInvocation{org.apache.maven.plugins:maven-invoker-plugin:3.1.0@integration-test  integration-test}: windows-jdk9-m3.5.x_build\target\invoker-reports\*.xml
[withMaven] openTasksPublisher - Scan Tasks for Maven artifact org.apache.maven.plugins:maven-jdeps-plugin:maven-plugin:3.1.2-SNAPSHOT in source directory windows-jdk11-m3.5.x_build\src\main\java
[TASKS] Scanning folder 'f:\jenkins\jenkins-slave\workspace\en-box_maven-jdeps-plugin_master@2' for files matching the pattern 'windows-jdk11-m3.5.x_build\src\main\java\**\*' - excludes: null
[TASKS] Found 5 files to scan for tasks
[TASKS] Found 1 open tasks.
Skipping warnings blame since pipelines do not have an SCM link.%n
[TASKS] Computing warning deltas based on reference build #48
[withMaven] invokerPublisher - Archive invoker results for Maven artifact MavenArtifact{org.apache.maven.plugins:maven-jdeps-plugin:maven-plugin:3.1.2-SNAPSHOT(version: 3.1.2-SNAPSHOT, snapshot:false) } generated by PluginInvocation{org.apache.maven.plugins:maven-invoker-plugin:3.1.0@integration-test  integration-test}: windows-jdk11-m3.5.x_build\target\invoker-reports\*.xml
[withMaven] Publishers: Generated Artifacts Publisher: 123 ms, Junit Publisher: 83 ms, Open Task Scanner Publisher: 77 ms, Invoker Publisher: 1296 ms, Pipeline Graph Publisher: 1 ms
[Pipeline] // withMaven
[Pipeline] cleanWs
[WS-CLEANUP] Deleting project workspace...
[WS-CLEANUP] Deferred wipeout is used...
[WS-CLEANUP] done
[Pipeline] }
[Pipeline] // stage
[Pipeline] }
[Pipeline] // ws
[Pipeline] }
[Pipeline] // node
[Pipeline] }
[withMaven] Publishers: Generated Artifacts Publisher: 115 ms, Junit Publisher: 79 ms, Open Task Scanner Publisher: 236 ms, Invoker Publisher: 1999 ms, Pipeline Graph Publisher: 1 ms
[Pipeline] // withMaven
[Pipeline] cleanWs
[WS-CLEANUP] Deleting project workspace...
[WS-CLEANUP] Deferred wipeout is used...
[WS-CLEANUP] done
[Pipeline] }
[Pipeline] // stage
[Pipeline] }
[Pipeline] // ws
[Pipeline] }
[Pipeline] // node
[Pipeline] }
[Pipeline] // parallel
[Pipeline] stage
[Pipeline] { (Notifications)
[Pipeline] echo
Build result: FAILURE
[Pipeline] jiraIssueSelector
[Pipeline] emailext