Build failed in Jenkins: Maven TLP » maven-javadoc-plugin » MJAVADOC-591 #10

classic Classic list List threaded Threaded
3 messages Options
Reply | Threaded
Open this post in threaded view
|

Build failed in Jenkins: Maven TLP » maven-javadoc-plugin » MJAVADOC-591 #10

Apache Jenkins Server-2
See https://builds.apache.org/job/maven-box/job/maven-javadoc-plugin/job/MJAVADOC-591/10/

Changes:

* Log unique commits
* Other attempt due to 'Scripts not permitted to use staticMethod
* Revert "Log unique commits"

All tests passed

Build log:
[...truncated 7795 lines...]
[Pipeline] // dir
[Pipeline] }
[withMaven] junitPublisher - Archive test results for Maven artifact org.apache.maven.plugins:maven-javadoc-plugin:maven-plugin:3.1.1-SNAPSHOT generated by maven-surefire-plugin:test (default-test): windows-jdk11-m3.6.x_build\target\surefire-reports\*.xml
Recording test results
[withMaven] openTasksPublisher - Scan Tasks for Maven artifact org.apache.maven.plugins:maven-javadoc-plugin:maven-plugin:3.1.1-SNAPSHOT in source directory windows-jdk11-m3.6.x_build\src\main\java
[TASKS] Scanning folder 'f:\jenkins\jenkins-slave\workspace\aven-javadoc-plugin_MJAVADOC-591@2' for files matching the pattern 'windows-jdk11-m3.6.x_build\src\main\java\**\*' - excludes: null
[TASKS] Found 26 files to scan for tasks
[TASKS] Found 7 open tasks.
Skipping warnings blame since pipelines do not have an SCM link.%n
[TASKS] Computing warning deltas based on reference build #6
[withMaven] invokerPublisher - Archive invoker results for Maven artifact MavenArtifact{org.apache.maven.plugins:maven-javadoc-plugin:maven-plugin:3.1.1-SNAPSHOT(version: 3.1.1-SNAPSHOT, snapshot:false) } generated by PluginInvocation{org.apache.maven.plugins:maven-invoker-plugin:3.1.0@integration-test  integration-test}: windows-jdk11-m3.6.x_build\target\invoker-reports\*.xml
[INFO] run post-build script verify.groovy
[INFO]           MJAVADOC-427\pom.xml ............................. SUCCESS (14.7 s)
[INFO] Building: MJAVADOC-434_fixcompile\pom.xml
[INFO]           MJAVADOC-434_fixcompile\pom.xml .................. SUCCESS (14.7 s)
[INFO] Building: MJAVADOC-437\pom.xml
[INFO] run post-build script verify.bsh
[INFO]           MJAVADOC-437\pom.xml ............................. SUCCESS (10.6 s)
[INFO] Building: MJAVADOC-444\pom.xml
[withMaven] Publishers: Generated Artifacts Publisher: 19 ms, Junit Publisher: 274 ms, Open Task Scanner Publisher: 187 ms, Dependencies Fingerprint Publisher: 1 ms, Invoker Publisher: 56828 ms
[Pipeline] // withMaven
[Pipeline] cleanWs
[WS-CLEANUP] Deleting project workspace...
[WS-CLEANUP] Deferred wipeout is used...
[WS-CLEANUP] done
[Pipeline] cleanWs
[WS-CLEANUP] Deleting project workspace...
[WS-CLEANUP] Deferred wipeout is used...
[WS-CLEANUP] done
[Pipeline] }
[Pipeline] // stage
[Pipeline] }
[Pipeline] // ws
[Pipeline] }
[Pipeline] // node
[Pipeline] }
Failed in branch windows-jdk11-m3.6.x_build
[INFO] run post-build script verify.bsh
[INFO]           MJAVADOC-444\pom.xml ............................. SUCCESS (40.9 s)
[INFO] Building: MJAVADOC-449_aggr_modulepath\pom.xml
[INFO] artifact org.codehaus:mojo: checking for updates from central
[INFO] artifact org.apache.maven:plugins: checking for updates from central
[INFO] run post-build script verify.groovy
[INFO]           MJAVADOC-449_aggr_modulepath\pom.xml ............. SUCCESS (14.0 s)
[INFO] Building: MJAVADOC-452_fix-duplicateparams\pom.xml
[INFO] run post-build script verify.groovy
[INFO]           MJAVADOC-452_fix-duplicateparams\pom.xml ......... SUCCESS (11.1 s)
[INFO] Building: MJAVADOC-494_aggregate-repositories\pom.xml
[INFO]           MJAVADOC-494_aggregate-repositories\pom.xml ...... SUCCESS (11.6 s)
[INFO] Building: MJAVADOC-495_offline-filescheme\pom.xml
[INFO] run post-build script verify.groovy
[INFO]           MJAVADOC-495_offline-filescheme\pom.xml .......... SUCCESS (18.9 s)
[INFO] Building: MJAVADOC-497\pom.xml
[INFO] run post-build script verify.bsh
[INFO]           MJAVADOC-497\pom.xml ............................. SUCCESS (10.6 s)
[INFO] Building: MJAVADOC-498_aggr_modulepath\pom.xml
[INFO]           MJAVADOC-498_aggr_modulepath\pom.xml ............. SUCCESS (33.1 s)
[INFO] Building: MJAVADOC-498_mm_modulepath\pom.xml
[INFO]           MJAVADOC-498_mm_modulepath\pom.xml ............... SUCCESS (16.6 s)
[INFO] Building: MJAVADOC-498_modulepath\pom.xml
[INFO] run post-build script verify.groovy
[INFO]           MJAVADOC-498_modulepath\pom.xml .................. SUCCESS (19.4 s)
[INFO] Building: MJAVADOC-506_excl-module-info\pom.xml
[INFO] run post-build script verify.groovy
[INFO]           MJAVADOC-506_excl-module-info\pom.xml ............ SUCCESS (11.1 s)
[INFO] Building: MJAVADOC-508\pom.xml
[INFO]           MJAVADOC-508\pom.xml ............................. SUCCESS (9.3 s)
[INFO] Building: MJAVADOC-514_3rdparty-doclettags\pom.xml
[INFO]           MJAVADOC-514_3rdparty-doclettags\pom.xml ......... SUCCESS (7.8 s)
[INFO] Building: MJAVADOC-526_aggr-managedDeps\pom.xml
[INFO]           MJAVADOC-526_aggr-managedDeps\pom.xml ............ SUCCESS (14.3 s)
[INFO] Building: MJAVADOC-528\pom.xml
[INFO] run post-build script verify.groovy
[INFO]           MJAVADOC-528\pom.xml ............................. SUCCESS (12.4 s)
[INFO] Building: MJAVADOC-538\pom.xml
[INFO]           MJAVADOC-538\pom.xml ............................. SUCCESS (9.0 s)
[INFO] Building: MJAVADOC-551 spaces\pom.xml
[INFO]           MJAVADOC-551 spaces\pom.xml ...................... SUCCESS (6.5 s)
[INFO] Building: MJAVADOC-552_fix-author\pom.xml
[INFO] run post-build script verify.groovy
[INFO]           MJAVADOC-552_fix-author\pom.xml .................. SUCCESS (11.0 s)
[INFO] Building: MJAVADOC-555_aggr_mixed\pom.xml
[INFO] run post-build script verify.groovy
[INFO]           MJAVADOC-555_aggr_mixed\pom.xml .................. SUCCESS (15.3 s)
[INFO] Building: MJAVADOC-555_link-automatic-modules\pom.xml
[INFO] run post-build script verify.groovy
[INFO]           MJAVADOC-555_link-automatic-modules\pom.xml ...... FAILED (17.2 s)
[INFO]   The post-build script did not succeed. assert m[0][1] == "https://google.github.io/guava/releases/27.0.1-jre/api/docs/com/google/common/collect/Multimap.html?is-external=true"
       ||  |   |
       ||  |   false
       ||  https://guava.dev/releases/27.0.1-jre/api/docs/com/google/common/collect/Multimap.html?is-external=true
       |[<a href="https://guava.dev/releases/27.0.1-jre/api/docs/com/google/common/collect/Multimap.html?is-external=true" title="class or interface in com.google.common.collect" class="externalLink">Multimap</a>, https://guava.dev/releases/27.0.1-jre/api/docs/com/google/common/collect/Multimap.html?is-external=true]
       java.util.regex.Matcher[pattern=<a href="([^"]+)"(?:[^>]+)>Multimap</a> region=0,13043 lastmatch=<a href="https://guava.dev/releases/27.0.1-jre/api/docs/com/google/common/collect/Multimap.html?is-external=true" title="class or interface in com.google.common.collect" class="externalLink">Multimap</a>]
[INFO] Building: MJAVADOC-556_hide-non-exported-packages\pom.xml
[INFO]           MJAVADOC-556_hide-non-exported-packages\pom.xml .. SUCCESS (10.6 s)
[INFO] Building: MJAVADOC-558_fix-unknownthrows\pom.xml
[INFO] run post-build script verify.groovy
[INFO]           MJAVADOC-558_fix-unknownthrows\pom.xml ........... SUCCESS (11.7 s)
[INFO] Building: MJAVADOC-562_release\pom.xml
[INFO]           MJAVADOC-562_release\pom.xml ..................... SUCCESS (12.4 s)
[INFO] Building: MJAVADOC-567_aggr-mixed\pom.xml
[INFO] run post-build script verify.groovy
[INFO]           MJAVADOC-567_aggr-mixed\pom.xml .................. SUCCESS (6.6 s)
[INFO] Building: MJAVADOC-568_export-to-testcase\pom.xml
[INFO]           MJAVADOC-568_export-to-testcase\pom.xml .......... SUCCESS (27.4 s)
[INFO] Building: MJAVADOC-568_jar-mixed\pom.xml
[INFO]           MJAVADOC-568_jar-mixed\pom.xml ................... SUCCESS (20.7 s)
[INFO] Building: MJAVADOC-568_manifest-splitpackage\pom.xml
[INFO]           MJAVADOC-568_manifest-splitpackage\pom.xml ....... SUCCESS (31.4 s)
[INFO] Building: MJAVADOC-569_aggr-mixed\pom.xml
[INFO]           MJAVADOC-569_aggr-mixed\pom.xml .................. SUCCESS (24.7 s)
[INFO] Building: MJAVADOC-575_source8-module-info\pom.xml
[INFO]           MJAVADOC-575_source8-module-info\pom.xml ......... SKIPPED due to JRE version
[INFO] Building: MJAVADOC-580_detectLinks\pom.xml
[INFO] run post-build script verify.groovy
[INFO]           MJAVADOC-580_detectLinks\pom.xml ................. SUCCESS (10.1 s)
[INFO] Building: MJAVADOC-591_release8\pom.xml
[INFO] artifact org.apache.maven.plugins:maven-resources-plugin: checking for updates from central
[INFO] artifact org.apache.maven.plugins:maven-compiler-plugin: checking for updates from central
[INFO] artifact org.apache.maven.plugins:maven-surefire-plugin: checking for updates from central
[INFO] artifact org.apache.maven.plugins:maven-install-plugin: checking for updates from central
[INFO] artifact org.apache.maven.plugins:maven-deploy-plugin: checking for updates from central
[INFO]           MJAVADOC-591_release8\pom.xml .................... SUCCESS (35.3 s)
[INFO] Building: site-failOnError\pom.xml
[INFO]           site-failOnError\pom.xml ......................... SUCCESS (10.6 s)
[INFO]
[INFO] --- mrm-maven-plugin:1.1.0:stop (repository) @ maven-javadoc-plugin ---
[INFO] Stopping Mock Repository Manager on http://localhost:52821
[INFO] Stopped SocketConnector@0.0.0.0:52821
[INFO] Mock Repository Manager http://localhost:52821 is stopped.
[INFO]
[INFO] --- mrm-maven-plugin:1.1.0:stop (3rdparty) @ maven-javadoc-plugin ---
[INFO] Stopping Mock Repository Manager on http://localhost:52822
[INFO] Stopped SocketConnector@0.0.0.0:52822
[INFO] Mock Repository Manager http://localhost:52822 is stopped.
[INFO]
[INFO] --- maven-checkstyle-plugin:3.0.0:check (checkstyle-check) @ maven-javadoc-plugin ---
[INFO] There are 4 errors reported by Checkstyle 6.18 with config/maven_checks.xml ruleset.
[INFO] Ignored 4 errors, 0 violation remaining.
[INFO]
[INFO] --- maven-invoker-plugin:3.1.0:verify (integration-test) @ maven-javadoc-plugin ---
[INFO] -------------------------------------------------
[INFO] Build Summary:
[INFO]   Passed: 60, Failed: 1, Errors: 0, Skipped: 3
[INFO] -------------------------------------------------
[ERROR] The following builds failed:
[ERROR] *  MJAVADOC-555_link-automatic-modules\pom.xml
[INFO] -------------------------------------------------
[INFO] ------------------------------------------------------------------------
[INFO] BUILD FAILURE
[INFO] ------------------------------------------------------------------------
[INFO] Total time:  23:55 min
[INFO] Finished at: 2019-09-22T19:47:58-07:00
[INFO] ------------------------------------------------------------------------
[INFO] [jenkins-event-spy] Generated F:\jenkins\jenkins-slave\workspace\aven-javadoc-plugin_MJAVADOC-591@2@tmp\withMaven249f32ac\maven-spy-20190922-192402-3963135191377042206696.log
[ERROR] Failed to execute goal org.apache.maven.plugins:maven-invoker-plugin:3.1.0:verify (integration-test) on project maven-javadoc-plugin: 1 build failed. See console output above for details. -> [Help 1]
org.apache.maven.lifecycle.LifecycleExecutionException: Failed to execute goal org.apache.maven.plugins:maven-invoker-plugin:3.1.0:verify (integration-test) on project maven-javadoc-plugin: 1 build failed. See console output above for details.
    at org.apache.maven.lifecycle.internal.MojoExecutor.execute (MojoExecutor.java:215)
    at org.apache.maven.lifecycle.internal.MojoExecutor.execute (MojoExecutor.java:156)
    at org.apache.maven.lifecycle.internal.MojoExecutor.execute (MojoExecutor.java:148)
    at org.apache.maven.lifecycle.internal.LifecycleModuleBuilder.buildProject (LifecycleModuleBuilder.java:117)
    at org.apache.maven.lifecycle.internal.LifecycleModuleBuilder.buildProject (LifecycleModuleBuilder.java:81)
    at org.apache.maven.lifecycle.internal.builder.singlethreaded.SingleThreadedBuilder.build (SingleThreadedBuilder.java:56)
    at org.apache.maven.lifecycle.internal.LifecycleStarter.execute (LifecycleStarter.java:128)
    at org.apache.maven.DefaultMaven.doExecute (DefaultMaven.java:305)
    at org.apache.maven.DefaultMaven.doExecute (DefaultMaven.java:192)
    at org.apache.maven.DefaultMaven.execute (DefaultMaven.java:105)
    at org.apache.maven.cli.MavenCli.execute (MavenCli.java:956)
    at org.apache.maven.cli.MavenCli.doMain (MavenCli.java:288)
    at org.apache.maven.cli.MavenCli.main (MavenCli.java:192)
    at jdk.internal.reflect.NativeMethodAccessorImpl.invoke0 (Native Method)
    at jdk.internal.reflect.NativeMethodAccessorImpl.invoke (NativeMethodAccessorImpl.java:62)
    at jdk.internal.reflect.DelegatingMethodAccessorImpl.invoke (DelegatingMethodAccessorImpl.java:43)
    at java.lang.reflect.Method.invoke (Method.java:567)
    at org.codehaus.plexus.classworlds.launcher.Launcher.launchEnhanced (Launcher.java:289)
    at org.codehaus.plexus.classworlds.launcher.Launcher.launch (Launcher.java:229)
    at org.codehaus.plexus.classworlds.launcher.Launcher.mainWithExitCode (Launcher.java:415)
    at org.codehaus.plexus.classworlds.launcher.Launcher.main (Launcher.java:356)
Caused by: org.apache.maven.plugin.MojoFailureException: 1 build failed. See console output above for details.
    at org.apache.maven.plugins.invoker.InvokerSession.handleFailures (InvokerSession.java:260)
    at org.apache.maven.plugins.invoker.VerifyMojo.execute (VerifyMojo.java:137)
    at org.apache.maven.plugin.DefaultBuildPluginManager.executeMojo (DefaultBuildPluginManager.java:137)
    at org.apache.maven.lifecycle.internal.MojoExecutor.execute (MojoExecutor.java:210)
    at org.apache.maven.lifecycle.internal.MojoExecutor.execute (MojoExecutor.java:156)
    at org.apache.maven.lifecycle.internal.MojoExecutor.execute (MojoExecutor.java:148)
    at org.apache.maven.lifecycle.internal.LifecycleModuleBuilder.buildProject (LifecycleModuleBuilder.java:117)
    at org.apache.maven.lifecycle.internal.LifecycleModuleBuilder.buildProject (LifecycleModuleBuilder.java:81)
    at org.apache.maven.lifecycle.internal.builder.singlethreaded.SingleThreadedBuilder.build (SingleThreadedBuilder.java:56)
    at org.apache.maven.lifecycle.internal.LifecycleStarter.execute (LifecycleStarter.java:128)
    at org.apache.maven.DefaultMaven.doExecute (DefaultMaven.java:305)
    at org.apache.maven.DefaultMaven.doExecute (DefaultMaven.java:192)
    at org.apache.maven.DefaultMaven.execute (DefaultMaven.java:105)
    at org.apache.maven.cli.MavenCli.execute (MavenCli.java:956)
    at org.apache.maven.cli.MavenCli.doMain (MavenCli.java:288)
    at org.apache.maven.cli.MavenCli.main (MavenCli.java:192)
    at jdk.internal.reflect.NativeMethodAccessorImpl.invoke0 (Native Method)
    at jdk.internal.reflect.NativeMethodAccessorImpl.invoke (NativeMethodAccessorImpl.java:62)
    at jdk.internal.reflect.DelegatingMethodAccessorImpl.invoke (DelegatingMethodAccessorImpl.java:43)
    at java.lang.reflect.Method.invoke (Method.java:567)
    at org.codehaus.plexus.classworlds.launcher.Launcher.launchEnhanced (Launcher.java:289)
    at org.codehaus.plexus.classworlds.launcher.Launcher.launch (Launcher.java:229)
    at org.codehaus.plexus.classworlds.launcher.Launcher.mainWithExitCode (Launcher.java:415)
    at org.codehaus.plexus.classworlds.launcher.Launcher.main (Launcher.java:356)
[ERROR]
[ERROR] Re-run Maven using the -X switch to enable full debug logging.
[ERROR]
[ERROR] For more information about the errors and possible solutions, please read the following articles:
[ERROR] [Help 1] http://cwiki.apache.org/confluence/display/MAVEN/MojoFailureException
[Pipeline] }
[Pipeline] // dir
[Pipeline] }
[withMaven] junitPublisher - Archive test results for Maven artifact org.apache.maven.plugins:maven-javadoc-plugin:maven-plugin:3.1.1-SNAPSHOT generated by maven-surefire-plugin:test (default-test): windows-jdk12-m3.6.x_build\target\surefire-reports\*.xml
Recording test results
[withMaven] openTasksPublisher - Scan Tasks for Maven artifact org.apache.maven.plugins:maven-javadoc-plugin:maven-plugin:3.1.1-SNAPSHOT in source directory windows-jdk12-m3.6.x_build\src\main\java
[TASKS] Scanning folder 'f:\jenkins\jenkins-slave\workspace\aven-javadoc-plugin_MJAVADOC-591@2' for files matching the pattern 'windows-jdk12-m3.6.x_build\src\main\java\**\*' - excludes: null
[TASKS] Found 26 files to scan for tasks
[TASKS] Found 7 open tasks.
Skipping warnings blame since pipelines do not have an SCM link.%n
[TASKS] Computing warning deltas based on reference build #6
[withMaven] invokerPublisher - Archive invoker results for Maven artifact MavenArtifact{org.apache.maven.plugins:maven-javadoc-plugin:maven-plugin:3.1.1-SNAPSHOT(version: 3.1.1-SNAPSHOT, snapshot:false) } generated by PluginInvocation{org.apache.maven.plugins:maven-invoker-plugin:3.1.0@integration-test  integration-test}: windows-jdk12-m3.6.x_build\target\invoker-reports\*.xml
[withMaven] Publishers: Generated Artifacts Publisher: 21 ms, Junit Publisher: 264 ms, Open Task Scanner Publisher: 243 ms, Invoker Publisher: 52599 ms
[Pipeline] // withMaven
[Pipeline] cleanWs
[WS-CLEANUP] Deleting project workspace...
[WS-CLEANUP] Deferred wipeout is used...
[WS-CLEANUP] done
[Pipeline] cleanWs
[WS-CLEANUP] Deleting project workspace...
[WS-CLEANUP] Deferred wipeout is used...
[WS-CLEANUP] done
[Pipeline] }
[Pipeline] // stage
[Pipeline] }
[Pipeline] // ws
[Pipeline] }
[Pipeline] // node
[Pipeline] }
Failed in branch windows-jdk12-m3.6.x_build
[Pipeline] // parallel
[Pipeline] stage
[Pipeline] { (Notifications)
[Pipeline] echo
Build result: FAILURE
[Pipeline] jiraIssueSelector
[Pipeline] echo
The authors of changes [rfscholte].
[Pipeline] echo
Sending email ...
[Pipeline] emailext
Reply | Threaded
Open this post in threaded view
|

Build failed in Jenkins: Maven TLP » maven-javadoc-plugin » MJAVADOC-591 #11

Apache Jenkins Server-2
See https://builds.apache.org/job/maven-box/job/maven-javadoc-plugin/job/MJAVADOC-591/11/

Changes:

* Apply Maven 3.6.2
* H29 has checkout issues...
* Issues with H28 too
* Seems like Maven 3.6.2 is not available on all Linux nodes yet
* Java 13 released: drop 12 + include 14 (-ea)

All tests passed

Build log:
[...truncated 7899 lines...]
    at jdk.internal.reflect.DelegatingMethodAccessorImpl.invoke (DelegatingMethodAccessorImpl.java:43)
    at java.lang.reflect.Method.invoke (Method.java:566)
    at org.codehaus.plexus.classworlds.launcher.Launcher.launchEnhanced (Launcher.java:282)
    at org.codehaus.plexus.classworlds.launcher.Launcher.launch (Launcher.java:225)
    at org.codehaus.plexus.classworlds.launcher.Launcher.mainWithExitCode (Launcher.java:406)
    at org.codehaus.plexus.classworlds.launcher.Launcher.main (Launcher.java:347)
Caused by: org.apache.maven.plugin.MojoFailureException: 1 build failed. See console output above for details.
    at org.apache.maven.plugins.invoker.InvokerSession.handleFailures (InvokerSession.java:260)
    at org.apache.maven.plugins.invoker.VerifyMojo.execute (VerifyMojo.java:137)
    at org.apache.maven.plugin.DefaultBuildPluginManager.executeMojo (DefaultBuildPluginManager.java:137)
    at org.apache.maven.lifecycle.internal.MojoExecutor.execute (MojoExecutor.java:210)
    at org.apache.maven.lifecycle.internal.MojoExecutor.execute (MojoExecutor.java:156)
    at org.apache.maven.lifecycle.internal.MojoExecutor.execute (MojoExecutor.java:148)
    at org.apache.maven.lifecycle.internal.LifecycleModuleBuilder.buildProject (LifecycleModuleBuilder.java:117)
    at org.apache.maven.lifecycle.internal.LifecycleModuleBuilder.buildProject (LifecycleModuleBuilder.java:81)
    at org.apache.maven.lifecycle.internal.builder.singlethreaded.SingleThreadedBuilder.build (SingleThreadedBuilder.java:56)
    at org.apache.maven.lifecycle.internal.LifecycleStarter.execute (LifecycleStarter.java:128)
    at org.apache.maven.DefaultMaven.doExecute (DefaultMaven.java:305)
    at org.apache.maven.DefaultMaven.doExecute (DefaultMaven.java:192)
    at org.apache.maven.DefaultMaven.execute (DefaultMaven.java:105)
    at org.apache.maven.cli.MavenCli.execute (MavenCli.java:956)
    at org.apache.maven.cli.MavenCli.doMain (MavenCli.java:288)
    at org.apache.maven.cli.MavenCli.main (MavenCli.java:192)
    at jdk.internal.reflect.NativeMethodAccessorImpl.invoke0 (Native Method)
    at jdk.internal.reflect.NativeMethodAccessorImpl.invoke (NativeMethodAccessorImpl.java:62)
    at jdk.internal.reflect.DelegatingMethodAccessorImpl.invoke (DelegatingMethodAccessorImpl.java:43)
    at java.lang.reflect.Method.invoke (Method.java:566)
    at org.codehaus.plexus.classworlds.launcher.Launcher.launchEnhanced (Launcher.java:282)
    at org.codehaus.plexus.classworlds.launcher.Launcher.launch (Launcher.java:225)
    at org.codehaus.plexus.classworlds.launcher.Launcher.mainWithExitCode (Launcher.java:406)
    at org.codehaus.plexus.classworlds.launcher.Launcher.main (Launcher.java:347)
[ERROR]
[ERROR] Re-run Maven using the -X switch to enable full debug logging.
[ERROR]
[ERROR] For more information about the errors and possible solutions, please read the following articles:
[ERROR] [Help 1] http://cwiki.apache.org/confluence/display/MAVEN/MojoFailureException
[Pipeline] }
[Pipeline] // dir
[Pipeline] }
[withMaven] junitPublisher - Archive test results for Maven artifact org.apache.maven.plugins:maven-javadoc-plugin:maven-plugin:3.1.1-SNAPSHOT generated by maven-surefire-plugin:test (default-test): windows-jdk11-m3.6.x_build\target\surefire-reports\*.xml
Recording test results
[withMaven] openTasksPublisher - Scan Tasks for Maven artifact org.apache.maven.plugins:maven-javadoc-plugin:maven-plugin:3.1.1-SNAPSHOT in source directory windows-jdk11-m3.6.x_build\src\main\java
[TASKS] Scanning folder 'f:\jenkins\jenkins-slave\workspace\aven-javadoc-plugin_MJAVADOC-591@2' for files matching the pattern 'windows-jdk11-m3.6.x_build\src\main\java\**\*' - excludes: null
[TASKS] Found 26 files to scan for tasks
[TASKS] Found 7 open tasks.
Skipping warnings blame since pipelines do not have an SCM link.%n
[TASKS] Computing warning deltas based on reference build #6
[withMaven] invokerPublisher - Archive invoker results for Maven artifact MavenArtifact{org.apache.maven.plugins:maven-javadoc-plugin:maven-plugin:3.1.1-SNAPSHOT(version: 3.1.1-SNAPSHOT, snapshot:false) } generated by PluginInvocation{org.apache.maven.plugins:maven-invoker-plugin:3.1.0@integration-test  integration-test}: windows-jdk11-m3.6.x_build\target\invoker-reports\*.xml
[INFO] run post-build script verify.groovy
[INFO]           MJAVADOC-506_excl-module-info\pom.xml ............ SUCCESS (10.9 s)
[INFO] Building: MJAVADOC-508\pom.xml
[INFO]           MJAVADOC-508\pom.xml ............................. SUCCESS (9.4 s)
[INFO] Building: MJAVADOC-514_3rdparty-doclettags\pom.xml
[INFO]           MJAVADOC-514_3rdparty-doclettags\pom.xml ......... SUCCESS (7.6 s)
[INFO] Building: MJAVADOC-526_aggr-managedDeps\pom.xml
[INFO]           MJAVADOC-526_aggr-managedDeps\pom.xml ............ SUCCESS (14.1 s)
[INFO] Building: MJAVADOC-528\pom.xml
[INFO] run post-build script verify.groovy
[INFO]           MJAVADOC-528\pom.xml ............................. SUCCESS (15.6 s)
[INFO] Building: MJAVADOC-538\pom.xml
[withMaven] Publishers: Generated Artifacts Publisher: 15 ms, Junit Publisher: 230 ms, Open Task Scanner Publisher: 201 ms, Invoker Publisher: 52214 ms
[Pipeline] // withMaven
[Pipeline] cleanWs
[WS-CLEANUP] Deleting project workspace...
[WS-CLEANUP] Deferred wipeout is used...
[WS-CLEANUP] done
[Pipeline] cleanWs
[WS-CLEANUP] Deleting project workspace...
[WS-CLEANUP] Deferred wipeout is used...
[WS-CLEANUP] done
[Pipeline] }
[Pipeline] // stage
[Pipeline] }
[Pipeline] // ws
[Pipeline] }
[Pipeline] // node
[Pipeline] }
Failed in branch windows-jdk11-m3.6.x_build
[INFO]           MJAVADOC-538\pom.xml ............................. SUCCESS (8.2 s)
[INFO] Building: MJAVADOC-551 spaces\pom.xml
[INFO]           MJAVADOC-551 spaces\pom.xml ...................... SUCCESS (5.4 s)
[INFO] Building: MJAVADOC-552_fix-author\pom.xml
[INFO] run post-build script verify.groovy
[INFO]           MJAVADOC-552_fix-author\pom.xml .................. SUCCESS (10.0 s)
[INFO] Building: MJAVADOC-555_aggr_mixed\pom.xml
[INFO] run post-build script verify.groovy
[INFO]           MJAVADOC-555_aggr_mixed\pom.xml .................. SUCCESS (12.0 s)
[INFO] Building: MJAVADOC-555_link-automatic-modules\pom.xml
[INFO] run post-build script verify.groovy
[INFO]           MJAVADOC-555_link-automatic-modules\pom.xml ...... FAILED (17.3 s)
[INFO]   The post-build script did not succeed. assert m[0][1] == "https://google.github.io/guava/releases/27.0.1-jre/api/docs/com/google/common/collect/Multimap.html?is-external=true"
       ||  |   |
       ||  |   false
       ||  https://guava.dev/releases/27.0.1-jre/api/docs/com/google/common/collect/Multimap.html?is-external=true
       |[<a href="https://guava.dev/releases/27.0.1-jre/api/docs/com/google/common/collect/Multimap.html?is-external=true" title="class or interface in com.google.common.collect" class="externalLink">Multimap</a>, https://guava.dev/releases/27.0.1-jre/api/docs/com/google/common/collect/Multimap.html?is-external=true]
       java.util.regex.Matcher[pattern=<a href="([^"]+)"(?:[^>]+)>Multimap</a> region=0,13043 lastmatch=<a href="https://guava.dev/releases/27.0.1-jre/api/docs/com/google/common/collect/Multimap.html?is-external=true" title="class or interface in com.google.common.collect" class="externalLink">Multimap</a>]
[INFO] Building: MJAVADOC-556_hide-non-exported-packages\pom.xml
[INFO]           MJAVADOC-556_hide-non-exported-packages\pom.xml .. SUCCESS (9.2 s)
[INFO] Building: MJAVADOC-558_fix-unknownthrows\pom.xml
[INFO] run post-build script verify.groovy
[INFO]           MJAVADOC-558_fix-unknownthrows\pom.xml ........... SUCCESS (9.6 s)
[INFO] Building: MJAVADOC-562_release\pom.xml
[INFO]           MJAVADOC-562_release\pom.xml ..................... SUCCESS (10.4 s)
[INFO] Building: MJAVADOC-567_aggr-mixed\pom.xml
[INFO] run post-build script verify.groovy
[INFO]           MJAVADOC-567_aggr-mixed\pom.xml .................. SUCCESS (6.2 s)
[INFO] Building: MJAVADOC-568_export-to-testcase\pom.xml
[INFO]           MJAVADOC-568_export-to-testcase\pom.xml .......... SUCCESS (23.2 s)
[INFO] Building: MJAVADOC-568_jar-mixed\pom.xml
[INFO]           MJAVADOC-568_jar-mixed\pom.xml ................... SUCCESS (18.0 s)
[INFO] Building: MJAVADOC-568_manifest-splitpackage\pom.xml
[INFO]           MJAVADOC-568_manifest-splitpackage\pom.xml ....... SUCCESS (26.6 s)
[INFO] Building: MJAVADOC-569_aggr-mixed\pom.xml
[INFO]           MJAVADOC-569_aggr-mixed\pom.xml .................. SUCCESS (19.0 s)
[INFO] Building: MJAVADOC-575_source8-module-info\pom.xml
[INFO]           MJAVADOC-575_source8-module-info\pom.xml ......... SKIPPED due to JRE version
[INFO] Building: MJAVADOC-580_detectLinks\pom.xml
[INFO] run post-build script verify.groovy
[INFO]           MJAVADOC-580_detectLinks\pom.xml ................. SUCCESS (8.9 s)
[INFO] Building: MJAVADOC-591_release8\pom.xml
[INFO] artifact org.apache.maven.plugins:maven-compiler-plugin: checking for updates from central
[INFO] artifact org.apache.maven.plugins:maven-surefire-plugin: checking for updates from central
[INFO]           MJAVADOC-591_release8\pom.xml .................... SUCCESS (27.9 s)
[INFO] Building: site-failOnError\pom.xml
[INFO]           site-failOnError\pom.xml ......................... SUCCESS (8.2 s)
[INFO]
[INFO] --- mrm-maven-plugin:1.1.0:stop (repository) @ maven-javadoc-plugin ---
[INFO] Stopping Mock Repository Manager on http://localhost:63786
[INFO] Stopped SocketConnector@0.0.0.0:63786
[INFO] Mock Repository Manager http://localhost:63786 is stopped.
[INFO]
[INFO] --- mrm-maven-plugin:1.1.0:stop (3rdparty) @ maven-javadoc-plugin ---
[INFO] Stopping Mock Repository Manager on http://localhost:63791
[INFO] Stopped SocketConnector@0.0.0.0:63791
[INFO] Mock Repository Manager http://localhost:63791 is stopped.
[INFO]
[INFO] --- maven-checkstyle-plugin:3.0.0:check (checkstyle-check) @ maven-javadoc-plugin ---
[INFO] There are 4 errors reported by Checkstyle 6.18 with config/maven_checks.xml ruleset.
[INFO] Ignored 4 errors, 0 violation remaining.
[INFO]
[INFO] --- maven-invoker-plugin:3.1.0:verify (integration-test) @ maven-javadoc-plugin ---
[INFO] -------------------------------------------------
[INFO] Build Summary:
[INFO]   Passed: 60, Failed: 1, Errors: 0, Skipped: 3
[INFO] -------------------------------------------------
[ERROR] The following builds failed:
[ERROR] *  MJAVADOC-555_link-automatic-modules\pom.xml
[INFO] -------------------------------------------------
[INFO] ------------------------------------------------------------------------
[INFO] BUILD FAILURE
[INFO] ------------------------------------------------------------------------
[INFO] Total time:  19:28 min
[INFO] Finished at: 2019-10-01T04:51:04-07:00
[INFO] ------------------------------------------------------------------------
[INFO] [jenkins-event-spy] Generated F:\jenkins\jenkins-slave\workspace\aven-javadoc-plugin_MJAVADOC-591@3@2@tmp\withMaven73ef1267\maven-spy-20191001-043135-69512692727856595579884.log
[ERROR] Failed to execute goal org.apache.maven.plugins:maven-invoker-plugin:3.1.0:verify (integration-test) on project maven-javadoc-plugin: 1 build failed. See console output above for details. -> [Help 1]
org.apache.maven.lifecycle.LifecycleExecutionException: Failed to execute goal org.apache.maven.plugins:maven-invoker-plugin:3.1.0:verify (integration-test) on project maven-javadoc-plugin: 1 build failed. See console output above for details.
    at org.apache.maven.lifecycle.internal.MojoExecutor.execute (MojoExecutor.java:215)
    at org.apache.maven.lifecycle.internal.MojoExecutor.execute (MojoExecutor.java:156)
    at org.apache.maven.lifecycle.internal.MojoExecutor.execute (MojoExecutor.java:148)
    at org.apache.maven.lifecycle.internal.LifecycleModuleBuilder.buildProject (LifecycleModuleBuilder.java:117)
    at org.apache.maven.lifecycle.internal.LifecycleModuleBuilder.buildProject (LifecycleModuleBuilder.java:81)
    at org.apache.maven.lifecycle.internal.builder.singlethreaded.SingleThreadedBuilder.build (SingleThreadedBuilder.java:56)
    at org.apache.maven.lifecycle.internal.LifecycleStarter.execute (LifecycleStarter.java:128)
    at org.apache.maven.DefaultMaven.doExecute (DefaultMaven.java:305)
    at org.apache.maven.DefaultMaven.doExecute (DefaultMaven.java:192)
    at org.apache.maven.DefaultMaven.execute (DefaultMaven.java:105)
    at org.apache.maven.cli.MavenCli.execute (MavenCli.java:956)
    at org.apache.maven.cli.MavenCli.doMain (MavenCli.java:288)
    at org.apache.maven.cli.MavenCli.main (MavenCli.java:192)
    at jdk.internal.reflect.NativeMethodAccessorImpl.invoke0 (Native Method)
    at jdk.internal.reflect.NativeMethodAccessorImpl.invoke (NativeMethodAccessorImpl.java:62)
    at jdk.internal.reflect.DelegatingMethodAccessorImpl.invoke (DelegatingMethodAccessorImpl.java:43)
    at java.lang.reflect.Method.invoke (Method.java:567)
    at org.codehaus.plexus.classworlds.launcher.Launcher.launchEnhanced (Launcher.java:282)
    at org.codehaus.plexus.classworlds.launcher.Launcher.launch (Launcher.java:225)
    at org.codehaus.plexus.classworlds.launcher.Launcher.mainWithExitCode (Launcher.java:406)
    at org.codehaus.plexus.classworlds.launcher.Launcher.main (Launcher.java:347)
Caused by: org.apache.maven.plugin.MojoFailureException: 1 build failed. See console output above for details.
    at org.apache.maven.plugins.invoker.InvokerSession.handleFailures (InvokerSession.java:260)
    at org.apache.maven.plugins.invoker.VerifyMojo.execute (VerifyMojo.java:137)
    at org.apache.maven.plugin.DefaultBuildPluginManager.executeMojo (DefaultBuildPluginManager.java:137)
    at org.apache.maven.lifecycle.internal.MojoExecutor.execute (MojoExecutor.java:210)
    at org.apache.maven.lifecycle.internal.MojoExecutor.execute (MojoExecutor.java:156)
    at org.apache.maven.lifecycle.internal.MojoExecutor.execute (MojoExecutor.java:148)
    at org.apache.maven.lifecycle.internal.LifecycleModuleBuilder.buildProject (LifecycleModuleBuilder.java:117)
    at org.apache.maven.lifecycle.internal.LifecycleModuleBuilder.buildProject (LifecycleModuleBuilder.java:81)
    at org.apache.maven.lifecycle.internal.builder.singlethreaded.SingleThreadedBuilder.build (SingleThreadedBuilder.java:56)
    at org.apache.maven.lifecycle.internal.LifecycleStarter.execute (LifecycleStarter.java:128)
    at org.apache.maven.DefaultMaven.doExecute (DefaultMaven.java:305)
    at org.apache.maven.DefaultMaven.doExecute (DefaultMaven.java:192)
    at org.apache.maven.DefaultMaven.execute (DefaultMaven.java:105)
    at org.apache.maven.cli.MavenCli.execute (MavenCli.java:956)
    at org.apache.maven.cli.MavenCli.doMain (MavenCli.java:288)
    at org.apache.maven.cli.MavenCli.main (MavenCli.java:192)
    at jdk.internal.reflect.NativeMethodAccessorImpl.invoke0 (Native Method)
    at jdk.internal.reflect.NativeMethodAccessorImpl.invoke (NativeMethodAccessorImpl.java:62)
    at jdk.internal.reflect.DelegatingMethodAccessorImpl.invoke (DelegatingMethodAccessorImpl.java:43)
    at java.lang.reflect.Method.invoke (Method.java:567)
    at org.codehaus.plexus.classworlds.launcher.Launcher.launchEnhanced (Launcher.java:282)
    at org.codehaus.plexus.classworlds.launcher.Launcher.launch (Launcher.java:225)
    at org.codehaus.plexus.classworlds.launcher.Launcher.mainWithExitCode (Launcher.java:406)
    at org.codehaus.plexus.classworlds.launcher.Launcher.main (Launcher.java:347)
[ERROR]
[ERROR] Re-run Maven using the -X switch to enable full debug logging.
[ERROR]
[ERROR] For more information about the errors and possible solutions, please read the following articles:
[ERROR] [Help 1] http://cwiki.apache.org/confluence/display/MAVEN/MojoFailureException
[Pipeline] }
[Pipeline] // dir
[Pipeline] }
[withMaven] junitPublisher - Archive test results for Maven artifact org.apache.maven.plugins:maven-javadoc-plugin:maven-plugin:3.1.1-SNAPSHOT generated by maven-surefire-plugin:test (default-test): windows-jdk12-m3.6.x_build\target\surefire-reports\*.xml
Recording test results
[withMaven] openTasksPublisher - Scan Tasks for Maven artifact org.apache.maven.plugins:maven-javadoc-plugin:maven-plugin:3.1.1-SNAPSHOT in source directory windows-jdk12-m3.6.x_build\src\main\java
[TASKS] Scanning folder 'f:\jenkins\jenkins-slave\workspace\aven-javadoc-plugin_MJAVADOC-591@3@2' for files matching the pattern 'windows-jdk12-m3.6.x_build\src\main\java\**\*' - excludes: null
[TASKS] Found 26 files to scan for tasks
[TASKS] Found 7 open tasks.
Skipping warnings blame since pipelines do not have an SCM link.%n
[TASKS] Computing warning deltas based on reference build #6
[withMaven] invokerPublisher - Archive invoker results for Maven artifact MavenArtifact{org.apache.maven.plugins:maven-javadoc-plugin:maven-plugin:3.1.1-SNAPSHOT(version: 3.1.1-SNAPSHOT, snapshot:false) } generated by PluginInvocation{org.apache.maven.plugins:maven-invoker-plugin:3.1.0@integration-test  integration-test}: windows-jdk12-m3.6.x_build\target\invoker-reports\*.xml
[withMaven] Publishers: Generated Artifacts Publisher: 12 ms, Junit Publisher: 260 ms, Open Task Scanner Publisher: 188 ms, Invoker Publisher: 62680 ms
[Pipeline] // withMaven
[Pipeline] cleanWs
[WS-CLEANUP] Deleting project workspace...
[WS-CLEANUP] Deferred wipeout is used...
[WS-CLEANUP] done
[Pipeline] cleanWs
[WS-CLEANUP] Deleting project workspace...
[WS-CLEANUP] Deferred wipeout is used...
[WS-CLEANUP] done
[Pipeline] }
[Pipeline] // stage
[Pipeline] }
[Pipeline] // ws
[Pipeline] }
[Pipeline] // node
[Pipeline] }
Failed in branch windows-jdk12-m3.6.x_build
[Pipeline] // parallel
[Pipeline] stage
[Pipeline] { (Notifications)
[Pipeline] echo
Build result: FAILURE
[Pipeline] jiraIssueSelector
[Pipeline] echo
The authors of changes [rfscholte].
[Pipeline] echo
Sending email ...
[Pipeline] emailext
Reply | Threaded
Open this post in threaded view
|

Build failed in Jenkins: Maven TLP » maven-javadoc-plugin » MJAVADOC-591 #12

Apache Jenkins Server-2
See https://builds.apache.org/job/maven-box/job/maven-javadoc-plugin/job/MJAVADOC-591/12/

No changes.

All tests passed

Build log:
[...truncated 8593 lines...]
    at org.apache.maven.lifecycle.internal.builder.singlethreaded.SingleThreadedBuilder.build (SingleThreadedBuilder.java:56)
    at org.apache.maven.lifecycle.internal.LifecycleStarter.execute (LifecycleStarter.java:128)
    at org.apache.maven.DefaultMaven.doExecute (DefaultMaven.java:305)
    at org.apache.maven.DefaultMaven.doExecute (DefaultMaven.java:192)
    at org.apache.maven.DefaultMaven.execute (DefaultMaven.java:105)
    at org.apache.maven.cli.MavenCli.execute (MavenCli.java:956)
    at org.apache.maven.cli.MavenCli.doMain (MavenCli.java:288)
    at org.apache.maven.cli.MavenCli.main (MavenCli.java:192)
    at jdk.internal.reflect.NativeMethodAccessorImpl.invoke0 (Native Method)
    at jdk.internal.reflect.NativeMethodAccessorImpl.invoke (NativeMethodAccessorImpl.java:62)
    at jdk.internal.reflect.DelegatingMethodAccessorImpl.invoke (DelegatingMethodAccessorImpl.java:43)
    at java.lang.reflect.Method.invoke (Method.java:566)
    at org.codehaus.plexus.classworlds.launcher.Launcher.launchEnhanced (Launcher.java:282)
    at org.codehaus.plexus.classworlds.launcher.Launcher.launch (Launcher.java:225)
    at org.codehaus.plexus.classworlds.launcher.Launcher.mainWithExitCode (Launcher.java:406)
    at org.codehaus.plexus.classworlds.launcher.Launcher.main (Launcher.java:347)
[ERROR]
[ERROR] Re-run Maven using the -X switch to enable full debug logging.
[ERROR]
[ERROR] For more information about the errors and possible solutions, please read the following articles:
[ERROR] [Help 1] http://cwiki.apache.org/confluence/display/MAVEN/MojoFailureException
[Pipeline] }
[Pipeline] // dir
[Pipeline] }
[withMaven] junitPublisher - Archive test results for Maven artifact org.apache.maven.plugins:maven-javadoc-plugin:maven-plugin:3.1.1-SNAPSHOT generated by maven-surefire-plugin:test (default-test): windows-jdk11-m3.6.x_build\target\surefire-reports\*.xml
Recording test results
[withMaven] openTasksPublisher - Scan Tasks for Maven artifact org.apache.maven.plugins:maven-javadoc-plugin:maven-plugin:3.1.1-SNAPSHOT in source directory windows-jdk11-m3.6.x_build\src\main\java
[TASKS] Scanning folder 'f:\jenkins\jenkins-slave\workspace\aven-javadoc-plugin_MJAVADOC-591@2' for files matching the pattern 'windows-jdk11-m3.6.x_build\src\main\java\**\*' - excludes: null
[TASKS] Found 26 files to scan for tasks
[TASKS] Found 7 open tasks.
Skipping warnings blame since pipelines do not have an SCM link.%n
[TASKS] Computing warning deltas based on reference build #6
[withMaven] invokerPublisher - Archive invoker results for Maven artifact MavenArtifact{org.apache.maven.plugins:maven-javadoc-plugin:maven-plugin:3.1.1-SNAPSHOT(version: 3.1.1-SNAPSHOT, snapshot:false) } generated by PluginInvocation{org.apache.maven.plugins:maven-invoker-plugin:3.1.0@integration-test  integration-test}: windows-jdk11-m3.6.x_build\target\invoker-reports\*.xml
[INFO]           MJAVADOC-494_aggregate-repositories\pom.xml ...... SUCCESS (9.7 s)
[INFO] Building: MJAVADOC-495_offline-filescheme\pom.xml
[INFO] run post-build script verify.groovy
[INFO]           MJAVADOC-495_offline-filescheme\pom.xml .......... SUCCESS (15.1 s)
[INFO] Building: MJAVADOC-497\pom.xml
[INFO] run post-build script verify.bsh
[INFO]           MJAVADOC-497\pom.xml ............................. SUCCESS (9.3 s)
[INFO] Building: MJAVADOC-498_aggr_modulepath\pom.xml
[INFO]           MJAVADOC-498_aggr_modulepath\pom.xml ............. SUCCESS (25.2 s)
[INFO] Building: MJAVADOC-498_mm_modulepath\pom.xml
[withMaven] Publishers: Generated Artifacts Publisher: 14 ms, Junit Publisher: 256 ms, Open Task Scanner Publisher: 194 ms, Invoker Publisher: 58154 ms
[Pipeline] // withMaven
[Pipeline] cleanWs
[WS-CLEANUP] Deleting project workspace...
[WS-CLEANUP] Deferred wipeout is used...
[WS-CLEANUP] done
[Pipeline] cleanWs
[WS-CLEANUP] Deleting project workspace...
[WS-CLEANUP] Deferred wipeout is used...
[WS-CLEANUP] done
[Pipeline] }
[Pipeline] // stage
[Pipeline] }
[Pipeline] // ws
[Pipeline] }
[Pipeline] // node
[Pipeline] }
Failed in branch windows-jdk11-m3.6.x_build
[INFO]           MJAVADOC-498_mm_modulepath\pom.xml ............... SUCCESS (14.1 s)
[INFO] Building: MJAVADOC-498_modulepath\pom.xml
[INFO] run post-build script verify.groovy
[INFO]           MJAVADOC-498_modulepath\pom.xml .................. SUCCESS (13.8 s)
[INFO] Building: MJAVADOC-506_excl-module-info\pom.xml
[INFO] run post-build script verify.groovy
[INFO]           MJAVADOC-506_excl-module-info\pom.xml ............ SUCCESS (9.2 s)
[INFO] Building: MJAVADOC-508\pom.xml
[INFO]           MJAVADOC-508\pom.xml ............................. SUCCESS (7.4 s)
[INFO] Building: MJAVADOC-514_3rdparty-doclettags\pom.xml
[INFO]           MJAVADOC-514_3rdparty-doclettags\pom.xml ......... SUCCESS (5.9 s)
[INFO] Building: MJAVADOC-526_aggr-managedDeps\pom.xml
[INFO]           MJAVADOC-526_aggr-managedDeps\pom.xml ............ SUCCESS (10.7 s)
[INFO] Building: MJAVADOC-528\pom.xml
[INFO] run post-build script verify.groovy
[INFO]           MJAVADOC-528\pom.xml ............................. SUCCESS (10.2 s)
[INFO] Building: MJAVADOC-538\pom.xml
[INFO]           MJAVADOC-538\pom.xml ............................. SUCCESS (6.7 s)
[INFO] Building: MJAVADOC-551 spaces\pom.xml
[INFO]           MJAVADOC-551 spaces\pom.xml ...................... SUCCESS (5.3 s)
[INFO] Building: MJAVADOC-552_fix-author\pom.xml
[INFO] run post-build script verify.groovy
[INFO]           MJAVADOC-552_fix-author\pom.xml .................. SUCCESS (9.2 s)
[INFO] Building: MJAVADOC-555_aggr_mixed\pom.xml
[INFO] run post-build script verify.groovy
[INFO]           MJAVADOC-555_aggr_mixed\pom.xml .................. SUCCESS (11.3 s)
[INFO] Building: MJAVADOC-555_link-automatic-modules\pom.xml
[INFO] run post-build script verify.groovy
[INFO]           MJAVADOC-555_link-automatic-modules\pom.xml ...... FAILED (13.4 s)
[INFO]   The post-build script did not succeed. assert m[0][1] == "https://google.github.io/guava/releases/27.0.1-jre/api/docs/com/google/common/collect/Multimap.html?is-external=true"
       ||  |   |
       ||  |   false
       ||  https://guava.dev/releases/27.0.1-jre/api/docs/com/google/common/collect/Multimap.html?is-external=true
       |[<a href="https://guava.dev/releases/27.0.1-jre/api/docs/com/google/common/collect/Multimap.html?is-external=true" title="class or interface in com.google.common.collect" class="externalLink">Multimap</a>, https://guava.dev/releases/27.0.1-jre/api/docs/com/google/common/collect/Multimap.html?is-external=true]
       java.util.regex.Matcher[pattern=<a href="([^"]+)"(?:[^>]+)>Multimap</a> region=0,13043 lastmatch=<a href="https://guava.dev/releases/27.0.1-jre/api/docs/com/google/common/collect/Multimap.html?is-external=true" title="class or interface in com.google.common.collect" class="externalLink">Multimap</a>]
[INFO] Building: MJAVADOC-556_hide-non-exported-packages\pom.xml
[INFO]           MJAVADOC-556_hide-non-exported-packages\pom.xml .. SUCCESS (8.3 s)
[INFO] Building: MJAVADOC-558_fix-unknownthrows\pom.xml
[INFO] run post-build script verify.groovy
[INFO]           MJAVADOC-558_fix-unknownthrows\pom.xml ........... SUCCESS (10.5 s)
[INFO] Building: MJAVADOC-562_release\pom.xml
[INFO]           MJAVADOC-562_release\pom.xml ..................... SUCCESS (11.2 s)
[INFO] Building: MJAVADOC-567_aggr-mixed\pom.xml
[INFO] run post-build script verify.groovy
[INFO]           MJAVADOC-567_aggr-mixed\pom.xml .................. SUCCESS (6.4 s)
[INFO] Building: MJAVADOC-568_export-to-testcase\pom.xml
[INFO]           MJAVADOC-568_export-to-testcase\pom.xml .......... SUCCESS (22.5 s)
[INFO] Building: MJAVADOC-568_jar-mixed\pom.xml
[INFO]           MJAVADOC-568_jar-mixed\pom.xml ................... SUCCESS (17.2 s)
[INFO] Building: MJAVADOC-568_manifest-splitpackage\pom.xml
[INFO]           MJAVADOC-568_manifest-splitpackage\pom.xml ....... SUCCESS (24.5 s)
[INFO] Building: MJAVADOC-569_aggr-mixed\pom.xml
[INFO]           MJAVADOC-569_aggr-mixed\pom.xml .................. SUCCESS (19.7 s)
[INFO] Building: MJAVADOC-575_source8-module-info\pom.xml
[INFO]           MJAVADOC-575_source8-module-info\pom.xml ......... SKIPPED due to JRE version
[INFO] Building: MJAVADOC-580_detectLinks\pom.xml
[INFO] run post-build script verify.groovy
[INFO]           MJAVADOC-580_detectLinks\pom.xml ................. SUCCESS (7.9 s)
[INFO] Building: MJAVADOC-591_release8\pom.xml
[INFO] artifact org.apache.maven.plugins:maven-compiler-plugin: checking for updates from central
[INFO] artifact org.apache.maven.plugins:maven-surefire-plugin: checking for updates from central
[INFO]           MJAVADOC-591_release8\pom.xml .................... SUCCESS (23.9 s)
[INFO] Building: site-failOnError\pom.xml
[INFO]           site-failOnError\pom.xml ......................... SUCCESS (8.6 s)
[INFO]
[INFO] --- mrm-maven-plugin:1.1.0:stop (repository) @ maven-javadoc-plugin ---
[INFO] Stopping Mock Repository Manager on http://localhost:60600
[INFO] Stopped SocketConnector@0.0.0.0:60600
[INFO] Mock Repository Manager http://localhost:60600 is stopped.
[INFO]
[INFO] --- mrm-maven-plugin:1.1.0:stop (3rdparty) @ maven-javadoc-plugin ---
[INFO] Stopping Mock Repository Manager on http://localhost:60602
[INFO] Stopped SocketConnector@0.0.0.0:60602
[INFO] Mock Repository Manager http://localhost:60602 is stopped.
[INFO]
[INFO] --- maven-checkstyle-plugin:3.0.0:check (checkstyle-check) @ maven-javadoc-plugin ---
[INFO] There are 4 errors reported by Checkstyle 6.18 with config/maven_checks.xml ruleset.
[INFO] Ignored 4 errors, 0 violation remaining.
[INFO]
[INFO] --- maven-invoker-plugin:3.1.0:verify (integration-test) @ maven-javadoc-plugin ---
[INFO] -------------------------------------------------
[INFO] Build Summary:
[INFO]   Passed: 60, Failed: 1, Errors: 0, Skipped: 3
[INFO] -------------------------------------------------
[ERROR] The following builds failed:
[ERROR] *  MJAVADOC-555_link-automatic-modules\pom.xml
[INFO] -------------------------------------------------
[INFO] ------------------------------------------------------------------------
[INFO] BUILD FAILURE
[INFO] ------------------------------------------------------------------------
[INFO] Total time:  18:38 min
[INFO] Finished at: 2019-10-04T06:24:43-07:00
[INFO] ------------------------------------------------------------------------
[INFO] [jenkins-event-spy] Generated F:\jenkins\jenkins-slave\workspace\aven-javadoc-plugin_MJAVADOC-591@2@tmp\withMaven7feb4476\maven-spy-20191004-060604-86715965629311161679857.log
[ERROR] Failed to execute goal org.apache.maven.plugins:maven-invoker-plugin:3.1.0:verify (integration-test) on project maven-javadoc-plugin: 1 build failed. See console output above for details. -> [Help 1]
org.apache.maven.lifecycle.LifecycleExecutionException: Failed to execute goal org.apache.maven.plugins:maven-invoker-plugin:3.1.0:verify (integration-test) on project maven-javadoc-plugin: 1 build failed. See console output above for details.
    at org.apache.maven.lifecycle.internal.MojoExecutor.execute (MojoExecutor.java:215)
    at org.apache.maven.lifecycle.internal.MojoExecutor.execute (MojoExecutor.java:156)
    at org.apache.maven.lifecycle.internal.MojoExecutor.execute (MojoExecutor.java:148)
    at org.apache.maven.lifecycle.internal.LifecycleModuleBuilder.buildProject (LifecycleModuleBuilder.java:117)
    at org.apache.maven.lifecycle.internal.LifecycleModuleBuilder.buildProject (LifecycleModuleBuilder.java:81)
    at org.apache.maven.lifecycle.internal.builder.singlethreaded.SingleThreadedBuilder.build (SingleThreadedBuilder.java:56)
    at org.apache.maven.lifecycle.internal.LifecycleStarter.execute (LifecycleStarter.java:128)
    at org.apache.maven.DefaultMaven.doExecute (DefaultMaven.java:305)
    at org.apache.maven.DefaultMaven.doExecute (DefaultMaven.java:192)
    at org.apache.maven.DefaultMaven.execute (DefaultMaven.java:105)
    at org.apache.maven.cli.MavenCli.execute (MavenCli.java:956)
    at org.apache.maven.cli.MavenCli.doMain (MavenCli.java:288)
    at org.apache.maven.cli.MavenCli.main (MavenCli.java:192)
    at jdk.internal.reflect.NativeMethodAccessorImpl.invoke0 (Native Method)
    at jdk.internal.reflect.NativeMethodAccessorImpl.invoke (NativeMethodAccessorImpl.java:62)
    at jdk.internal.reflect.DelegatingMethodAccessorImpl.invoke (DelegatingMethodAccessorImpl.java:43)
    at java.lang.reflect.Method.invoke (Method.java:567)
    at org.codehaus.plexus.classworlds.launcher.Launcher.launchEnhanced (Launcher.java:282)
    at org.codehaus.plexus.classworlds.launcher.Launcher.launch (Launcher.java:225)
    at org.codehaus.plexus.classworlds.launcher.Launcher.mainWithExitCode (Launcher.java:406)
    at org.codehaus.plexus.classworlds.launcher.Launcher.main (Launcher.java:347)
Caused by: org.apache.maven.plugin.MojoFailureException: 1 build failed. See console output above for details.
    at org.apache.maven.plugins.invoker.InvokerSession.handleFailures (InvokerSession.java:260)
    at org.apache.maven.plugins.invoker.VerifyMojo.execute (VerifyMojo.java:137)
    at org.apache.maven.plugin.DefaultBuildPluginManager.executeMojo (DefaultBuildPluginManager.java:137)
    at org.apache.maven.lifecycle.internal.MojoExecutor.execute (MojoExecutor.java:210)
    at org.apache.maven.lifecycle.internal.MojoExecutor.execute (MojoExecutor.java:156)
    at org.apache.maven.lifecycle.internal.MojoExecutor.execute (MojoExecutor.java:148)
    at org.apache.maven.lifecycle.internal.LifecycleModuleBuilder.buildProject (LifecycleModuleBuilder.java:117)
    at org.apache.maven.lifecycle.internal.LifecycleModuleBuilder.buildProject (LifecycleModuleBuilder.java:81)
    at org.apache.maven.lifecycle.internal.builder.singlethreaded.SingleThreadedBuilder.build (SingleThreadedBuilder.java:56)
    at org.apache.maven.lifecycle.internal.LifecycleStarter.execute (LifecycleStarter.java:128)
    at org.apache.maven.DefaultMaven.doExecute (DefaultMaven.java:305)
    at org.apache.maven.DefaultMaven.doExecute (DefaultMaven.java:192)
    at org.apache.maven.DefaultMaven.execute (DefaultMaven.java:105)
    at org.apache.maven.cli.MavenCli.execute (MavenCli.java:956)
    at org.apache.maven.cli.MavenCli.doMain (MavenCli.java:288)
    at org.apache.maven.cli.MavenCli.main (MavenCli.java:192)
    at jdk.internal.reflect.NativeMethodAccessorImpl.invoke0 (Native Method)
    at jdk.internal.reflect.NativeMethodAccessorImpl.invoke (NativeMethodAccessorImpl.java:62)
    at jdk.internal.reflect.DelegatingMethodAccessorImpl.invoke (DelegatingMethodAccessorImpl.java:43)
    at java.lang.reflect.Method.invoke (Method.java:567)
    at org.codehaus.plexus.classworlds.launcher.Launcher.launchEnhanced (Launcher.java:282)
    at org.codehaus.plexus.classworlds.launcher.Launcher.launch (Launcher.java:225)
    at org.codehaus.plexus.classworlds.launcher.Launcher.mainWithExitCode (Launcher.java:406)
    at org.codehaus.plexus.classworlds.launcher.Launcher.main (Launcher.java:347)
[ERROR]
[ERROR] Re-run Maven using the -X switch to enable full debug logging.
[ERROR]
[ERROR] For more information about the errors and possible solutions, please read the following articles:
[ERROR] [Help 1] http://cwiki.apache.org/confluence/display/MAVEN/MojoFailureException
[Pipeline] }
[Pipeline] // dir
[Pipeline] }
[withMaven] junitPublisher - Archive test results for Maven artifact org.apache.maven.plugins:maven-javadoc-plugin:maven-plugin:3.1.1-SNAPSHOT generated by maven-surefire-plugin:test (default-test): windows-jdk12-m3.6.x_build\target\surefire-reports\*.xml
Recording test results
[withMaven] openTasksPublisher - Scan Tasks for Maven artifact org.apache.maven.plugins:maven-javadoc-plugin:maven-plugin:3.1.1-SNAPSHOT in source directory windows-jdk12-m3.6.x_build\src\main\java
[TASKS] Scanning folder 'f:\jenkins\jenkins-slave\workspace\aven-javadoc-plugin_MJAVADOC-591@2' for files matching the pattern 'windows-jdk12-m3.6.x_build\src\main\java\**\*' - excludes: null
[TASKS] Found 26 files to scan for tasks
[TASKS] Found 7 open tasks.
Skipping warnings blame since pipelines do not have an SCM link.%n
[TASKS] Computing warning deltas based on reference build #6
[withMaven] invokerPublisher - Archive invoker results for Maven artifact MavenArtifact{org.apache.maven.plugins:maven-javadoc-plugin:maven-plugin:3.1.1-SNAPSHOT(version: 3.1.1-SNAPSHOT, snapshot:false) } generated by PluginInvocation{org.apache.maven.plugins:maven-invoker-plugin:3.1.0@integration-test  integration-test}: windows-jdk12-m3.6.x_build\target\invoker-reports\*.xml
[withMaven] Publishers: Generated Artifacts Publisher: 17 ms, Junit Publisher: 242 ms, Open Task Scanner Publisher: 218 ms, Dependencies Fingerprint Publisher: 1 ms, Invoker Publisher: 61639 ms
[Pipeline] // withMaven
[Pipeline] cleanWs
[WS-CLEANUP] Deleting project workspace...
[WS-CLEANUP] Deferred wipeout is used...
[WS-CLEANUP] done
[Pipeline] cleanWs
[WS-CLEANUP] Deleting project workspace...
[WS-CLEANUP] Deferred wipeout is used...
[WS-CLEANUP] done
[Pipeline] }
[Pipeline] // stage
[Pipeline] }
[Pipeline] // ws
[Pipeline] }
[Pipeline] // node
[Pipeline] }
Failed in branch windows-jdk12-m3.6.x_build
[Pipeline] // parallel
[Pipeline] stage
[Pipeline] { (Notifications)
[Pipeline] echo
Build result: FAILURE
[Pipeline] jiraIssueSelector
[Pipeline] echo
The authors of changes [].
[Pipeline] echo
Sending email ...
[Pipeline] emailext