Build failed in Jenkins: Maven TLP » maven-javadoc-plugin » MJAVADOC-515 #1

Previous Topic Next Topic
 
classic Classic list List threaded Threaded
3 messages Options
Reply | Threaded
Open this post in threaded view
|

Build failed in Jenkins: Maven TLP » maven-javadoc-plugin » MJAVADOC-515 #1

Apache Jenkins Server-2
See https://builds.apache.org/job/maven-box/job/maven-javadoc-plugin/job/MJAVADOC-515/1/

No changes.

All tests passed

Build log:
[...truncated 1.09 MB...]
[windows-jdk8] [INFO] Building: MJAVADOC-320\pom.xml
[windows-jdk7] [INFO] run post-build script verify.bsh
[windows-jdk7] [INFO]           dependencySource-4\pom.xml ....................... SUCCESS (25.1 s)
[windows-jdk7] [INFO] Building: detectLinks\pom.xml
[windows-jdk8] [INFO] run post-build script verify.bsh
[windows-jdk8] [INFO]           MJAVADOC-320\pom.xml ............................. SUCCESS (8.5 s)
[windows-jdk8] [INFO] Building: MJAVADOC-325\pom.xml
[windows-jdk9] [INFO] run post-build script verify.bsh
[windows-jdk9] [INFO]           dependencySource-4\pom.xml ....................... SUCCESS (21.7 s)
[windows-jdk9] [INFO] Building: detectLinks\pom.xml
[windows-jdk8] [INFO] run post-build script verify.bsh
[windows-jdk8] [INFO]           MJAVADOC-325\pom.xml ............................. SUCCESS (4.0 s)
[windows-jdk8] [INFO] Building: MJAVADOC-365\pom.xml
[windows-jdk8] [INFO] run post-build script verify.bsh
[windows-jdk8] [INFO]           MJAVADOC-365\pom.xml ............................. SUCCESS (3.9 s)
[windows-jdk8] [INFO] Building: MJAVADOC-369\pom.xml
[windows-jdk8] [INFO] run post-build script verify.bsh
[windows-jdk8] [INFO]           MJAVADOC-369\pom.xml ............................. SUCCESS (8.8 s)
[windows-jdk8] [INFO] Building: MJAVADOC-384\pom.xml
[windows-jdk8] [INFO] run post-build script verify.bsh
[windows-jdk8] [INFO]           MJAVADOC-384\pom.xml ............................. SUCCESS (3.8 s)
[windows-jdk8] [INFO] Building: MJAVADOC-407\pom.xml
[windows-jdk7] [INFO] run post-build script verify.bsh
[windows-jdk7] [INFO]           detectLinks\pom.xml .............................. FAILED (25.7 s)
[windows-jdk7] [INFO]   The post-build script returned false.
[windows-jdk7] [INFO] Building: javadoc-fix\pom.xml
[windows-jdk8] [INFO] run post-build script verify.bsh
[windows-jdk8] [INFO]           MJAVADOC-407\pom.xml ............................. SUCCESS (5.2 s)
[windows-jdk8] [INFO] Building: MJAVADOC-414\pom.xml
[windows-jdk9] [INFO] run post-build script verify.bsh
[windows-jdk9] [INFO]           detectLinks\pom.xml .............................. FAILED (21.4 s)
[windows-jdk9] [INFO]   The post-build script returned false.
[windows-jdk9] [INFO] Building: javadoc-fix\pom.xml
[windows-jdk7] [INFO] run post-build script verify.bsh
[windows-jdk7] [INFO]           javadoc-fix\pom.xml .............................. SUCCESS (8.0 s)
[windows-jdk7] [INFO] Building: MJAVADOC-110\pom.xml
[windows-jdk9] [INFO] run post-build script verify.bsh
[windows-jdk9] [INFO]           javadoc-fix\pom.xml .............................. SUCCESS (6.5 s)
[windows-jdk9] [INFO] Building: MJAVADOC-110\pom.xml
[windows-jdk8] [INFO] run post-build script verify.bsh
[windows-jdk8] [INFO]           MJAVADOC-414\pom.xml ............................. SUCCESS (4.9 s)
[windows-jdk8] [INFO] Building: MJAVADOC-437\pom.xml
[windows-jdk8] [INFO] run post-build script verify.bsh
[windows-jdk8] [INFO]           MJAVADOC-437\pom.xml ............................. SUCCESS (5.2 s)
[windows-jdk8] [INFO] Building: MJAVADOC-494_aggregate-repositories\pom.xml
[windows-jdk7] [INFO] run post-build script verify.bsh
[windows-jdk7] [INFO]           MJAVADOC-110\pom.xml ............................. SUCCESS (10.0 s)
[windows-jdk7] [INFO] Building: MJAVADOC-126\pom.xml
[windows-jdk9] [INFO] run post-build script verify.bsh
[windows-jdk9] [INFO]           MJAVADOC-110\pom.xml ............................. SUCCESS (9.1 s)
[windows-jdk9] [INFO] Building: MJAVADOC-126\pom.xml
[windows-jdk8] [INFO]           MJAVADOC-494_aggregate-repositories\pom.xml ...... SUCCESS (5.3 s)
[windows-jdk8] [INFO] Building: MJAVADOC-497\pom.xml
[windows-jdk8] [INFO] run post-build script verify.bsh
[windows-jdk8] [INFO]           MJAVADOC-497\pom.xml ............................. SUCCESS (4.8 s)
[windows-jdk8] [INFO] Building: MJAVADOC-498_aggr_modulepath\pom.xml
[windows-jdk8] [INFO]           MJAVADOC-498_aggr_modulepath\pom.xml ............. SKIPPED due to JRE version
[windows-jdk8] [INFO] Building: MJAVADOC-498_mm_modulepath\pom.xml
[windows-jdk8] [INFO]           MJAVADOC-498_mm_modulepath\pom.xml ............... SKIPPED due to JRE version
[windows-jdk8] [INFO] Building: MJAVADOC-498_modulepath\pom.xml
[windows-jdk8] [INFO]           MJAVADOC-498_modulepath\pom.xml .................. SKIPPED due to JRE version
[windows-jdk8] [INFO] Building: MJAVADOC-508\pom.xml
[windows-jdk7] [INFO] run post-build script verify.bsh
[windows-jdk7] [INFO]           MJAVADOC-126\pom.xml ............................. SUCCESS (9.9 s)
[windows-jdk7] [INFO] Building: MJAVADOC-137\pom.xml
[windows-jdk8] [INFO]           MJAVADOC-508\pom.xml ............................. SUCCESS (3.9 s)
[windows-jdk8] [INFO] Building: site-failOnError\pom.xml
[windows-jdk9] [INFO] run post-build script verify.bsh
[windows-jdk9] [INFO]           MJAVADOC-126\pom.xml ............................. SUCCESS (10.7 s)
[windows-jdk9] [INFO] Building: MJAVADOC-137\pom.xml
[windows-jdk7] [INFO] run post-build script verify.bsh
[windows-jdk7] [INFO]           MJAVADOC-137\pom.xml ............................. SUCCESS (10.8 s)
[windows-jdk7] [INFO] Building: MJAVADOC-172\pom.xml
[windows-jdk8] [INFO]           site-failOnError\pom.xml ......................... SUCCESS (9.6 s)
[windows-jdk8] [INFO]
[windows-jdk8] [INFO] --- mrm-maven-plugin:1.1.0:stop (repository) @ maven-javadoc-plugin ---
[windows-jdk8] [INFO] Stopping Mock Repository Manager on http://localhost:63328
[windows-jdk8] [INFO] Stopped SocketConnector@0.0.0.0:63328
[windows-jdk8] [INFO] Mock Repository Manager http://localhost:63328 is stopped.
[windows-jdk8] [INFO]
[windows-jdk8] [INFO] --- mrm-maven-plugin:1.1.0:stop (3rdparty) @ maven-javadoc-plugin ---
[windows-jdk8] [INFO] Stopping Mock Repository Manager on http://localhost:63329
[windows-jdk8] [INFO] Stopped SocketConnector@0.0.0.0:63329
[windows-jdk8] [INFO] Mock Repository Manager http://localhost:63329 is stopped.
[windows-jdk8] [INFO]
[windows-jdk8] [INFO] --- maven-checkstyle-plugin:3.0.0:check (checkstyle-check) @ maven-javadoc-plugin ---
[windows-jdk8] [INFO] Downloading: https://repo.maven.apache.org/maven2/org/apache/maven/shared/maven-shared-resources/2/maven-shared-resources-2.pom
[windows-jdk8] [INFO] Downloaded: https://repo.maven.apache.org/maven2/org/apache/maven/shared/maven-shared-resources/2/maven-shared-resources-2.pom (3.0 kB at 174 kB/s)
[windows-jdk8] [INFO] Downloading: https://repo.maven.apache.org/maven2/org/codehaus/plexus/plexus-utils/3.0.10/plexus-utils-3.0.10.pom
[windows-jdk8] [INFO] Downloaded: https://repo.maven.apache.org/maven2/org/codehaus/plexus/plexus-utils/3.0.10/plexus-utils-3.0.10.pom (3.1 kB at 225 kB/s)
[windows-jdk8] [INFO] Downloading: https://repo.maven.apache.org/maven2/org/codehaus/plexus/plexus/3.3/plexus-3.3.pom
[windows-jdk8] [INFO] Downloaded: https://repo.maven.apache.org/maven2/org/codehaus/plexus/plexus/3.3/plexus-3.3.pom (20 kB at 1.4 MB/s)
[windows-jdk8] [INFO] Downloading: https://repo.maven.apache.org/maven2/org/apache/maven/doxia/doxia-integration-tools/1.6/doxia-integration-tools-1.6.pom
[windows-jdk8] [INFO] Downloaded: https://repo.maven.apache.org/maven2/org/apache/maven/doxia/doxia-integration-tools/1.6/doxia-integration-tools-1.6.pom (7.0 kB at 632 kB/s)
[windows-jdk8] [INFO] Downloading: https://repo.maven.apache.org/maven2/org/apache/maven/doxia/doxia-tools/3/doxia-tools-3.pom
[windows-jdk8] [INFO] Downloaded: https://repo.maven.apache.org/maven2/org/apache/maven/doxia/doxia-tools/3/doxia-tools-3.pom (9.9 kB at 827 kB/s)
[windows-jdk8] [INFO] Downloading: https://repo.maven.apache.org/maven2/org/codehaus/plexus/plexus-resources/1.1.0/plexus-resources-1.1.0.pom
[windows-jdk8] [INFO] Downloaded: https://repo.maven.apache.org/maven2/org/codehaus/plexus/plexus-resources/1.1.0/plexus-resources-1.1.0.pom (3.2 kB at 199 kB/s)
[windows-jdk8] [INFO] Downloading: https://repo.maven.apache.org/maven2/com/puppycrawl/tools/checkstyle/6.18/checkstyle-6.18.pom
[windows-jdk8] [INFO] Downloaded: https://repo.maven.apache.org/maven2/com/puppycrawl/tools/checkstyle/6.18/checkstyle-6.18.pom (71 kB at 3.6 MB/s)
[windows-jdk8] [INFO] Downloading: https://repo.maven.apache.org/maven2/antlr/antlr/2.7.7/antlr-2.7.7.pom
[windows-jdk8] [INFO] Downloaded: https://repo.maven.apache.org/maven2/antlr/antlr/2.7.7/antlr-2.7.7.pom (632 B at 57 kB/s)
[windows-jdk8] [INFO] Downloading: https://repo.maven.apache.org/maven2/org/antlr/antlr4-runtime/4.5.3/antlr4-runtime-4.5.3.pom
[windows-jdk8] [INFO] Downloaded: https://repo.maven.apache.org/maven2/org/antlr/antlr4-runtime/4.5.3/antlr4-runtime-4.5.3.pom (2.3 kB at 210 kB/s)
[windows-jdk8] [INFO] Downloading: https://repo.maven.apache.org/maven2/org/antlr/antlr4-master/4.5.3/antlr4-master-4.5.3.pom
[windows-jdk8] [INFO] Downloaded: https://repo.maven.apache.org/maven2/org/antlr/antlr4-master/4.5.3/antlr4-master-4.5.3.pom (3.7 kB at 307 kB/s)
[windows-jdk8] [INFO] Downloading: https://repo.maven.apache.org/maven2/commons-beanutils/commons-beanutils/1.9.2/commons-beanutils-1.9.2.pom
[windows-jdk8] [INFO] Downloaded: https://repo.maven.apache.org/maven2/commons-beanutils/commons-beanutils/1.9.2/commons-beanutils-1.9.2.pom (14 kB at 1.1 MB/s)
[windows-jdk8] [INFO] Downloading: https://repo.maven.apache.org/maven2/org/apache/commons/commons-parent/33/commons-parent-33.pom
[windows-jdk8] [INFO] Downloaded: https://repo.maven.apache.org/maven2/org/apache/commons/commons-parent/33/commons-parent-33.pom (53 kB at 3.5 MB/s)
[windows-jdk8] [INFO] Downloading: https://repo.maven.apache.org/maven2/commons-cli/commons-cli/1.3.1/commons-cli-1.3.1.pom
[windows-jdk8] [INFO] Downloaded: https://repo.maven.apache.org/maven2/commons-cli/commons-cli/1.3.1/commons-cli-1.3.1.pom (10 kB at 866 kB/s)
[windows-jdk8] [INFO] Downloading: https://repo.maven.apache.org/maven2/com/google/guava/guava/19.0/guava-19.0.pom
[windows-jdk8] [INFO] Downloaded: https://repo.maven.apache.org/maven2/com/google/guava/guava/19.0/guava-19.0.pom (6.8 kB at 424 kB/s)
[windows-jdk8] [INFO] Downloading: https://repo.maven.apache.org/maven2/com/google/guava/guava-parent/19.0/guava-parent-19.0.pom
[windows-jdk8] [INFO] Downloaded: https://repo.maven.apache.org/maven2/com/google/guava/guava-parent/19.0/guava-parent-19.0.pom (9.9 kB at 760 kB/s)
[windows-jdk8] [INFO] Downloading: https://repo.maven.apache.org/maven2/org/sonatype/oss/oss-parent/7/oss-parent-7.pom
[windows-jdk8] [INFO] Downloaded: https://repo.maven.apache.org/maven2/org/sonatype/oss/oss-parent/7/oss-parent-7.pom (4.8 kB at 402 kB/s)
[windows-jdk8] [INFO] Downloading: https://repo.maven.apache.org/maven2/org/apache/maven/doxia/doxia-core/1.2/doxia-core-1.2.jar
[windows-jdk8] [INFO] Downloading: https://repo.maven.apache.org/maven2/commons-logging/commons-logging/1.0.4/commons-logging-1.0.4.jar
[windows-jdk8] [INFO] Downloading: https://repo.maven.apache.org/maven2/commons-digester/commons-digester/1.6/commons-digester-1.6.jar
[windows-jdk8] [INFO] Downloading: https://repo.maven.apache.org/maven2/org/apache/maven/doxia/doxia-integration-tools/1.6/doxia-integration-tools-1.6.jar
[windows-jdk8] [INFO] Downloading: https://repo.maven.apache.org/maven2/org/apache/maven/shared/maven-shared-resources/2/maven-shared-resources-2.jar
[windows-jdk8] [INFO] Downloaded: https://repo.maven.apache.org/maven2/commons-logging/commons-logging/1.0.4/commons-logging-1.0.4.jar (38 kB at 1.3 MB/s)
[windows-jdk8] [INFO] Downloading: https://repo.maven.apache.org/maven2/commons-io/commons-io/1.4/commons-io-1.4.jar
[windows-jdk8] [INFO] Downloaded: https://repo.maven.apache.org/maven2/commons-io/commons-io/1.4/commons-io-1.4.jar (109 kB at 2.4 MB/s)
[windows-jdk8] [INFO] Downloading: https://repo.maven.apache.org/maven2/org/codehaus/plexus/plexus-resources/1.1.0/plexus-resources-1.1.0.jar
[windows-jdk8] [INFO] Downloaded: https://repo.maven.apache.org/maven2/org/apache/maven/doxia/doxia-core/1.2/doxia-core-1.2.jar (154 kB at 2.3 MB/s)
[windows-jdk8] [INFO] Downloading: https://repo.maven.apache.org/maven2/com/puppycrawl/tools/checkstyle/6.18/checkstyle-6.18.jar
[windows-jdk8] [INFO] Downloaded: https://repo.maven.apache.org/maven2/commons-digester/commons-digester/1.6/commons-digester-1.6.jar (168 kB at 2.3 MB/s)
[windows-jdk8] [INFO] Downloading: https://repo.maven.apache.org/maven2/antlr/antlr/2.7.7/antlr-2.7.7.jar
[windows-jdk8] [INFO] Downloaded: https://repo.maven.apache.org/maven2/com/puppycrawl/tools/checkstyle/6.18/checkstyle-6.18.jar (1.2 MB at 9.3 MB/s)
[windows-jdk8] [INFO] Downloading: https://repo.maven.apache.org/maven2/org/antlr/antlr4-runtime/4.5.3/antlr4-runtime-4.5.3.jar
[windows-jdk8] [INFO] Downloaded: https://repo.maven.apache.org/maven2/org/apache/maven/shared/maven-shared-resources/2/maven-shared-resources-2.jar (13 kB at 93 kB/s)
[windows-jdk8] [INFO] Downloading: https://repo.maven.apache.org/maven2/commons-beanutils/commons-beanutils/1.9.2/commons-beanutils-1.9.2.jar
[windows-jdk8] [INFO] Downloaded: https://repo.maven.apache.org/maven2/org/codehaus/plexus/plexus-resources/1.1.0/plexus-resources-1.1.0.jar (23 kB at 135 kB/s)
[windows-jdk8] [INFO] Downloading: https://repo.maven.apache.org/maven2/commons-cli/commons-cli/1.3.1/commons-cli-1.3.1.jar
[windows-jdk8] [INFO] Downloaded: https://repo.maven.apache.org/maven2/commons-beanutils/commons-beanutils/1.9.2/commons-beanutils-1.9.2.jar (234 kB at 1.3 MB/s)
[windows-jdk8] [INFO] Downloading: https://repo.maven.apache.org/maven2/com/google/guava/guava/19.0/guava-19.0.jar
[windows-jdk8] [INFO] Downloaded: https://repo.maven.apache.org/maven2/antlr/antlr/2.7.7/antlr-2.7.7.jar (445 kB at 2.4 MB/s)
[windows-jdk8] [INFO] Downloading: https://repo.maven.apache.org/maven2/commons-lang/commons-lang/2.1/commons-lang-2.1.jar
[windows-jdk8] [INFO] Downloaded: https://repo.maven.apache.org/maven2/commons-cli/commons-cli/1.3.1/commons-cli-1.3.1.jar (53 kB at 255 kB/s)
[windows-jdk8] [INFO] Downloaded: https://repo.maven.apache.org/maven2/commons-lang/commons-lang/2.1/commons-lang-2.1.jar (208 kB at 931 kB/s)
[windows-jdk8] [INFO] Downloaded: https://repo.maven.apache.org/maven2/org/antlr/antlr4-runtime/4.5.3/antlr4-runtime-4.5.3.jar (302 kB at 1.2 MB/s)
[windows-jdk8] [INFO] Downloaded: https://repo.maven.apache.org/maven2/org/apache/maven/doxia/doxia-integration-tools/1.6/doxia-integration-tools-1.6.jar (45 kB at 170 kB/s)
[windows-jdk8] [INFO] Downloaded: https://repo.maven.apache.org/maven2/com/google/guava/guava/19.0/guava-19.0.jar (2.3 MB at 8.5 MB/s)
[windows-jdk8] [INFO] There are 6 errors reported by Checkstyle 6.18 with config/maven_checks.xml ruleset.
[windows-jdk8] [ERROR] src\main\java\org\apache\maven\plugins\javadoc\AbstractFixJavadocMojo.java:[3684,9] (modifier) RedundantModifier: Redundant 'public' modifier.
[windows-jdk8] [ERROR] src\main\java\org\apache\maven\plugins\javadoc\JavadocUtil.java:[1391,9] (modifier) RedundantModifier: Redundant 'public' modifier.
[windows-jdk8] [INFO] Ignored 4 errors, 2 violations remaining.
[windows-jdk8] [INFO] ------------------------------------------------------------------------
[windows-jdk8] [INFO] BUILD FAILURE
[windows-jdk8] [INFO] ------------------------------------------------------------------------
[windows-jdk8] [INFO] Total time: 06:47 min
[windows-jdk8] [INFO] Finished at: 2018-02-13T19:17:27Z
[windows-jdk8] [INFO] Final Memory: 68M/1095M
[windows-jdk8] [INFO] ------------------------------------------------------------------------
[windows-jdk8] [INFO] [jenkins-event-spy] Generated F:\jenkins\jenkins-slave\workspace\javadoc-plugin_MJAVADOC-515-B55ESPLZJXU5ECAWKWIVPDGGDPEBAS2CZXJ3KWVUGGBWF6MWWHIQ@tmp\withMavenf704595b\maven-spy-20180213-191040-3664677758894070543539.log
[windows-jdk8] [ERROR] Failed to execute goal org.apache.maven.plugins:maven-checkstyle-plugin:3.0.0:check (checkstyle-check) on project maven-javadoc-plugin: You have 2 Checkstyle violations. -> [Help 1]
[windows-jdk8] [ERROR]
[windows-jdk8] [ERROR] To see the full stack trace of the errors, re-run Maven with the -e switch.
[windows-jdk8] [ERROR] Re-run Maven using the -X switch to enable full debug logging.
[windows-jdk8] [ERROR]
[windows-jdk8] [ERROR] For more information about the errors and possible solutions, please read the following articles:
[windows-jdk8] [ERROR] [Help 1] http://cwiki.apache.org/confluence/display/MAVEN/MojoFailureException
[windows-jdk8] Picked up JAVA_TOOL_OPTIONS: -Dmaven.ext.class.path="f:\jenkins\jenkins-slave\workspace\javadoc-plugin_MJAVADOC-515-B55ESPLZJXU5ECAWKWIVPDGGDPEBAS2CZXJ3KWVUGGBWF6MWWHIQ@tmp\withMavenf704595b\pipeline-maven-spy.jar" -Dorg.jenkinsci.plugins.pipeline.maven.reportsFolder="f:\jenkins\jenkins-slave\workspace\javadoc-plugin_MJAVADOC-515-B55ESPLZJXU5ECAWKWIVPDGGDPEBAS2CZXJ3KWVUGGBWF6MWWHIQ@tmp\withMavenf704595b"
[Pipeline] [windows-jdk8] }
[Pipeline] [windows-jdk8] // dir
[windows-jdk9] [INFO] run post-build script verify.bsh
[windows-jdk9] [INFO]           MJAVADOC-137\pom.xml ............................. SUCCESS (13.4 s)
[windows-jdk9] [INFO] Building: MJAVADOC-172\pom.xml
[windows-jdk7] [INFO] run post-build script verify.bsh
[windows-jdk7] [INFO]           MJAVADOC-172\pom.xml ............................. SUCCESS (9.6 s)
[windows-jdk7] [INFO] Building: MJAVADOC-180\pom.xml
[windows-jdk9] [INFO] run post-build script verify.bsh
[windows-jdk9] [INFO]           MJAVADOC-172\pom.xml ............................. SUCCESS (10.4 s)
[windows-jdk9] [INFO] Building: MJAVADOC-180\pom.xml
[windows-jdk7] [INFO] run post-build script verify.bsh
[windows-jdk7] [INFO]           MJAVADOC-180\pom.xml ............................. SUCCESS (8.9 s)
[windows-jdk7] [INFO] Building: MJAVADOC-194\pom.xml
[windows-jdk9] [INFO] run post-build script verify.bsh
[windows-jdk9] [INFO]           MJAVADOC-180\pom.xml ............................. SUCCESS (9.9 s)
[windows-jdk9] [INFO] Building: MJAVADOC-194\pom.xml
[windows-jdk7] [INFO] run post-build script verify.bsh
[windows-jdk7] [INFO]           MJAVADOC-194\pom.xml ............................. SUCCESS (10.5 s)
[windows-jdk7] [INFO] Building: MJAVADOC-250\pom.xml
[Pipeline] [windows-jdk8] }
[windows-jdk8] [withMaven] Skip 'Generated Artifacts Publisher' disabled by configuration
[windows-jdk8] [withMaven] junitPublisher - Archive test results for Maven artifact org.apache.maven.plugins:maven-javadoc-plugin:3.0.1-SNAPSHOT generated by maven-surefire-plugin:test (default-test): m\target\surefire-reports\*.xml
[windows-jdk8] [withMaven] junitPublisher - Jenkins JUnit Attachments Plugin not found, can't publish test attachments.Recording test results
[windows-jdk8] [withMaven] Skip 'Findbugs Publisher' disabled by configuration
[windows-jdk8] [withMaven] Skip 'Open Task Scanner Publisher' disabled by configuration
[Pipeline] [windows-jdk8] // withMaven
[Pipeline] [windows-jdk8] echo
[windows-jdk8] [FAIL FAST] This is the first failure and likely root cause
[Pipeline] [windows-jdk8] }
[Pipeline] [windows-jdk8] // stage
[Pipeline] [windows-jdk8] }
[Pipeline] [windows-jdk8] // node
[Pipeline] [windows-jdk8] }
[windows-jdk7] Sending interrupt signal to process
[windows-jdk9] Sending interrupt signal to process
[windows-jdk8] Failed in branch windows-jdk8
[Pipeline] [linux-jdk7] // node
[Pipeline] [linux-jdk8] // node
[Pipeline] [linux-jdk9] // node
[Pipeline] [linux-jdk7] }
[linux-jdk7] Failed in branch linux-jdk7
[Pipeline] [linux-jdk8] }
[linux-jdk8] Failed in branch linux-jdk8
[Pipeline] [linux-jdk9] }
[linux-jdk9] Failed in branch linux-jdk9
[Pipeline] [windows-jdk7] }
[Pipeline] [windows-jdk7] // dir
[Pipeline] [windows-jdk7] }
[windows-jdk7] [withMaven] One or multiple Maven executions have been ignored by the Jenkins Pipeline Maven Plugin because they have been interrupted before completion (1). See Pipeline Maven Plugin FAQ for more details.
[Pipeline] [windows-jdk7] // withMaven
[Pipeline] [windows-jdk7] echo
[windows-jdk7] [FAIL FAST] windows-jdk8 had first failure, ignoring script returned exit code -1
[Pipeline] [windows-jdk7] }
[Pipeline] [windows-jdk7] // stage
[Pipeline] [windows-jdk7] }
[Pipeline] [windows-jdk7] // node
[Pipeline] [windows-jdk7] }
[windows-jdk9] After 10s process did not stop
[Pipeline] [windows-jdk9] }
[Pipeline] [windows-jdk9] // dir
[Pipeline] [windows-jdk9] }
[windows-jdk9] [withMaven] One or multiple Maven executions have been ignored by the Jenkins Pipeline Maven Plugin because they have been interrupted before completion (1). See Pipeline Maven Plugin FAQ for more details.
[Pipeline] [windows-jdk9] // withMaven
[Pipeline] [windows-jdk9] echo
[windows-jdk9] [FAIL FAST] windows-jdk8 had first failure, ignoring null
[Pipeline] [windows-jdk9] }
[Pipeline] [windows-jdk9] // stage
[Pipeline] [windows-jdk9] }
[Pipeline] [windows-jdk9] // node
[Pipeline] [windows-jdk9] }
[Pipeline] // parallel
[Pipeline] echo
***** FAST FAILURE *****

Fast failure triggered by windows-jdk8

***** FAST FAILURE *****
[Pipeline] stage
[Pipeline] { (Notifications)
[Pipeline] echo
Build result: FAILURE
[Pipeline] jiraIssueSelector
Reply | Threaded
Open this post in threaded view
|

Build failed in Jenkins: Maven TLP » maven-javadoc-plugin » MJAVADOC-515 #2

Apache Jenkins Server-2
See https://builds.apache.org/job/maven-box/job/maven-javadoc-plugin/job/MJAVADOC-515/2/

Changes:

* [MJAVADOC-515] - Upgrade parent to 31  o Fixed checkstyle issues related
* [MJAVADOC-515] - Upgrade parent to 31  o Fixed checkstyle issues related

No tests ran.

Build log:
[...truncated 48.87 KB...]
[windows-jdk9] [INFO] Adding ignore: module-info
[windows-jdk7] [INFO] /f:/jenkins/jenkins-slave/workspace/javadoc-plugin_MJAVADOC-515-B55ESPLZJXU5ECAWKWIVPDGGDPEBAS2CZXJ3KWVUGGBWF6MWWHIQ/m/src/main/java/org/apache/maven/plugins/javadoc/JavadocReport.java: Some input files use or override a deprecated API.
[windows-jdk7] [INFO] /f:/jenkins/jenkins-slave/workspace/javadoc-plugin_MJAVADOC-515-B55ESPLZJXU5ECAWKWIVPDGGDPEBAS2CZXJ3KWVUGGBWF6MWWHIQ/m/src/main/java/org/apache/maven/plugins/javadoc/JavadocReport.java: Recompile with -Xlint:deprecation for details.
[windows-jdk7] [INFO] /f:/jenkins/jenkins-slave/workspace/javadoc-plugin_MJAVADOC-515-B55ESPLZJXU5ECAWKWIVPDGGDPEBAS2CZXJ3KWVUGGBWF6MWWHIQ/m/src/main/java/org/apache/maven/plugins/javadoc/AbstractJavadocMojo.java: Some input files use unchecked or unsafe operations.
[windows-jdk7] [INFO] /f:/jenkins/jenkins-slave/workspace/javadoc-plugin_MJAVADOC-515-B55ESPLZJXU5ECAWKWIVPDGGDPEBAS2CZXJ3KWVUGGBWF6MWWHIQ/m/src/main/java/org/apache/maven/plugins/javadoc/AbstractJavadocMojo.java: Recompile with -Xlint:unchecked for details.
[windows-jdk7] [INFO]
[windows-jdk7] [INFO] --- maven-plugin-plugin:3.5:descriptor (default-descriptor) @ maven-javadoc-plugin ---
[windows-jdk7] [INFO] Using 'UTF-8' encoding to read mojo source files.
[windows-jdk8] [INFO]
[windows-jdk8] [INFO] --- maven-resources-plugin:3.0.2:resources (default-resources) @ maven-javadoc-plugin ---
[windows-jdk8] [INFO] Using 'UTF-8' encoding to copy filtered resources.
[windows-jdk8] [INFO] Copying 22 resources
[windows-jdk8] [INFO] Copying 3 resources
[windows-jdk8] [INFO]
[windows-jdk8] [INFO] --- maven-compiler-plugin:3.7.0:compile (default-compile) @ maven-javadoc-plugin ---
[windows-jdk8] [INFO] Changes detected - recompiling the module!
[windows-jdk8] [INFO] Compiling 36 source files to f:\jenkins\jenkins-slave\workspace\javadoc-plugin_MJAVADOC-515-B55ESPLZJXU5ECAWKWIVPDGGDPEBAS2CZXJ3KWVUGGBWF6MWWHIQ\m\target\classes
[windows-jdk7] [INFO] java-annotations mojo extractor found 15 mojo descriptors.
[windows-jdk9] [INFO]
[windows-jdk9] [INFO] --- maven-enforcer-plugin:1.4.1:enforce (ban-known-bad-maven-versions) @ maven-javadoc-plugin ---
[windows-jdk9] [INFO]
[windows-jdk9] [INFO] --- maven-enforcer-plugin:1.4.1:enforce (ensure-no-container-api) @ maven-javadoc-plugin ---
[windows-jdk7] [INFO] java-javadoc mojo extractor found 0 mojo descriptor.
[windows-jdk7] [INFO] ------------------------------------------------------------------------
[windows-jdk7] [INFO] BUILD FAILURE
[windows-jdk7] [INFO] ------------------------------------------------------------------------
[windows-jdk7] [INFO] Total time: 19.847 s
[windows-jdk7] [INFO] Finished at: 2018-02-13T21:48:03Z
[windows-jdk7] [INFO] Final Memory: 60M/1011M
[windows-jdk7] [INFO] ------------------------------------------------------------------------
[windows-jdk7] [INFO] [jenkins-event-spy] Generated F:\jenkins\jenkins-slave\workspace\javadoc-plugin_MJAVADOC-515-B55ESPLZJXU5ECAWKWIVPDGGDPEBAS2CZXJ3KWVUGGBWF6MWWHIQ@tmp\withMavenbb857d77\maven-spy-20180213-214742-8518861533345717530391.log
[windows-jdk7] [ERROR] Failed to execute goal org.apache.maven.plugins:maven-plugin-plugin:3.5:descriptor (default-descriptor) on project maven-javadoc-plugin: Execution default-descriptor of goal org.apache.maven.plugins:maven-plugin-plugin:3.5:descriptor failed. NoSuchElementException -> [Help 1]
[windows-jdk7] [ERROR]
[windows-jdk7] [ERROR] To see the full stack trace of the errors, re-run Maven with the -e switch.
[windows-jdk7] [ERROR] Re-run Maven using the -X switch to enable full debug logging.
[windows-jdk7] [ERROR]
[windows-jdk7] [ERROR] For more information about the errors and possible solutions, please read the following articles:
[windows-jdk7] [ERROR] [Help 1] http://cwiki.apache.org/confluence/display/MAVEN/PluginExecutionException
[windows-jdk7] Picked up JAVA_TOOL_OPTIONS: -Dmaven.ext.class.path="f:\jenkins\jenkins-slave\workspace\javadoc-plugin_MJAVADOC-515-B55ESPLZJXU5ECAWKWIVPDGGDPEBAS2CZXJ3KWVUGGBWF6MWWHIQ@tmp\withMavenbb857d77\pipeline-maven-spy.jar" -Dorg.jenkinsci.plugins.pipeline.maven.reportsFolder="f:\jenkins\jenkins-slave\workspace\javadoc-plugin_MJAVADOC-515-B55ESPLZJXU5ECAWKWIVPDGGDPEBAS2CZXJ3KWVUGGBWF6MWWHIQ@tmp\withMavenbb857d77"
[windows-jdk9] [INFO]
[windows-jdk9] [INFO] --- apache-rat-plugin:0.12:check (rat-check) @ maven-javadoc-plugin ---
[windows-jdk9] [INFO] Enabled default license matchers.
[windows-jdk9] [INFO] Will parse SCM ignores for exclusions...
[windows-jdk9] [INFO] Parsing exclusions from f:\jenkins\jenkins-slave\workspace\javadoc-plugin_MJAVADOC-515-B55ESPLZJXU5ECAWKWIVPDGGDPEBAS2CZXJ3KWVUGGBWF6MWWHIQ\m\.gitignore
[windows-jdk9] [INFO] Finished adding exclusions from SCM ignore files.
[windows-jdk9] [INFO] 72 implicit excludes (use -debug for more details).
[windows-jdk9] [INFO] Exclude: **/*.psd
[windows-jdk9] [INFO] Exclude: **/*.sha1
[windows-jdk9] [INFO] Exclude: **/*package-list*
[windows-jdk9] [INFO] Exclude: src/main/resources/org/apache/maven/plugins/javadoc/frame-injection-fix.txt
[windows-jdk9] [INFO] Exclude: src/test/resources/unit/test-javadoc-test/junit/junit/3.8.1/junit-3.8.1.pom
[windows-jdk9] [INFO] Exclude: javadoc-options-javadoc-resources.xml
[windows-jdk9] [INFO] Exclude: .repository/**
[windows-jdk9] [INFO] Exclude: .maven/spy.log
[windows-jdk9] [INFO] Exclude: dependency-reduced-pom.xml
[windows-jdk9] [INFO] Exclude: .java-version
[windows-jdk9] [INFO] 577 resources included (use -debug for more details)
[Pipeline] [windows-jdk7] }
[Pipeline] [windows-jdk7] // dir
[windows-jdk8] [INFO] /f:/jenkins/jenkins-slave/workspace/javadoc-plugin_MJAVADOC-515-B55ESPLZJXU5ECAWKWIVPDGGDPEBAS2CZXJ3KWVUGGBWF6MWWHIQ/m/src/main/java/org/apache/maven/plugins/javadoc/JavadocUtil.java: Some input files use or override a deprecated API.
[windows-jdk8] [INFO] /f:/jenkins/jenkins-slave/workspace/javadoc-plugin_MJAVADOC-515-B55ESPLZJXU5ECAWKWIVPDGGDPEBAS2CZXJ3KWVUGGBWF6MWWHIQ/m/src/main/java/org/apache/maven/plugins/javadoc/JavadocUtil.java: Recompile with -Xlint:deprecation for details.
[windows-jdk8] [INFO] /f:/jenkins/jenkins-slave/workspace/javadoc-plugin_MJAVADOC-515-B55ESPLZJXU5ECAWKWIVPDGGDPEBAS2CZXJ3KWVUGGBWF6MWWHIQ/m/src/main/java/org/apache/maven/plugins/javadoc/AbstractJavadocMojo.java: Some input files use unchecked or unsafe operations.
[windows-jdk8] [INFO] /f:/jenkins/jenkins-slave/workspace/javadoc-plugin_MJAVADOC-515-B55ESPLZJXU5ECAWKWIVPDGGDPEBAS2CZXJ3KWVUGGBWF6MWWHIQ/m/src/main/java/org/apache/maven/plugins/javadoc/AbstractJavadocMojo.java: Recompile with -Xlint:unchecked for details.
[windows-jdk8] [INFO]
[windows-jdk8] [INFO] --- maven-plugin-plugin:3.5:descriptor (default-descriptor) @ maven-javadoc-plugin ---
[windows-jdk8] [INFO] Using 'UTF-8' encoding to read mojo source files.
[windows-jdk8] [INFO] java-javadoc mojo extractor found 0 mojo descriptor.
[windows-jdk8] [INFO] java-annotations mojo extractor found 15 mojo descriptors.
[windows-jdk8] [INFO]
[windows-jdk8] [INFO] --- plexus-component-metadata:1.7.1:generate-metadata (default) @ maven-javadoc-plugin ---
[windows-jdk8] [INFO] Discovered 1 component descriptors(s)
[windows-jdk8] [INFO]
[windows-jdk8] [INFO] --- maven-resources-plugin:3.0.2:testResources (default-testResources) @ maven-javadoc-plugin ---
[windows-jdk8] [INFO] Using 'UTF-8' encoding to copy filtered resources.
[windows-jdk8] [INFO] Copying 192 resources
[windows-jdk9] [INFO] Rat check: Summary over all files. Unapproved: 0, unknown: 0, generated: 0, approved: 549 licenses.
[windows-jdk9] [INFO]
[windows-jdk9] [INFO] --- maven-plugin-plugin:3.5:helpmojo (generate-helpmojo) @ maven-javadoc-plugin ---
[windows-jdk9] [INFO] Downloading: https://repo.maven.apache.org/maven2/org/ow2/asm/asm/6.0_ALPHA/asm-6.0_ALPHA.pom
[windows-jdk9] [INFO] Downloaded: https://repo.maven.apache.org/maven2/org/ow2/asm/asm/6.0_ALPHA/asm-6.0_ALPHA.pom (1.9 kB at 6.4 kB/s)
[windows-jdk9] [INFO] Downloading: https://repo.maven.apache.org/maven2/org/ow2/asm/asm-parent/6.0_ALPHA/asm-parent-6.0_ALPHA.pom
[windows-jdk9] [INFO] Downloaded: https://repo.maven.apache.org/maven2/org/ow2/asm/asm-parent/6.0_ALPHA/asm-parent-6.0_ALPHA.pom (5.5 kB at 289 kB/s)
[windows-jdk9] [INFO] Downloading: https://repo.maven.apache.org/maven2/org/ow2/asm/asm-commons/6.0_ALPHA/asm-commons-6.0_ALPHA.pom
[windows-jdk9] [INFO] Downloaded: https://repo.maven.apache.org/maven2/org/ow2/asm/asm-commons/6.0_ALPHA/asm-commons-6.0_ALPHA.pom (2.1 kB at 131 kB/s)
[windows-jdk9] [INFO] Downloading: https://repo.maven.apache.org/maven2/org/ow2/asm/asm-tree/6.0_ALPHA/asm-tree-6.0_ALPHA.pom
[windows-jdk9] [INFO] Downloaded: https://repo.maven.apache.org/maven2/org/ow2/asm/asm-tree/6.0_ALPHA/asm-tree-6.0_ALPHA.pom (2.1 kB at 95 kB/s)
[windows-jdk8] [INFO] Copying 3 resources
[windows-jdk8] [INFO]
[windows-jdk8] [INFO] --- maven-compiler-plugin:3.7.0:testCompile (default-testCompile) @ maven-javadoc-plugin ---
[windows-jdk8] [INFO] Changes detected - recompiling the module!
[windows-jdk8] [INFO] Compiling 50 source files to f:\jenkins\jenkins-slave\workspace\javadoc-plugin_MJAVADOC-515-B55ESPLZJXU5ECAWKWIVPDGGDPEBAS2CZXJ3KWVUGGBWF6MWWHIQ\m\target\test-classes
[windows-jdk8] [INFO] /f:/jenkins/jenkins-slave/workspace/javadoc-plugin_MJAVADOC-515-B55ESPLZJXU5ECAWKWIVPDGGDPEBAS2CZXJ3KWVUGGBWF6MWWHIQ/m/src/test/java/org/apache/maven/plugins/javadoc/AbstractJavadocMojoTest.java: Some input files use or override a deprecated API.
[windows-jdk8] [INFO] /f:/jenkins/jenkins-slave/workspace/javadoc-plugin_MJAVADOC-515-B55ESPLZJXU5ECAWKWIVPDGGDPEBAS2CZXJ3KWVUGGBWF6MWWHIQ/m/src/test/java/org/apache/maven/plugins/javadoc/AbstractJavadocMojoTest.java: Recompile with -Xlint:deprecation for details.
[windows-jdk8] [INFO]
[windows-jdk8] [INFO] --- plexus-component-metadata:1.7.1:generate-test-metadata (default) @ maven-javadoc-plugin ---
[windows-jdk9] [INFO] Downloading: https://repo.maven.apache.org/maven2/org/ow2/asm/asm/6.0_ALPHA/asm-6.0_ALPHA.jar
[windows-jdk9] [INFO] Downloading: https://repo.maven.apache.org/maven2/org/ow2/asm/asm-tree/6.0_ALPHA/asm-tree-6.0_ALPHA.jar
[windows-jdk9] [INFO] Downloading: https://repo.maven.apache.org/maven2/org/ow2/asm/asm-commons/6.0_ALPHA/asm-commons-6.0_ALPHA.jar
[windows-jdk9] [INFO] Downloaded: https://repo.maven.apache.org/maven2/org/ow2/asm/asm/6.0_ALPHA/asm-6.0_ALPHA.jar (56 kB at 542 kB/s)
[windows-jdk9] [INFO] Downloaded: https://repo.maven.apache.org/maven2/org/ow2/asm/asm-commons/6.0_ALPHA/asm-commons-6.0_ALPHA.jar (49 kB at 244 kB/s)
[windows-jdk9] [INFO] Downloaded: https://repo.maven.apache.org/maven2/org/ow2/asm/asm-tree/6.0_ALPHA/asm-tree-6.0_ALPHA.jar (32 kB at 159 kB/s)
[windows-jdk8] [INFO]
[windows-jdk8] [INFO] --- maven-surefire-plugin:2.20.1:test (default-test) @ maven-javadoc-plugin ---
[windows-jdk8] [INFO]
[windows-jdk8] [INFO] -------------------------------------------------------
[windows-jdk8] [INFO]  T E S T S
[windows-jdk8] [INFO] -------------------------------------------------------
[windows-jdk9] [INFO] Using 'UTF-8' encoding to read mojo source files.
[windows-jdk9] [INFO] java-javadoc mojo extractor found 0 mojo descriptor.
[windows-jdk9] [INFO] java-annotations mojo extractor found 0 mojo descriptor.
[windows-jdk9] [INFO]
[windows-jdk9] [INFO] --- modello-maven-plugin:1.9.1:java (default) @ maven-javadoc-plugin ---
[windows-jdk8] [INFO] Running org.apache.maven.plugins.javadoc.AbstractFixJavadocMojoTest
[windows-jdk8] [INFO] Tests run: 10, Failures: 0, Errors: 0, Skipped: 0, Time elapsed: 0.031 s - in org.apache.maven.plugins.javadoc.AbstractFixJavadocMojoTest
[windows-jdk8] [INFO] Running org.apache.maven.plugins.javadoc.AbstractJavadocMojoTest
[windows-jdk9] [INFO] outputDirectory: f:\jenkins\jenkins-slave\workspace\javadoc-plugin_MJAVADOC-515-B55ESPLZJXU5ECAWKWIVPDGGDPEBAS2CZXJ3KWVUGGBWF6MWWHIQ\m\target\generated-sources\modello
[windows-jdk9] [INFO] Working on model: src/main/mdo/javadocOptions.mdo
[windows-jdk9] [INFO] Generating current version: 1.1.0
[windows-jdk9] [INFO]
[windows-jdk9] [INFO] --- modello-maven-plugin:1.9.1:xpp3-reader (default) @ maven-javadoc-plugin ---
[windows-jdk9] [INFO] outputDirectory: f:\jenkins\jenkins-slave\workspace\javadoc-plugin_MJAVADOC-515-B55ESPLZJXU5ECAWKWIVPDGGDPEBAS2CZXJ3KWVUGGBWF6MWWHIQ\m\target\generated-sources\modello
[windows-jdk9] [INFO] Working on model: src/main/mdo/javadocOptions.mdo
[windows-jdk9] [INFO] Generating current version: 1.1.0
[windows-jdk9] [INFO]
[windows-jdk9] [INFO] --- modello-maven-plugin:1.9.1:xpp3-writer (default) @ maven-javadoc-plugin ---
[windows-jdk9] [INFO] outputDirectory: f:\jenkins\jenkins-slave\workspace\javadoc-plugin_MJAVADOC-515-B55ESPLZJXU5ECAWKWIVPDGGDPEBAS2CZXJ3KWVUGGBWF6MWWHIQ\m\target\generated-sources\modello
[windows-jdk9] [INFO] Working on model: src/main/mdo/javadocOptions.mdo
[windows-jdk9] [INFO] Generating current version: 1.1.0
[windows-jdk9] [INFO]
[windows-jdk9] [INFO] --- maven-remote-resources-plugin:1.5:process (process-resource-bundles) @ maven-javadoc-plugin ---
[windows-jdk8] [INFO] Tests run: 1, Failures: 0, Errors: 0, Skipped: 0, Time elapsed: 1.219 s - in org.apache.maven.plugins.javadoc.AbstractJavadocMojoTest
[windows-jdk8] [INFO] Running org.apache.maven.plugins.javadoc.AggregatorJavadocReportTest
[windows-jdk9] [INFO]
[windows-jdk9] [INFO] --- maven-resources-plugin:3.0.2:resources (default-resources) @ maven-javadoc-plugin ---
[windows-jdk9] [INFO] Using 'UTF-8' encoding to copy filtered resources.
[windows-jdk9] [INFO] Copying 22 resources
[windows-jdk9] [INFO] Copying 3 resources
[windows-jdk9] [INFO]
[windows-jdk9] [INFO] --- maven-compiler-plugin:3.7.0:compile (default-compile) @ maven-javadoc-plugin ---
[windows-jdk8] [ERROR] no reactor project: org.apache.maven.plugins.maven-javadoc-plugin.unit:aggregate-resources-test
[windows-jdk8] [ERROR] no reactor project: org.apache.maven.plugins.maven-javadoc-plugin.unit:project1
[windows-jdk8] [ERROR] no reactor project: org.apache.maven.plugins.maven-javadoc-plugin.unit:project2
[windows-jdk9] [INFO] Changes detected - recompiling the module!
[windows-jdk9] [INFO] Compiling 36 source files to f:\jenkins\jenkins-slave\workspace\javadoc-plugin_MJAVADOC-515-B55ESPLZJXU5ECAWKWIVPDGGDPEBAS2CZXJ3KWVUGGBWF6MWWHIQ\m\target\classes
[windows-jdk8] [INFO]
[windows-jdk8] 1 warning
[windows-jdk8] [WARNING] Javadoc Warnings
[windows-jdk8] [WARNING] javadoc: warning - Multiple sources of package comments found for package "resources.test"
[windows-jdk8] [WARNING] Picked up JAVA_TOOL_OPTIONS: -Dmaven.ext.class.path="f:\jenkins\jenkins-slave\workspace\javadoc-plugin_MJAVADOC-515-B55ESPLZJXU5ECAWKWIVPDGGDPEBAS2CZXJ3KWVUGGBWF6MWWHIQ@tmp\withMaven4cbe00a0\pipeline-maven-spy.jar" -Dorg.jenkinsci.plugins.pipeline.maven.reportsFolder="f:\jenkins\jenkins-slave\workspace\javadoc-plugin_MJAVADOC-515-B55ESPLZJXU5ECAWKWIVPDGGDPEBAS2CZXJ3KWVUGGBWF6MWWHIQ@tmp\withMaven4cbe00a0"
[windows-jdk9] [INFO] /F:/jenkins/jenkins-slave/workspace/javadoc-plugin_MJAVADOC-515-B55ESPLZJXU5ECAWKWIVPDGGDPEBAS2CZXJ3KWVUGGBWF6MWWHIQ/m/src/main/java/org/apache/maven/plugins/javadoc/JavadocUtil.java: Some input files use or override a deprecated API.
[windows-jdk9] [INFO] /F:/jenkins/jenkins-slave/workspace/javadoc-plugin_MJAVADOC-515-B55ESPLZJXU5ECAWKWIVPDGGDPEBAS2CZXJ3KWVUGGBWF6MWWHIQ/m/src/main/java/org/apache/maven/plugins/javadoc/JavadocUtil.java: Recompile with -Xlint:deprecation for details.
[windows-jdk9] [INFO] /F:/jenkins/jenkins-slave/workspace/javadoc-plugin_MJAVADOC-515-B55ESPLZJXU5ECAWKWIVPDGGDPEBAS2CZXJ3KWVUGGBWF6MWWHIQ/m/src/main/java/org/apache/maven/plugins/javadoc/AbstractJavadocMojo.java: Some input files use unchecked or unsafe operations.
[windows-jdk9] [INFO] /F:/jenkins/jenkins-slave/workspace/javadoc-plugin_MJAVADOC-515-B55ESPLZJXU5ECAWKWIVPDGGDPEBAS2CZXJ3KWVUGGBWF6MWWHIQ/m/src/main/java/org/apache/maven/plugins/javadoc/AbstractJavadocMojo.java: Recompile with -Xlint:unchecked for details.
[windows-jdk9] [INFO]
[windows-jdk9] [INFO] --- maven-plugin-plugin:3.5:descriptor (default-descriptor) @ maven-javadoc-plugin ---
[windows-jdk9] [INFO] Using 'UTF-8' encoding to read mojo source files.
[windows-jdk9] [INFO] java-javadoc mojo extractor found 0 mojo descriptor.
[windows-jdk8] [ERROR] no reactor project: org.apache.maven.plugins.maven-javadoc-plugin.unit:aggregate-test
[windows-jdk8] [ERROR] no reactor project: org.apache.maven.plugins.maven-javadoc-plugin.unit:aggregate-test-project1
[windows-jdk8] [ERROR] no reactor project: org.apache.maven.plugins.maven-javadoc-plugin.unit:aggregate-test-project2
[windows-jdk9] [INFO] java-annotations mojo extractor found 15 mojo descriptors.
[windows-jdk9] [INFO]
[windows-jdk9] [INFO] --- plexus-component-metadata:1.7.1:generate-metadata (default) @ maven-javadoc-plugin ---
[windows-jdk9] [INFO] Discovered 1 component descriptors(s)
[windows-jdk9] [INFO]
[windows-jdk9] [INFO] --- maven-resources-plugin:3.0.2:testResources (default-testResources) @ maven-javadoc-plugin ---
[windows-jdk9] [INFO] Using 'UTF-8' encoding to copy filtered resources.
[windows-jdk9] [INFO] Copying 192 resources
[windows-jdk8] [WARNING] Javadoc Warnings
[windows-jdk8] [WARNING] Picked up JAVA_TOOL_OPTIONS: -Dmaven.ext.class.path="f:\jenkins\jenkins-slave\workspace\javadoc-plugin_MJAVADOC-515-B55ESPLZJXU5ECAWKWIVPDGGDPEBAS2CZXJ3KWVUGGBWF6MWWHIQ@tmp\withMaven4cbe00a0\pipeline-maven-spy.jar" -Dorg.jenkinsci.plugins.pipeline.maven.reportsFolder="f:\jenkins\jenkins-slave\workspace\javadoc-plugin_MJAVADOC-515-B55ESPLZJXU5ECAWKWIVPDGGDPEBAS2CZXJ3KWVUGGBWF6MWWHIQ@tmp\withMaven4cbe00a0"
[windows-jdk8] [INFO] Tests run: 2, Failures: 0, Errors: 0, Skipped: 0, Time elapsed: 8.103 s - in org.apache.maven.plugins.javadoc.AggregatorJavadocReportTest
[windows-jdk8] [INFO] Running org.apache.maven.plugins.javadoc.FixJavadocMojoTest
[windows-jdk9] [INFO] Copying 3 resources
[windows-jdk9] [INFO]
[windows-jdk9] [INFO] --- maven-compiler-plugin:3.7.0:testCompile (default-testCompile) @ maven-javadoc-plugin ---
[windows-jdk9] [INFO] Changes detected - recompiling the module!
[windows-jdk9] [INFO] Compiling 50 source files to f:\jenkins\jenkins-slave\workspace\javadoc-plugin_MJAVADOC-515-B55ESPLZJXU5ECAWKWIVPDGGDPEBAS2CZXJ3KWVUGGBWF6MWWHIQ\m\target\test-classes
[Pipeline] [windows-jdk7] }
[windows-jdk7] [withMaven] Skip 'Generated Artifacts Publisher' disabled by configuration
[windows-jdk7] [withMaven] Skip 'Findbugs Publisher' disabled by configuration
[windows-jdk7] [withMaven] Skip 'Open Task Scanner Publisher' disabled by configuration
[Pipeline] [windows-jdk7] // withMaven
[Pipeline] [windows-jdk7] echo
[windows-jdk7] [FAIL FAST] This is the first failure and likely root cause
[Pipeline] [windows-jdk7] }
[Pipeline] [windows-jdk7] // stage
[Pipeline] [windows-jdk7] }
[Pipeline] [windows-jdk7] // node
[Pipeline] [windows-jdk7] }
[windows-jdk8] Sending interrupt signal to process
[windows-jdk9] [INFO] /F:/jenkins/jenkins-slave/workspace/javadoc-plugin_MJAVADOC-515-B55ESPLZJXU5ECAWKWIVPDGGDPEBAS2CZXJ3KWVUGGBWF6MWWHIQ/m/src/test/java/org/apache/maven/plugins/javadoc/AbstractJavadocMojoTest.java: Some input files use or override a deprecated API.
[windows-jdk9] [INFO] /F:/jenkins/jenkins-slave/workspace/javadoc-plugin_MJAVADOC-515-B55ESPLZJXU5ECAWKWIVPDGGDPEBAS2CZXJ3KWVUGGBWF6MWWHIQ/m/src/test/java/org/apache/maven/plugins/javadoc/AbstractJavadocMojoTest.java: Recompile with -Xlint:deprecation for details.
[windows-jdk9] [INFO]
[windows-jdk9] [INFO] --- plexus-component-metadata:1.7.1:generate-test-metadata (default) @ maven-javadoc-plugin ---
[windows-jdk9] [INFO]
[windows-jdk9] [INFO] --- maven-surefire-plugin:2.20.1:test (default-test) @ maven-javadoc-plugin ---
[windows-jdk7] Failed in branch windows-jdk7
[windows-jdk9] [INFO]
[windows-jdk9] [INFO] -------------------------------------------------------
[windows-jdk9] [INFO]  T E S T S
[windows-jdk9] [INFO] -------------------------------------------------------
[windows-jdk9] Sending interrupt signal to process
[Pipeline] [linux-jdk7] // node
[Pipeline] [linux-jdk8] // node
[Pipeline] [linux-jdk9] // node
[Pipeline] [linux-jdk7] }
[linux-jdk7] Failed in branch linux-jdk7
[Pipeline] [linux-jdk8] }
[linux-jdk8] Failed in branch linux-jdk8
[Pipeline] [linux-jdk9] }
[linux-jdk9] Failed in branch linux-jdk9
[Pipeline] [windows-jdk8] }
[windows-jdk9] [INFO] Running org.apache.maven.plugins.javadoc.AbstractFixJavadocMojoTest
[windows-jdk9] [INFO] Tests run: 10, Failures: 0, Errors: 0, Skipped: 0, Time elapsed: 0.118 s - in org.apache.maven.plugins.javadoc.AbstractFixJavadocMojoTest
[windows-jdk9] [INFO] Running org.apache.maven.plugins.javadoc.AbstractJavadocMojoTest
[Pipeline] [windows-jdk8] // dir
[Pipeline] [windows-jdk8] }
[windows-jdk8] [withMaven] One or multiple Maven executions have been ignored by the Jenkins Pipeline Maven Plugin because they have been interrupted before completion (1). See Pipeline Maven Plugin FAQ for more details.
[Pipeline] [windows-jdk8] // withMaven
[Pipeline] [windows-jdk8] }
[Pipeline] [windows-jdk8] // stage
[Pipeline] [windows-jdk8] }
[Pipeline] [windows-jdk8] // node
[Pipeline] [windows-jdk8] }
[Pipeline] [windows-jdk9] }
[Pipeline] [windows-jdk9] // dir
[Pipeline] [windows-jdk9] }
[windows-jdk9] [withMaven] One or multiple Maven executions have been ignored by the Jenkins Pipeline Maven Plugin because they have been interrupted before completion (1). See Pipeline Maven Plugin FAQ for more details.
[Pipeline] [windows-jdk9] // withMaven
[Pipeline] [windows-jdk9] echo
[windows-jdk9] [FAIL FAST] windows-jdk7 had first failure, ignoring script returned exit code -1
[Pipeline] [windows-jdk9] }
[Pipeline] [windows-jdk9] // stage
[Pipeline] [windows-jdk9] }
[Pipeline] [windows-jdk9] // node
[Pipeline] [windows-jdk9] }
[Pipeline] // parallel
[Pipeline] echo
***** FAST FAILURE *****

Fast failure triggered by windows-jdk7

***** FAST FAILURE *****
[Pipeline] stage
[Pipeline] { (Notifications)
[Pipeline] echo
Build result: FAILURE
[Pipeline] jiraIssueSelector
[Pipeline] jiraComment
Reply | Threaded
Open this post in threaded view
|

Build succeeded in Jenkins: Maven TLP » maven-javadoc-plugin » MJAVADOC-515 #3

Apache Jenkins Server-2