Build failed in Jenkins: Maven TLP » maven-jarsigner-plugin » master #28

classic Classic list List threaded Threaded
3 messages Options
Reply | Threaded
Open this post in threaded view
|

Build failed in Jenkins: Maven TLP » maven-jarsigner-plugin » master #28

Apache Jenkins Server-2
See https://builds.apache.org/job/maven-box/job/maven-jarsigner-plugin/job/master/28/

Changes:

* Removed exclusion for problematic node cause the node is back online.
* reduce the history archiving
* reduce the history archiving
* increase a bit archiving
* increase a bit archiving
* Activate sonarqube on first project
* Disable sonar:sonar for now
* use publisherStrategy: 'EXPLICIT' to avoid non used publishers
* [INFRA-17514] Fix file separator + add other locations for workspaces
* fix indent
* use a special local repo to have a bit of caching

No tests ran.

Build log:
[...truncated 292.09 KB...]
[Pipeline] [windows-jdk11-m3.5.x_build] }
[Pipeline] [windows-jdk7-m3.3.x_build] cleanWs
[Pipeline] [windows-jdk7-m3.2.x_build] cleanWs
[Pipeline] [linux-jdk7-m3.5.x_build] cleanWs
[Pipeline] [linux-jdk7-m3.3.x_build] }
[Pipeline] [linux-jdk8-m3.5.x_build] }
[Pipeline] [linux-jdk11-m3.5.x_build] }
[Pipeline] [linux-jdk7-m3.2.x_build] // node
[windows-jdk7-m3.3.x_build] [WS-CLEANUP] Deleting project workspace...Cannot delete workspace :remote file operation failed: f:\jenkins\jenkins-slave\workspace\ven-jarsigner-plugin_master-WSGRVLKXZECZGP32RZT4MBI3KFMRMRWSXLO7SDY6D4ICDVYPA7RA@2@2 at hudson.remoting.Channel@4ee2423:JNLP4-connect connection from 37.48.69.226/37.48.69.226:64887: java.nio.file.AccessDeniedException: f:\jenkins\jenkins-slave\workspace\ven-jarsigner-plugin_master-WSGRVLKXZECZGP32RZT4MBI3KFMRMRWSXLO7SDY6D4ICDVYPA7RA@2@2 -> f:\jenkins\jenkins-slave\workspace\ven-jarsigner-plugin_master-WSGRVLKXZECZGP32RZT4MBI3KFMRMRWSXLO7SDY6D4ICDVYPA7RA@2@2_ws-cleanup_1546209087028
[windows-jdk7-m3.2.x_build] [WS-CLEANUP] Deleting project workspace...Cannot delete workspace :remote file operation failed: f:\jenkins\jenkins-slave\workspace\ven-jarsigner-plugin_master-WSGRVLKXZECZGP32RZT4MBI3KFMRMRWSXLO7SDY6D4ICDVYPA7RA@3 at hudson.remoting.Channel@4ee2423:JNLP4-connect connection from 37.48.69.226/37.48.69.226:64887: java.nio.file.AccessDeniedException: f:\jenkins\jenkins-slave\workspace\ven-jarsigner-plugin_master-WSGRVLKXZECZGP32RZT4MBI3KFMRMRWSXLO7SDY6D4ICDVYPA7RA@3 -> f:\jenkins\jenkins-slave\workspace\ven-jarsigner-plugin_master-WSGRVLKXZECZGP32RZT4MBI3KFMRMRWSXLO7SDY6D4ICDVYPA7RA@3_ws-cleanup_1546209087032
[Pipeline] [windows-jdk11-m3.5.x_build] // ws
[Pipeline] [linux-jdk7-m3.3.x_build] // stage
[Pipeline] [linux-jdk8-m3.5.x_build] // stage
[Pipeline] [linux-jdk11-m3.5.x_build] // stage
[Pipeline] [linux-jdk7-m3.2.x_build] }
[Pipeline] [windows-jdk11-m3.5.x_build] }
[Pipeline] [linux-jdk7-m3.3.x_build] }
[Pipeline] [linux-jdk8-m3.5.x_build] }
[Pipeline] [linux-jdk11-m3.5.x_build] }
[Pipeline] [windows-jdk7-m3.3.x_build] }
[Pipeline] [windows-jdk7-m3.2.x_build] }
[Pipeline] [windows-jdk11-m3.5.x_build] // node
[Pipeline] [linux-jdk7-m3.3.x_build] // ws
[Pipeline] [linux-jdk8-m3.5.x_build] // ws
[Pipeline] [linux-jdk11-m3.5.x_build] // ws
[Pipeline] [windows-jdk11-m3.5.x_build] }
[windows-jdk11-m3.5.x_build] Failed in branch windows-jdk11-m3.5.x_build
[Pipeline] [linux-jdk7-m3.3.x_build] }
[Pipeline] [linux-jdk8-m3.5.x_build] }
[Pipeline] [linux-jdk11-m3.5.x_build] }
[Pipeline] [windows-jdk7-m3.3.x_build] // stage
[Pipeline] [windows-jdk7-m3.2.x_build] // stage
[Pipeline] [windows-jdk7-m3.2.x_build] }
[Pipeline] [windows-jdk7-m3.3.x_build] }
[Pipeline] [linux-jdk7-m3.3.x_build] // node
[Pipeline] [linux-jdk8-m3.5.x_build] // node
[Pipeline] [linux-jdk11-m3.5.x_build] // node
[Pipeline] [linux-jdk7-m3.3.x_build] }
[Pipeline] [linux-jdk8-m3.5.x_build] }
[Pipeline] [linux-jdk11-m3.5.x_build] }
[Pipeline] [windows-jdk7-m3.2.x_build] // ws
[Pipeline] [windows-jdk7-m3.3.x_build] // ws
[Pipeline] [windows-jdk7-m3.2.x_build] }
[Pipeline] [windows-jdk7-m3.3.x_build] }
[Pipeline] [windows-jdk7-m3.2.x_build] // node
[Pipeline] [windows-jdk7-m3.3.x_build] // node
[Pipeline] [windows-jdk7-m3.2.x_build] }
[windows-jdk7-m3.2.x_build] Failed in branch windows-jdk7-m3.2.x_build
[Pipeline] [windows-jdk7-m3.3.x_build] }
[linux-jdk7-m3.5.x_build] [WS-CLEANUP] Deleting project workspace...[WS-CLEANUP] done
[windows-jdk7-m3.3.x_build] Failed in branch windows-jdk7-m3.3.x_build
[Pipeline] [linux-jdk7-m3.5.x_build] }
[Pipeline] [linux-jdk7-m3.5.x_build] // stage
[Pipeline] [linux-jdk7-m3.5.x_build] }
[Pipeline] [linux-jdk7-m3.5.x_build] // ws
[Pipeline] [linux-jdk7-m3.5.x_build] }
[Pipeline] [linux-jdk7-m3.5.x_build] // node
[Pipeline] [linux-jdk7-m3.5.x_build] }
[windows-jdk7-m3.5.x_build] [INFO]           verify-fail\pom.xml .............................. SUCCESS (6.4 s)
[windows-jdk7-m3.5.x_build] [INFO] Building: verify-fail-if-not-signed\pom.xml
[windows-jdk7-m3.5.x_build] [INFO]           verify-fail-if-not-signed\pom.xml ................ SUCCESS (5.4 s)
[windows-jdk7-m3.5.x_build] [INFO]
[windows-jdk7-m3.5.x_build] [INFO] --- maven-checkstyle-plugin:3.0.0:check (checkstyle-check) @ maven-jarsigner-plugin ---
[windows-jdk7-m3.5.x_build] [INFO]
[windows-jdk7-m3.5.x_build] [INFO] --- maven-invoker-plugin:3.1.0:verify (integration-test) @ maven-jarsigner-plugin ---
[windows-jdk7-m3.5.x_build] [INFO] -------------------------------------------------
[windows-jdk7-m3.5.x_build] [INFO] Build Summary:
[windows-jdk7-m3.5.x_build] [INFO]   Passed: 9, Failed: 0, Errors: 0, Skipped: 0
[windows-jdk7-m3.5.x_build] [INFO] -------------------------------------------------
[windows-jdk7-m3.5.x_build] [INFO] ------------------------------------------------------------------------
[windows-jdk7-m3.5.x_build] [INFO] BUILD SUCCESS
[windows-jdk7-m3.5.x_build] [INFO] ------------------------------------------------------------------------
[windows-jdk7-m3.5.x_build] [INFO] Total time: 02:17 min
[windows-jdk7-m3.5.x_build] [INFO] Finished at: 2018-12-30T14:31:42-08:00
[windows-jdk7-m3.5.x_build] [INFO] Final Memory: 36M/206M
[windows-jdk7-m3.5.x_build] [INFO] ------------------------------------------------------------------------
[windows-jdk7-m3.5.x_build] [INFO] [jenkins-event-spy] Generated F:\jenkins\jenkins-slave\workspace\ven-jarsigner-plugin_master-WSGRVLKXZECZGP32RZT4MBI3KFMRMRWSXLO7SDY6D4ICDVYPA7RA@2@tmp\withMaven83dd17b0\maven-spy-20181230-142924-4903527508395159843362.log
[windows-jdk7-m3.5.x_build] Picked up JAVA_TOOL_OPTIONS: -Dmaven.ext.class.path="f:\jenkins\jenkins-slave\workspace\ven-jarsigner-plugin_master-WSGRVLKXZECZGP32RZT4MBI3KFMRMRWSXLO7SDY6D4ICDVYPA7RA@2@tmp\withMaven83dd17b0\pipeline-maven-spy.jar" -Dorg.jenkinsci.plugins.pipeline.maven.reportsFolder="f:\jenkins\jenkins-slave\workspace\ven-jarsigner-plugin_master-WSGRVLKXZECZGP32RZT4MBI3KFMRMRWSXLO7SDY6D4ICDVYPA7RA@2@tmp\withMaven83dd17b0"
[Pipeline] [windows-jdk7-m3.5.x_build] }
[Pipeline] [windows-jdk7-m3.5.x_build] // dir
[Pipeline] [windows-jdk7-m3.5.x_build] }
[windows-jdk7-m3.5.x_build] [withMaven] artifactsPublisher - Archive artifact windows-jdk7-m3.5.x_build\pom.xml under org\apache\maven\plugins\maven-jarsigner-plugin\3.0.1-SNAPSHOT\maven-jarsigner-plugin-3.0.1-SNAPSHOT.pom
[windows-jdk7-m3.5.x_build] [withMaven] artifactsPublisher - Archive artifact windows-jdk7-m3.5.x_build\target\maven-jarsigner-plugin-3.0.1-SNAPSHOT.jar under org\apache\maven\plugins\maven-jarsigner-plugin\3.0.1-SNAPSHOT\maven-jarsigner-plugin-3.0.1-SNAPSHOT.jar
[windows-jdk7-m3.5.x_build] [withMaven] junitPublisher - Archive test results for Maven artifact org.apache.maven.plugins:maven-jarsigner-plugin:3.0.1-SNAPSHOT generated by maven-surefire-plugin:test (default-test): windows-jdk7-m3.5.x_build\target\surefire-reports\*.xml
[windows-jdk7-m3.5.x_build] Recording test results
[windows-jdk7-m3.5.x_build] None of the test reports contained any result
[windows-jdk7-m3.5.x_build] [withMaven] openTasksPublisher - Scan Tasks for Maven artifact org.apache.maven.plugins:maven-jarsigner-plugin:3.0.1-SNAPSHOT in source directory windows-jdk7-m3.5.x_build\src\main\java
[windows-jdk7-m3.5.x_build] [TASKS] Scanning folder 'f:\jenkins\jenkins-slave\workspace\ven-jarsigner-plugin_master-WSGRVLKXZECZGP32RZT4MBI3KFMRMRWSXLO7SDY6D4ICDVYPA7RA@2' for files matching the pattern 'windows-jdk7-m3.5.x_build\src\main\java\**\*' - excludes: null
[windows-jdk7-m3.5.x_build] [TASKS] Found 3 files to scan for tasks
[windows-jdk7-m3.5.x_build] [TASKS] Found 2 open tasks.
[windows-jdk7-m3.5.x_build] Skipping warnings blame since pipelines do not have an SCM link.%n
[windows-jdk7-m3.5.x_build] [TASKS] Computing warning deltas based on reference build #27
[windows-jdk7-m3.5.x_build] [withMaven] invokerPublisher - Archive invoker results for Maven artifact MavenArtifact{org.apache.maven.plugins:maven-jarsigner-plugin::3.0.1-SNAPSHOT(version: 3.0.1-SNAPSHOT, snapshot:false) } generated by PluginInvocation{org.apache.maven.plugins:maven-invoker-plugin:3.1.0@integration-test  integration-test}: windows-jdk7-m3.5.x_build\target\invoker-reports\*.xml
[Pipeline] [windows-jdk7-m3.5.x_build] // withMaven
[Pipeline] [windows-jdk7-m3.5.x_build] cleanWs
[windows-jdk7-m3.5.x_build] [WS-CLEANUP] Deleting project workspace...Cannot delete workspace :remote file operation failed: f:\jenkins\jenkins-slave\workspace\ven-jarsigner-plugin_master-WSGRVLKXZECZGP32RZT4MBI3KFMRMRWSXLO7SDY6D4ICDVYPA7RA@2 at hudson.remoting.Channel@6cb8ec07:JNLP4-connect connection from 37.48.69.226/37.48.69.226:60168: java.nio.file.AccessDeniedException: f:\jenkins\jenkins-slave\workspace\ven-jarsigner-plugin_master-WSGRVLKXZECZGP32RZT4MBI3KFMRMRWSXLO7SDY6D4ICDVYPA7RA@2 -> f:\jenkins\jenkins-slave\workspace\ven-jarsigner-plugin_master-WSGRVLKXZECZGP32RZT4MBI3KFMRMRWSXLO7SDY6D4ICDVYPA7RA@2_ws-cleanup_1546209105168
[Pipeline] [windows-jdk7-m3.5.x_build] }
[Pipeline] [windows-jdk7-m3.5.x_build] // stage
[Pipeline] [windows-jdk7-m3.5.x_build] }
[Pipeline] [windows-jdk7-m3.5.x_build] // ws
[Pipeline] [windows-jdk7-m3.5.x_build] }
[Pipeline] [windows-jdk7-m3.5.x_build] // node
[Pipeline] [windows-jdk7-m3.5.x_build] }
[windows-jdk7-m3.5.x_build] Failed in branch windows-jdk7-m3.5.x_build
[windows-jdk8-m3.5.x_build] [INFO] Downloaded from central: https://repo.maven.apache.org/maven2/org/apache/maven/shared/maven-jarsigner/3.0.0/maven-jarsigner-3.0.0.pom (0 B at 0 B/s)
[windows-jdk8-m3.5.x_build] [INFO]
[windows-jdk8-m3.5.x_build] [INFO] --- maven-clean-plugin:3.1.0:clean (default-clean) @ maven-jarsigner-plugin ---
[windows-jdk8-m3.5.x_build] [INFO]
[windows-jdk8-m3.5.x_build] [INFO] --- maven-enforcer-plugin:1.4.1:enforce (enforce-maven-version) @ maven-jarsigner-plugin ---
[windows-jdk8-m3.5.x_build] [INFO]
[windows-jdk8-m3.5.x_build] [INFO] --- maven-enforcer-plugin:1.4.1:enforce (enforce-bytecode-version) @ maven-jarsigner-plugin ---
[windows-jdk8-m3.5.x_build] [INFO]
[windows-jdk8-m3.5.x_build] [INFO] --- maven-enforcer-plugin:1.4.1:enforce (ban-known-bad-maven-versions) @ maven-jarsigner-plugin ---
[windows-jdk8-m3.5.x_build] [INFO]
[windows-jdk8-m3.5.x_build] [INFO] --- maven-enforcer-plugin:1.4.1:enforce (ensure-no-container-api) @ maven-jarsigner-plugin ---
[windows-jdk8-m3.5.x_build] [INFO]
[windows-jdk8-m3.5.x_build] [INFO] --- apache-rat-plugin:0.12:check (rat-check) @ maven-jarsigner-plugin ---
[windows-jdk8-m3.5.x_build] [INFO] Enabled default license matchers.
[windows-jdk8-m3.5.x_build] [INFO] Will parse SCM ignores for exclusions...
[windows-jdk8-m3.5.x_build] [INFO] Parsing exclusions from f:\jenkins\jenkins-slave\workspace\ven-jarsigner-plugin_master-WSGRVLKXZECZGP32RZT4MBI3KFMRMRWSXLO7SDY6D4ICDVYPA7RA@3\windows-jdk8-m3.5.x_build\.gitignore
[windows-jdk8-m3.5.x_build] [INFO] Finished adding exclusions from SCM ignore files.
[windows-jdk8-m3.5.x_build] [INFO] 71 implicit excludes (use -debug for more details).
[windows-jdk8-m3.5.x_build] [INFO] Exclude: src/it/unsign/src/main/resources/META-INF/UNSIGNED.*
[windows-jdk8-m3.5.x_build] [INFO] Exclude: src/it/keystore
[windows-jdk8-m3.5.x_build] [INFO] Exclude: .repository/**
[windows-jdk8-m3.5.x_build] [INFO] Exclude: .maven/spy.log
[windows-jdk8-m3.5.x_build] [INFO] Exclude: dependency-reduced-pom.xml
[windows-jdk8-m3.5.x_build] [INFO] Exclude: .java-version
[windows-jdk8-m3.5.x_build] [INFO] 47 resources included (use -debug for more details)
[windows-jdk8-m3.5.x_build] [INFO] Rat check: Summary over all files. Unapproved: 0, unknown: 0, generated: 0, approved: 41 licenses.
[windows-jdk8-m3.5.x_build] [INFO]
[windows-jdk8-m3.5.x_build] [INFO] --- maven-plugin-plugin:3.5.2:helpmojo (generate-helpmojo) @ maven-jarsigner-plugin ---
[windows-jdk8-m3.5.x_build] [INFO] Using 'UTF-8' encoding to read mojo source files.
[windows-jdk8-m3.5.x_build] [INFO] java-javadoc mojo extractor found 0 mojo descriptor.
[windows-jdk8-m3.5.x_build] [INFO] java-annotations mojo extractor found 0 mojo descriptor.
[windows-jdk8-m3.5.x_build] [INFO]
[windows-jdk8-m3.5.x_build] [INFO] --- maven-remote-resources-plugin:1.5:process (process-resource-bundles) @ maven-jarsigner-plugin ---
[windows-jdk8-m3.5.x_build] [INFO]
[windows-jdk8-m3.5.x_build] [INFO] --- maven-resources-plugin:3.1.0:resources (default-resources) @ maven-jarsigner-plugin ---
[windows-jdk8-m3.5.x_build] [INFO] Using 'UTF-8' encoding to copy filtered resources.
[windows-jdk8-m3.5.x_build] [INFO] Copying 5 resources
[windows-jdk8-m3.5.x_build] [INFO] Copying 3 resources
[windows-jdk8-m3.5.x_build] [INFO]
[windows-jdk8-m3.5.x_build] [INFO] --- maven-compiler-plugin:3.7.0:compile (default-compile) @ maven-jarsigner-plugin ---
[windows-jdk8-m3.5.x_build] [INFO] Changes detected - recompiling the module!
[windows-jdk8-m3.5.x_build] [INFO] Compiling 4 source files to f:\jenkins\jenkins-slave\workspace\ven-jarsigner-plugin_master-WSGRVLKXZECZGP32RZT4MBI3KFMRMRWSXLO7SDY6D4ICDVYPA7RA@3\windows-jdk8-m3.5.x_build\target\classes
[windows-jdk8-m3.5.x_build] [INFO]
[windows-jdk8-m3.5.x_build] [INFO] --- maven-plugin-plugin:3.5.2:descriptor (default-descriptor) @ maven-jarsigner-plugin ---
[windows-jdk8-m3.5.x_build] [INFO] Using 'UTF-8' encoding to read mojo source files.
[windows-jdk8-m3.5.x_build] [INFO] java-javadoc mojo extractor found 0 mojo descriptor.
[windows-jdk8-m3.5.x_build] [INFO] java-annotations mojo extractor found 3 mojo descriptors.
[windows-jdk8-m3.5.x_build] [INFO]
[windows-jdk8-m3.5.x_build] [INFO] --- maven-resources-plugin:3.1.0:testResources (default-testResources) @ maven-jarsigner-plugin ---
[windows-jdk8-m3.5.x_build] [INFO] Using 'UTF-8' encoding to copy filtered resources.
[windows-jdk8-m3.5.x_build] [INFO] skip non existing resourceDirectory f:\jenkins\jenkins-slave\workspace\ven-jarsigner-plugin_master-WSGRVLKXZECZGP32RZT4MBI3KFMRMRWSXLO7SDY6D4ICDVYPA7RA@3\windows-jdk8-m3.5.x_build\src\test\resources
[windows-jdk8-m3.5.x_build] [INFO] Copying 3 resources
[windows-jdk8-m3.5.x_build] [INFO]
[windows-jdk8-m3.5.x_build] [INFO] --- maven-compiler-plugin:3.7.0:testCompile (default-testCompile) @ maven-jarsigner-plugin ---
[windows-jdk8-m3.5.x_build] [INFO] No sources to compile
[windows-jdk8-m3.5.x_build] [INFO]
[windows-jdk8-m3.5.x_build] [INFO] --- maven-surefire-plugin:2.22.0:test (default-test) @ maven-jarsigner-plugin ---
[windows-jdk8-m3.5.x_build] [INFO]
[windows-jdk8-m3.5.x_build] [INFO] --- maven-jar-plugin:3.1.0:jar (default-jar) @ maven-jarsigner-plugin ---
[windows-jdk8-m3.5.x_build] [INFO] Building jar: f:\jenkins\jenkins-slave\workspace\ven-jarsigner-plugin_master-WSGRVLKXZECZGP32RZT4MBI3KFMRMRWSXLO7SDY6D4ICDVYPA7RA@3\windows-jdk8-m3.5.x_build\target\maven-jarsigner-plugin-3.0.1-SNAPSHOT.jar
[windows-jdk8-m3.5.x_build] [INFO]
[windows-jdk8-m3.5.x_build] [INFO] --- maven-plugin-plugin:3.5.2:addPluginArtifactMetadata (default-addPluginArtifactMetadata) @ maven-jarsigner-plugin ---
[windows-jdk8-m3.5.x_build] [INFO]
[windows-jdk8-m3.5.x_build] [INFO] --- maven-site-plugin:3.7.1:attach-descriptor (attach-descriptor) @ maven-jarsigner-plugin ---
[windows-jdk8-m3.5.x_build] [INFO] Skipping because packaging 'maven-plugin' is not pom.
[windows-jdk8-m3.5.x_build] [INFO]
[windows-jdk8-m3.5.x_build] [INFO] --- maven-invoker-plugin:3.1.0:install (integration-test) @ maven-jarsigner-plugin ---
[windows-jdk8-m3.5.x_build] [INFO] Installing f:\jenkins\jenkins-slave\workspace\ven-jarsigner-plugin_master-WSGRVLKXZECZGP32RZT4MBI3KFMRMRWSXLO7SDY6D4ICDVYPA7RA@3\windows-jdk8-m3.5.x_build\pom.xml to f:\jenkins\jenkins-slave\workspace\ven-jarsigner-plugin_master-WSGRVLKXZECZGP32RZT4MBI3KFMRMRWSXLO7SDY6D4ICDVYPA7RA@3\windows-jdk8-m3.5.x_build\target\local-repo\org\apache\maven\plugins\maven-jarsigner-plugin\3.0.1-SNAPSHOT\maven-jarsigner-plugin-3.0.1-SNAPSHOT.pom
[windows-jdk8-m3.5.x_build] [INFO] Installing f:\jenkins\jenkins-slave\workspace\ven-jarsigner-plugin_master-WSGRVLKXZECZGP32RZT4MBI3KFMRMRWSXLO7SDY6D4ICDVYPA7RA@3\windows-jdk8-m3.5.x_build\target\maven-jarsigner-plugin-3.0.1-SNAPSHOT.jar to f:\jenkins\jenkins-slave\workspace\ven-jarsigner-plugin_master-WSGRVLKXZECZGP32RZT4MBI3KFMRMRWSXLO7SDY6D4ICDVYPA7RA@3\windows-jdk8-m3.5.x_build\target\local-repo\org\apache\maven\plugins\maven-jarsigner-plugin\3.0.1-SNAPSHOT\maven-jarsigner-plugin-3.0.1-SNAPSHOT.jar
[windows-jdk8-m3.5.x_build] [INFO]
[windows-jdk8-m3.5.x_build] [INFO] --- maven-invoker-plugin:3.1.0:integration-test (integration-test) @ maven-jarsigner-plugin ---
[windows-jdk8-m3.5.x_build] [INFO] Building: archive-dir\pom.xml
[windows-jdk8-m3.5.x_build] [INFO] run post-build script verify.bsh
[windows-jdk8-m3.5.x_build] [INFO]           archive-dir\pom.xml .............................. SUCCESS (8.9 s)
[windows-jdk8-m3.5.x_build] [INFO] Building: attachment-selection\pom.xml
[windows-jdk8-m3.5.x_build] [INFO] run post-build script verify.bsh
[windows-jdk8-m3.5.x_build] [INFO]           attachment-selection\pom.xml ..................... SUCCESS (7.5 s)
[windows-jdk8-m3.5.x_build] [INFO] Building: basic\pom.xml
[windows-jdk8-m3.5.x_build] [INFO] run post-build script verify.bsh
[windows-jdk8-m3.5.x_build] [INFO]           basic\pom.xml .................................... SUCCESS (9.1 s)
[windows-jdk8-m3.5.x_build] [INFO] Building: resign\pom.xml
[windows-jdk8-m3.5.x_build] [INFO]           resign\pom.xml ................................... SUCCESS (11.1 s)
[windows-jdk8-m3.5.x_build] [INFO] Building: spacy path\pom.xml
[windows-jdk8-m3.5.x_build] [INFO] run post-build script verify.bsh
[windows-jdk8-m3.5.x_build] [INFO]           spacy path\pom.xml ............................... SUCCESS (6.1 s)
[windows-jdk8-m3.5.x_build] [INFO] Building: type-detection\pom.xml
[windows-jdk8-m3.5.x_build] [INFO] run post-build script verify.bsh
[windows-jdk8-m3.5.x_build] [INFO]           type-detection\pom.xml ........................... SUCCESS (8.2 s)
[windows-jdk8-m3.5.x_build] [INFO] Building: unsign\pom.xml
[windows-jdk8-m3.5.x_build] [INFO] run post-build script verify.bsh
[windows-jdk8-m3.5.x_build] [INFO]           unsign\pom.xml ................................... SUCCESS (6.5 s)
[windows-jdk8-m3.5.x_build] [INFO] Building: verify-fail\pom.xml
[windows-jdk8-m3.5.x_build] [INFO]           verify-fail\pom.xml .............................. SUCCESS (4.5 s)
[windows-jdk8-m3.5.x_build] [INFO] Building: verify-fail-if-not-signed\pom.xml
[windows-jdk8-m3.5.x_build] [INFO]           verify-fail-if-not-signed\pom.xml ................ SUCCESS (3.9 s)
[windows-jdk8-m3.5.x_build] [INFO]
[windows-jdk8-m3.5.x_build] [INFO] --- maven-checkstyle-plugin:3.0.0:check (checkstyle-check) @ maven-jarsigner-plugin ---
[windows-jdk8-m3.5.x_build] [INFO]
[windows-jdk8-m3.5.x_build] [INFO] --- maven-invoker-plugin:3.1.0:verify (integration-test) @ maven-jarsigner-plugin ---
[windows-jdk8-m3.5.x_build] [INFO] -------------------------------------------------
[windows-jdk8-m3.5.x_build] [INFO] Build Summary:
[windows-jdk8-m3.5.x_build] [INFO]   Passed: 9, Failed: 0, Errors: 0, Skipped: 0
[windows-jdk8-m3.5.x_build] [INFO] -------------------------------------------------
[windows-jdk8-m3.5.x_build] [INFO] ------------------------------------------------------------------------
[windows-jdk8-m3.5.x_build] [INFO] BUILD SUCCESS
[windows-jdk8-m3.5.x_build] [INFO] ------------------------------------------------------------------------
[windows-jdk8-m3.5.x_build] [INFO] Total time: 16:19 min
[windows-jdk8-m3.5.x_build] [INFO] Finished at: 2018-12-30T22:45:34Z
[windows-jdk8-m3.5.x_build] [INFO] Final Memory: 43M/418M
[windows-jdk8-m3.5.x_build] [INFO] ------------------------------------------------------------------------
[windows-jdk8-m3.5.x_build] [INFO] [jenkins-event-spy] Generated F:\jenkins\jenkins-slave\workspace\ven-jarsigner-plugin_master-WSGRVLKXZECZGP32RZT4MBI3KFMRMRWSXLO7SDY6D4ICDVYPA7RA@3@tmp\withMaven9298879c\maven-spy-20181230-222914-4886975887025869608251.log
[windows-jdk8-m3.5.x_build] Picked up JAVA_TOOL_OPTIONS: -Dmaven.ext.class.path="f:\jenkins\jenkins-slave\workspace\ven-jarsigner-plugin_master-WSGRVLKXZECZGP32RZT4MBI3KFMRMRWSXLO7SDY6D4ICDVYPA7RA@3@tmp\withMaven9298879c\pipeline-maven-spy.jar" -Dorg.jenkinsci.plugins.pipeline.maven.reportsFolder="f:\jenkins\jenkins-slave\workspace\ven-jarsigner-plugin_master-WSGRVLKXZECZGP32RZT4MBI3KFMRMRWSXLO7SDY6D4ICDVYPA7RA@3@tmp\withMaven9298879c"
[Pipeline] [windows-jdk8-m3.5.x_build] }
[Pipeline] [windows-jdk8-m3.5.x_build] // dir
[Pipeline] [windows-jdk8-m3.5.x_build] }
[windows-jdk8-m3.5.x_build] [withMaven] artifactsPublisher - Archive artifact windows-jdk8-m3.5.x_build\pom.xml under org\apache\maven\plugins\maven-jarsigner-plugin\3.0.1-SNAPSHOT\maven-jarsigner-plugin-3.0.1-SNAPSHOT.pom
[windows-jdk8-m3.5.x_build] [withMaven] artifactsPublisher - Archive artifact windows-jdk8-m3.5.x_build\target\maven-jarsigner-plugin-3.0.1-SNAPSHOT.jar under org\apache\maven\plugins\maven-jarsigner-plugin\3.0.1-SNAPSHOT\maven-jarsigner-plugin-3.0.1-SNAPSHOT.jar
[windows-jdk8-m3.5.x_build] [withMaven] junitPublisher - Archive test results for Maven artifact org.apache.maven.plugins:maven-jarsigner-plugin:3.0.1-SNAPSHOT generated by maven-surefire-plugin:test (default-test): windows-jdk8-m3.5.x_build\target\surefire-reports\*.xml
[windows-jdk8-m3.5.x_build] Recording test results
[windows-jdk8-m3.5.x_build] None of the test reports contained any result
[windows-jdk8-m3.5.x_build] [withMaven] openTasksPublisher - Scan Tasks for Maven artifact org.apache.maven.plugins:maven-jarsigner-plugin:3.0.1-SNAPSHOT in source directory windows-jdk8-m3.5.x_build\src\main\java
[windows-jdk8-m3.5.x_build] [TASKS] Scanning folder 'f:\jenkins\jenkins-slave\workspace\ven-jarsigner-plugin_master-WSGRVLKXZECZGP32RZT4MBI3KFMRMRWSXLO7SDY6D4ICDVYPA7RA@3' for files matching the pattern 'windows-jdk8-m3.5.x_build\src\main\java\**\*' - excludes: null
[windows-jdk8-m3.5.x_build] [TASKS] Found 3 files to scan for tasks
[windows-jdk8-m3.5.x_build] [TASKS] Found 2 open tasks.
[windows-jdk8-m3.5.x_build] Skipping warnings blame since pipelines do not have an SCM link.%n
[windows-jdk8-m3.5.x_build] [TASKS] Computing warning deltas based on reference build #27
[windows-jdk8-m3.5.x_build] [withMaven] invokerPublisher - Archive invoker results for Maven artifact MavenArtifact{org.apache.maven.plugins:maven-jarsigner-plugin::3.0.1-SNAPSHOT(version: 3.0.1-SNAPSHOT, snapshot:false) } generated by PluginInvocation{org.apache.maven.plugins:maven-invoker-plugin:3.1.0@integration-test  integration-test}: windows-jdk8-m3.5.x_build\target\invoker-reports\*.xml
[Pipeline] [windows-jdk8-m3.5.x_build] // withMaven
[Pipeline] [windows-jdk8-m3.5.x_build] cleanWs
[windows-jdk8-m3.5.x_build] [WS-CLEANUP] Deleting project workspace...Cannot delete workspace :remote file operation failed: f:\jenkins\jenkins-slave\workspace\ven-jarsigner-plugin_master-WSGRVLKXZECZGP32RZT4MBI3KFMRMRWSXLO7SDY6D4ICDVYPA7RA@3 at hudson.remoting.Channel@41afa848:JNLP4-connect connection from 37.48.69.226/37.48.69.226:49574: java.nio.file.AccessDeniedException: f:\jenkins\jenkins-slave\workspace\ven-jarsigner-plugin_master-WSGRVLKXZECZGP32RZT4MBI3KFMRMRWSXLO7SDY6D4ICDVYPA7RA@3 -> f:\jenkins\jenkins-slave\workspace\ven-jarsigner-plugin_master-WSGRVLKXZECZGP32RZT4MBI3KFMRMRWSXLO7SDY6D4ICDVYPA7RA@3_ws-cleanup_1546209937745
[Pipeline] [windows-jdk8-m3.5.x_build] }
[Pipeline] [windows-jdk8-m3.5.x_build] // stage
[Pipeline] [windows-jdk8-m3.5.x_build] }
[Pipeline] [windows-jdk8-m3.5.x_build] // ws
[Pipeline] [windows-jdk8-m3.5.x_build] }
[Pipeline] [windows-jdk8-m3.5.x_build] // node
[Pipeline] [windows-jdk8-m3.5.x_build] }
[windows-jdk8-m3.5.x_build] Failed in branch windows-jdk8-m3.5.x_build
[Pipeline] // parallel
[Pipeline] stage
[Pipeline] { (Notifications)
[Pipeline] echo
Build result: FAILURE
[Pipeline] jiraIssueSelector
[Pipeline] emailext
Reply | Threaded
Open this post in threaded view
|

Build failed in Jenkins: Maven TLP » maven-jarsigner-plugin » master #29

Apache Jenkins Server-2
See https://builds.apache.org/job/maven-box/job/maven-jarsigner-plugin/job/master/29/

Changes:

* add mavenLinkerPublisher

No tests ran.

Build log:
[...truncated 1942 lines...]
[INFO] Total time: 03:25 min
[INFO] Finished at: 2019-01-01T20:49:00Z
[INFO] Final Memory: 45M/518M
[INFO] ------------------------------------------------------------------------
[INFO] [jenkins-event-spy] Generated F:\jenkins\jenkins-slave\workspace\ox_maven-jarsigner-plugin_master@2@tmp\withMavencdf234db\maven-spy-20190101-204535-5097207105961386301821.log
Picked up JAVA_TOOL_OPTIONS: -Dmaven.ext.class.path="f:\jenkins\jenkins-slave\workspace\ox_maven-jarsigner-plugin_master@2@tmp\withMavencdf234db\pipeline-maven-spy.jar" -Dorg.jenkinsci.plugins.pipeline.maven.reportsFolder="f:\jenkins\jenkins-slave\workspace\ox_maven-jarsigner-plugin_master@2@tmp\withMavencdf234db"
[Pipeline] }
[Pipeline] // dir
[Pipeline] }
[withMaven] artifactsPublisher - Archive artifact windows-jdk8-m3.5.x_build\pom.xml under org\apache\maven\plugins\maven-jarsigner-plugin\3.0.1-SNAPSHOT\maven-jarsigner-plugin-3.0.1-SNAPSHOT.pom
[withMaven] artifactsPublisher - Archive artifact windows-jdk8-m3.5.x_build\target\maven-jarsigner-plugin-3.0.1-SNAPSHOT.jar under org\apache\maven\plugins\maven-jarsigner-plugin\3.0.1-SNAPSHOT\maven-jarsigner-plugin-3.0.1-SNAPSHOT.jar
[withMaven] junitPublisher - Archive test results for Maven artifact org.apache.maven.plugins:maven-jarsigner-plugin:maven-plugin:3.0.1-SNAPSHOT generated by maven-surefire-plugin:test (default-test): windows-jdk8-m3.5.x_build\target\surefire-reports\*.xml
Recording test results
None of the test reports contained any result
[withMaven] openTasksPublisher - Scan Tasks for Maven artifact org.apache.maven.plugins:maven-jarsigner-plugin:maven-plugin:3.0.1-SNAPSHOT in source directory windows-jdk8-m3.5.x_build\src\main\java
[TASKS] Scanning folder 'f:\jenkins\jenkins-slave\workspace\ox_maven-jarsigner-plugin_master@2' for files matching the pattern 'windows-jdk8-m3.5.x_build\src\main\java\**\*' - excludes: null
[TASKS] Found 3 files to scan for tasks
[TASKS] Found 2 open tasks.
Skipping warnings blame since pipelines do not have an SCM link.%n
[TASKS] Computing warning deltas based on reference build #27
[withMaven] invokerPublisher - Archive invoker results for Maven artifact MavenArtifact{org.apache.maven.plugins:maven-jarsigner-plugin:maven-plugin:3.0.1-SNAPSHOT(version: 3.0.1-SNAPSHOT, snapshot:false) } generated by PluginInvocation{org.apache.maven.plugins:maven-invoker-plugin:3.1.0@integration-test  integration-test}: windows-jdk8-m3.5.x_build\target\invoker-reports\*.xml
[withMaven] Publishers: Generated Artifacts Publisher: 844 ms, Junit Publisher: 111 ms, Open Task Scanner Publisher: 926 ms, Invoker Publisher: 12280 ms, Pipeline Graph Publisher: 1 ms
[Pipeline] // withMaven
[Pipeline] cleanWs
[WS-CLEANUP] Deleting project workspace...
[WS-CLEANUP] Deferred wipeout is used...
ERROR: Cannot delete workspace :f:\jenkins\jenkins-slave\workspace\ox_maven-jarsigner-plugin_master@2\windows-jdk7-m3.2.x_build\target\invoker-reports\BUILD-archive-dir.xml
[Pipeline] }
[Pipeline] // stage
[Pipeline] }
[Pipeline] // ws
[Pipeline] }
[Pipeline] // node
[Pipeline] }
Failed in branch windows-jdk8-m3.5.x_build
Running on windows-2016-1 in f:\jenkins\jenkins-slave\workspace\ox_maven-jarsigner-plugin_master
[Pipeline] {
[Pipeline] pwd
[Pipeline] ws
Running in f:\jenkins\jenkins-slave\workspace\ox_maven-jarsigner-plugin_master@2
[Pipeline] {
[Pipeline] stage
[Pipeline] { (Checkout windows-jdk11-m3.5.x_build)
[Pipeline] dir
Running in f:\jenkins\jenkins-slave\workspace\ox_maven-jarsigner-plugin_master@2\windows-jdk11-m3.5.x_build
[Pipeline] {
[Pipeline] checkout
Cloning the remote Git repository
Cloning with configured refspecs honoured and without tags
Cloning repository https://gitbox.apache.org/repos/asf/maven-jarsigner-plugin.git
 > git init f:\jenkins\jenkins-slave\workspace\ox_maven-jarsigner-plugin_master@2\windows-jdk11-m3.5.x_build # timeout=10
Fetching upstream changes from https://gitbox.apache.org/repos/asf/maven-jarsigner-plugin.git
 > git --version # timeout=10
 > git fetch --no-tags --progress https://gitbox.apache.org/repos/asf/maven-jarsigner-plugin.git +refs/heads/*:refs/remotes/origin/*
 > git config remote.origin.url https://gitbox.apache.org/repos/asf/maven-jarsigner-plugin.git # timeout=10
 > git config --add remote.origin.fetch +refs/heads/*:refs/remotes/origin/* # timeout=10
Fetching without tags
 > git config remote.origin.url https://gitbox.apache.org/repos/asf/maven-jarsigner-plugin.git # timeout=10
Fetching upstream changes from https://gitbox.apache.org/repos/asf/maven-jarsigner-plugin.git
 > git fetch --no-tags --progress https://gitbox.apache.org/repos/asf/maven-jarsigner-plugin.git +refs/heads/*:refs/remotes/origin/*
Checking out Revision 6b7ec998d6c8d153b47cf7be49208a28f6992ba9 (master)
 > git config core.sparsecheckout # timeout=10
 > git checkout -f 6b7ec998d6c8d153b47cf7be49208a28f6992ba9
Commit message: "[maven-release-plugin] prepare for next development iteration"
Cleaning workspace
 > git rev-parse --verify HEAD # timeout=10
Resetting working tree
 > git reset --hard # timeout=10
[Pipeline] }
[Pipeline] // dir
[Pipeline] }
[Pipeline] // stage
[Pipeline] stage
[Pipeline] { (Build windows-jdk11-m3.5.x_build)
[Pipeline] withMaven
[withMaven] Options: [org.jenkinsci.plugins.pipeline.maven.publishers.GeneratedArtifactsPublisher[disabled=false], JunitTestsPublisher[disabled=false,healthScaleFactor=,keepLongStdio=false,ignoreAttachments=false], org.jenkinsci.plugins.pipeline.maven.publishers.FindbugsAnalysisPublisher[disabled='false', healthy='', unHealthy='', thresholdLimit='low'], org.jenkinsci.plugins.pipeline.maven.publishers.TasksScannerPublisher[disabled='false', healthy='', unHealthy='', thresholdLimit='low'], org.jenkinsci.plugins.pipeline.maven.publishers.DependenciesFingerprintPublisher[disabled=false, scopes=[compile, provided, runtime], versions={snapshot:true, release:false}], org.jenkinsci.plugins.pipeline.maven.publishers.InvokerRunsPublisher[disabled=false], org.jenkinsci.plugins.pipeline.maven.publishers.PipelineGraphPublisher[disabled=false, scopes=[compile, provided, runtime], versions={snapshot:true, release:false}, skipDownstreamTriggers=false, lifecycleThreshold=deploy, ignoreUpstreamTriggers=false], org.jenkinsci.plugins.pipeline.maven.publishers.MavenLinkerPublisher2[disabled=false]]
[withMaven] Available options:
[withMaven] using JDK installation JDK 11 (latest)
[withMaven] using Maven installation 'Maven 3.5.2 (Windows)'
 > git clean -fdx # timeout=10
[Pipeline] {
[Pipeline] dir
Running in f:\jenkins\jenkins-slave\workspace\ox_maven-jarsigner-plugin_master@2\windows-jdk11-m3.5.x_build
[Pipeline] {
[Pipeline] isUnix
[Pipeline] bat

f:\jenkins\jenkins-slave\workspace\ox_maven-jarsigner-plugin_master@2\windows-jdk11-m3.5.x_build>mvn -P+run-its -Dmaven.test.failure.ignore=true -Dfindbugs.failOnError=false -e clean verify
----- withMaven Wrapper script -----
Picked up JAVA_TOOL_OPTIONS: -Dmaven.ext.class.path="f:\jenkins\jenkins-slave\workspace\ox_maven-jarsigner-plugin_master@2@tmp\withMaven25334798\pipeline-maven-spy.jar" -Dorg.jenkinsci.plugins.pipeline.maven.reportsFolder="f:\jenkins\jenkins-slave\workspace\ox_maven-jarsigner-plugin_master@2@tmp\withMaven25334798"
Apache Maven 3.5.2 (138edd61fd100ec658bfa2d307c43b76940a5d7d; 2017-10-18T07:58:13Z)
Maven home: F:\jenkins\tools\maven\apache-maven-3.5.2\bin\..
Java version: 11, vendor: Oracle Corporation
Java home: f:\jenkins\tools\java\latest11
Default locale: en_US, platform encoding: Cp1252
OS name: "windows server 2016", version: "10.0", arch: "amd64", family: "windows"
[INFO] [jenkins-event-spy] Generate F:\jenkins\jenkins-slave\workspace\ox_maven-jarsigner-plugin_master@2@tmp\withMaven25334798\maven-spy-20190101-204940-4805114459725795676776.log.tmp ...
[INFO] Error stacktraces are turned on.
[INFO] Scanning for projects...
[INFO]
[INFO] ------------------------------------------------------------------------
[INFO] Building Apache Maven Jarsigner Plugin 3.0.1-SNAPSHOT
[INFO] ------------------------------------------------------------------------
[INFO]
[INFO] --- maven-clean-plugin:3.1.0:clean (default-clean) @ maven-jarsigner-plugin ---
[INFO]
[INFO] --- maven-enforcer-plugin:1.4.1:enforce (enforce-maven-version) @ maven-jarsigner-plugin ---
[INFO]
[INFO] --- maven-enforcer-plugin:1.4.1:enforce (enforce-bytecode-version) @ maven-jarsigner-plugin ---
[INFO]
[INFO] --- maven-enforcer-plugin:1.4.1:enforce (ban-known-bad-maven-versions) @ maven-jarsigner-plugin ---
[INFO]
[INFO] --- maven-enforcer-plugin:1.4.1:enforce (ensure-no-container-api) @ maven-jarsigner-plugin ---
[INFO]
[INFO] --- apache-rat-plugin:0.12:check (rat-check) @ maven-jarsigner-plugin ---
[INFO] Enabled default license matchers.
[INFO] Will parse SCM ignores for exclusions...
[INFO] Parsing exclusions from f:\jenkins\jenkins-slave\workspace\ox_maven-jarsigner-plugin_master@2\windows-jdk11-m3.5.x_build\.gitignore
[INFO] Finished adding exclusions from SCM ignore files.
[INFO] 71 implicit excludes (use -debug for more details).
[INFO] Exclude: src/it/unsign/src/main/resources/META-INF/UNSIGNED.*
[INFO] Exclude: src/it/keystore
[INFO] Exclude: .repository/**
[INFO] Exclude: .maven/spy.log
[INFO] Exclude: dependency-reduced-pom.xml
[INFO] Exclude: .java-version
[INFO] 47 resources included (use -debug for more details)
[INFO] Rat check: Summary over all files. Unapproved: 0, unknown: 0, generated: 0, approved: 41 licenses.
[INFO]
[INFO] --- maven-plugin-plugin:3.5.2:helpmojo (generate-helpmojo) @ maven-jarsigner-plugin ---
[INFO] Using 'UTF-8' encoding to read mojo source files.
[INFO] java-javadoc mojo extractor found 0 mojo descriptor.
[INFO] java-annotations mojo extractor found 0 mojo descriptor.
[INFO]
[INFO] --- maven-remote-resources-plugin:1.5:process (process-resource-bundles) @ maven-jarsigner-plugin ---
[INFO]
[INFO] --- maven-resources-plugin:3.1.0:resources (default-resources) @ maven-jarsigner-plugin ---
[INFO] Using 'UTF-8' encoding to copy filtered resources.
[INFO] Copying 5 resources
[INFO] Copying 3 resources
[INFO]
[INFO] --- maven-compiler-plugin:3.7.0:compile (default-compile) @ maven-jarsigner-plugin ---
[INFO] Changes detected - recompiling the module!
[INFO] Compiling 4 source files to f:\jenkins\jenkins-slave\workspace\ox_maven-jarsigner-plugin_master@2\windows-jdk11-m3.5.x_build\target\classes
[INFO]
[INFO] --- maven-plugin-plugin:3.5.2:descriptor (default-descriptor) @ maven-jarsigner-plugin ---
[INFO] Using 'UTF-8' encoding to read mojo source files.
[INFO] java-javadoc mojo extractor found 0 mojo descriptor.
[INFO] java-annotations mojo extractor found 3 mojo descriptors.
[INFO]
[INFO] --- maven-resources-plugin:3.1.0:testResources (default-testResources) @ maven-jarsigner-plugin ---
[INFO] Using 'UTF-8' encoding to copy filtered resources.
[INFO] skip non existing resourceDirectory f:\jenkins\jenkins-slave\workspace\ox_maven-jarsigner-plugin_master@2\windows-jdk11-m3.5.x_build\src\test\resources
[INFO] Copying 3 resources
[INFO]
[INFO] --- maven-compiler-plugin:3.7.0:testCompile (default-testCompile) @ maven-jarsigner-plugin ---
[INFO] No sources to compile
[INFO]
[INFO] --- maven-surefire-plugin:2.22.0:test (default-test) @ maven-jarsigner-plugin ---
[INFO]
[INFO] --- maven-jar-plugin:3.1.0:jar (default-jar) @ maven-jarsigner-plugin ---
[INFO] Building jar: f:\jenkins\jenkins-slave\workspace\ox_maven-jarsigner-plugin_master@2\windows-jdk11-m3.5.x_build\target\maven-jarsigner-plugin-3.0.1-SNAPSHOT.jar
[INFO]
[INFO] --- maven-plugin-plugin:3.5.2:addPluginArtifactMetadata (default-addPluginArtifactMetadata) @ maven-jarsigner-plugin ---
[INFO]
[INFO] --- maven-site-plugin:3.7.1:attach-descriptor (attach-descriptor) @ maven-jarsigner-plugin ---
[INFO] Skipping because packaging 'maven-plugin' is not pom.
[INFO]
[INFO] --- maven-invoker-plugin:3.1.0:install (integration-test) @ maven-jarsigner-plugin ---
[INFO] Installing f:\jenkins\jenkins-slave\workspace\ox_maven-jarsigner-plugin_master@2\windows-jdk11-m3.5.x_build\pom.xml to f:\jenkins\jenkins-slave\workspace\ox_maven-jarsigner-plugin_master@2\windows-jdk11-m3.5.x_build\target\local-repo\org\apache\maven\plugins\maven-jarsigner-plugin\3.0.1-SNAPSHOT\maven-jarsigner-plugin-3.0.1-SNAPSHOT.pom
[INFO] Installing f:\jenkins\jenkins-slave\workspace\ox_maven-jarsigner-plugin_master@2\windows-jdk11-m3.5.x_build\target\maven-jarsigner-plugin-3.0.1-SNAPSHOT.jar to f:\jenkins\jenkins-slave\workspace\ox_maven-jarsigner-plugin_master@2\windows-jdk11-m3.5.x_build\target\local-repo\org\apache\maven\plugins\maven-jarsigner-plugin\3.0.1-SNAPSHOT\maven-jarsigner-plugin-3.0.1-SNAPSHOT.jar
[INFO]
[INFO] --- maven-invoker-plugin:3.1.0:integration-test (integration-test) @ maven-jarsigner-plugin ---
[INFO] Building: archive-dir\pom.xml
[INFO] run post-build script verify.bsh
[INFO]           archive-dir\pom.xml .............................. SUCCESS (7.7 s)
[INFO] Building: attachment-selection\pom.xml
[INFO] run post-build script verify.bsh
[INFO]           attachment-selection\pom.xml ..................... SUCCESS (4.7 s)
[INFO] Building: basic\pom.xml
[INFO] run post-build script verify.bsh
[INFO]           basic\pom.xml .................................... SUCCESS (5.4 s)
[INFO] Building: resign\pom.xml
[INFO]           resign\pom.xml ................................... SUCCESS (12.0 s)
[INFO] Building: spacy path\pom.xml
[INFO] run post-build script verify.bsh
[INFO]           spacy path\pom.xml ............................... SUCCESS (3.7 s)
[INFO] Building: type-detection\pom.xml
[INFO] run post-build script verify.bsh
[INFO]           type-detection\pom.xml ........................... SUCCESS (5.2 s)
[INFO] Building: unsign\pom.xml
[INFO] run post-build script verify.bsh
[INFO]           unsign\pom.xml ................................... SUCCESS (4.8 s)
[INFO] Building: verify-fail\pom.xml
[INFO]           verify-fail\pom.xml .............................. SUCCESS (8.2 s)
[INFO] Building: verify-fail-if-not-signed\pom.xml
[INFO]           verify-fail-if-not-signed\pom.xml ................ SUCCESS (18.5 s)
[INFO]
[INFO] --- maven-checkstyle-plugin:3.0.0:check (checkstyle-check) @ maven-jarsigner-plugin ---
[INFO]
[INFO] --- maven-invoker-plugin:3.1.0:verify (integration-test) @ maven-jarsigner-plugin ---
[INFO] -------------------------------------------------
[INFO] Build Summary:
[INFO]   Passed: 9, Failed: 0, Errors: 0, Skipped: 0
[INFO] -------------------------------------------------
[INFO] ------------------------------------------------------------------------
[INFO] BUILD SUCCESS
[INFO] ------------------------------------------------------------------------
[INFO] Total time: 01:49 min
[INFO] Finished at: 2019-01-01T20:51:31Z
[INFO] Final Memory: 37M/130M
[INFO] ------------------------------------------------------------------------
[INFO] [jenkins-event-spy] Generated F:\jenkins\jenkins-slave\workspace\ox_maven-jarsigner-plugin_master@2@tmp\withMaven25334798\maven-spy-20190101-204940-4805114459725795676776.log
[Pipeline] }
[Pipeline] // dir
[Pipeline] }
[withMaven] artifactsPublisher - Archive artifact windows-jdk11-m3.5.x_build\pom.xml under org\apache\maven\plugins\maven-jarsigner-plugin\3.0.1-SNAPSHOT\maven-jarsigner-plugin-3.0.1-SNAPSHOT.pom
[withMaven] artifactsPublisher - Archive artifact windows-jdk11-m3.5.x_build\target\maven-jarsigner-plugin-3.0.1-SNAPSHOT.jar under org\apache\maven\plugins\maven-jarsigner-plugin\3.0.1-SNAPSHOT\maven-jarsigner-plugin-3.0.1-SNAPSHOT.jar
[withMaven] junitPublisher - Archive test results for Maven artifact org.apache.maven.plugins:maven-jarsigner-plugin:maven-plugin:3.0.1-SNAPSHOT generated by maven-surefire-plugin:test (default-test): windows-jdk11-m3.5.x_build\target\surefire-reports\*.xml
Recording test results
None of the test reports contained any result
[withMaven] openTasksPublisher - Scan Tasks for Maven artifact org.apache.maven.plugins:maven-jarsigner-plugin:maven-plugin:3.0.1-SNAPSHOT in source directory windows-jdk11-m3.5.x_build\src\main\java
[TASKS] Scanning folder 'f:\jenkins\jenkins-slave\workspace\ox_maven-jarsigner-plugin_master@2' for files matching the pattern 'windows-jdk11-m3.5.x_build\src\main\java\**\*' - excludes: null
[TASKS] Found 3 files to scan for tasks
[TASKS] Found 2 open tasks.
Skipping warnings blame since pipelines do not have an SCM link.%n
[TASKS] Computing warning deltas based on reference build #27
[withMaven] invokerPublisher - Archive invoker results for Maven artifact MavenArtifact{org.apache.maven.plugins:maven-jarsigner-plugin:maven-plugin:3.0.1-SNAPSHOT(version: 3.0.1-SNAPSHOT, snapshot:false) } generated by PluginInvocation{org.apache.maven.plugins:maven-invoker-plugin:3.1.0@integration-test  integration-test}: windows-jdk11-m3.5.x_build\target\invoker-reports\*.xml
[withMaven] Publishers: Generated Artifacts Publisher: 748 ms, Junit Publisher: 107 ms, Open Task Scanner Publisher: 370 ms, Invoker Publisher: 21513 ms
[Pipeline] // withMaven
[Pipeline] cleanWs
[WS-CLEANUP] Deleting project workspace...
[WS-CLEANUP] Deferred wipeout is used...
ERROR: Cannot delete workspace :f:\jenkins\jenkins-slave\workspace\ox_maven-jarsigner-plugin_master@2\windows-jdk11-m3.5.x_build\target\invoker-reports\BUILD-archive-dir.xml
[Pipeline] }
[Pipeline] // stage
[Pipeline] }
[Pipeline] // ws
[Pipeline] }
[Pipeline] // node
[Pipeline] }
Failed in branch windows-jdk11-m3.5.x_build
[Pipeline] // parallel
[Pipeline] stage
[Pipeline] { (Notifications)
[Pipeline] echo
Build result: FAILURE
[Pipeline] jiraIssueSelector
[Pipeline] emailext
Reply | Threaded
Open this post in threaded view
|

Build succeeded in Jenkins: Maven TLP » maven-jarsigner-plugin » master #30

Apache Jenkins Server-2
See https://builds.apache.org/job/maven-box/job/maven-jarsigner-plugin/job/master/30/

Changes:

* Disable cleanWs() due to issues with file handles on Windows
* added a link to asf-gitpubsub-jenkins-plugin
* fixed markup (asciidoc, not markdown...)

No tests ran.