Build failed in Jenkins: Maven TLP » maven-jar-plugin » master #26

Previous Topic Next Topic
 
classic Classic list List threaded Threaded
4 messages Options
Reply | Threaded
Open this post in threaded view
|

Build failed in Jenkins: Maven TLP » maven-jar-plugin » master #26

Apache Jenkins Server-2
See https://builds.apache.org/job/maven-box/job/maven-jar-plugin/job/master/26/

No changes.

All tests passed

Build log:
[...truncated 28.42 MB...]
[windows-jdk10] [INFO] snapshots: [enabled => true, update => daily]
[windows-jdk10] [INFO]  releases: [enabled => true, update => daily]
[windows-jdk10] [INFO] ,       id: central
[windows-jdk10] [INFO]       url: https://repo.maven.apache.org/maven2
[windows-jdk10] [INFO]    layout: default
[windows-jdk10] [INFO] snapshots: [enabled => false, update => daily]
[windows-jdk10] [INFO]  releases: [enabled => true, update => never]
[windows-jdk10] [INFO] ]
[windows-jdk10] [INFO] [DEBUG]   (f) reportFormat = brief
[windows-jdk10] [INFO] [DEBUG]   (f) reportsDirectory = F:\jenkins\jenkins-slave\workspace\box_maven-jar-plugin_master-EOL2JTSLPKWLYYEA7ISEGP2JMWPBRZU7FXH6EG3ZDZ25NFJIJ2HQ\m\target\it\project-004\target\surefire-reports
[windows-jdk10] [INFO] [DEBUG]   (f) testClassesDirectory = F:\jenkins\jenkins-slave\workspace\box_maven-jar-plugin_master-EOL2JTSLPKWLYYEA7ISEGP2JMWPBRZU7FXH6EG3ZDZ25NFJIJ2HQ\m\target\it\project-004\target\test-classes
[windows-jdk10] [INFO] [DEBUG]   (f) testSourceDirectory = F:\jenkins\jenkins-slave\workspace\box_maven-jar-plugin_master-EOL2JTSLPKWLYYEA7ISEGP2JMWPBRZU7FXH6EG3ZDZ25NFJIJ2HQ\m\target\it\project-004\src\test\java
[windows-jdk10] [INFO] [DEBUG]   (f) threadCount = 5
[windows-jdk10] [INFO] [DEBUG]   (f) trimStackTrace = true
[windows-jdk10] [INFO] [DEBUG]   (f) useFile = true
[windows-jdk10] [INFO] [DEBUG]   (f) useSystemClassLoader = false
[windows-jdk10] [INFO] [DEBUG] -- end configuration --
[windows-jdk10] [INFO] [INFO] No tests to run.
[windows-jdk10] [INFO] [INFO]
[windows-jdk10] [INFO] [INFO] --- maven-jar-plugin:3.1.1-SNAPSHOT:jar (default-jar) @ maven-jar-plugin-test-project-004 ---
[windows-jdk10] [INFO] [DEBUG] Dependency collection stats: {ConflictMarker.analyzeTime=0, ConflictMarker.markTime=0, ConflictMarker.nodeCount=83, ConflictIdSorter.graphTime=1, ConflictIdSorter.topsortTime=0, ConflictIdSorter.conflictIdCount=32, ConflictIdSorter.conflictIdCycleCount=0, ConflictResolver.totalTime=1, ConflictResolver.conflictItemCount=75, DefaultDependencyCollector.collectTime=205, DefaultDependencyCollector.transformTime=2}
[windows-jdk10] [INFO] [DEBUG] org.apache.maven.plugins:maven-jar-plugin:jar:3.1.1-SNAPSHOT:
[windows-jdk10] [INFO] [DEBUG]    org.apache.maven:maven-plugin-api:jar:3.0:compile
[windows-jdk10] [INFO] [DEBUG]       org.apache.maven:maven-model:jar:3.0:compile
[windows-jdk10] [INFO] [DEBUG]       org.sonatype.sisu:sisu-inject-plexus:jar:1.4.2:compile
[windows-jdk10] [INFO] [DEBUG]          org.sonatype.sisu:sisu-inject-bean:jar:1.4.2:compile
[windows-jdk10] [INFO] [DEBUG]             org.sonatype.sisu:sisu-guice:jar:noaop:2.1.7:compile
[windows-jdk10] [INFO] [DEBUG]    org.apache.maven:maven-core:jar:3.0:compile
[windows-jdk10] [INFO] [DEBUG]       org.apache.maven:maven-settings:jar:3.0:compile
[windows-jdk10] [INFO] [DEBUG]       org.apache.maven:maven-settings-builder:jar:3.0:compile
[windows-jdk10] [INFO] [DEBUG]       org.apache.maven:maven-repository-metadata:jar:3.0:compile
[windows-jdk10] [INFO] [DEBUG]       org.apache.maven:maven-model-builder:jar:3.0:compile
[windows-jdk10] [INFO] [DEBUG]       org.apache.maven:maven-aether-provider:jar:3.0:runtime
[windows-jdk10] [INFO] [DEBUG]       org.sonatype.aether:aether-impl:jar:1.7:compile
[windows-jdk10] [INFO] [DEBUG]          org.sonatype.aether:aether-spi:jar:1.7:compile
[windows-jdk10] [INFO] [DEBUG]       org.sonatype.aether:aether-api:jar:1.7:compile
[windows-jdk10] [INFO] [DEBUG]       org.sonatype.aether:aether-util:jar:1.7:compile
[windows-jdk10] [INFO] [DEBUG]       org.codehaus.plexus:plexus-interpolation:jar:1.14:compile
[windows-jdk10] [INFO] [DEBUG]       org.codehaus.plexus:plexus-classworlds:jar:2.2.3:compile
[windows-jdk10] [INFO] [DEBUG]       org.codehaus.plexus:plexus-component-annotations:jar:1.7.1:compile
[windows-jdk10] [INFO] [DEBUG]       org.sonatype.plexus:plexus-sec-dispatcher:jar:1.3:compile
[windows-jdk10] [INFO] [DEBUG]          org.sonatype.plexus:plexus-cipher:jar:1.4:compile
[windows-jdk10] [INFO] [DEBUG]    org.apache.maven:maven-artifact:jar:3.0:compile
[windows-jdk10] [INFO] [DEBUG]    org.apache.maven:maven-archiver:jar:3.2.0:compile
[windows-jdk10] [INFO] [DEBUG]       org.apache.maven.shared:maven-shared-utils:jar:3.2.0:compile
[windows-jdk10] [INFO] [DEBUG]       commons-io:commons-io:jar:2.5:compile
[windows-jdk10] [INFO] [DEBUG]    org.codehaus.plexus:plexus-archiver:jar:3.6.0:compile
[windows-jdk10] [INFO] [DEBUG]       org.codehaus.plexus:plexus-io:jar:3.0.1:compile
[windows-jdk10] [INFO] [DEBUG]       org.apache.commons:commons-compress:jar:1.16.1:compile
[windows-jdk10] [INFO] [DEBUG]          org.objenesis:objenesis:jar:2.6:compile
[windows-jdk10] [INFO] [DEBUG]       org.iq80.snappy:snappy:jar:0.4:compile
[windows-jdk10] [INFO] [DEBUG]       org.tukaani:xz:jar:1.8:runtime
[windows-jdk10] [INFO] [DEBUG]    org.codehaus.plexus:plexus-utils:jar:3.1.0:compile
[windows-jdk10] [INFO] [DEBUG] Created new class realm plugin>org.apache.maven.plugins:maven-jar-plugin:3.1.1-SNAPSHOT
[windows-jdk10] [INFO] [DEBUG] Importing foreign packages into class realm plugin>org.apache.maven.plugins:maven-jar-plugin:3.1.1-SNAPSHOT
[windows-jdk10] [INFO] [DEBUG]   Imported:  < maven.api
[windows-jdk10] [INFO] [DEBUG] Populating class realm plugin>org.apache.maven.plugins:maven-jar-plugin:3.1.1-SNAPSHOT
[windows-jdk10] [INFO] [DEBUG]   Included: org.apache.maven.plugins:maven-jar-plugin:jar:3.1.1-SNAPSHOT
[windows-jdk10] [INFO] [DEBUG]   Included: org.sonatype.sisu:sisu-inject-bean:jar:1.4.2
[windows-jdk10] [INFO] [DEBUG]   Included: org.sonatype.sisu:sisu-guice:jar:noaop:2.1.7
[windows-jdk10] [INFO] [DEBUG]   Included: org.apache.maven:maven-aether-provider:jar:3.0
[windows-jdk10] [INFO] [DEBUG]   Included: org.sonatype.aether:aether-util:jar:1.7
[windows-jdk10] [INFO] [DEBUG]   Included: org.codehaus.plexus:plexus-interpolation:jar:1.14
[windows-jdk10] [INFO] [DEBUG]   Included: org.codehaus.plexus:plexus-component-annotations:jar:1.7.1
[windows-jdk10] [INFO] [DEBUG]   Included: org.sonatype.plexus:plexus-sec-dispatcher:jar:1.3
[windows-jdk10] [INFO] [DEBUG]   Included: org.sonatype.plexus:plexus-cipher:jar:1.4
[windows-jdk10] [INFO] [DEBUG]   Included: org.apache.maven:maven-archiver:jar:3.2.0
[windows-jdk10] [INFO] [DEBUG]   Included: org.apache.maven.shared:maven-shared-utils:jar:3.2.0
[windows-jdk10] [INFO] [DEBUG]   Included: commons-io:commons-io:jar:2.5
[windows-jdk10] [INFO] [DEBUG]   Included: org.codehaus.plexus:plexus-archiver:jar:3.6.0
[windows-jdk10] [INFO] [DEBUG]   Included: org.codehaus.plexus:plexus-io:jar:3.0.1
[windows-jdk10] [INFO] [DEBUG]   Included: org.apache.commons:commons-compress:jar:1.16.1
[windows-jdk10] [INFO] [DEBUG]   Included: org.objenesis:objenesis:jar:2.6
[windows-jdk10] [INFO] [DEBUG]   Included: org.iq80.snappy:snappy:jar:0.4
[windows-jdk10] [INFO] [DEBUG]   Included: org.tukaani:xz:jar:1.8
[windows-jdk10] [INFO] [DEBUG]   Included: org.codehaus.plexus:plexus-utils:jar:3.1.0
[windows-jdk10] [INFO] [DEBUG] Configuring mojo org.apache.maven.plugins:maven-jar-plugin:3.1.1-SNAPSHOT:jar from plugin realm ClassRealm[plugin>org.apache.maven.plugins:maven-jar-plugin:3.1.1-SNAPSHOT, parent: jdk.internal.loader.ClassLoaders$AppClassLoader@5ef04b5]
[windows-jdk10] [INFO] [DEBUG] Configuring mojo 'org.apache.maven.plugins:maven-jar-plugin:3.1.1-SNAPSHOT:jar' with basic configurator -->
[windows-jdk10] [INFO] [DEBUG]   (f) classesDirectory = F:\jenkins\jenkins-slave\workspace\box_maven-jar-plugin_master-EOL2JTSLPKWLYYEA7ISEGP2JMWPBRZU7FXH6EG3ZDZ25NFJIJ2HQ\m\target\it\project-004\target\classes
[windows-jdk10] [INFO] [DEBUG]   (f) finalName = maven-jar-plugin-test-project-004-99.0
[windows-jdk10] [INFO] [DEBUG]   (f) forceCreation = false
[windows-jdk10] [INFO] [DEBUG]   (f) outputDirectory = F:\jenkins\jenkins-slave\workspace\box_maven-jar-plugin_master-EOL2JTSLPKWLYYEA7ISEGP2JMWPBRZU7FXH6EG3ZDZ25NFJIJ2HQ\m\target\it\project-004\target
[windows-jdk10] [INFO] [DEBUG]   (f) project = MavenProject: org.apache.maven.plugins:maven-jar-plugin-test-project-004:99.0 @ F:\jenkins\jenkins-slave\workspace\box_maven-jar-plugin_master-EOL2JTSLPKWLYYEA7ISEGP2JMWPBRZU7FXH6EG3ZDZ25NFJIJ2HQ\m\target\it\project-004\pom.xml
[windows-jdk10] [INFO] [DEBUG]   (f) session = org.apache.maven.execution.MavenSession@4cb0a000
[windows-jdk10] [INFO] [DEBUG]   (f) skipIfEmpty = false
[windows-jdk10] [INFO] [DEBUG]   (f) useDefaultManifestFile = false
[windows-jdk10] [INFO] [DEBUG] -- end configuration --
[windows-jdk10] [INFO] [DEBUG] isUp2date: false (Destination F:\jenkins\jenkins-slave\workspace\box_maven-jar-plugin_master-EOL2JTSLPKWLYYEA7ISEGP2JMWPBRZU7FXH6EG3ZDZ25NFJIJ2HQ\m\target\it\project-004\target\maven-jar-plugin-test-project-004-99.0.jar not found.)
[windows-jdk10] [INFO] [INFO] Building jar: F:\jenkins\jenkins-slave\workspace\box_maven-jar-plugin_master-EOL2JTSLPKWLYYEA7ISEGP2JMWPBRZU7FXH6EG3ZDZ25NFJIJ2HQ\m\target\it\project-004\target\maven-jar-plugin-test-project-004-99.0.jar
[windows-jdk10] [INFO] [DEBUG] adding directory META-INF/
[windows-jdk10] [INFO] [DEBUG] adding entry META-INF/MANIFEST.MF
[windows-jdk10] [INFO] [DEBUG] adding directory service/
[windows-jdk10] [INFO] [DEBUG] adding directory service/impl/
[windows-jdk10] [INFO] [DEBUG] adding entry notIncluded.xml
[windows-jdk10] [INFO] [DEBUG] adding entry service/impl/TestImplementation.class
[windows-jdk10] [INFO] [DEBUG] adding entry service/TestInterface.class
[windows-jdk10] [INFO] [DEBUG] adding entry TestCompile1.class
[windows-jdk10] [INFO] [DEBUG] adding directory META-INF/maven/
[windows-jdk10] [INFO] [DEBUG] adding directory META-INF/maven/org.apache.maven.plugins/
[windows-jdk10] [INFO] [DEBUG] adding directory META-INF/maven/org.apache.maven.plugins/maven-jar-plugin-test-project-004/
[windows-jdk10] [INFO] [DEBUG] adding entry META-INF/maven/org.apache.maven.plugins/maven-jar-plugin-test-project-004/pom.xml
[windows-jdk10] [INFO] [DEBUG] adding entry META-INF/maven/org.apache.maven.plugins/maven-jar-plugin-test-project-004/pom.properties
[windows-jdk10] [INFO] [INFO]
[windows-jdk10] [INFO] [INFO] --- maven-jar-plugin:3.1.1-SNAPSHOT:jar (default) @ maven-jar-plugin-test-project-004 ---
[windows-jdk10] [INFO] [DEBUG] Configuring mojo org.apache.maven.plugins:maven-jar-plugin:3.1.1-SNAPSHOT:jar from plugin realm ClassRealm[plugin>org.apache.maven.plugins:maven-jar-plugin:3.1.1-SNAPSHOT, parent: jdk.internal.loader.ClassLoaders$AppClassLoader@5ef04b5]
[windows-jdk10] [INFO] [DEBUG] Configuring mojo 'org.apache.maven.plugins:maven-jar-plugin:3.1.1-SNAPSHOT:jar' with basic configurator -->
[windows-jdk10] [INFO] [DEBUG]   (f) classesDirectory = F:\jenkins\jenkins-slave\workspace\box_maven-jar-plugin_master-EOL2JTSLPKWLYYEA7ISEGP2JMWPBRZU7FXH6EG3ZDZ25NFJIJ2HQ\m\target\it\project-004\target\classes
[windows-jdk10] [INFO] [DEBUG]   (f) classifier = service
[windows-jdk10] [INFO] [DEBUG]   (f) finalName = maven-jar-plugin-test-project-004-99.0
[windows-jdk10] [INFO] [DEBUG]   (f) forceCreation = false
[windows-jdk10] [INFO] [DEBUG]   (f) includes = [**/service/*]
[windows-jdk10] [INFO] [DEBUG]   (f) outputDirectory = F:\jenkins\jenkins-slave\workspace\box_maven-jar-plugin_master-EOL2JTSLPKWLYYEA7ISEGP2JMWPBRZU7FXH6EG3ZDZ25NFJIJ2HQ\m\target\it\project-004\target
[windows-jdk10] [INFO] [DEBUG]   (f) project = MavenProject: org.apache.maven.plugins:maven-jar-plugin-test-project-004:99.0 @ F:\jenkins\jenkins-slave\workspace\box_maven-jar-plugin_master-EOL2JTSLPKWLYYEA7ISEGP2JMWPBRZU7FXH6EG3ZDZ25NFJIJ2HQ\m\target\it\project-004\pom.xml
[windows-jdk10] [INFO] [DEBUG]   (f) session = org.apache.maven.execution.MavenSession@4cb0a000
[windows-jdk10] [INFO] [DEBUG]   (f) skipIfEmpty = false
[windows-jdk10] [INFO] [DEBUG]   (f) useDefaultManifestFile = false
[windows-jdk10] [INFO] [DEBUG] -- end configuration --
[windows-jdk10] [INFO] [DEBUG] isUp2date: false (Destination F:\jenkins\jenkins-slave\workspace\box_maven-jar-plugin_master-EOL2JTSLPKWLYYEA7ISEGP2JMWPBRZU7FXH6EG3ZDZ25NFJIJ2HQ\m\target\it\project-004\target\maven-jar-plugin-test-project-004-99.0-service.jar not found.)
[windows-jdk10] [INFO] [INFO] Building jar: F:\jenkins\jenkins-slave\workspace\box_maven-jar-plugin_master-EOL2JTSLPKWLYYEA7ISEGP2JMWPBRZU7FXH6EG3ZDZ25NFJIJ2HQ\m\target\it\project-004\target\maven-jar-plugin-test-project-004-99.0-service.jar
[windows-jdk10] [INFO] [DEBUG] adding directory META-INF/
[windows-jdk10] [INFO] [DEBUG] adding entry META-INF/MANIFEST.MF
[windows-jdk10] [INFO] [DEBUG] adding directory service/
[windows-jdk10] [INFO] [DEBUG] adding directory service/impl/
[windows-jdk10] [INFO] [DEBUG] adding entry service/TestInterface.class
[windows-jdk10] [INFO] [DEBUG] adding directory META-INF/maven/
[windows-jdk10] [INFO] [DEBUG] adding directory META-INF/maven/org.apache.maven.plugins/
[windows-jdk10] [INFO] [DEBUG] adding directory META-INF/maven/org.apache.maven.plugins/maven-jar-plugin-test-project-004/
[windows-jdk10] [INFO] [DEBUG] adding entry META-INF/maven/org.apache.maven.plugins/maven-jar-plugin-test-project-004/pom.xml
[windows-jdk10] [INFO] [DEBUG] adding entry META-INF/maven/org.apache.maven.plugins/maven-jar-plugin-test-project-004/pom.properties
[windows-jdk10] [INFO] [INFO] ------------------------------------------------------------------------
[windows-jdk10] [INFO] [INFO] BUILD SUCCESS
[windows-jdk10] [INFO] [INFO] ------------------------------------------------------------------------
[windows-jdk10] [INFO] [INFO] Total time: 2.978 s
[windows-jdk10] [INFO] [INFO] Finished at: 2018-08-08T13:27:13-07:00
[windows-jdk10] [INFO] [INFO] Final Memory: 14M/54M
[windows-jdk10] [INFO] [INFO] ------------------------------------------------------------------------
[windows-jdk10] [INFO] run post-build script verify.bsh
[windows-jdk10] [INFO] Running post-build script: f:\jenkins\jenkins-slave\workspace\box_maven-jar-plugin_master-EOL2JTSLPKWLYYEA7ISEGP2JMWPBRZU7FXH6EG3ZDZ25NFJIJ2HQ\m\target\it\project-004\verify.bsh
[windows-jdk10] [INFO] Finished post-build script: f:\jenkins\jenkins-slave\workspace\box_maven-jar-plugin_master-EOL2JTSLPKWLYYEA7ISEGP2JMWPBRZU7FXH6EG3ZDZ25NFJIJ2HQ\m\target\it\project-004\verify.bsh
[windows-jdk10] [INFO]           project-004\pom.xml .............................. SUCCESS (6.4 s)
[windows-jdk10] [INFO]
[windows-jdk10] [INFO] --- maven-checkstyle-plugin:3.0.0:check (checkstyle-check) @ maven-jar-plugin ---
[windows-jdk10] [INFO] Downloading: https://repo.maven.apache.org/maven2/org/apache/maven/shared/maven-shared-resources/2/maven-shared-resources-2.pom
[windows-jdk10] [INFO] Downloaded: https://repo.maven.apache.org/maven2/org/apache/maven/shared/maven-shared-resources/2/maven-shared-resources-2.pom (3.0 kB at 129 kB/s)
[windows-jdk10] [INFO] Downloading: https://repo.maven.apache.org/maven2/org/codehaus/plexus/plexus-utils/3.0.10/plexus-utils-3.0.10.pom
[windows-jdk10] [INFO] Downloaded: https://repo.maven.apache.org/maven2/org/codehaus/plexus/plexus-utils/3.0.10/plexus-utils-3.0.10.pom (3.1 kB at 101 kB/s)
[windows-jdk10] [INFO] Downloading: https://repo.maven.apache.org/maven2/org/codehaus/plexus/plexus/3.3/plexus-3.3.pom
[windows-jdk10] [INFO] Downloaded: https://repo.maven.apache.org/maven2/org/codehaus/plexus/plexus/3.3/plexus-3.3.pom (20 kB at 765 kB/s)
[windows-jdk10] [INFO] Downloading: https://repo.maven.apache.org/maven2/org/apache/maven/doxia/doxia-integration-tools/1.6/doxia-integration-tools-1.6.pom
[windows-jdk10] [INFO] Downloaded: https://repo.maven.apache.org/maven2/org/apache/maven/doxia/doxia-integration-tools/1.6/doxia-integration-tools-1.6.pom (7.0 kB at 278 kB/s)
[windows-jdk10] [INFO] Downloading: https://repo.maven.apache.org/maven2/org/apache/maven/doxia/doxia-tools/3/doxia-tools-3.pom
[windows-jdk10] [INFO] Downloaded: https://repo.maven.apache.org/maven2/org/apache/maven/doxia/doxia-tools/3/doxia-tools-3.pom (9.9 kB at 414 kB/s)
[windows-jdk10] [INFO] Downloading: https://repo.maven.apache.org/maven2/org/codehaus/plexus/plexus-resources/1.1.0/plexus-resources-1.1.0.pom
[windows-jdk10] [INFO] Downloaded: https://repo.maven.apache.org/maven2/org/codehaus/plexus/plexus-resources/1.1.0/plexus-resources-1.1.0.pom (3.2 kB at 127 kB/s)
[windows-jdk10] [INFO] Downloading: https://repo.maven.apache.org/maven2/com/puppycrawl/tools/checkstyle/6.18/checkstyle-6.18.pom
[windows-jdk10] [INFO] Downloaded: https://repo.maven.apache.org/maven2/com/puppycrawl/tools/checkstyle/6.18/checkstyle-6.18.pom (71 kB at 2.1 MB/s)
[windows-jdk10] [INFO] Downloading: https://repo.maven.apache.org/maven2/antlr/antlr/2.7.7/antlr-2.7.7.pom
[windows-jdk10] [INFO] Downloaded: https://repo.maven.apache.org/maven2/antlr/antlr/2.7.7/antlr-2.7.7.pom (632 B at 27 kB/s)
[windows-jdk10] [INFO] Downloading: https://repo.maven.apache.org/maven2/org/antlr/antlr4-runtime/4.5.3/antlr4-runtime-4.5.3.pom
[windows-jdk10] [INFO] Downloaded: https://repo.maven.apache.org/maven2/org/antlr/antlr4-runtime/4.5.3/antlr4-runtime-4.5.3.pom (2.3 kB at 96 kB/s)
[windows-jdk10] [INFO] Downloading: https://repo.maven.apache.org/maven2/org/antlr/antlr4-master/4.5.3/antlr4-master-4.5.3.pom
[windows-jdk10] [INFO] Downloaded: https://repo.maven.apache.org/maven2/org/antlr/antlr4-master/4.5.3/antlr4-master-4.5.3.pom (3.7 kB at 167 kB/s)
[windows-jdk10] [INFO] Downloading: https://repo.maven.apache.org/maven2/commons-beanutils/commons-beanutils/1.9.2/commons-beanutils-1.9.2.pom
[windows-jdk10] [INFO] Downloaded: https://repo.maven.apache.org/maven2/commons-beanutils/commons-beanutils/1.9.2/commons-beanutils-1.9.2.pom (14 kB at 622 kB/s)
[windows-jdk10] [INFO] Downloading: https://repo.maven.apache.org/maven2/org/apache/commons/commons-parent/33/commons-parent-33.pom
[windows-jdk10] [INFO] Downloaded: https://repo.maven.apache.org/maven2/org/apache/commons/commons-parent/33/commons-parent-33.pom (53 kB at 1.2 MB/s)
[windows-jdk10] [INFO] Downloading: https://repo.maven.apache.org/maven2/commons-cli/commons-cli/1.3.1/commons-cli-1.3.1.pom
[windows-jdk10] [INFO] Downloaded: https://repo.maven.apache.org/maven2/commons-cli/commons-cli/1.3.1/commons-cli-1.3.1.pom (10 kB at 385 kB/s)
[windows-jdk10] [INFO] Downloading: https://repo.maven.apache.org/maven2/com/google/guava/guava/19.0/guava-19.0.pom
[windows-jdk10] [INFO] Downloaded: https://repo.maven.apache.org/maven2/com/google/guava/guava/19.0/guava-19.0.pom (6.8 kB at 283 kB/s)
[windows-jdk10] [INFO] Downloading: https://repo.maven.apache.org/maven2/com/google/guava/guava-parent/19.0/guava-parent-19.0.pom
[windows-jdk10] [INFO] Downloaded: https://repo.maven.apache.org/maven2/com/google/guava/guava-parent/19.0/guava-parent-19.0.pom (9.9 kB at 366 kB/s)
[windows-jdk10] [INFO] Downloading: https://repo.maven.apache.org/maven2/org/sonatype/oss/oss-parent/7/oss-parent-7.pom
[windows-jdk10] [INFO] Downloaded: https://repo.maven.apache.org/maven2/org/sonatype/oss/oss-parent/7/oss-parent-7.pom (4.8 kB at 179 kB/s)
[windows-jdk10] [INFO] Downloading: https://repo.maven.apache.org/maven2/javax/xml/bind/jaxb-api/2.3.0/jaxb-api-2.3.0.pom
[windows-jdk10] [INFO] Downloaded: https://repo.maven.apache.org/maven2/javax/xml/bind/jaxb-api/2.3.0/jaxb-api-2.3.0.pom (23 kB at 851 kB/s)
[windows-jdk10] [INFO] Downloading: https://repo.maven.apache.org/maven2/javax/xml/bind/jaxb-api-parent/2.3.0/jaxb-api-parent-2.3.0.pom
[windows-jdk10] [INFO] Downloaded: https://repo.maven.apache.org/maven2/javax/xml/bind/jaxb-api-parent/2.3.0/jaxb-api-parent-2.3.0.pom (5.6 kB at 226 kB/s)
[windows-jdk10] [INFO] Downloading: https://repo.maven.apache.org/maven2/net/java/jvnet-parent/5/jvnet-parent-5.pom
[windows-jdk10] [INFO] Downloaded: https://repo.maven.apache.org/maven2/net/java/jvnet-parent/5/jvnet-parent-5.pom (8.9 kB at 385 kB/s)
[windows-jdk10] [INFO] Downloading: https://repo.maven.apache.org/maven2/org/apache/maven/shared/maven-shared-resources/2/maven-shared-resources-2.jar
[windows-jdk10] [INFO] Downloading: https://repo.maven.apache.org/maven2/org/apache/maven/doxia/doxia-core/1.2/doxia-core-1.2.jar
[windows-jdk10] [INFO] Downloading: https://repo.maven.apache.org/maven2/commons-digester/commons-digester/1.6/commons-digester-1.6.jar
[windows-jdk10] [INFO] Downloading: https://repo.maven.apache.org/maven2/commons-logging/commons-logging/1.0.4/commons-logging-1.0.4.jar
[windows-jdk10] [INFO] Downloading: https://repo.maven.apache.org/maven2/org/apache/maven/doxia/doxia-integration-tools/1.6/doxia-integration-tools-1.6.jar
[windows-jdk10] [INFO] Downloaded: https://repo.maven.apache.org/maven2/commons-logging/commons-logging/1.0.4/commons-logging-1.0.4.jar (38 kB at 1.3 MB/s)
[windows-jdk10] [INFO] Downloading: https://repo.maven.apache.org/maven2/commons-io/commons-io/1.4/commons-io-1.4.jar
[windows-jdk10] [INFO] Downloaded: https://repo.maven.apache.org/maven2/commons-digester/commons-digester/1.6/commons-digester-1.6.jar (168 kB at 4.4 MB/s)
[windows-jdk10] [INFO] Downloading: https://repo.maven.apache.org/maven2/org/codehaus/plexus/plexus-resources/1.1.0/plexus-resources-1.1.0.jar
[windows-jdk10] [INFO] Downloaded: https://repo.maven.apache.org/maven2/org/apache/maven/doxia/doxia-core/1.2/doxia-core-1.2.jar (154 kB at 2.8 MB/s)
[windows-jdk10] [INFO] Downloading: https://repo.maven.apache.org/maven2/com/puppycrawl/tools/checkstyle/6.18/checkstyle-6.18.jar
[windows-jdk10] [INFO] Downloaded: https://repo.maven.apache.org/maven2/commons-io/commons-io/1.4/commons-io-1.4.jar (109 kB at 1.8 MB/s)
[windows-jdk10] [INFO] Downloading: https://repo.maven.apache.org/maven2/antlr/antlr/2.7.7/antlr-2.7.7.jar
[windows-jdk10] [INFO] Downloaded: https://repo.maven.apache.org/maven2/org/apache/maven/shared/maven-shared-resources/2/maven-shared-resources-2.jar (13 kB at 127 kB/s)
[windows-jdk10] [INFO] Downloading: https://repo.maven.apache.org/maven2/org/antlr/antlr4-runtime/4.5.3/antlr4-runtime-4.5.3.jar
[windows-jdk10] [INFO] Downloaded: https://repo.maven.apache.org/maven2/antlr/antlr/2.7.7/antlr-2.7.7.jar (445 kB at 4.2 MB/s)
[windows-jdk10] [INFO] Downloading: https://repo.maven.apache.org/maven2/commons-beanutils/commons-beanutils/1.9.2/commons-beanutils-1.9.2.jar
[windows-jdk10] [INFO] Downloaded: https://repo.maven.apache.org/maven2/org/antlr/antlr4-runtime/4.5.3/antlr4-runtime-4.5.3.jar (302 kB at 2.3 MB/s)
[windows-jdk10] [INFO] Downloading: https://repo.maven.apache.org/maven2/commons-cli/commons-cli/1.3.1/commons-cli-1.3.1.jar
[windows-jdk10] [INFO] Downloaded: https://repo.maven.apache.org/maven2/com/puppycrawl/tools/checkstyle/6.18/checkstyle-6.18.jar (1.2 MB at 7.9 MB/s)
[windows-jdk10] [INFO] Downloading: https://repo.maven.apache.org/maven2/com/google/guava/guava/19.0/guava-19.0.jar
[windows-jdk10] [INFO] Downloaded: https://repo.maven.apache.org/maven2/commons-beanutils/commons-beanutils/1.9.2/commons-beanutils-1.9.2.jar (234 kB at 1.6 MB/s)
[windows-jdk10] [INFO] Downloading: https://repo.maven.apache.org/maven2/commons-lang/commons-lang/2.1/commons-lang-2.1.jar
[windows-jdk10] [INFO] Downloaded: https://repo.maven.apache.org/maven2/commons-cli/commons-cli/1.3.1/commons-cli-1.3.1.jar (53 kB at 312 kB/s)
[windows-jdk10] [INFO] Downloading: https://repo.maven.apache.org/maven2/javax/xml/bind/jaxb-api/2.3.0/jaxb-api-2.3.0.jar
[windows-jdk10] [INFO] Downloaded: https://repo.maven.apache.org/maven2/commons-lang/commons-lang/2.1/commons-lang-2.1.jar (208 kB at 1.2 MB/s)
[windows-jdk10] [INFO] Downloaded: https://repo.maven.apache.org/maven2/javax/xml/bind/jaxb-api/2.3.0/jaxb-api-2.3.0.jar (126 kB at 658 kB/s)
[windows-jdk10] [INFO] Downloaded: https://repo.maven.apache.org/maven2/org/codehaus/plexus/plexus-resources/1.1.0/plexus-resources-1.1.0.jar (23 kB at 99 kB/s)
[windows-jdk10] [INFO] Downloaded: https://repo.maven.apache.org/maven2/com/google/guava/guava/19.0/guava-19.0.jar (2.3 MB at 9.3 MB/s)
[windows-jdk10] [INFO] Downloaded: https://repo.maven.apache.org/maven2/org/apache/maven/doxia/doxia-integration-tools/1.6/doxia-integration-tools-1.6.jar (45 kB at 160 kB/s)
[windows-jdk10] [INFO]
[windows-jdk10] [INFO] --- maven-invoker-plugin:3.1.0:verify (integration-test) @ maven-jar-plugin ---
[windows-jdk10] [INFO] -------------------------------------------------
[windows-jdk10] [INFO] Build Summary:
[windows-jdk10] [INFO]   Passed: 24, Failed: 0, Errors: 0, Skipped: 0
[windows-jdk10] [INFO] -------------------------------------------------
[windows-jdk10] [INFO] ------------------------------------------------------------------------
[windows-jdk10] [INFO] BUILD SUCCESS
[windows-jdk10] [INFO] ------------------------------------------------------------------------
[windows-jdk10] [INFO] Total time: 03:53 min
[windows-jdk10] [INFO] Finished at: 2018-08-08T13:27:17-07:00
[windows-jdk10] [INFO] Final Memory: 42M/147M
[windows-jdk10] [INFO] ------------------------------------------------------------------------
[windows-jdk10] [INFO] [jenkins-event-spy] Generated F:\jenkins\jenkins-slave\workspace\box_maven-jar-plugin_master-EOL2JTSLPKWLYYEA7ISEGP2JMWPBRZU7FXH6EG3ZDZ25NFJIJ2HQ@tmp\withMavenb90b3b47\maven-spy-20180808-132323-6777171740772528712296.log
[Pipeline] [windows-jdk10] }
[Pipeline] [windows-jdk10] // dir
[Pipeline] [windows-jdk10] }
[windows-jdk10] [withMaven] invokerPublisher - Archive invoker results for Maven artifact MavenArtifact{org.apache.maven.plugins:maven-jar-plugin::3.1.1-SNAPSHOT(version: 3.1.1-SNAPSHOT, snapshot:false) } generated by PluginInvocation{org.apache.maven.plugins:maven-invoker-plugin:3.1.0@integration-test  integration-test}: m\target\invoker-reports\*.xml
[windows-jdk10] performing MavenInvokerRecorder, reportsFilenamePattern:'**/m\target\invoker-reports/BUILD*.xml', invokerBuildDir:'**/m\target\it'
[windows-jdk10] Found reports:[f:\jenkins\jenkins-slave\workspace\box_maven-jar-plugin_master-EOL2JTSLPKWLYYEA7ISEGP2JMWPBRZU7FXH6EG3ZDZ25NFJIJ2HQ\m\target\invoker-reports\BUILD-MJAR-162.xml, f:\jenkins\jenkins-slave\workspace\box_maven-jar-plugin_master-EOL2JTSLPKWLYYEA7ISEGP2JMWPBRZU7FXH6EG3ZDZ25NFJIJ2HQ\m\target\invoker-reports\BUILD-MJAR-183.xml, f:\jenkins\jenkins-slave\workspace\box_maven-jar-plugin_master-EOL2JTSLPKWLYYEA7ISEGP2JMWPBRZU7FXH6EG3ZDZ25NFJIJ2HQ\m\target\invoker-reports\BUILD-MJAR-198.xml, f:\jenkins\jenkins-slave\workspace\box_maven-jar-plugin_master-EOL2JTSLPKWLYYEA7ISEGP2JMWPBRZU7FXH6EG3ZDZ25NFJIJ2HQ\m\target\invoker-reports\BUILD-MJAR-199-change-classifier.xml, f:\jenkins\jenkins-slave\workspace\box_maven-jar-plugin_master-EOL2JTSLPKWLYYEA7ISEGP2JMWPBRZU7FXH6EG3ZDZ25NFJIJ2HQ\m\target\invoker-reports\BUILD-MJAR-199.xml, f:\jenkins\jenkins-slave\workspace\box_maven-jar-plugin_master-EOL2JTSLPKWLYYEA7ISEGP2JMWPBRZU7FXH6EG3ZDZ25NFJIJ2HQ\m\target\invoker-reports\BUILD-MJAR-210.xml, f:\jenkins\jenkins-slave\workspace\box_maven-jar-plugin_master-EOL2JTSLPKWLYYEA7ISEGP2JMWPBRZU7FXH6EG3ZDZ25NFJIJ2HQ\m\target\invoker-reports\BUILD-MJAR-228.xml, f:\jenkins\jenkins-slave\workspace\box_maven-jar-plugin_master-EOL2JTSLPKWLYYEA7ISEGP2JMWPBRZU7FXH6EG3ZDZ25NFJIJ2HQ\m\target\invoker-reports\BUILD-MJAR-30-excludes.xml, f:\jenkins\jenkins-slave\workspace\box_maven-jar-plugin_master-EOL2JTSLPKWLYYEA7ISEGP2JMWPBRZU7FXH6EG3ZDZ25NFJIJ2HQ\m\target\invoker-reports\BUILD-MJAR-30-fullcontent.xml, f:\jenkins\jenkins-slave\workspace\box_maven-jar-plugin_master-EOL2JTSLPKWLYYEA7ISEGP2JMWPBRZU7FXH6EG3ZDZ25NFJIJ2HQ\m\target\invoker-reports\BUILD-MJAR-30-include.xml, f:\jenkins\jenkins-slave\workspace\box_maven-jar-plugin_master-EOL2JTSLPKWLYYEA7ISEGP2JMWPBRZU7FXH6EG3ZDZ25NFJIJ2HQ\m\target\invoker-reports\BUILD-MJAR-60.xml, f:\jenkins\jenkins-slave\workspace\box_maven-jar-plugin_master-EOL2JTSLPKWLYYEA7ISEGP2JMWPBRZU7FXH6EG3ZDZ25NFJIJ2HQ\m\target\invoker-reports\BUILD-MJAR-70-no-recreation.xml, f:\jenkins\jenkins-slave\workspace\box_maven-jar-plugin_master-EOL2JTSLPKWLYYEA7ISEGP2JMWPBRZU7FXH6EG3ZDZ25NFJIJ2HQ\m\target\invoker-reports\BUILD-MJAR-70-recreation.xml, f:\jenkins\jenkins-slave\workspace\box_maven-jar-plugin_master-EOL2JTSLPKWLYYEA7ISEGP2JMWPBRZU7FXH6EG3ZDZ25NFJIJ2HQ\m\target\invoker-reports\BUILD-MJAR-75.xml, f:\jenkins\jenkins-slave\workspace\box_maven-jar-plugin_master-EOL2JTSLPKWLYYEA7ISEGP2JMWPBRZU7FXH6EG3ZDZ25NFJIJ2HQ\m\target\invoker-reports\BUILD-MJAR-80-exclude.xml, f:\jenkins\jenkins-slave\workspace\box_maven-jar-plugin_master-EOL2JTSLPKWLYYEA7ISEGP2JMWPBRZU7FXH6EG3ZDZ25NFJIJ2HQ\m\target\invoker-reports\BUILD-MJAR-80-fullcontent.xml, f:\jenkins\jenkins-slave\workspace\box_maven-jar-plugin_master-EOL2JTSLPKWLYYEA7ISEGP2JMWPBRZU7FXH6EG3ZDZ25NFJIJ2HQ\m\target\invoker-reports\BUILD-MJAR-80-include.xml, f:\jenkins\jenkins-slave\workspace\box_maven-jar-plugin_master-EOL2JTSLPKWLYYEA7ISEGP2JMWPBRZU7FXH6EG3ZDZ25NFJIJ2HQ\m\target\invoker-reports\BUILD-MJAR-82.xml, f:\jenkins\jenkins-slave\workspace\box_maven-jar-plugin_master-EOL2JTSLPKWLYYEA7ISEGP2JMWPBRZU7FXH6EG3ZDZ25NFJIJ2HQ\m\target\invoker-reports\BUILD-manifest-content.xml, f:\jenkins\jenkins-slave\workspace\box_maven-jar-plugin_master-EOL2JTSLPKWLYYEA7ISEGP2JMWPBRZU7FXH6EG3ZDZ25NFJIJ2HQ\m\target\invoker-reports\BUILD-mjar-139.xml, f:\jenkins\jenkins-slave\workspace\box_maven-jar-plugin_master-EOL2JTSLPKWLYYEA7ISEGP2JMWPBRZU7FXH6EG3ZDZ25NFJIJ2HQ\m\target\invoker-reports\BUILD-mjar-71-01.xml, f:\jenkins\jenkins-slave\workspace\box_maven-jar-plugin_master-EOL2JTSLPKWLYYEA7ISEGP2JMWPBRZU7FXH6EG3ZDZ25NFJIJ2HQ\m\target\invoker-reports\BUILD-mjar-71-02.xml, f:\jenkins\jenkins-slave\workspace\box_maven-jar-plugin_master-EOL2JTSLPKWLYYEA7ISEGP2JMWPBRZU7FXH6EG3ZDZ25NFJIJ2HQ\m\target\invoker-reports\BUILD-mjar-90.xml, f:\jenkins\jenkins-slave\workspace\box_maven-jar-plugin_master-EOL2JTSLPKWLYYEA7ISEGP2JMWPBRZU7FXH6EG3ZDZ25NFJIJ2HQ\m\target\invoker-reports\BUILD-project-004.xml]
[windows-jdk10] Found logs:[f:\jenkins\jenkins-slave\workspace\box_maven-jar-plugin_master-EOL2JTSLPKWLYYEA7ISEGP2JMWPBRZU7FXH6EG3ZDZ25NFJIJ2HQ\m\target\it\MJAR-162\build.log, f:\jenkins\jenkins-slave\workspace\box_maven-jar-plugin_master-EOL2JTSLPKWLYYEA7ISEGP2JMWPBRZU7FXH6EG3ZDZ25NFJIJ2HQ\m\target\it\MJAR-183\build.log, f:\jenkins\jenkins-slave\workspace\box_maven-jar-plugin_master-EOL2JTSLPKWLYYEA7ISEGP2JMWPBRZU7FXH6EG3ZDZ25NFJIJ2HQ\m\target\it\MJAR-198\build.log, f:\jenkins\jenkins-slave\workspace\box_maven-jar-plugin_master-EOL2JTSLPKWLYYEA7ISEGP2JMWPBRZU7FXH6EG3ZDZ25NFJIJ2HQ\m\target\it\MJAR-199-change-classifier\build.log, f:\jenkins\jenkins-slave\workspace\box_maven-jar-plugin_master-EOL2JTSLPKWLYYEA7ISEGP2JMWPBRZU7FXH6EG3ZDZ25NFJIJ2HQ\m\target\it\MJAR-199\build.log, f:\jenkins\jenkins-slave\workspace\box_maven-jar-plugin_master-EOL2JTSLPKWLYYEA7ISEGP2JMWPBRZU7FXH6EG3ZDZ25NFJIJ2HQ\m\target\it\MJAR-210\build.log, f:\jenkins\jenkins-slave\workspace\box_maven-jar-plugin_master-EOL2JTSLPKWLYYEA7ISEGP2JMWPBRZU7FXH6EG3ZDZ25NFJIJ2HQ\m\target\it\MJAR-228\build.log, f:\jenkins\jenkins-slave\workspace\box_maven-jar-plugin_master-EOL2JTSLPKWLYYEA7ISEGP2JMWPBRZU7FXH6EG3ZDZ25NFJIJ2HQ\m\target\it\MJAR-30-excludes\build.log, f:\jenkins\jenkins-slave\workspace\box_maven-jar-plugin_master-EOL2JTSLPKWLYYEA7ISEGP2JMWPBRZU7FXH6EG3ZDZ25NFJIJ2HQ\m\target\it\MJAR-30-fullcontent\build.log, f:\jenkins\jenkins-slave\workspace\box_maven-jar-plugin_master-EOL2JTSLPKWLYYEA7ISEGP2JMWPBRZU7FXH6EG3ZDZ25NFJIJ2HQ\m\target\it\MJAR-30-include\build.log, f:\jenkins\jenkins-slave\workspace\box_maven-jar-plugin_master-EOL2JTSLPKWLYYEA7ISEGP2JMWPBRZU7FXH6EG3ZDZ25NFJIJ2HQ\m\target\it\MJAR-60\build.log, f:\jenkins\jenkins-slave\workspace\box_maven-jar-plugin_master-EOL2JTSLPKWLYYEA7ISEGP2JMWPBRZU7FXH6EG3ZDZ25NFJIJ2HQ\m\target\it\MJAR-70-no-recreation\build.log, f:\jenkins\jenkins-slave\workspace\box_maven-jar-plugin_master-EOL2JTSLPKWLYYEA7ISEGP2JMWPBRZU7FXH6EG3ZDZ25NFJIJ2HQ\m\target\it\MJAR-70-recreation\build.log, f:\jenkins\jenkins-slave\workspace\box_maven-jar-plugin_master-EOL2JTSLPKWLYYEA7ISEGP2JMWPBRZU7FXH6EG3ZDZ25NFJIJ2HQ\m\target\it\MJAR-75\build.log, f:\jenkins\jenkins-slave\workspace\box_maven-jar-plugin_master-EOL2JTSLPKWLYYEA7ISEGP2JMWPBRZU7FXH6EG3ZDZ25NFJIJ2HQ\m\target\it\MJAR-80-exclude\build.log, f:\jenkins\jenkins-slave\workspace\box_maven-jar-plugin_master-EOL2JTSLPKWLYYEA7ISEGP2JMWPBRZU7FXH6EG3ZDZ25NFJIJ2HQ\m\target\it\MJAR-80-fullcontent\build.log, f:\jenkins\jenkins-slave\workspace\box_maven-jar-plugin_master-EOL2JTSLPKWLYYEA7ISEGP2JMWPBRZU7FXH6EG3ZDZ25NFJIJ2HQ\m\target\it\MJAR-80-include\build.log, f:\jenkins\jenkins-slave\workspace\box_maven-jar-plugin_master-EOL2JTSLPKWLYYEA7ISEGP2JMWPBRZU7FXH6EG3ZDZ25NFJIJ2HQ\m\target\it\MJAR-82\build.log, f:\jenkins\jenkins-slave\workspace\box_maven-jar-plugin_master-EOL2JTSLPKWLYYEA7ISEGP2JMWPBRZU7FXH6EG3ZDZ25NFJIJ2HQ\m\target\it\manifest-content\build.log, f:\jenkins\jenkins-slave\workspace\box_maven-jar-plugin_master-EOL2JTSLPKWLYYEA7ISEGP2JMWPBRZU7FXH6EG3ZDZ25NFJIJ2HQ\m\target\it\mjar-139\build.log, f:\jenkins\jenkins-slave\workspace\box_maven-jar-plugin_master-EOL2JTSLPKWLYYEA7ISEGP2JMWPBRZU7FXH6EG3ZDZ25NFJIJ2HQ\m\target\it\mjar-71-01\build.log, f:\jenkins\jenkins-slave\workspace\box_maven-jar-plugin_master-EOL2JTSLPKWLYYEA7ISEGP2JMWPBRZU7FXH6EG3ZDZ25NFJIJ2HQ\m\target\it\mjar-71-02\build.log, f:\jenkins\jenkins-slave\workspace\box_maven-jar-plugin_master-EOL2JTSLPKWLYYEA7ISEGP2JMWPBRZU7FXH6EG3ZDZ25NFJIJ2HQ\m\target\it\mjar-90\build.log, f:\jenkins\jenkins-slave\workspace\box_maven-jar-plugin_master-EOL2JTSLPKWLYYEA7ISEGP2JMWPBRZU7FXH6EG3ZDZ25NFJIJ2HQ\m\target\it\project-004\build.log]
[windows-jdk10] Finished parsing Maven Invoker results (found 24)
[windows-jdk10] [withMaven] junitPublisher - Archive test results for Maven artifact org.apache.maven.plugins:maven-jar-plugin:3.1.1-SNAPSHOT generated by maven-surefire-plugin:test (default-test): m\target\surefire-reports\*.xml
[windows-jdk10] Recording test results
[Pipeline] [windows-jdk10] // withMaven
[Pipeline] [windows-jdk10] cleanWs
[windows-jdk10] [WS-CLEANUP] Deleting project workspace...[WS-CLEANUP] done
[Pipeline] [windows-jdk10] }
[Pipeline] [windows-jdk10] // stage
[Pipeline] [windows-jdk10] }
[Pipeline] [windows-jdk10] // node
[Pipeline] [windows-jdk10] }
[Pipeline] // parallel
[Pipeline] stage
[Pipeline] { (Notifications)
[Pipeline] echo
Build result: FAILURE
[Pipeline] jiraIssueSelector
[Pipeline] emailext
Reply | Threaded
Open this post in threaded view
|

Build failed in Jenkins: Maven TLP » maven-jar-plugin » master #27

Apache Jenkins Server-2
See https://builds.apache.org/job/maven-box/job/maven-jar-plugin/job/master/27/

No changes.

All tests passed

Build log:
[...truncated 28.42 MB...]
[windows-jdk10] [INFO] snapshots: [enabled => true, update => daily]
[windows-jdk10] [INFO]  releases: [enabled => true, update => daily]
[windows-jdk10] [INFO] ,       id: central
[windows-jdk10] [INFO]       url: https://repo.maven.apache.org/maven2
[windows-jdk10] [INFO]    layout: default
[windows-jdk10] [INFO] snapshots: [enabled => false, update => daily]
[windows-jdk10] [INFO]  releases: [enabled => true, update => never]
[windows-jdk10] [INFO] ]
[windows-jdk10] [INFO] [DEBUG]   (f) reportFormat = brief
[windows-jdk10] [INFO] [DEBUG]   (f) reportsDirectory = F:\jenkins\jenkins-slave\workspace\box_maven-jar-plugin_master-EOL2JTSLPKWLYYEA7ISEGP2JMWPBRZU7FXH6EG3ZDZ25NFJIJ2HQ\m\target\it\project-004\target\surefire-reports
[windows-jdk10] [INFO] [DEBUG]   (f) testClassesDirectory = F:\jenkins\jenkins-slave\workspace\box_maven-jar-plugin_master-EOL2JTSLPKWLYYEA7ISEGP2JMWPBRZU7FXH6EG3ZDZ25NFJIJ2HQ\m\target\it\project-004\target\test-classes
[windows-jdk10] [INFO] [DEBUG]   (f) testSourceDirectory = F:\jenkins\jenkins-slave\workspace\box_maven-jar-plugin_master-EOL2JTSLPKWLYYEA7ISEGP2JMWPBRZU7FXH6EG3ZDZ25NFJIJ2HQ\m\target\it\project-004\src\test\java
[windows-jdk10] [INFO] [DEBUG]   (f) threadCount = 5
[windows-jdk10] [INFO] [DEBUG]   (f) trimStackTrace = true
[windows-jdk10] [INFO] [DEBUG]   (f) useFile = true
[windows-jdk10] [INFO] [DEBUG]   (f) useSystemClassLoader = false
[windows-jdk10] [INFO] [DEBUG] -- end configuration --
[windows-jdk10] [INFO] [INFO] No tests to run.
[windows-jdk10] [INFO] [INFO]
[windows-jdk10] [INFO] [INFO] --- maven-jar-plugin:3.1.1-SNAPSHOT:jar (default-jar) @ maven-jar-plugin-test-project-004 ---
[windows-jdk10] [INFO] [DEBUG] Dependency collection stats: {ConflictMarker.analyzeTime=0, ConflictMarker.markTime=0, ConflictMarker.nodeCount=83, ConflictIdSorter.graphTime=1, ConflictIdSorter.topsortTime=0, ConflictIdSorter.conflictIdCount=32, ConflictIdSorter.conflictIdCycleCount=0, ConflictResolver.totalTime=1, ConflictResolver.conflictItemCount=75, DefaultDependencyCollector.collectTime=160, DefaultDependencyCollector.transformTime=2}
[windows-jdk10] [INFO] [DEBUG] org.apache.maven.plugins:maven-jar-plugin:jar:3.1.1-SNAPSHOT:
[windows-jdk10] [INFO] [DEBUG]    org.apache.maven:maven-plugin-api:jar:3.0:compile
[windows-jdk10] [INFO] [DEBUG]       org.apache.maven:maven-model:jar:3.0:compile
[windows-jdk10] [INFO] [DEBUG]       org.sonatype.sisu:sisu-inject-plexus:jar:1.4.2:compile
[windows-jdk10] [INFO] [DEBUG]          org.sonatype.sisu:sisu-inject-bean:jar:1.4.2:compile
[windows-jdk10] [INFO] [DEBUG]             org.sonatype.sisu:sisu-guice:jar:noaop:2.1.7:compile
[windows-jdk10] [INFO] [DEBUG]    org.apache.maven:maven-core:jar:3.0:compile
[windows-jdk10] [INFO] [DEBUG]       org.apache.maven:maven-settings:jar:3.0:compile
[windows-jdk10] [INFO] [DEBUG]       org.apache.maven:maven-settings-builder:jar:3.0:compile
[windows-jdk10] [INFO] [DEBUG]       org.apache.maven:maven-repository-metadata:jar:3.0:compile
[windows-jdk10] [INFO] [DEBUG]       org.apache.maven:maven-model-builder:jar:3.0:compile
[windows-jdk10] [INFO] [DEBUG]       org.apache.maven:maven-aether-provider:jar:3.0:runtime
[windows-jdk10] [INFO] [DEBUG]       org.sonatype.aether:aether-impl:jar:1.7:compile
[windows-jdk10] [INFO] [DEBUG]          org.sonatype.aether:aether-spi:jar:1.7:compile
[windows-jdk10] [INFO] [DEBUG]       org.sonatype.aether:aether-api:jar:1.7:compile
[windows-jdk10] [INFO] [DEBUG]       org.sonatype.aether:aether-util:jar:1.7:compile
[windows-jdk10] [INFO] [DEBUG]       org.codehaus.plexus:plexus-interpolation:jar:1.14:compile
[windows-jdk10] [INFO] [DEBUG]       org.codehaus.plexus:plexus-classworlds:jar:2.2.3:compile
[windows-jdk10] [INFO] [DEBUG]       org.codehaus.plexus:plexus-component-annotations:jar:1.7.1:compile
[windows-jdk10] [INFO] [DEBUG]       org.sonatype.plexus:plexus-sec-dispatcher:jar:1.3:compile
[windows-jdk10] [INFO] [DEBUG]          org.sonatype.plexus:plexus-cipher:jar:1.4:compile
[windows-jdk10] [INFO] [DEBUG]    org.apache.maven:maven-artifact:jar:3.0:compile
[windows-jdk10] [INFO] [DEBUG]    org.apache.maven:maven-archiver:jar:3.2.0:compile
[windows-jdk10] [INFO] [DEBUG]       org.apache.maven.shared:maven-shared-utils:jar:3.2.0:compile
[windows-jdk10] [INFO] [DEBUG]       commons-io:commons-io:jar:2.5:compile
[windows-jdk10] [INFO] [DEBUG]    org.codehaus.plexus:plexus-archiver:jar:3.6.0:compile
[windows-jdk10] [INFO] [DEBUG]       org.codehaus.plexus:plexus-io:jar:3.0.1:compile
[windows-jdk10] [INFO] [DEBUG]       org.apache.commons:commons-compress:jar:1.16.1:compile
[windows-jdk10] [INFO] [DEBUG]          org.objenesis:objenesis:jar:2.6:compile
[windows-jdk10] [INFO] [DEBUG]       org.iq80.snappy:snappy:jar:0.4:compile
[windows-jdk10] [INFO] [DEBUG]       org.tukaani:xz:jar:1.8:runtime
[windows-jdk10] [INFO] [DEBUG]    org.codehaus.plexus:plexus-utils:jar:3.1.0:compile
[windows-jdk10] [INFO] [DEBUG] Created new class realm plugin>org.apache.maven.plugins:maven-jar-plugin:3.1.1-SNAPSHOT
[windows-jdk10] [INFO] [DEBUG] Importing foreign packages into class realm plugin>org.apache.maven.plugins:maven-jar-plugin:3.1.1-SNAPSHOT
[windows-jdk10] [INFO] [DEBUG]   Imported:  < maven.api
[windows-jdk10] [INFO] [DEBUG] Populating class realm plugin>org.apache.maven.plugins:maven-jar-plugin:3.1.1-SNAPSHOT
[windows-jdk10] [INFO] [DEBUG]   Included: org.apache.maven.plugins:maven-jar-plugin:jar:3.1.1-SNAPSHOT
[windows-jdk10] [INFO] [DEBUG]   Included: org.sonatype.sisu:sisu-inject-bean:jar:1.4.2
[windows-jdk10] [INFO] [DEBUG]   Included: org.sonatype.sisu:sisu-guice:jar:noaop:2.1.7
[windows-jdk10] [INFO] [DEBUG]   Included: org.apache.maven:maven-aether-provider:jar:3.0
[windows-jdk10] [INFO] [DEBUG]   Included: org.sonatype.aether:aether-util:jar:1.7
[windows-jdk10] [INFO] [DEBUG]   Included: org.codehaus.plexus:plexus-interpolation:jar:1.14
[windows-jdk10] [INFO] [DEBUG]   Included: org.codehaus.plexus:plexus-component-annotations:jar:1.7.1
[windows-jdk10] [INFO] [DEBUG]   Included: org.sonatype.plexus:plexus-sec-dispatcher:jar:1.3
[windows-jdk10] [INFO] [DEBUG]   Included: org.sonatype.plexus:plexus-cipher:jar:1.4
[windows-jdk10] [INFO] [DEBUG]   Included: org.apache.maven:maven-archiver:jar:3.2.0
[windows-jdk10] [INFO] [DEBUG]   Included: org.apache.maven.shared:maven-shared-utils:jar:3.2.0
[windows-jdk10] [INFO] [DEBUG]   Included: commons-io:commons-io:jar:2.5
[windows-jdk10] [INFO] [DEBUG]   Included: org.codehaus.plexus:plexus-archiver:jar:3.6.0
[windows-jdk10] [INFO] [DEBUG]   Included: org.codehaus.plexus:plexus-io:jar:3.0.1
[windows-jdk10] [INFO] [DEBUG]   Included: org.apache.commons:commons-compress:jar:1.16.1
[windows-jdk10] [INFO] [DEBUG]   Included: org.objenesis:objenesis:jar:2.6
[windows-jdk10] [INFO] [DEBUG]   Included: org.iq80.snappy:snappy:jar:0.4
[windows-jdk10] [INFO] [DEBUG]   Included: org.tukaani:xz:jar:1.8
[windows-jdk10] [INFO] [DEBUG]   Included: org.codehaus.plexus:plexus-utils:jar:3.1.0
[windows-jdk10] [INFO] [DEBUG] Configuring mojo org.apache.maven.plugins:maven-jar-plugin:3.1.1-SNAPSHOT:jar from plugin realm ClassRealm[plugin>org.apache.maven.plugins:maven-jar-plugin:3.1.1-SNAPSHOT, parent: jdk.internal.loader.ClassLoaders$AppClassLoader@5ef04b5]
[windows-jdk10] [INFO] [DEBUG] Configuring mojo 'org.apache.maven.plugins:maven-jar-plugin:3.1.1-SNAPSHOT:jar' with basic configurator -->
[windows-jdk10] [INFO] [DEBUG]   (f) classesDirectory = F:\jenkins\jenkins-slave\workspace\box_maven-jar-plugin_master-EOL2JTSLPKWLYYEA7ISEGP2JMWPBRZU7FXH6EG3ZDZ25NFJIJ2HQ\m\target\it\project-004\target\classes
[windows-jdk10] [INFO] [DEBUG]   (f) finalName = maven-jar-plugin-test-project-004-99.0
[windows-jdk10] [INFO] [DEBUG]   (f) forceCreation = false
[windows-jdk10] [INFO] [DEBUG]   (f) outputDirectory = F:\jenkins\jenkins-slave\workspace\box_maven-jar-plugin_master-EOL2JTSLPKWLYYEA7ISEGP2JMWPBRZU7FXH6EG3ZDZ25NFJIJ2HQ\m\target\it\project-004\target
[windows-jdk10] [INFO] [DEBUG]   (f) project = MavenProject: org.apache.maven.plugins:maven-jar-plugin-test-project-004:99.0 @ F:\jenkins\jenkins-slave\workspace\box_maven-jar-plugin_master-EOL2JTSLPKWLYYEA7ISEGP2JMWPBRZU7FXH6EG3ZDZ25NFJIJ2HQ\m\target\it\project-004\pom.xml
[windows-jdk10] [INFO] [DEBUG]   (f) session = org.apache.maven.execution.MavenSession@4cb0a000
[windows-jdk10] [INFO] [DEBUG]   (f) skipIfEmpty = false
[windows-jdk10] [INFO] [DEBUG]   (f) useDefaultManifestFile = false
[windows-jdk10] [INFO] [DEBUG] -- end configuration --
[windows-jdk10] [INFO] [DEBUG] isUp2date: false (Destination F:\jenkins\jenkins-slave\workspace\box_maven-jar-plugin_master-EOL2JTSLPKWLYYEA7ISEGP2JMWPBRZU7FXH6EG3ZDZ25NFJIJ2HQ\m\target\it\project-004\target\maven-jar-plugin-test-project-004-99.0.jar not found.)
[windows-jdk10] [INFO] [INFO] Building jar: F:\jenkins\jenkins-slave\workspace\box_maven-jar-plugin_master-EOL2JTSLPKWLYYEA7ISEGP2JMWPBRZU7FXH6EG3ZDZ25NFJIJ2HQ\m\target\it\project-004\target\maven-jar-plugin-test-project-004-99.0.jar
[windows-jdk10] [INFO] [DEBUG] adding directory META-INF/
[windows-jdk10] [INFO] [DEBUG] adding entry META-INF/MANIFEST.MF
[windows-jdk10] [INFO] [DEBUG] adding directory service/
[windows-jdk10] [INFO] [DEBUG] adding directory service/impl/
[windows-jdk10] [INFO] [DEBUG] adding entry notIncluded.xml
[windows-jdk10] [INFO] [DEBUG] adding entry service/impl/TestImplementation.class
[windows-jdk10] [INFO] [DEBUG] adding entry service/TestInterface.class
[windows-jdk10] [INFO] [DEBUG] adding entry TestCompile1.class
[windows-jdk10] [INFO] [DEBUG] adding directory META-INF/maven/
[windows-jdk10] [INFO] [DEBUG] adding directory META-INF/maven/org.apache.maven.plugins/
[windows-jdk10] [INFO] [DEBUG] adding directory META-INF/maven/org.apache.maven.plugins/maven-jar-plugin-test-project-004/
[windows-jdk10] [INFO] [DEBUG] adding entry META-INF/maven/org.apache.maven.plugins/maven-jar-plugin-test-project-004/pom.xml
[windows-jdk10] [INFO] [DEBUG] adding entry META-INF/maven/org.apache.maven.plugins/maven-jar-plugin-test-project-004/pom.properties
[windows-jdk10] [INFO] [INFO]
[windows-jdk10] [INFO] [INFO] --- maven-jar-plugin:3.1.1-SNAPSHOT:jar (default) @ maven-jar-plugin-test-project-004 ---
[windows-jdk10] [INFO] [DEBUG] Configuring mojo org.apache.maven.plugins:maven-jar-plugin:3.1.1-SNAPSHOT:jar from plugin realm ClassRealm[plugin>org.apache.maven.plugins:maven-jar-plugin:3.1.1-SNAPSHOT, parent: jdk.internal.loader.ClassLoaders$AppClassLoader@5ef04b5]
[windows-jdk10] [INFO] [DEBUG] Configuring mojo 'org.apache.maven.plugins:maven-jar-plugin:3.1.1-SNAPSHOT:jar' with basic configurator -->
[windows-jdk10] [INFO] [DEBUG]   (f) classesDirectory = F:\jenkins\jenkins-slave\workspace\box_maven-jar-plugin_master-EOL2JTSLPKWLYYEA7ISEGP2JMWPBRZU7FXH6EG3ZDZ25NFJIJ2HQ\m\target\it\project-004\target\classes
[windows-jdk10] [INFO] [DEBUG]   (f) classifier = service
[windows-jdk10] [INFO] [DEBUG]   (f) finalName = maven-jar-plugin-test-project-004-99.0
[windows-jdk10] [INFO] [DEBUG]   (f) forceCreation = false
[windows-jdk10] [INFO] [DEBUG]   (f) includes = [**/service/*]
[windows-jdk10] [INFO] [DEBUG]   (f) outputDirectory = F:\jenkins\jenkins-slave\workspace\box_maven-jar-plugin_master-EOL2JTSLPKWLYYEA7ISEGP2JMWPBRZU7FXH6EG3ZDZ25NFJIJ2HQ\m\target\it\project-004\target
[windows-jdk10] [INFO] [DEBUG]   (f) project = MavenProject: org.apache.maven.plugins:maven-jar-plugin-test-project-004:99.0 @ F:\jenkins\jenkins-slave\workspace\box_maven-jar-plugin_master-EOL2JTSLPKWLYYEA7ISEGP2JMWPBRZU7FXH6EG3ZDZ25NFJIJ2HQ\m\target\it\project-004\pom.xml
[windows-jdk10] [INFO] [DEBUG]   (f) session = org.apache.maven.execution.MavenSession@4cb0a000
[windows-jdk10] [INFO] [DEBUG]   (f) skipIfEmpty = false
[windows-jdk10] [INFO] [DEBUG]   (f) useDefaultManifestFile = false
[windows-jdk10] [INFO] [DEBUG] -- end configuration --
[windows-jdk10] [INFO] [DEBUG] isUp2date: false (Destination F:\jenkins\jenkins-slave\workspace\box_maven-jar-plugin_master-EOL2JTSLPKWLYYEA7ISEGP2JMWPBRZU7FXH6EG3ZDZ25NFJIJ2HQ\m\target\it\project-004\target\maven-jar-plugin-test-project-004-99.0-service.jar not found.)
[windows-jdk10] [INFO] [INFO] Building jar: F:\jenkins\jenkins-slave\workspace\box_maven-jar-plugin_master-EOL2JTSLPKWLYYEA7ISEGP2JMWPBRZU7FXH6EG3ZDZ25NFJIJ2HQ\m\target\it\project-004\target\maven-jar-plugin-test-project-004-99.0-service.jar
[windows-jdk10] [INFO] [DEBUG] adding directory META-INF/
[windows-jdk10] [INFO] [DEBUG] adding entry META-INF/MANIFEST.MF
[windows-jdk10] [INFO] [DEBUG] adding directory service/
[windows-jdk10] [INFO] [DEBUG] adding directory service/impl/
[windows-jdk10] [INFO] [DEBUG] adding entry service/TestInterface.class
[windows-jdk10] [INFO] [DEBUG] adding directory META-INF/maven/
[windows-jdk10] [INFO] [DEBUG] adding directory META-INF/maven/org.apache.maven.plugins/
[windows-jdk10] [INFO] [DEBUG] adding directory META-INF/maven/org.apache.maven.plugins/maven-jar-plugin-test-project-004/
[windows-jdk10] [INFO] [DEBUG] adding entry META-INF/maven/org.apache.maven.plugins/maven-jar-plugin-test-project-004/pom.xml
[windows-jdk10] [INFO] [DEBUG] adding entry META-INF/maven/org.apache.maven.plugins/maven-jar-plugin-test-project-004/pom.properties
[windows-jdk10] [INFO] [INFO] ------------------------------------------------------------------------
[windows-jdk10] [INFO] [INFO] BUILD SUCCESS
[windows-jdk10] [INFO] [INFO] ------------------------------------------------------------------------
[windows-jdk10] [INFO] [INFO] Total time: 2.524 s
[windows-jdk10] [INFO] [INFO] Finished at: 2018-08-09T10:02:01-07:00
[windows-jdk10] [INFO] [INFO] Final Memory: 14M/54M
[windows-jdk10] [INFO] [INFO] ------------------------------------------------------------------------
[windows-jdk10] [INFO] run post-build script verify.bsh
[windows-jdk10] [INFO] Running post-build script: f:\jenkins\jenkins-slave\workspace\box_maven-jar-plugin_master-EOL2JTSLPKWLYYEA7ISEGP2JMWPBRZU7FXH6EG3ZDZ25NFJIJ2HQ\m\target\it\project-004\verify.bsh
[windows-jdk10] [INFO] Finished post-build script: f:\jenkins\jenkins-slave\workspace\box_maven-jar-plugin_master-EOL2JTSLPKWLYYEA7ISEGP2JMWPBRZU7FXH6EG3ZDZ25NFJIJ2HQ\m\target\it\project-004\verify.bsh
[windows-jdk10] [INFO]           project-004\pom.xml .............................. SUCCESS (5.8 s)
[windows-jdk10] [INFO]
[windows-jdk10] [INFO] --- maven-checkstyle-plugin:3.0.0:check (checkstyle-check) @ maven-jar-plugin ---
[windows-jdk10] [INFO] Downloading: https://repo.maven.apache.org/maven2/org/apache/maven/shared/maven-shared-resources/2/maven-shared-resources-2.pom
[windows-jdk10] [INFO] Downloaded: https://repo.maven.apache.org/maven2/org/apache/maven/shared/maven-shared-resources/2/maven-shared-resources-2.pom (3.0 kB at 134 kB/s)
[windows-jdk10] [INFO] Downloading: https://repo.maven.apache.org/maven2/org/codehaus/plexus/plexus-utils/3.0.10/plexus-utils-3.0.10.pom
[windows-jdk10] [INFO] Downloaded: https://repo.maven.apache.org/maven2/org/codehaus/plexus/plexus-utils/3.0.10/plexus-utils-3.0.10.pom (3.1 kB at 157 kB/s)
[windows-jdk10] [INFO] Downloading: https://repo.maven.apache.org/maven2/org/codehaus/plexus/plexus/3.3/plexus-3.3.pom
[windows-jdk10] [INFO] Downloaded: https://repo.maven.apache.org/maven2/org/codehaus/plexus/plexus/3.3/plexus-3.3.pom (20 kB at 948 kB/s)
[windows-jdk10] [INFO] Downloading: https://repo.maven.apache.org/maven2/org/apache/maven/doxia/doxia-integration-tools/1.6/doxia-integration-tools-1.6.pom
[windows-jdk10] [INFO] Downloaded: https://repo.maven.apache.org/maven2/org/apache/maven/doxia/doxia-integration-tools/1.6/doxia-integration-tools-1.6.pom (7.0 kB at 409 kB/s)
[windows-jdk10] [INFO] Downloading: https://repo.maven.apache.org/maven2/org/apache/maven/doxia/doxia-tools/3/doxia-tools-3.pom
[windows-jdk10] [INFO] Downloaded: https://repo.maven.apache.org/maven2/org/apache/maven/doxia/doxia-tools/3/doxia-tools-3.pom (9.9 kB at 432 kB/s)
[windows-jdk10] [INFO] Downloading: https://repo.maven.apache.org/maven2/org/codehaus/plexus/plexus-resources/1.1.0/plexus-resources-1.1.0.pom
[windows-jdk10] [INFO] Downloaded: https://repo.maven.apache.org/maven2/org/codehaus/plexus/plexus-resources/1.1.0/plexus-resources-1.1.0.pom (3.2 kB at 159 kB/s)
[windows-jdk10] [INFO] Downloading: https://repo.maven.apache.org/maven2/com/puppycrawl/tools/checkstyle/6.18/checkstyle-6.18.pom
[windows-jdk10] [INFO] Downloaded: https://repo.maven.apache.org/maven2/com/puppycrawl/tools/checkstyle/6.18/checkstyle-6.18.pom (71 kB at 2.4 MB/s)
[windows-jdk10] [INFO] Downloading: https://repo.maven.apache.org/maven2/antlr/antlr/2.7.7/antlr-2.7.7.pom
[windows-jdk10] [INFO] Downloaded: https://repo.maven.apache.org/maven2/antlr/antlr/2.7.7/antlr-2.7.7.pom (632 B at 33 kB/s)
[windows-jdk10] [INFO] Downloading: https://repo.maven.apache.org/maven2/org/antlr/antlr4-runtime/4.5.3/antlr4-runtime-4.5.3.pom
[windows-jdk10] [INFO] Downloaded: https://repo.maven.apache.org/maven2/org/antlr/antlr4-runtime/4.5.3/antlr4-runtime-4.5.3.pom (2.3 kB at 136 kB/s)
[windows-jdk10] [INFO] Downloading: https://repo.maven.apache.org/maven2/org/antlr/antlr4-master/4.5.3/antlr4-master-4.5.3.pom
[windows-jdk10] [INFO] Downloaded: https://repo.maven.apache.org/maven2/org/antlr/antlr4-master/4.5.3/antlr4-master-4.5.3.pom (3.7 kB at 205 kB/s)
[windows-jdk10] [INFO] Downloading: https://repo.maven.apache.org/maven2/commons-beanutils/commons-beanutils/1.9.2/commons-beanutils-1.9.2.pom
[windows-jdk10] [INFO] Downloaded: https://repo.maven.apache.org/maven2/commons-beanutils/commons-beanutils/1.9.2/commons-beanutils-1.9.2.pom (14 kB at 795 kB/s)
[windows-jdk10] [INFO] Downloading: https://repo.maven.apache.org/maven2/org/apache/commons/commons-parent/33/commons-parent-33.pom
[windows-jdk10] [INFO] Downloaded: https://repo.maven.apache.org/maven2/org/apache/commons/commons-parent/33/commons-parent-33.pom (53 kB at 2.8 MB/s)
[windows-jdk10] [INFO] Downloading: https://repo.maven.apache.org/maven2/commons-cli/commons-cli/1.3.1/commons-cli-1.3.1.pom
[windows-jdk10] [INFO] Downloaded: https://repo.maven.apache.org/maven2/commons-cli/commons-cli/1.3.1/commons-cli-1.3.1.pom (10 kB at 577 kB/s)
[windows-jdk10] [INFO] Downloading: https://repo.maven.apache.org/maven2/com/google/guava/guava/19.0/guava-19.0.pom
[windows-jdk10] [INFO] Downloaded: https://repo.maven.apache.org/maven2/com/google/guava/guava/19.0/guava-19.0.pom (6.8 kB at 453 kB/s)
[windows-jdk10] [INFO] Downloading: https://repo.maven.apache.org/maven2/com/google/guava/guava-parent/19.0/guava-parent-19.0.pom
[windows-jdk10] [INFO] Downloaded: https://repo.maven.apache.org/maven2/com/google/guava/guava-parent/19.0/guava-parent-19.0.pom (9.9 kB at 617 kB/s)
[windows-jdk10] [INFO] Downloading: https://repo.maven.apache.org/maven2/org/sonatype/oss/oss-parent/7/oss-parent-7.pom
[windows-jdk10] [INFO] Downloaded: https://repo.maven.apache.org/maven2/org/sonatype/oss/oss-parent/7/oss-parent-7.pom (4.8 kB at 210 kB/s)
[windows-jdk10] [INFO] Downloading: https://repo.maven.apache.org/maven2/javax/xml/bind/jaxb-api/2.3.0/jaxb-api-2.3.0.pom
[windows-jdk10] [INFO] Downloaded: https://repo.maven.apache.org/maven2/javax/xml/bind/jaxb-api/2.3.0/jaxb-api-2.3.0.pom (23 kB at 1.1 MB/s)
[windows-jdk10] [INFO] Downloading: https://repo.maven.apache.org/maven2/javax/xml/bind/jaxb-api-parent/2.3.0/jaxb-api-parent-2.3.0.pom
[windows-jdk10] [INFO] Downloaded: https://repo.maven.apache.org/maven2/javax/xml/bind/jaxb-api-parent/2.3.0/jaxb-api-parent-2.3.0.pom (5.6 kB at 297 kB/s)
[windows-jdk10] [INFO] Downloading: https://repo.maven.apache.org/maven2/net/java/jvnet-parent/5/jvnet-parent-5.pom
[windows-jdk10] [INFO] Downloaded: https://repo.maven.apache.org/maven2/net/java/jvnet-parent/5/jvnet-parent-5.pom (8.9 kB at 466 kB/s)
[windows-jdk10] [INFO] Downloading: https://repo.maven.apache.org/maven2/org/apache/maven/shared/maven-shared-resources/2/maven-shared-resources-2.jar
[windows-jdk10] [INFO] Downloading: https://repo.maven.apache.org/maven2/org/apache/maven/doxia/doxia-integration-tools/1.6/doxia-integration-tools-1.6.jar
[windows-jdk10] [INFO] Downloading: https://repo.maven.apache.org/maven2/org/apache/maven/doxia/doxia-core/1.2/doxia-core-1.2.jar
[windows-jdk10] [INFO] Downloading: https://repo.maven.apache.org/maven2/commons-logging/commons-logging/1.0.4/commons-logging-1.0.4.jar
[windows-jdk10] [INFO] Downloading: https://repo.maven.apache.org/maven2/commons-digester/commons-digester/1.6/commons-digester-1.6.jar
[windows-jdk10] [INFO] Downloaded: https://repo.maven.apache.org/maven2/org/apache/maven/doxia/doxia-core/1.2/doxia-core-1.2.jar (154 kB at 5.7 MB/s)
[windows-jdk10] [INFO] Downloading: https://repo.maven.apache.org/maven2/commons-io/commons-io/1.4/commons-io-1.4.jar
[windows-jdk10] [INFO] Downloaded: https://repo.maven.apache.org/maven2/commons-logging/commons-logging/1.0.4/commons-logging-1.0.4.jar (38 kB at 1.1 MB/s)
[windows-jdk10] [INFO] Downloading: https://repo.maven.apache.org/maven2/org/codehaus/plexus/plexus-resources/1.1.0/plexus-resources-1.1.0.jar
[windows-jdk10] [INFO] Downloaded: https://repo.maven.apache.org/maven2/commons-digester/commons-digester/1.6/commons-digester-1.6.jar (168 kB at 3.7 MB/s)
[windows-jdk10] [INFO] Downloading: https://repo.maven.apache.org/maven2/com/puppycrawl/tools/checkstyle/6.18/checkstyle-6.18.jar
[windows-jdk10] [INFO] Downloaded: https://repo.maven.apache.org/maven2/commons-io/commons-io/1.4/commons-io-1.4.jar (109 kB at 2.4 MB/s)
[windows-jdk10] [INFO] Downloading: https://repo.maven.apache.org/maven2/antlr/antlr/2.7.7/antlr-2.7.7.jar
[windows-jdk10] [INFO] Downloaded: https://repo.maven.apache.org/maven2/org/apache/maven/shared/maven-shared-resources/2/maven-shared-resources-2.jar (13 kB at 181 kB/s)
[windows-jdk10] [INFO] Downloading: https://repo.maven.apache.org/maven2/org/antlr/antlr4-runtime/4.5.3/antlr4-runtime-4.5.3.jar
[windows-jdk10] [INFO] Downloaded: https://repo.maven.apache.org/maven2/antlr/antlr/2.7.7/antlr-2.7.7.jar (445 kB at 5.1 MB/s)
[windows-jdk10] [INFO] Downloading: https://repo.maven.apache.org/maven2/commons-beanutils/commons-beanutils/1.9.2/commons-beanutils-1.9.2.jar
[windows-jdk10] [INFO] Downloaded: https://repo.maven.apache.org/maven2/org/antlr/antlr4-runtime/4.5.3/antlr4-runtime-4.5.3.jar (302 kB at 3.0 MB/s)
[windows-jdk10] [INFO] Downloading: https://repo.maven.apache.org/maven2/commons-cli/commons-cli/1.3.1/commons-cli-1.3.1.jar
[windows-jdk10] [INFO] Downloaded: https://repo.maven.apache.org/maven2/com/puppycrawl/tools/checkstyle/6.18/checkstyle-6.18.jar (1.2 MB at 11 MB/s)
[windows-jdk10] [INFO] Downloading: https://repo.maven.apache.org/maven2/com/google/guava/guava/19.0/guava-19.0.jar
[windows-jdk10] [INFO] Downloaded: https://repo.maven.apache.org/maven2/commons-beanutils/commons-beanutils/1.9.2/commons-beanutils-1.9.2.jar (234 kB at 2.1 MB/s)
[windows-jdk10] [INFO] Downloading: https://repo.maven.apache.org/maven2/commons-lang/commons-lang/2.1/commons-lang-2.1.jar
[windows-jdk10] [INFO] Downloaded: https://repo.maven.apache.org/maven2/commons-cli/commons-cli/1.3.1/commons-cli-1.3.1.jar (53 kB at 384 kB/s)
[windows-jdk10] [INFO] Downloading: https://repo.maven.apache.org/maven2/javax/xml/bind/jaxb-api/2.3.0/jaxb-api-2.3.0.jar
[windows-jdk10] [INFO] Downloaded: https://repo.maven.apache.org/maven2/commons-lang/commons-lang/2.1/commons-lang-2.1.jar (208 kB at 1.5 MB/s)
[windows-jdk10] [INFO] Downloaded: https://repo.maven.apache.org/maven2/javax/xml/bind/jaxb-api/2.3.0/jaxb-api-2.3.0.jar (126 kB at 805 kB/s)
[windows-jdk10] [INFO] Downloaded: https://repo.maven.apache.org/maven2/com/google/guava/guava/19.0/guava-19.0.jar (2.3 MB at 13 MB/s)
[windows-jdk10] [INFO] Downloaded: https://repo.maven.apache.org/maven2/org/codehaus/plexus/plexus-resources/1.1.0/plexus-resources-1.1.0.jar (23 kB at 109 kB/s)
[windows-jdk10] [INFO] Downloaded: https://repo.maven.apache.org/maven2/org/apache/maven/doxia/doxia-integration-tools/1.6/doxia-integration-tools-1.6.jar (45 kB at 175 kB/s)
[windows-jdk10] [INFO]
[windows-jdk10] [INFO] --- maven-invoker-plugin:3.1.0:verify (integration-test) @ maven-jar-plugin ---
[windows-jdk10] [INFO] -------------------------------------------------
[windows-jdk10] [INFO] Build Summary:
[windows-jdk10] [INFO]   Passed: 24, Failed: 0, Errors: 0, Skipped: 0
[windows-jdk10] [INFO] -------------------------------------------------
[windows-jdk10] [INFO] ------------------------------------------------------------------------
[windows-jdk10] [INFO] BUILD SUCCESS
[windows-jdk10] [INFO] ------------------------------------------------------------------------
[windows-jdk10] [INFO] Total time: 03:49 min
[windows-jdk10] [INFO] Finished at: 2018-08-09T10:02:04-07:00
[windows-jdk10] [INFO] Final Memory: 42M/147M
[windows-jdk10] [INFO] ------------------------------------------------------------------------
[windows-jdk10] [INFO] [jenkins-event-spy] Generated F:\jenkins\jenkins-slave\workspace\box_maven-jar-plugin_master-EOL2JTSLPKWLYYEA7ISEGP2JMWPBRZU7FXH6EG3ZDZ25NFJIJ2HQ@tmp\withMavenc1e42365\maven-spy-20180809-095815-17517213376861975803264.log
[Pipeline] [windows-jdk10] }
[Pipeline] [windows-jdk10] // dir
[Pipeline] [windows-jdk10] }
[windows-jdk10] [withMaven] invokerPublisher - Archive invoker results for Maven artifact MavenArtifact{org.apache.maven.plugins:maven-jar-plugin::3.1.1-SNAPSHOT(version: 3.1.1-SNAPSHOT, snapshot:false) } generated by PluginInvocation{org.apache.maven.plugins:maven-invoker-plugin:3.1.0@integration-test  integration-test}: m\target\invoker-reports\*.xml
[windows-jdk10] performing MavenInvokerRecorder, reportsFilenamePattern:'**/m\target\invoker-reports/BUILD*.xml', invokerBuildDir:'**/m\target\it'
[windows-jdk10] Found reports:[f:\jenkins\jenkins-slave\workspace\box_maven-jar-plugin_master-EOL2JTSLPKWLYYEA7ISEGP2JMWPBRZU7FXH6EG3ZDZ25NFJIJ2HQ\m\target\invoker-reports\BUILD-MJAR-162.xml, f:\jenkins\jenkins-slave\workspace\box_maven-jar-plugin_master-EOL2JTSLPKWLYYEA7ISEGP2JMWPBRZU7FXH6EG3ZDZ25NFJIJ2HQ\m\target\invoker-reports\BUILD-MJAR-183.xml, f:\jenkins\jenkins-slave\workspace\box_maven-jar-plugin_master-EOL2JTSLPKWLYYEA7ISEGP2JMWPBRZU7FXH6EG3ZDZ25NFJIJ2HQ\m\target\invoker-reports\BUILD-MJAR-198.xml, f:\jenkins\jenkins-slave\workspace\box_maven-jar-plugin_master-EOL2JTSLPKWLYYEA7ISEGP2JMWPBRZU7FXH6EG3ZDZ25NFJIJ2HQ\m\target\invoker-reports\BUILD-MJAR-199-change-classifier.xml, f:\jenkins\jenkins-slave\workspace\box_maven-jar-plugin_master-EOL2JTSLPKWLYYEA7ISEGP2JMWPBRZU7FXH6EG3ZDZ25NFJIJ2HQ\m\target\invoker-reports\BUILD-MJAR-199.xml, f:\jenkins\jenkins-slave\workspace\box_maven-jar-plugin_master-EOL2JTSLPKWLYYEA7ISEGP2JMWPBRZU7FXH6EG3ZDZ25NFJIJ2HQ\m\target\invoker-reports\BUILD-MJAR-210.xml, f:\jenkins\jenkins-slave\workspace\box_maven-jar-plugin_master-EOL2JTSLPKWLYYEA7ISEGP2JMWPBRZU7FXH6EG3ZDZ25NFJIJ2HQ\m\target\invoker-reports\BUILD-MJAR-228.xml, f:\jenkins\jenkins-slave\workspace\box_maven-jar-plugin_master-EOL2JTSLPKWLYYEA7ISEGP2JMWPBRZU7FXH6EG3ZDZ25NFJIJ2HQ\m\target\invoker-reports\BUILD-MJAR-30-excludes.xml, f:\jenkins\jenkins-slave\workspace\box_maven-jar-plugin_master-EOL2JTSLPKWLYYEA7ISEGP2JMWPBRZU7FXH6EG3ZDZ25NFJIJ2HQ\m\target\invoker-reports\BUILD-MJAR-30-fullcontent.xml, f:\jenkins\jenkins-slave\workspace\box_maven-jar-plugin_master-EOL2JTSLPKWLYYEA7ISEGP2JMWPBRZU7FXH6EG3ZDZ25NFJIJ2HQ\m\target\invoker-reports\BUILD-MJAR-30-include.xml, f:\jenkins\jenkins-slave\workspace\box_maven-jar-plugin_master-EOL2JTSLPKWLYYEA7ISEGP2JMWPBRZU7FXH6EG3ZDZ25NFJIJ2HQ\m\target\invoker-reports\BUILD-MJAR-60.xml, f:\jenkins\jenkins-slave\workspace\box_maven-jar-plugin_master-EOL2JTSLPKWLYYEA7ISEGP2JMWPBRZU7FXH6EG3ZDZ25NFJIJ2HQ\m\target\invoker-reports\BUILD-MJAR-70-no-recreation.xml, f:\jenkins\jenkins-slave\workspace\box_maven-jar-plugin_master-EOL2JTSLPKWLYYEA7ISEGP2JMWPBRZU7FXH6EG3ZDZ25NFJIJ2HQ\m\target\invoker-reports\BUILD-MJAR-70-recreation.xml, f:\jenkins\jenkins-slave\workspace\box_maven-jar-plugin_master-EOL2JTSLPKWLYYEA7ISEGP2JMWPBRZU7FXH6EG3ZDZ25NFJIJ2HQ\m\target\invoker-reports\BUILD-MJAR-75.xml, f:\jenkins\jenkins-slave\workspace\box_maven-jar-plugin_master-EOL2JTSLPKWLYYEA7ISEGP2JMWPBRZU7FXH6EG3ZDZ25NFJIJ2HQ\m\target\invoker-reports\BUILD-MJAR-80-exclude.xml, f:\jenkins\jenkins-slave\workspace\box_maven-jar-plugin_master-EOL2JTSLPKWLYYEA7ISEGP2JMWPBRZU7FXH6EG3ZDZ25NFJIJ2HQ\m\target\invoker-reports\BUILD-MJAR-80-fullcontent.xml, f:\jenkins\jenkins-slave\workspace\box_maven-jar-plugin_master-EOL2JTSLPKWLYYEA7ISEGP2JMWPBRZU7FXH6EG3ZDZ25NFJIJ2HQ\m\target\invoker-reports\BUILD-MJAR-80-include.xml, f:\jenkins\jenkins-slave\workspace\box_maven-jar-plugin_master-EOL2JTSLPKWLYYEA7ISEGP2JMWPBRZU7FXH6EG3ZDZ25NFJIJ2HQ\m\target\invoker-reports\BUILD-MJAR-82.xml, f:\jenkins\jenkins-slave\workspace\box_maven-jar-plugin_master-EOL2JTSLPKWLYYEA7ISEGP2JMWPBRZU7FXH6EG3ZDZ25NFJIJ2HQ\m\target\invoker-reports\BUILD-manifest-content.xml, f:\jenkins\jenkins-slave\workspace\box_maven-jar-plugin_master-EOL2JTSLPKWLYYEA7ISEGP2JMWPBRZU7FXH6EG3ZDZ25NFJIJ2HQ\m\target\invoker-reports\BUILD-mjar-139.xml, f:\jenkins\jenkins-slave\workspace\box_maven-jar-plugin_master-EOL2JTSLPKWLYYEA7ISEGP2JMWPBRZU7FXH6EG3ZDZ25NFJIJ2HQ\m\target\invoker-reports\BUILD-mjar-71-01.xml, f:\jenkins\jenkins-slave\workspace\box_maven-jar-plugin_master-EOL2JTSLPKWLYYEA7ISEGP2JMWPBRZU7FXH6EG3ZDZ25NFJIJ2HQ\m\target\invoker-reports\BUILD-mjar-71-02.xml, f:\jenkins\jenkins-slave\workspace\box_maven-jar-plugin_master-EOL2JTSLPKWLYYEA7ISEGP2JMWPBRZU7FXH6EG3ZDZ25NFJIJ2HQ\m\target\invoker-reports\BUILD-mjar-90.xml, f:\jenkins\jenkins-slave\workspace\box_maven-jar-plugin_master-EOL2JTSLPKWLYYEA7ISEGP2JMWPBRZU7FXH6EG3ZDZ25NFJIJ2HQ\m\target\invoker-reports\BUILD-project-004.xml]
[windows-jdk10] Found logs:[f:\jenkins\jenkins-slave\workspace\box_maven-jar-plugin_master-EOL2JTSLPKWLYYEA7ISEGP2JMWPBRZU7FXH6EG3ZDZ25NFJIJ2HQ\m\target\it\MJAR-162\build.log, f:\jenkins\jenkins-slave\workspace\box_maven-jar-plugin_master-EOL2JTSLPKWLYYEA7ISEGP2JMWPBRZU7FXH6EG3ZDZ25NFJIJ2HQ\m\target\it\MJAR-183\build.log, f:\jenkins\jenkins-slave\workspace\box_maven-jar-plugin_master-EOL2JTSLPKWLYYEA7ISEGP2JMWPBRZU7FXH6EG3ZDZ25NFJIJ2HQ\m\target\it\MJAR-198\build.log, f:\jenkins\jenkins-slave\workspace\box_maven-jar-plugin_master-EOL2JTSLPKWLYYEA7ISEGP2JMWPBRZU7FXH6EG3ZDZ25NFJIJ2HQ\m\target\it\MJAR-199-change-classifier\build.log, f:\jenkins\jenkins-slave\workspace\box_maven-jar-plugin_master-EOL2JTSLPKWLYYEA7ISEGP2JMWPBRZU7FXH6EG3ZDZ25NFJIJ2HQ\m\target\it\MJAR-199\build.log, f:\jenkins\jenkins-slave\workspace\box_maven-jar-plugin_master-EOL2JTSLPKWLYYEA7ISEGP2JMWPBRZU7FXH6EG3ZDZ25NFJIJ2HQ\m\target\it\MJAR-210\build.log, f:\jenkins\jenkins-slave\workspace\box_maven-jar-plugin_master-EOL2JTSLPKWLYYEA7ISEGP2JMWPBRZU7FXH6EG3ZDZ25NFJIJ2HQ\m\target\it\MJAR-228\build.log, f:\jenkins\jenkins-slave\workspace\box_maven-jar-plugin_master-EOL2JTSLPKWLYYEA7ISEGP2JMWPBRZU7FXH6EG3ZDZ25NFJIJ2HQ\m\target\it\MJAR-30-excludes\build.log, f:\jenkins\jenkins-slave\workspace\box_maven-jar-plugin_master-EOL2JTSLPKWLYYEA7ISEGP2JMWPBRZU7FXH6EG3ZDZ25NFJIJ2HQ\m\target\it\MJAR-30-fullcontent\build.log, f:\jenkins\jenkins-slave\workspace\box_maven-jar-plugin_master-EOL2JTSLPKWLYYEA7ISEGP2JMWPBRZU7FXH6EG3ZDZ25NFJIJ2HQ\m\target\it\MJAR-30-include\build.log, f:\jenkins\jenkins-slave\workspace\box_maven-jar-plugin_master-EOL2JTSLPKWLYYEA7ISEGP2JMWPBRZU7FXH6EG3ZDZ25NFJIJ2HQ\m\target\it\MJAR-60\build.log, f:\jenkins\jenkins-slave\workspace\box_maven-jar-plugin_master-EOL2JTSLPKWLYYEA7ISEGP2JMWPBRZU7FXH6EG3ZDZ25NFJIJ2HQ\m\target\it\MJAR-70-no-recreation\build.log, f:\jenkins\jenkins-slave\workspace\box_maven-jar-plugin_master-EOL2JTSLPKWLYYEA7ISEGP2JMWPBRZU7FXH6EG3ZDZ25NFJIJ2HQ\m\target\it\MJAR-70-recreation\build.log, f:\jenkins\jenkins-slave\workspace\box_maven-jar-plugin_master-EOL2JTSLPKWLYYEA7ISEGP2JMWPBRZU7FXH6EG3ZDZ25NFJIJ2HQ\m\target\it\MJAR-75\build.log, f:\jenkins\jenkins-slave\workspace\box_maven-jar-plugin_master-EOL2JTSLPKWLYYEA7ISEGP2JMWPBRZU7FXH6EG3ZDZ25NFJIJ2HQ\m\target\it\MJAR-80-exclude\build.log, f:\jenkins\jenkins-slave\workspace\box_maven-jar-plugin_master-EOL2JTSLPKWLYYEA7ISEGP2JMWPBRZU7FXH6EG3ZDZ25NFJIJ2HQ\m\target\it\MJAR-80-fullcontent\build.log, f:\jenkins\jenkins-slave\workspace\box_maven-jar-plugin_master-EOL2JTSLPKWLYYEA7ISEGP2JMWPBRZU7FXH6EG3ZDZ25NFJIJ2HQ\m\target\it\MJAR-80-include\build.log, f:\jenkins\jenkins-slave\workspace\box_maven-jar-plugin_master-EOL2JTSLPKWLYYEA7ISEGP2JMWPBRZU7FXH6EG3ZDZ25NFJIJ2HQ\m\target\it\MJAR-82\build.log, f:\jenkins\jenkins-slave\workspace\box_maven-jar-plugin_master-EOL2JTSLPKWLYYEA7ISEGP2JMWPBRZU7FXH6EG3ZDZ25NFJIJ2HQ\m\target\it\manifest-content\build.log, f:\jenkins\jenkins-slave\workspace\box_maven-jar-plugin_master-EOL2JTSLPKWLYYEA7ISEGP2JMWPBRZU7FXH6EG3ZDZ25NFJIJ2HQ\m\target\it\mjar-139\build.log, f:\jenkins\jenkins-slave\workspace\box_maven-jar-plugin_master-EOL2JTSLPKWLYYEA7ISEGP2JMWPBRZU7FXH6EG3ZDZ25NFJIJ2HQ\m\target\it\mjar-71-01\build.log, f:\jenkins\jenkins-slave\workspace\box_maven-jar-plugin_master-EOL2JTSLPKWLYYEA7ISEGP2JMWPBRZU7FXH6EG3ZDZ25NFJIJ2HQ\m\target\it\mjar-71-02\build.log, f:\jenkins\jenkins-slave\workspace\box_maven-jar-plugin_master-EOL2JTSLPKWLYYEA7ISEGP2JMWPBRZU7FXH6EG3ZDZ25NFJIJ2HQ\m\target\it\mjar-90\build.log, f:\jenkins\jenkins-slave\workspace\box_maven-jar-plugin_master-EOL2JTSLPKWLYYEA7ISEGP2JMWPBRZU7FXH6EG3ZDZ25NFJIJ2HQ\m\target\it\project-004\build.log]
[windows-jdk10] Finished parsing Maven Invoker results (found 24)
[windows-jdk10] [withMaven] junitPublisher - Archive test results for Maven artifact org.apache.maven.plugins:maven-jar-plugin:3.1.1-SNAPSHOT generated by maven-surefire-plugin:test (default-test): m\target\surefire-reports\*.xml
[windows-jdk10] Recording test results
[Pipeline] [windows-jdk10] // withMaven
[Pipeline] [windows-jdk10] cleanWs
[windows-jdk10] [WS-CLEANUP] Deleting project workspace...[WS-CLEANUP] done
[Pipeline] [windows-jdk10] }
[Pipeline] [windows-jdk10] // stage
[Pipeline] [windows-jdk10] }
[Pipeline] [windows-jdk10] // node
[Pipeline] [windows-jdk10] }
[Pipeline] // parallel
[Pipeline] stage
[Pipeline] { (Notifications)
[Pipeline] echo
Build result: FAILURE
[Pipeline] jiraIssueSelector
[Pipeline] emailext
Reply | Threaded
Open this post in threaded view
|

Build failed in Jenkins: Maven TLP » maven-jar-plugin » master #28

Apache Jenkins Server-2
See https://builds.apache.org/job/maven-box/job/maven-jar-plugin/job/master/28/

Changes:

* Upgrade latest version of Maven
* [INFRA-16893] set Windows to windows-2016-1 node
* Back to Windows label
* Windows + M3.5.x = M3.5.2
* [INFRA-16893] Trying workaround
* Revert "[INFRA-16893] Trying workaround"
* Try to display PATH value

All tests passed

Build log:
[...truncated 28.42 MB...]
[linux-jdk10] [INFO] [DEBUG]   (f) buildFilters = []
[linux-jdk10] [INFO] [DEBUG]   (f) escapeWindowsPaths = true
[linux-jdk10] [INFO] [DEBUG]   (s) includeEmptyDirs = false
[linux-jdk10] [INFO] [DEBUG]   (s) outputDirectory = /home/jenkins/jenkins-slave/workspace/box_maven-jar-plugin_master-EOL2JTSLPKWLYYEA7ISEGP2JMWPBRZU7FXH6EG3ZDZ25NFJIJ2HQ/m/target/it/MJAR-70-recreation/target/test-classes
[linux-jdk10] [INFO] [DEBUG]   (s) overwrite = false
[linux-jdk10] [INFO] [DEBUG]   (f) project = MavenProject: org.apache.maven.plugins:MJAR-70-recreation:1.0-SNAPSHOT @ /home/jenkins/jenkins-slave/workspace/box_maven-jar-plugin_master-EOL2JTSLPKWLYYEA7ISEGP2JMWPBRZU7FXH6EG3ZDZ25NFJIJ2HQ/m/target/it/MJAR-70-recreation/pom.xml
[linux-jdk10] [INFO] [DEBUG]   (s) resources = [Resource {targetPath: null, filtering: false, FileSet {directory: /home/jenkins/jenkins-slave/workspace/box_maven-jar-plugin_master-EOL2JTSLPKWLYYEA7ISEGP2JMWPBRZU7FXH6EG3ZDZ25NFJIJ2HQ/m/target/it/MJAR-70-recreation/src/test/resources, PatternSet [includes: {}, excludes: {}]}}]
[linux-jdk10] [INFO] [DEBUG]   (f) session = org.apache.maven.execution.MavenSession@4248e66b
[linux-jdk10] [INFO] [DEBUG]   (f) supportMultiLineFiltering = false
[linux-jdk10] [INFO] [DEBUG]   (f) useBuildFilters = true
[linux-jdk10] [INFO] [DEBUG]   (s) useDefaultDelimiters = true
[linux-jdk10] [INFO] [DEBUG] -- end configuration --
[linux-jdk10] [INFO] [DEBUG] properties used {java.specification.version=10, sun.cpu.isalist=, env.EXECUTOR_NUMBER=0, sun.arch.data.model=64, env.NIX_LABEL=ubuntu, java.vendor.url=http://java.oracle.com/, env.JENKINS_HOME=/x1/jenkins/jenkins-home, env.JOB_DISPLAY_URL=https://builds.apache.org/job/maven-box/job/maven-jar-plugin/job/master/display/redirect, sun.boot.library.path=/usr/local/asfpackages/java/jdk-10.0.1/lib, sun.java.command=org.codehaus.plexus.classworlds.launcher.Launcher -B -X -D maven.repo.local=/home/jenkins/jenkins-slave/workspace/box_maven-jar-plugin_master-EOL2JTSLPKWLYYEA7ISEGP2JMWPBRZU7FXH6EG3ZDZ25NFJIJ2HQ/m/target/local-repo -s /home/jenkins/jenkins-slave/workspace/box_maven-jar-plugin_master-EOL2JTSLPKWLYYEA7ISEGP2JMWPBRZU7FXH6EG3ZDZ25NFJIJ2HQ/m/target/it/interpolated-settings.xml -D maven.compiler.target=1.7 -D maven.compiler.source=1.7 clean integration-test package, jdk.debug=release, maven.version=3.5.4, java.specification.vendor=Oracle Corporation, java.version.date=2018-04-17, java.home=/usr/local/asfpackages/java/jdk-10.0.1, java.specification.name=Java Platform API Specification, java.vm.specification.vendor=Oracle Corporation, env.JENKINS_SERVER_COOKIE=durable-48121f0c345065ab3da7082890bc1cb7, sun.management.compiler=HotSpot 64-Bit Tiered Compilers, java.runtime.version=10.0.1+10, env.PATH=/home/jenkins/tools/java/latest10/bin:/home/jenkins/jenkins-slave/workspace/box_maven-jar-plugin_master-EOL2JTSLPKWLYYEA7ISEGP2JMWPBRZU7FXH6EG3ZDZ25NFJIJ2HQ@tmp/withMaven9a120971:/usr/local/sbin:/usr/local/bin:/usr/sbin:/usr/bin:/sbin:/bin:/usr/games:/usr/local/games:/snap/bin, env.MVN_CMD_DIR=/home/jenkins/jenkins-slave/workspace/box_maven-jar-plugin_master-EOL2JTSLPKWLYYEA7ISEGP2JMWPBRZU7FXH6EG3ZDZ25NFJIJ2HQ@tmp/withMaven9a120971, file.encoding=ISO-8859-1, java.vendor.version=18.3, env._=/home/jenkins/jenkins-slave/workspace/box_maven-jar-plugin_master-EOL2JTSLPKWLYYEA7ISEGP2JMWPBRZU7FXH6EG3ZDZ25NFJIJ2HQ@tmp/withMaven9a120971/mvn, env.SHLVL=2, java.io.tmpdir=/tmp, java.version=10.0.1, env.WORKSPACE=/home/jenkins/jenkins-slave/workspace/box_maven-jar-plugin_master-EOL2JTSLPKWLYYEA7ISEGP2JMWPBRZU7FXH6EG3ZDZ25NFJIJ2HQ, java.vm.specification.name=Java Virtual Machine Specification, java.awt.printerjob=sun.print.PSPrinterJob, env.BUILD_ID=28, env.JOB_NAME=maven-box/maven-jar-plugin/master, java.library.path=/usr/java/packages/lib:/usr/lib64:/lib64:/lib:/usr/lib, java.vendor=Oracle Corporation, classworlds.conf=/usr/local/asfpackages/maven/apache-maven-3.5.4/bin/m2.conf, env.HUDSON_HOME=/x1/jenkins/jenkins-home, env.XFILESEARCHPATH=/usr/dt/app-defaults/%L/Dt, sun.io.unicode.encoding=UnicodeLittle, env.LANG=en_US, env.SSH_CLIENT=195.201.170.234 41120 22, user.timezone=, env.RUN_DISPLAY_URL=https://builds.apache.org/job/maven-box/job/maven-jar-plugin/job/master/28/display/redirect, os.name=Linux, java.vm.specification.version=10, user.home=/home/jenkins, maven.compiler.source=1.7, env.SSH_CONNECTION=195.201.170.234 41120 67.195.81.179 22, env.HUDSON_COOKIE=48e4f051-43af-4154-97f9-116498cb7aa7, java.awt.graphicsenv=sun.awt.X11GraphicsEnvironment, env.JENKINS_URL=https://builds.apache.org/, path.separator=:, os.version=4.4.0-131-generic, env.MAIL=/var/mail/jenkins, env.NODE_NAME=H29, java.vm.name=Java HotSpot(TM) 64-Bit Server VM, env.SHELL=/bin/bash, maven.ext.class.path=/home/jenkins/jenkins-slave/workspace/box_maven-jar-plugin_master-EOL2JTSLPKWLYYEA7ISEGP2JMWPBRZU7FXH6EG3ZDZ25NFJIJ2HQ@tmp/withMaven9a120971/pipeline-maven-spy.jar, env.M2_HOME=/home/jenkins/tools/maven/apache-maven-3.5.4, env.MAVEN_CONFIG=--batch-mode --show-version "-Dmaven.repo.local=/home/jenkins/jenkins-slave/workspace/box_maven-jar-plugin_master-EOL2JTSLPKWLYYEA7ISEGP2JMWPBRZU7FXH6EG3ZDZ25NFJIJ2HQ/.repository" , os.arch=amd64, maven.multiModuleProjectDirectory=/home/jenkins/jenkins-slave/workspace/box_maven-jar-plugin_master-EOL2JTSLPKWLYYEA7ISEGP2JMWPBRZU7FXH6EG3ZDZ25NFJIJ2HQ/m/target/it/MJAR-70-recreation, env.MAVEN_PROJECTBASEDIR=/home/jenkins/jenkins-slave/workspace/box_maven-jar-plugin_master-EOL2JTSLPKWLYYEA7ISEGP2JMWPBRZU7FXH6EG3ZDZ25NFJIJ2HQ/m/target/it/MJAR-70-recreation, java.vm.info=mixed mode, env.USER=jenkins, java.class.version=54.0, awt.toolkit=sun.awt.X11.XToolkit, env.BUILD_TAG=jenkins-maven-box-maven-jar-plugin-master-28, sun.jnu.encoding=ISO-8859-1, env.HUDSON_URL=https://builds.apache.org/, maven.build.version=Apache Maven 3.5.4 (1edded0938998edf8bf061f1ceb3cfdeccf443fe; 2018-06-17T18:33:14Z), maven.home=/usr/local/asfpackages/maven/apache-maven-3.5.4, env.JENKINS_NODE_COOKIE=af3e25dd-ecdd-44fb-a1ca-b8cdc0621e34, env.JAVA_HOME=/home/jenkins/tools/java/latest10, file.separator=/, java.vm.compressedOopsMode=Zero based, line.separator=
[linux-jdk10] [INFO] , env.JAVA_TOOL_OPTIONS=-Dmaven.ext.class.path="/home/jenkins/jenkins-slave/workspace/box_maven-jar-plugin_master-EOL2JTSLPKWLYYEA7ISEGP2JMWPBRZU7FXH6EG3ZDZ25NFJIJ2HQ@tmp/withMaven9a120971/pipeline-maven-spy.jar" -Dorg.jenkinsci.plugins.pipeline.maven.reportsFolder="/home/jenkins/jenkins-slave/workspace/box_maven-jar-plugin_master-EOL2JTSLPKWLYYEA7ISEGP2JMWPBRZU7FXH6EG3ZDZ25NFJIJ2HQ@tmp/withMaven9a120971" , env.JENKINS_MAVEN_AGENT_DISABLED=true, user.name=jenkins, env.MAVEN_TERMINATE_CMD=on, env.BUILD_URL=https://builds.apache.org/job/maven-box/job/maven-jar-plugin/job/master/28/, env.LOGNAME=jenkins, env.JOB_URL=https://builds.apache.org/job/maven-box/job/maven-jar-plugin/job/master/, env.NODE_LABELS=H29 ubuntu xenial, env.XDG_RUNTIME_DIR=/run/user/910, env.RUN_CHANGES_DISPLAY_URL=https://builds.apache.org/job/maven-box/job/maven-jar-plugin/job/master/28/display/redirect?page=changes, sun.os.patch.level=unknown, maven.compiler.target=1.7, env.WIN_LABEL=Windows, library.jansi.path=/usr/local/asfpackages/maven/apache-maven-3.5.4/lib/jansi-native, maven.repo.local=/home/jenkins/jenkins-slave/workspace/box_maven-jar-plugin_master-EOL2JTSLPKWLYYEA7ISEGP2JMWPBRZU7FXH6EG3ZDZ25NFJIJ2HQ/m/target/local-repo, env.OLDPWD=/home/jenkins/jenkins-slave/workspace/box_maven-jar-plugin_master-EOL2JTSLPKWLYYEA7ISEGP2JMWPBRZU7FXH6EG3ZDZ25NFJIJ2HQ/m/target/it/MJAR-70-recreation, env.HUDSON_SERVER_COOKIE=f4ebd1e6b0d976e8, env.BUILD_NUMBER=28, env.PWD=/home/jenkins/jenkins-slave/workspace/box_maven-jar-plugin_master-EOL2JTSLPKWLYYEA7ISEGP2JMWPBRZU7FXH6EG3ZDZ25NFJIJ2HQ/m/target/it/MJAR-70-recreation, file.encoding.pkg=sun.io, java.class.path=/usr/local/asfpackages/maven/apache-maven-3.5.4/boot/plexus-classworlds-2.5.2.jar, env.HOME=/home/jenkins, java.vm.vendor="Oracle Corporation", maven.conf=/usr/local/asfpackages/maven/apache-maven-3.5.4/conf, org.jenkinsci.plugins.pipeline.maven.reportsFolder=/home/jenkins/jenkins-slave/workspace/box_maven-jar-plugin_master-EOL2JTSLPKWLYYEA7ISEGP2JMWPBRZU7FXH6EG3ZDZ25NFJIJ2HQ@tmp/withMaven9a120971, sun.java.launcher=SUN_STANDARD, user.country=US, env.BRANCH_NAME=master, sun.cpu.endian=little, user.language=en, env.NLSPATH=/usr/dt/lib/nls/msg/%L/%N.cat, env.MAVEN_HOME=/usr/local/asfpackages/maven/apache-maven-3.5.4, java.runtime.name=Java(TM) SE Runtime Environment, env.XDG_SESSION_ID=2, env.BUILD_DISPLAY_NAME=#28, env.STAGE_NAME=Build linux-jdk10, env.MVN_CMD=/home/jenkins/jenkins-slave/workspace/box_maven-jar-plugin_master-EOL2JTSLPKWLYYEA7ISEGP2JMWPBRZU7FXH6EG3ZDZ25NFJIJ2HQ@tmp/withMaven9a120971/mvn, env.MAVEN_CMD_LINE_ARGS=--batch-mode --show-version "-Dmaven.repo.local=/home/jenkins/jenkins-slave/workspace/box_maven-jar-plugin_master-EOL2JTSLPKWLYYEA7ISEGP2JMWPBRZU7FXH6EG3ZDZ25NFJIJ2HQ/.repository"  -B -X -D maven.repo.local=/home/jenkins/jenkins-slave/workspace/box_maven-jar-plugin_master-EOL2JTSLPKWLYYEA7ISEGP2JMWPBRZU7FXH6EG3ZDZ25NFJIJ2HQ/m/target/local-repo -s /home/jenkins/jenkins-slave/workspace/box_maven-jar-plugin_master-EOL2JTSLPKWLYYEA7ISEGP2JMWPBRZU7FXH6EG3ZDZ25NFJIJ2HQ/m/target/it/interpolated-settings.xml -D maven.compiler.target=1.7 -D maven.compiler.source=1.7 clean integration-test package, java.vendor.url.bug=http://bugreport.java.com/bugreport/, user.dir=/home/jenkins/jenkins-slave/workspace/box_maven-jar-plugin_master-EOL2JTSLPKWLYYEA7ISEGP2JMWPBRZU7FXH6EG3ZDZ25NFJIJ2HQ/m/target/it/MJAR-70-recreation, java.vm.version=10.0.1+10, env.JOB_BASE_NAME=master}
[linux-jdk10] [INFO] [WARNING] Using platform encoding (ISO-8859-1 actually) to copy filtered resources, i.e. build is platform dependent!
[linux-jdk10] [INFO] [DEBUG] resource with targetPath null
[linux-jdk10] [INFO] directory /home/jenkins/jenkins-slave/workspace/box_maven-jar-plugin_master-EOL2JTSLPKWLYYEA7ISEGP2JMWPBRZU7FXH6EG3ZDZ25NFJIJ2HQ/m/target/it/MJAR-70-recreation/src/test/resources
[linux-jdk10] [INFO] excludes []
[linux-jdk10] [INFO] includes []
[linux-jdk10] [INFO] [INFO] skip non existing resourceDirectory /home/jenkins/jenkins-slave/workspace/box_maven-jar-plugin_master-EOL2JTSLPKWLYYEA7ISEGP2JMWPBRZU7FXH6EG3ZDZ25NFJIJ2HQ/m/target/it/MJAR-70-recreation/src/test/resources
[linux-jdk10] [INFO] [DEBUG] no use filter components
[linux-jdk10] [INFO] [INFO]
[linux-jdk10] [INFO] [INFO] --- maven-compiler-plugin:3.1:testCompile (default-testCompile) @ MJAR-70-recreation ---
[linux-jdk10] [INFO] [DEBUG] Configuring mojo org.apache.maven.plugins:maven-compiler-plugin:3.1:testCompile from plugin realm ClassRealm[plugin>org.apache.maven.plugins:maven-compiler-plugin:3.1, parent: jdk.internal.loader.ClassLoaders$AppClassLoader@5387f9e0]
[linux-jdk10] [INFO] [DEBUG] Configuring mojo 'org.apache.maven.plugins:maven-compiler-plugin:3.1:testCompile' with basic configurator -->
[linux-jdk10] [INFO] [DEBUG]   (f) basedir = /home/jenkins/jenkins-slave/workspace/box_maven-jar-plugin_master-EOL2JTSLPKWLYYEA7ISEGP2JMWPBRZU7FXH6EG3ZDZ25NFJIJ2HQ/m/target/it/MJAR-70-recreation
[linux-jdk10] [INFO] [DEBUG]   (f) buildDirectory = /home/jenkins/jenkins-slave/workspace/box_maven-jar-plugin_master-EOL2JTSLPKWLYYEA7ISEGP2JMWPBRZU7FXH6EG3ZDZ25NFJIJ2HQ/m/target/it/MJAR-70-recreation/target
[linux-jdk10] [INFO] [DEBUG]   (f) classpathElements = [/home/jenkins/jenkins-slave/workspace/box_maven-jar-plugin_master-EOL2JTSLPKWLYYEA7ISEGP2JMWPBRZU7FXH6EG3ZDZ25NFJIJ2HQ/m/target/it/MJAR-70-recreation/target/test-classes, /home/jenkins/jenkins-slave/workspace/box_maven-jar-plugin_master-EOL2JTSLPKWLYYEA7ISEGP2JMWPBRZU7FXH6EG3ZDZ25NFJIJ2HQ/m/target/it/MJAR-70-recreation/target/classes]
[linux-jdk10] [INFO] [DEBUG]   (f) compileSourceRoots = [/home/jenkins/jenkins-slave/workspace/box_maven-jar-plugin_master-EOL2JTSLPKWLYYEA7ISEGP2JMWPBRZU7FXH6EG3ZDZ25NFJIJ2HQ/m/target/it/MJAR-70-recreation/src/test/java]
[linux-jdk10] [INFO] [DEBUG]   (f) compilerId = javac
[linux-jdk10] [INFO] [DEBUG]   (f) debug = true
[linux-jdk10] [INFO] [DEBUG]   (f) failOnError = true
[linux-jdk10] [INFO] [DEBUG]   (f) forceJavacCompilerUse = false
[linux-jdk10] [INFO] [DEBUG]   (f) fork = false
[linux-jdk10] [INFO] [DEBUG]   (f) generatedTestSourcesDirectory = /home/jenkins/jenkins-slave/workspace/box_maven-jar-plugin_master-EOL2JTSLPKWLYYEA7ISEGP2JMWPBRZU7FXH6EG3ZDZ25NFJIJ2HQ/m/target/it/MJAR-70-recreation/target/generated-test-sources/test-annotations
[linux-jdk10] [INFO] [DEBUG]   (f) mojoExecution = org.apache.maven.plugins:maven-compiler-plugin:3.1:testCompile {execution: default-testCompile}
[linux-jdk10] [INFO] [DEBUG]   (f) optimize = false
[linux-jdk10] [INFO] [DEBUG]   (f) outputDirectory = /home/jenkins/jenkins-slave/workspace/box_maven-jar-plugin_master-EOL2JTSLPKWLYYEA7ISEGP2JMWPBRZU7FXH6EG3ZDZ25NFJIJ2HQ/m/target/it/MJAR-70-recreation/target/test-classes
[linux-jdk10] [INFO] [DEBUG]   (f) showDeprecation = false
[linux-jdk10] [INFO] [DEBUG]   (f) showWarnings = false
[linux-jdk10] [INFO] [DEBUG]   (f) skipMultiThreadWarning = false
[linux-jdk10] [INFO] [DEBUG]   (f) source = 1.7
[linux-jdk10] [INFO] [DEBUG]   (f) staleMillis = 0
[linux-jdk10] [INFO] [DEBUG]   (f) target = 1.7
[linux-jdk10] [INFO] [DEBUG]   (f) useIncrementalCompilation = true
[linux-jdk10] [INFO] [DEBUG]   (f) verbose = false
[linux-jdk10] [INFO] [DEBUG]   (f) mavenSession = org.apache.maven.execution.MavenSession@4248e66b
[linux-jdk10] [INFO] [DEBUG]   (f) session = org.apache.maven.execution.MavenSession@4248e66b
[linux-jdk10] [INFO] [DEBUG] -- end configuration --
[linux-jdk10] [INFO] [DEBUG] Using compiler 'javac'.
[linux-jdk10] [INFO] [INFO] No sources to compile
[linux-jdk10] [INFO] [INFO]
[linux-jdk10] [INFO] [INFO] --- maven-surefire-plugin:2.12.4:test (default-test) @ MJAR-70-recreation ---
[linux-jdk10] [INFO] [DEBUG] Configuring mojo org.apache.maven.plugins:maven-surefire-plugin:2.12.4:test from plugin realm ClassRealm[plugin>org.apache.maven.plugins:maven-surefire-plugin:2.12.4, parent: jdk.internal.loader.ClassLoaders$AppClassLoader@5387f9e0]
[linux-jdk10] [INFO] [DEBUG] Configuring mojo 'org.apache.maven.plugins:maven-surefire-plugin:2.12.4:test' with basic configurator -->
[linux-jdk10] [INFO] [DEBUG]   (s) basedir = /home/jenkins/jenkins-slave/workspace/box_maven-jar-plugin_master-EOL2JTSLPKWLYYEA7ISEGP2JMWPBRZU7FXH6EG3ZDZ25NFJIJ2HQ/m/target/it/MJAR-70-recreation
[linux-jdk10] [INFO] [DEBUG]   (s) childDelegation = false
[linux-jdk10] [INFO] [DEBUG]   (s) classesDirectory = /home/jenkins/jenkins-slave/workspace/box_maven-jar-plugin_master-EOL2JTSLPKWLYYEA7ISEGP2JMWPBRZU7FXH6EG3ZDZ25NFJIJ2HQ/m/target/it/MJAR-70-recreation/target/classes
[linux-jdk10] [INFO] [DEBUG]   (s) disableXmlReport = false
[linux-jdk10] [INFO] [DEBUG]   (s) enableAssertions = true
[linux-jdk10] [INFO] [DEBUG]   (s) forkMode = once
[linux-jdk10] [INFO] [DEBUG]   (s) junitArtifactName = junit:junit
[linux-jdk10] [INFO] [DEBUG]   (s) localRepository =       id: local
[linux-jdk10] [INFO]       url: file:///home/jenkins/jenkins-slave/workspace/box_maven-jar-plugin_master-EOL2JTSLPKWLYYEA7ISEGP2JMWPBRZU7FXH6EG3ZDZ25NFJIJ2HQ/m/target/local-repo/
[linux-jdk10] [INFO]    layout: default
[linux-jdk10] [INFO] snapshots: [enabled => true, update => always]
[linux-jdk10] [INFO]  releases: [enabled => true, update => always]
[linux-jdk10] [INFO]
[linux-jdk10] [INFO] [DEBUG]   (f) parallelMavenExecution = false
[linux-jdk10] [INFO] [DEBUG]   (s) perCoreThreadCount = true
[linux-jdk10] [INFO] [DEBUG]   (s) pluginArtifactMap = {org.apache.maven.plugins:maven-surefire-plugin=org.apache.maven.plugins:maven-surefire-plugin:maven-plugin:2.12.4:, org.apache.maven:maven-plugin-api=org.apache.maven:maven-plugin-api:jar:2.0.9:compile, org.apache.maven.surefire:surefire-booter=org.apache.maven.surefire:surefire-booter:jar:2.12.4:compile, org.apache.maven.surefire:surefire-api=org.apache.maven.surefire:surefire-api:jar:2.12.4:compile, org.apache.maven.surefire:maven-surefire-common=org.apache.maven.surefire:maven-surefire-common:jar:2.12.4:compile, org.apache.commons:commons-lang3=org.apache.commons:commons-lang3:jar:3.1:compile, org.apache.maven.shared:maven-common-artifact-filters=org.apache.maven.shared:maven-common-artifact-filters:jar:1.3:compile, org.codehaus.plexus:plexus-utils=org.codehaus.plexus:plexus-utils:jar:3.0.8:compile, org.apache.maven:maven-artifact=org.apache.maven:maven-artifact:jar:2.0.9:compile, org.apache.maven:maven-project=org.apache.maven:maven-project:jar:2.0.9:compile, org.apache.maven:maven-settings=org.apache.maven:maven-settings:jar:2.0.9:compile, org.apache.maven:maven-profile=org.apache.maven:maven-profile:jar:2.0.9:compile, org.apache.maven:maven-model=org.apache.maven:maven-model:jar:2.0.9:compile, org.apache.maven:maven-artifact-manager=org.apache.maven:maven-artifact-manager:jar:2.0.9:compile, org.apache.maven:maven-plugin-registry=org.apache.maven:maven-plugin-registry:jar:2.0.9:compile, org.codehaus.plexus:plexus-container-default=org.codehaus.plexus:plexus-container-default:jar:1.0-alpha-9-stable-1:compile, org.apache.maven:maven-core=org.apache.maven:maven-core:jar:2.0.9:compile, org.apache.maven:maven-plugin-parameter-documenter=org.apache.maven:maven-plugin-parameter-documenter:jar:2.0.9:compile, org.apache.maven.reporting:maven-reporting-api=org.apache.maven.reporting:maven-reporting-api:jar:2.0.9:compile, org.apache.maven:maven-repository-metadata=org.apache.maven:maven-repository-metadata:jar:2.0.9:compile, org.apache.maven:maven-error-diagnostics=org.apache.maven:maven-error-diagnostics:jar:2.0.9:compile, org.apache.maven:maven-plugin-descriptor=org.apache.maven:maven-plugin-descriptor:jar:2.0.9:compile, org.apache.maven:maven-monitor=org.apache.maven:maven-monitor:jar:2.0.9:compile, classworlds:classworlds=classworlds:classworlds:jar:1.1:compile, org.apache.maven:maven-toolchain=org.apache.maven:maven-toolchain:jar:2.0.9:compile, org.apache.maven.plugin-tools:maven-plugin-annotations=org.apache.maven.plugin-tools:maven-plugin-annotations:jar:3.1:compile}
[linux-jdk10] [INFO] [DEBUG]   (f) pluginDescriptor = Component Descriptor: role: 'org.apache.maven.plugin.Mojo', implementation: 'org.apache.maven.plugin.surefire.HelpMojo', role hint: 'org.apache.maven.plugins:maven-surefire-plugin:2.12.4:help'
[linux-jdk10] [INFO] role: 'org.apache.maven.plugin.Mojo', implementation: 'org.apache.maven.plugin.surefire.SurefirePlugin', role hint: 'org.apache.maven.plugins:maven-surefire-plugin:2.12.4:test'
[linux-jdk10] [INFO] ---
[linux-jdk10] [INFO] [DEBUG]   (s) printSummary = true
[linux-jdk10] [INFO] [DEBUG]   (s) projectArtifactMap = {}
[linux-jdk10] [INFO] [DEBUG]   (s) redirectTestOutputToFile = false
[linux-jdk10] [INFO] [DEBUG]   (s) remoteRepositories = [      id: local.central
[linux-jdk10] [INFO]       url: file:///home/jenkins/jenkins-slave/workspace/box_maven-jar-plugin_master-EOL2JTSLPKWLYYEA7ISEGP2JMWPBRZU7FXH6EG3ZDZ25NFJIJ2HQ/.repository
[linux-jdk10] [INFO]    layout: default
[linux-jdk10] [INFO] snapshots: [enabled => true, update => daily]
[linux-jdk10] [INFO]  releases: [enabled => true, update => daily]
[linux-jdk10] [INFO] ,       id: central
[linux-jdk10] [INFO]       url: https://repo.maven.apache.org/maven2
[linux-jdk10] [INFO]    layout: default
[linux-jdk10] [INFO] snapshots: [enabled => false, update => daily]
[linux-jdk10] [INFO]  releases: [enabled => true, update => never]
[linux-jdk10] [INFO] ]
[linux-jdk10] [INFO] [DEBUG]   (s) reportFormat = brief
[linux-jdk10] [INFO] [DEBUG]   (s) reportsDirectory = /home/jenkins/jenkins-slave/workspace/box_maven-jar-plugin_master-EOL2JTSLPKWLYYEA7ISEGP2JMWPBRZU7FXH6EG3ZDZ25NFJIJ2HQ/m/target/it/MJAR-70-recreation/target/surefire-reports
[linux-jdk10] [INFO] [DEBUG]   (s) runOrder = filesystem
[linux-jdk10] [INFO] [DEBUG]   (s) skip = false
[linux-jdk10] [INFO] [DEBUG]   (s) skipTests = false
[linux-jdk10] [INFO] [DEBUG]   (s) testClassesDirectory = /home/jenkins/jenkins-slave/workspace/box_maven-jar-plugin_master-EOL2JTSLPKWLYYEA7ISEGP2JMWPBRZU7FXH6EG3ZDZ25NFJIJ2HQ/m/target/it/MJAR-70-recreation/target/test-classes
[linux-jdk10] [INFO] [DEBUG]   (s) testFailureIgnore = false
[linux-jdk10] [INFO] [DEBUG]   (s) testNGArtifactName = org.testng:testng
[linux-jdk10] [INFO] [DEBUG]   (s) testSourceDirectory = /home/jenkins/jenkins-slave/workspace/box_maven-jar-plugin_master-EOL2JTSLPKWLYYEA7ISEGP2JMWPBRZU7FXH6EG3ZDZ25NFJIJ2HQ/m/target/it/MJAR-70-recreation/src/test/java
[linux-jdk10] [INFO] [DEBUG]   (s) trimStackTrace = true
[linux-jdk10] [INFO] [DEBUG]   (s) useFile = true
[linux-jdk10] [INFO] [DEBUG]   (s) useManifestOnlyJar = true
[linux-jdk10] [INFO] [DEBUG]   (s) useSystemClassLoader = true
[linux-jdk10] [INFO] [DEBUG]   (s) useUnlimitedThreads = false
[linux-jdk10] [INFO] [DEBUG]   (s) workingDirectory = /home/jenkins/jenkins-slave/workspace/box_maven-jar-plugin_master-EOL2JTSLPKWLYYEA7ISEGP2JMWPBRZU7FXH6EG3ZDZ25NFJIJ2HQ/m/target/it/MJAR-70-recreation
[linux-jdk10] [INFO] [DEBUG]   (s) project = MavenProject: org.apache.maven.plugins:MJAR-70-recreation:1.0-SNAPSHOT @ /home/jenkins/jenkins-slave/workspace/box_maven-jar-plugin_master-EOL2JTSLPKWLYYEA7ISEGP2JMWPBRZU7FXH6EG3ZDZ25NFJIJ2HQ/m/target/it/MJAR-70-recreation/pom.xml
[linux-jdk10] [INFO] [DEBUG]   (s) session = org.apache.maven.execution.MavenSession@4248e66b
[linux-jdk10] [INFO] [DEBUG] -- end configuration --
[linux-jdk10] [INFO] [INFO] No tests to run.
[linux-jdk10] [INFO] [INFO] Skipping execution of surefire because it has already been run for this configuration
[linux-jdk10] [INFO] [INFO]
[linux-jdk10] [INFO] [INFO] --- maven-jar-plugin:3.1.1-SNAPSHOT:jar (default-jar) @ MJAR-70-recreation ---
[linux-jdk10] [INFO] [DEBUG] Configuring mojo org.apache.maven.plugins:maven-jar-plugin:3.1.1-SNAPSHOT:jar from plugin realm ClassRealm[plugin>org.apache.maven.plugins:maven-jar-plugin:3.1.1-SNAPSHOT, parent: jdk.internal.loader.ClassLoaders$AppClassLoader@5387f9e0]
[linux-jdk10] [INFO] [DEBUG] Configuring mojo 'org.apache.maven.plugins:maven-jar-plugin:3.1.1-SNAPSHOT:jar' with basic configurator -->
[linux-jdk10] [INFO] [DEBUG]   (f) classesDirectory = /home/jenkins/jenkins-slave/workspace/box_maven-jar-plugin_master-EOL2JTSLPKWLYYEA7ISEGP2JMWPBRZU7FXH6EG3ZDZ25NFJIJ2HQ/m/target/it/MJAR-70-recreation/target/classes
[linux-jdk10] [INFO] [DEBUG]   (f) finalName = MJAR-70-recreation-1.0-SNAPSHOT
[linux-jdk10] [INFO] [DEBUG]   (f) forceCreation = true
[linux-jdk10] [INFO] [DEBUG]   (f) outputDirectory = /home/jenkins/jenkins-slave/workspace/box_maven-jar-plugin_master-EOL2JTSLPKWLYYEA7ISEGP2JMWPBRZU7FXH6EG3ZDZ25NFJIJ2HQ/m/target/it/MJAR-70-recreation/target
[linux-jdk10] [INFO] [DEBUG]   (f) project = MavenProject: org.apache.maven.plugins:MJAR-70-recreation:1.0-SNAPSHOT @ /home/jenkins/jenkins-slave/workspace/box_maven-jar-plugin_master-EOL2JTSLPKWLYYEA7ISEGP2JMWPBRZU7FXH6EG3ZDZ25NFJIJ2HQ/m/target/it/MJAR-70-recreation/pom.xml
[linux-jdk10] [INFO] [DEBUG]   (f) session = org.apache.maven.execution.MavenSession@4248e66b
[linux-jdk10] [INFO] [DEBUG]   (f) skipIfEmpty = false
[linux-jdk10] [INFO] [DEBUG]   (f) useDefaultManifestFile = false
[linux-jdk10] [INFO] [DEBUG] -- end configuration --
[linux-jdk10] [INFO] [INFO] Building jar: /home/jenkins/jenkins-slave/workspace/box_maven-jar-plugin_master-EOL2JTSLPKWLYYEA7ISEGP2JMWPBRZU7FXH6EG3ZDZ25NFJIJ2HQ/m/target/it/MJAR-70-recreation/target/MJAR-70-recreation-1.0-SNAPSHOT.jar
[linux-jdk10] [INFO] [DEBUG] adding directory META-INF/
[linux-jdk10] [INFO] [DEBUG] adding entry META-INF/MANIFEST.MF
[linux-jdk10] [INFO] [DEBUG] adding directory myproject/
[linux-jdk10] [INFO] [DEBUG] adding entry myproject/HelloWorld.class
[linux-jdk10] [INFO] [DEBUG] adding directory META-INF/maven/
[linux-jdk10] [INFO] [DEBUG] adding directory META-INF/maven/org.apache.maven.plugins/
[linux-jdk10] [INFO] [DEBUG] adding directory META-INF/maven/org.apache.maven.plugins/MJAR-70-recreation/
[linux-jdk10] [INFO] [DEBUG] adding entry META-INF/maven/org.apache.maven.plugins/MJAR-70-recreation/pom.xml
[linux-jdk10] [INFO] [DEBUG] adding entry META-INF/maven/org.apache.maven.plugins/MJAR-70-recreation/pom.properties
[linux-jdk10] [INFO] [INFO] ------------------------------------------------------------------------
[linux-jdk10] [INFO] [INFO] BUILD SUCCESS
[linux-jdk10] [INFO] [INFO] ------------------------------------------------------------------------
[linux-jdk10] [INFO] [INFO] Total time: 5.168 s
[linux-jdk10] [INFO] [INFO] Finished at: 2018-08-17T20:56:48Z
[linux-jdk10] [INFO] [INFO] ------------------------------------------------------------------------
[linux-jdk10] [INFO] run post-build script verify.bsh
[linux-jdk10] [INFO] Running post-build script: /home/jenkins/jenkins-slave/workspace/box_maven-jar-plugin_master-EOL2JTSLPKWLYYEA7ISEGP2JMWPBRZU7FXH6EG3ZDZ25NFJIJ2HQ/m/target/it/MJAR-70-recreation/verify.bsh
[linux-jdk10] [INFO] Finished post-build script: /home/jenkins/jenkins-slave/workspace/box_maven-jar-plugin_master-EOL2JTSLPKWLYYEA7ISEGP2JMWPBRZU7FXH6EG3ZDZ25NFJIJ2HQ/m/target/it/MJAR-70-recreation/verify.bsh
[linux-jdk10] [INFO]           MJAR-70-recreation/pom.xml ....................... SUCCESS (7.8 s)
[linux-jdk10] [INFO]
[linux-jdk10] [INFO] --- maven-checkstyle-plugin:3.0.0:check (checkstyle-check) @ maven-jar-plugin ---
[linux-jdk10] [INFO] Downloading from central: https://repo.maven.apache.org/maven2/org/apache/maven/shared/maven-shared-resources/2/maven-shared-resources-2.pom
[linux-jdk10] [INFO] Downloaded from central: https://repo.maven.apache.org/maven2/org/apache/maven/shared/maven-shared-resources/2/maven-shared-resources-2.pom (3.0 kB at 174 kB/s)
[linux-jdk10] [INFO] Downloading from central: https://repo.maven.apache.org/maven2/org/codehaus/plexus/plexus-utils/3.0.10/plexus-utils-3.0.10.pom
[linux-jdk10] [INFO] Downloaded from central: https://repo.maven.apache.org/maven2/org/codehaus/plexus/plexus-utils/3.0.10/plexus-utils-3.0.10.pom (3.1 kB at 242 kB/s)
[linux-jdk10] [INFO] Downloading from central: https://repo.maven.apache.org/maven2/org/codehaus/plexus/plexus/3.3/plexus-3.3.pom
[linux-jdk10] [INFO] Downloaded from central: https://repo.maven.apache.org/maven2/org/codehaus/plexus/plexus/3.3/plexus-3.3.pom (20 kB at 1.5 MB/s)
[linux-jdk10] [INFO] Downloading from central: https://repo.maven.apache.org/maven2/org/apache/maven/doxia/doxia-integration-tools/1.6/doxia-integration-tools-1.6.pom
[linux-jdk10] [INFO] Downloaded from central: https://repo.maven.apache.org/maven2/org/apache/maven/doxia/doxia-integration-tools/1.6/doxia-integration-tools-1.6.pom (7.0 kB at 535 kB/s)
[linux-jdk10] [INFO] Downloading from central: https://repo.maven.apache.org/maven2/org/apache/maven/doxia/doxia-tools/3/doxia-tools-3.pom
[linux-jdk10] [INFO] Downloaded from central: https://repo.maven.apache.org/maven2/org/apache/maven/doxia/doxia-tools/3/doxia-tools-3.pom (9.9 kB at 827 kB/s)
[linux-jdk10] [INFO] Downloading from central: https://repo.maven.apache.org/maven2/org/codehaus/plexus/plexus-resources/1.1.0/plexus-resources-1.1.0.pom
[linux-jdk10] [INFO] Downloaded from central: https://repo.maven.apache.org/maven2/org/codehaus/plexus/plexus-resources/1.1.0/plexus-resources-1.1.0.pom (3.2 kB at 244 kB/s)
[linux-jdk10] [INFO] Downloading from central: https://repo.maven.apache.org/maven2/com/puppycrawl/tools/checkstyle/6.18/checkstyle-6.18.pom
[linux-jdk10] [INFO] Downloaded from central: https://repo.maven.apache.org/maven2/com/puppycrawl/tools/checkstyle/6.18/checkstyle-6.18.pom (71 kB at 4.4 MB/s)
[linux-jdk10] [INFO] Downloading from central: https://repo.maven.apache.org/maven2/antlr/antlr/2.7.7/antlr-2.7.7.pom
[linux-jdk10] [INFO] Downloaded from central: https://repo.maven.apache.org/maven2/antlr/antlr/2.7.7/antlr-2.7.7.pom (632 B at 57 kB/s)
[linux-jdk10] [INFO] Downloading from central: https://repo.maven.apache.org/maven2/org/antlr/antlr4-runtime/4.5.3/antlr4-runtime-4.5.3.pom
[linux-jdk10] [INFO] Downloaded from central: https://repo.maven.apache.org/maven2/org/antlr/antlr4-runtime/4.5.3/antlr4-runtime-4.5.3.pom (2.3 kB at 192 kB/s)
[linux-jdk10] [INFO] Downloading from central: https://repo.maven.apache.org/maven2/org/antlr/antlr4-master/4.5.3/antlr4-master-4.5.3.pom
[linux-jdk10] [INFO] Downloaded from central: https://repo.maven.apache.org/maven2/org/antlr/antlr4-master/4.5.3/antlr4-master-4.5.3.pom (3.7 kB at 335 kB/s)
[linux-jdk10] [INFO] Downloading from central: https://repo.maven.apache.org/maven2/commons-beanutils/commons-beanutils/1.9.2/commons-beanutils-1.9.2.pom
[linux-jdk10] [INFO] Downloaded from central: https://repo.maven.apache.org/maven2/commons-beanutils/commons-beanutils/1.9.2/commons-beanutils-1.9.2.pom (14 kB at 1.2 MB/s)
[linux-jdk10] [INFO] Downloading from central: https://repo.maven.apache.org/maven2/org/apache/commons/commons-parent/33/commons-parent-33.pom
[linux-jdk10] [INFO] Downloaded from central: https://repo.maven.apache.org/maven2/org/apache/commons/commons-parent/33/commons-parent-33.pom (53 kB at 3.8 MB/s)
[linux-jdk10] [INFO] Downloading from central: https://repo.maven.apache.org/maven2/commons-cli/commons-cli/1.3.1/commons-cli-1.3.1.pom
[linux-jdk10] [INFO] Downloaded from central: https://repo.maven.apache.org/maven2/commons-cli/commons-cli/1.3.1/commons-cli-1.3.1.pom (10 kB at 866 kB/s)
[linux-jdk10] [INFO] Downloading from central: https://repo.maven.apache.org/maven2/com/google/guava/guava/19.0/guava-19.0.pom
[linux-jdk10] [INFO] Downloaded from central: https://repo.maven.apache.org/maven2/com/google/guava/guava/19.0/guava-19.0.pom (6.8 kB at 566 kB/s)
[linux-jdk10] [INFO] Downloading from central: https://repo.maven.apache.org/maven2/com/google/guava/guava-parent/19.0/guava-parent-19.0.pom
[linux-jdk10] [INFO] Downloaded from central: https://repo.maven.apache.org/maven2/com/google/guava/guava-parent/19.0/guava-parent-19.0.pom (9.9 kB at 760 kB/s)
[linux-jdk10] [INFO] Downloading from central: https://repo.maven.apache.org/maven2/org/sonatype/oss/oss-parent/7/oss-parent-7.pom
[linux-jdk10] [INFO] Downloaded from central: https://repo.maven.apache.org/maven2/org/sonatype/oss/oss-parent/7/oss-parent-7.pom (4.8 kB at 402 kB/s)
[linux-jdk10] [INFO] Downloading from central: https://repo.maven.apache.org/maven2/javax/xml/bind/jaxb-api/2.3.0/jaxb-api-2.3.0.pom
[linux-jdk10] [INFO] Downloaded from central: https://repo.maven.apache.org/maven2/javax/xml/bind/jaxb-api/2.3.0/jaxb-api-2.3.0.pom (23 kB at 1.8 MB/s)
[linux-jdk10] [INFO] Downloading from central: https://repo.maven.apache.org/maven2/javax/xml/bind/jaxb-api-parent/2.3.0/jaxb-api-parent-2.3.0.pom
[linux-jdk10] [INFO] Downloaded from central: https://repo.maven.apache.org/maven2/javax/xml/bind/jaxb-api-parent/2.3.0/jaxb-api-parent-2.3.0.pom (5.6 kB at 513 kB/s)
[linux-jdk10] [INFO] Downloading from central: https://repo.maven.apache.org/maven2/net/java/jvnet-parent/5/jvnet-parent-5.pom
[linux-jdk10] [INFO] Downloaded from central: https://repo.maven.apache.org/maven2/net/java/jvnet-parent/5/jvnet-parent-5.pom (8.9 kB at 806 kB/s)
[linux-jdk10] [INFO] Downloading from central: https://repo.maven.apache.org/maven2/org/apache/maven/shared/maven-shared-resources/2/maven-shared-resources-2.jar
[linux-jdk10] [INFO] Downloading from central: https://repo.maven.apache.org/maven2/org/apache/maven/doxia/doxia-core/1.2/doxia-core-1.2.jar
[linux-jdk10] [INFO] Downloading from central: https://repo.maven.apache.org/maven2/org/apache/maven/doxia/doxia-integration-tools/1.6/doxia-integration-tools-1.6.jar
[linux-jdk10] [INFO] Downloading from central: https://repo.maven.apache.org/maven2/commons-logging/commons-logging/1.0.4/commons-logging-1.0.4.jar
[linux-jdk10] [INFO] Downloading from central: https://repo.maven.apache.org/maven2/commons-digester/commons-digester/1.6/commons-digester-1.6.jar
[linux-jdk10] [INFO] Downloaded from central: https://repo.maven.apache.org/maven2/org/apache/maven/shared/maven-shared-resources/2/maven-shared-resources-2.jar (13 kB at 933 kB/s)
[linux-jdk10] [INFO] Downloading from central: https://repo.maven.apache.org/maven2/commons-io/commons-io/1.4/commons-io-1.4.jar
[linux-jdk10] [INFO] Downloaded from central: https://repo.maven.apache.org/maven2/commons-logging/commons-logging/1.0.4/commons-logging-1.0.4.jar (38 kB at 2.0 MB/s)
[linux-jdk10] [INFO] Downloading from central: https://repo.maven.apache.org/maven2/org/codehaus/plexus/plexus-resources/1.1.0/plexus-resources-1.1.0.jar
[linux-jdk10] [INFO] Downloaded from central: https://repo.maven.apache.org/maven2/org/apache/maven/doxia/doxia-integration-tools/1.6/doxia-integration-tools-1.6.jar (45 kB at 2.1 MB/s)
[linux-jdk10] [INFO] Downloaded from central: https://repo.maven.apache.org/maven2/org/apache/maven/doxia/doxia-core/1.2/doxia-core-1.2.jar (154 kB at 6.7 MB/s)
[linux-jdk10] [INFO] Downloading from central: https://repo.maven.apache.org/maven2/com/puppycrawl/tools/checkstyle/6.18/checkstyle-6.18.jar
[linux-jdk10] [INFO] Downloading from central: https://repo.maven.apache.org/maven2/antlr/antlr/2.7.7/antlr-2.7.7.jar
[linux-jdk10] [INFO] Downloaded from central: https://repo.maven.apache.org/maven2/commons-digester/commons-digester/1.6/commons-digester-1.6.jar (168 kB at 6.7 MB/s)
[linux-jdk10] [INFO] Downloading from central: https://repo.maven.apache.org/maven2/org/antlr/antlr4-runtime/4.5.3/antlr4-runtime-4.5.3.jar
[linux-jdk10] [INFO] Downloaded from central: https://repo.maven.apache.org/maven2/commons-io/commons-io/1.4/commons-io-1.4.jar (109 kB at 4.0 MB/s)
[linux-jdk10] [INFO] Downloading from central: https://repo.maven.apache.org/maven2/commons-beanutils/commons-beanutils/1.9.2/commons-beanutils-1.9.2.jar
[linux-jdk10] [INFO] Downloaded from central: https://repo.maven.apache.org/maven2/org/codehaus/plexus/plexus-resources/1.1.0/plexus-resources-1.1.0.jar (23 kB at 703 kB/s)
[linux-jdk10] [INFO] Downloading from central: https://repo.maven.apache.org/maven2/commons-cli/commons-cli/1.3.1/commons-cli-1.3.1.jar
[linux-jdk10] [INFO] Downloaded from central: https://repo.maven.apache.org/maven2/commons-beanutils/commons-beanutils/1.9.2/commons-beanutils-1.9.2.jar (234 kB at 4.7 MB/s)
[linux-jdk10] [INFO] Downloaded from central: https://repo.maven.apache.org/maven2/org/antlr/antlr4-runtime/4.5.3/antlr4-runtime-4.5.3.jar (302 kB at 6.0 MB/s)
[linux-jdk10] [INFO] Downloading from central: https://repo.maven.apache.org/maven2/commons-lang/commons-lang/2.1/commons-lang-2.1.jar
[linux-jdk10] [INFO] Downloaded from central: https://repo.maven.apache.org/maven2/commons-cli/commons-cli/1.3.1/commons-cli-1.3.1.jar (53 kB at 1.1 MB/s)
[linux-jdk10] [INFO] Downloading from central: https://repo.maven.apache.org/maven2/javax/xml/bind/jaxb-api/2.3.0/jaxb-api-2.3.0.jar
[linux-jdk10] [INFO] Downloading from central: https://repo.maven.apache.org/maven2/com/google/guava/guava/19.0/guava-19.0.jar
[linux-jdk10] [INFO] Downloaded from central: https://repo.maven.apache.org/maven2/antlr/antlr/2.7.7/antlr-2.7.7.jar (445 kB at 8.1 MB/s)
[linux-jdk10] [INFO] Downloaded from central: https://repo.maven.apache.org/maven2/javax/xml/bind/jaxb-api/2.3.0/jaxb-api-2.3.0.jar (126 kB at 1.8 MB/s)
[linux-jdk10] [INFO] Downloaded from central: https://repo.maven.apache.org/maven2/commons-lang/commons-lang/2.1/commons-lang-2.1.jar (208 kB at 2.9 MB/s)
[linux-jdk10] [INFO] Downloaded from central: https://repo.maven.apache.org/maven2/com/puppycrawl/tools/checkstyle/6.18/checkstyle-6.18.jar (1.2 MB at 15 MB/s)
[linux-jdk10] [INFO] Downloaded from central: https://repo.maven.apache.org/maven2/com/google/guava/guava/19.0/guava-19.0.jar (2.3 MB at 18 MB/s)
[linux-jdk10] [INFO]
[linux-jdk10] [INFO] --- maven-invoker-plugin:3.1.0:verify (integration-test) @ maven-jar-plugin ---
[linux-jdk10] [INFO] -------------------------------------------------
[linux-jdk10] [INFO] Build Summary:
[linux-jdk10] [INFO]   Passed: 24, Failed: 0, Errors: 0, Skipped: 0
[linux-jdk10] [INFO] -------------------------------------------------
[linux-jdk10] [INFO] ------------------------------------------------------------------------
[linux-jdk10] [INFO] BUILD SUCCESS
[linux-jdk10] [INFO] ------------------------------------------------------------------------
[linux-jdk10] [INFO] Total time: 02:56 min
[linux-jdk10] [INFO] Finished at: 2018-08-17T20:56:51Z
[linux-jdk10] [INFO] ------------------------------------------------------------------------
[linux-jdk10] [INFO] [jenkins-event-spy] Generated /home/jenkins/jenkins-slave/workspace/box_maven-jar-plugin_master-EOL2JTSLPKWLYYEA7ISEGP2JMWPBRZU7FXH6EG3ZDZ25NFJIJ2HQ@tmp/withMaven9a120971/maven-spy-20180817-205354-36613777216795727348638.log
[Pipeline] [linux-jdk10] }
[Pipeline] [linux-jdk10] // dir
[Pipeline] [linux-jdk10] }
[linux-jdk10] [withMaven] invokerPublisher - Archive invoker results for Maven artifact MavenArtifact{org.apache.maven.plugins:maven-jar-plugin::3.1.1-SNAPSHOT(version: 3.1.1-SNAPSHOT, snapshot:false) } generated by PluginInvocation{org.apache.maven.plugins:maven-invoker-plugin:3.1.0@integration-test  integration-test}: m/target/invoker-reports/*.xml
[linux-jdk10] performing MavenInvokerRecorder, reportsFilenamePattern:'**/m/target/invoker-reports/BUILD*.xml', invokerBuildDir:'**/m/target/it'
[linux-jdk10] Found reports:[/home/jenkins/jenkins-slave/workspace/box_maven-jar-plugin_master-EOL2JTSLPKWLYYEA7ISEGP2JMWPBRZU7FXH6EG3ZDZ25NFJIJ2HQ/m/target/invoker-reports/BUILD-MJAR-162.xml, /home/jenkins/jenkins-slave/workspace/box_maven-jar-plugin_master-EOL2JTSLPKWLYYEA7ISEGP2JMWPBRZU7FXH6EG3ZDZ25NFJIJ2HQ/m/target/invoker-reports/BUILD-MJAR-183.xml, /home/jenkins/jenkins-slave/workspace/box_maven-jar-plugin_master-EOL2JTSLPKWLYYEA7ISEGP2JMWPBRZU7FXH6EG3ZDZ25NFJIJ2HQ/m/target/invoker-reports/BUILD-MJAR-198.xml, /home/jenkins/jenkins-slave/workspace/box_maven-jar-plugin_master-EOL2JTSLPKWLYYEA7ISEGP2JMWPBRZU7FXH6EG3ZDZ25NFJIJ2HQ/m/target/invoker-reports/BUILD-MJAR-199-change-classifier.xml, /home/jenkins/jenkins-slave/workspace/box_maven-jar-plugin_master-EOL2JTSLPKWLYYEA7ISEGP2JMWPBRZU7FXH6EG3ZDZ25NFJIJ2HQ/m/target/invoker-reports/BUILD-MJAR-199.xml, /home/jenkins/jenkins-slave/workspace/box_maven-jar-plugin_master-EOL2JTSLPKWLYYEA7ISEGP2JMWPBRZU7FXH6EG3ZDZ25NFJIJ2HQ/m/target/invoker-reports/BUILD-MJAR-210.xml, /home/jenkins/jenkins-slave/workspace/box_maven-jar-plugin_master-EOL2JTSLPKWLYYEA7ISEGP2JMWPBRZU7FXH6EG3ZDZ25NFJIJ2HQ/m/target/invoker-reports/BUILD-MJAR-228.xml, /home/jenkins/jenkins-slave/workspace/box_maven-jar-plugin_master-EOL2JTSLPKWLYYEA7ISEGP2JMWPBRZU7FXH6EG3ZDZ25NFJIJ2HQ/m/target/invoker-reports/BUILD-MJAR-30-excludes.xml, /home/jenkins/jenkins-slave/workspace/box_maven-jar-plugin_master-EOL2JTSLPKWLYYEA7ISEGP2JMWPBRZU7FXH6EG3ZDZ25NFJIJ2HQ/m/target/invoker-reports/BUILD-MJAR-30-fullcontent.xml, /home/jenkins/jenkins-slave/workspace/box_maven-jar-plugin_master-EOL2JTSLPKWLYYEA7ISEGP2JMWPBRZU7FXH6EG3ZDZ25NFJIJ2HQ/m/target/invoker-reports/BUILD-MJAR-30-include.xml, /home/jenkins/jenkins-slave/workspace/box_maven-jar-plugin_master-EOL2JTSLPKWLYYEA7ISEGP2JMWPBRZU7FXH6EG3ZDZ25NFJIJ2HQ/m/target/invoker-reports/BUILD-MJAR-60.xml, /home/jenkins/jenkins-slave/workspace/box_maven-jar-plugin_master-EOL2JTSLPKWLYYEA7ISEGP2JMWPBRZU7FXH6EG3ZDZ25NFJIJ2HQ/m/target/invoker-reports/BUILD-MJAR-70-no-recreation.xml, /home/jenkins/jenkins-slave/workspace/box_maven-jar-plugin_master-EOL2JTSLPKWLYYEA7ISEGP2JMWPBRZU7FXH6EG3ZDZ25NFJIJ2HQ/m/target/invoker-reports/BUILD-MJAR-70-recreation.xml, /home/jenkins/jenkins-slave/workspace/box_maven-jar-plugin_master-EOL2JTSLPKWLYYEA7ISEGP2JMWPBRZU7FXH6EG3ZDZ25NFJIJ2HQ/m/target/invoker-reports/BUILD-MJAR-75.xml, /home/jenkins/jenkins-slave/workspace/box_maven-jar-plugin_master-EOL2JTSLPKWLYYEA7ISEGP2JMWPBRZU7FXH6EG3ZDZ25NFJIJ2HQ/m/target/invoker-reports/BUILD-MJAR-80-exclude.xml, /home/jenkins/jenkins-slave/workspace/box_maven-jar-plugin_master-EOL2JTSLPKWLYYEA7ISEGP2JMWPBRZU7FXH6EG3ZDZ25NFJIJ2HQ/m/target/invoker-reports/BUILD-MJAR-80-fullcontent.xml, /home/jenkins/jenkins-slave/workspace/box_maven-jar-plugin_master-EOL2JTSLPKWLYYEA7ISEGP2JMWPBRZU7FXH6EG3ZDZ25NFJIJ2HQ/m/target/invoker-reports/BUILD-MJAR-80-include.xml, /home/jenkins/jenkins-slave/workspace/box_maven-jar-plugin_master-EOL2JTSLPKWLYYEA7ISEGP2JMWPBRZU7FXH6EG3ZDZ25NFJIJ2HQ/m/target/invoker-reports/BUILD-MJAR-82.xml, /home/jenkins/jenkins-slave/workspace/box_maven-jar-plugin_master-EOL2JTSLPKWLYYEA7ISEGP2JMWPBRZU7FXH6EG3ZDZ25NFJIJ2HQ/m/target/invoker-reports/BUILD-manifest-content.xml, /home/jenkins/jenkins-slave/workspace/box_maven-jar-plugin_master-EOL2JTSLPKWLYYEA7ISEGP2JMWPBRZU7FXH6EG3ZDZ25NFJIJ2HQ/m/target/invoker-reports/BUILD-mjar-139.xml, /home/jenkins/jenkins-slave/workspace/box_maven-jar-plugin_master-EOL2JTSLPKWLYYEA7ISEGP2JMWPBRZU7FXH6EG3ZDZ25NFJIJ2HQ/m/target/invoker-reports/BUILD-mjar-71-01.xml, /home/jenkins/jenkins-slave/workspace/box_maven-jar-plugin_master-EOL2JTSLPKWLYYEA7ISEGP2JMWPBRZU7FXH6EG3ZDZ25NFJIJ2HQ/m/target/invoker-reports/BUILD-mjar-71-02.xml, /home/jenkins/jenkins-slave/workspace/box_maven-jar-plugin_master-EOL2JTSLPKWLYYEA7ISEGP2JMWPBRZU7FXH6EG3ZDZ25NFJIJ2HQ/m/target/invoker-reports/BUILD-mjar-90.xml, /home/jenkins/jenkins-slave/workspace/box_maven-jar-plugin_master-EOL2JTSLPKWLYYEA7ISEGP2JMWPBRZU7FXH6EG3ZDZ25NFJIJ2HQ/m/target/invoker-reports/BUILD-project-004.xml]
[linux-jdk10] Found logs:[/home/jenkins/jenkins-slave/workspace/box_maven-jar-plugin_master-EOL2JTSLPKWLYYEA7ISEGP2JMWPBRZU7FXH6EG3ZDZ25NFJIJ2HQ/m/target/it/MJAR-162/build.log, /home/jenkins/jenkins-slave/workspace/box_maven-jar-plugin_master-EOL2JTSLPKWLYYEA7ISEGP2JMWPBRZU7FXH6EG3ZDZ25NFJIJ2HQ/m/target/it/MJAR-183/build.log, /home/jenkins/jenkins-slave/workspace/box_maven-jar-plugin_master-EOL2JTSLPKWLYYEA7ISEGP2JMWPBRZU7FXH6EG3ZDZ25NFJIJ2HQ/m/target/it/MJAR-198/build.log, /home/jenkins/jenkins-slave/workspace/box_maven-jar-plugin_master-EOL2JTSLPKWLYYEA7ISEGP2JMWPBRZU7FXH6EG3ZDZ25NFJIJ2HQ/m/target/it/MJAR-199-change-classifier/build.log, /home/jenkins/jenkins-slave/workspace/box_maven-jar-plugin_master-EOL2JTSLPKWLYYEA7ISEGP2JMWPBRZU7FXH6EG3ZDZ25NFJIJ2HQ/m/target/it/MJAR-199/build.log, /home/jenkins/jenkins-slave/workspace/box_maven-jar-plugin_master-EOL2JTSLPKWLYYEA7ISEGP2JMWPBRZU7FXH6EG3ZDZ25NFJIJ2HQ/m/target/it/MJAR-210/build.log, /home/jenkins/jenkins-slave/workspace/box_maven-jar-plugin_master-EOL2JTSLPKWLYYEA7ISEGP2JMWPBRZU7FXH6EG3ZDZ25NFJIJ2HQ/m/target/it/MJAR-228/build.log, /home/jenkins/jenkins-slave/workspace/box_maven-jar-plugin_master-EOL2JTSLPKWLYYEA7ISEGP2JMWPBRZU7FXH6EG3ZDZ25NFJIJ2HQ/m/target/it/MJAR-30-excludes/build.log, /home/jenkins/jenkins-slave/workspace/box_maven-jar-plugin_master-EOL2JTSLPKWLYYEA7ISEGP2JMWPBRZU7FXH6EG3ZDZ25NFJIJ2HQ/m/target/it/MJAR-30-fullcontent/build.log, /home/jenkins/jenkins-slave/workspace/box_maven-jar-plugin_master-EOL2JTSLPKWLYYEA7ISEGP2JMWPBRZU7FXH6EG3ZDZ25NFJIJ2HQ/m/target/it/MJAR-30-include/build.log, /home/jenkins/jenkins-slave/workspace/box_maven-jar-plugin_master-EOL2JTSLPKWLYYEA7ISEGP2JMWPBRZU7FXH6EG3ZDZ25NFJIJ2HQ/m/target/it/MJAR-60/build.log, /home/jenkins/jenkins-slave/workspace/box_maven-jar-plugin_master-EOL2JTSLPKWLYYEA7ISEGP2JMWPBRZU7FXH6EG3ZDZ25NFJIJ2HQ/m/target/it/MJAR-70-no-recreation/build.log, /home/jenkins/jenkins-slave/workspace/box_maven-jar-plugin_master-EOL2JTSLPKWLYYEA7ISEGP2JMWPBRZU7FXH6EG3ZDZ25NFJIJ2HQ/m/target/it/MJAR-70-recreation/build.log, /home/jenkins/jenkins-slave/workspace/box_maven-jar-plugin_master-EOL2JTSLPKWLYYEA7ISEGP2JMWPBRZU7FXH6EG3ZDZ25NFJIJ2HQ/m/target/it/MJAR-75/build.log, /home/jenkins/jenkins-slave/workspace/box_maven-jar-plugin_master-EOL2JTSLPKWLYYEA7ISEGP2JMWPBRZU7FXH6EG3ZDZ25NFJIJ2HQ/m/target/it/MJAR-80-exclude/build.log, /home/jenkins/jenkins-slave/workspace/box_maven-jar-plugin_master-EOL2JTSLPKWLYYEA7ISEGP2JMWPBRZU7FXH6EG3ZDZ25NFJIJ2HQ/m/target/it/MJAR-80-fullcontent/build.log, /home/jenkins/jenkins-slave/workspace/box_maven-jar-plugin_master-EOL2JTSLPKWLYYEA7ISEGP2JMWPBRZU7FXH6EG3ZDZ25NFJIJ2HQ/m/target/it/MJAR-80-include/build.log, /home/jenkins/jenkins-slave/workspace/box_maven-jar-plugin_master-EOL2JTSLPKWLYYEA7ISEGP2JMWPBRZU7FXH6EG3ZDZ25NFJIJ2HQ/m/target/it/MJAR-82/build.log, /home/jenkins/jenkins-slave/workspace/box_maven-jar-plugin_master-EOL2JTSLPKWLYYEA7ISEGP2JMWPBRZU7FXH6EG3ZDZ25NFJIJ2HQ/m/target/it/manifest-content/build.log, /home/jenkins/jenkins-slave/workspace/box_maven-jar-plugin_master-EOL2JTSLPKWLYYEA7ISEGP2JMWPBRZU7FXH6EG3ZDZ25NFJIJ2HQ/m/target/it/mjar-139/build.log, /home/jenkins/jenkins-slave/workspace/box_maven-jar-plugin_master-EOL2JTSLPKWLYYEA7ISEGP2JMWPBRZU7FXH6EG3ZDZ25NFJIJ2HQ/m/target/it/mjar-71-01/build.log, /home/jenkins/jenkins-slave/workspace/box_maven-jar-plugin_master-EOL2JTSLPKWLYYEA7ISEGP2JMWPBRZU7FXH6EG3ZDZ25NFJIJ2HQ/m/target/it/mjar-71-02/build.log, /home/jenkins/jenkins-slave/workspace/box_maven-jar-plugin_master-EOL2JTSLPKWLYYEA7ISEGP2JMWPBRZU7FXH6EG3ZDZ25NFJIJ2HQ/m/target/it/mjar-90/build.log, /home/jenkins/jenkins-slave/workspace/box_maven-jar-plugin_master-EOL2JTSLPKWLYYEA7ISEGP2JMWPBRZU7FXH6EG3ZDZ25NFJIJ2HQ/m/target/it/project-004/build.log]
[linux-jdk10] Finished parsing Maven Invoker results (found 24)
[linux-jdk10] [withMaven] junitPublisher - Archive test results for Maven artifact org.apache.maven.plugins:maven-jar-plugin:3.1.1-SNAPSHOT generated by maven-surefire-plugin:test (default-test): m/target/surefire-reports/*.xml
[linux-jdk10] Recording test results
[Pipeline] [linux-jdk10] // withMaven
[Pipeline] [linux-jdk10] cleanWs
[linux-jdk10] [WS-CLEANUP] Deleting project workspace...[WS-CLEANUP] done
[Pipeline] [linux-jdk10] }
[Pipeline] [linux-jdk10] // stage
[Pipeline] [linux-jdk10] }
[Pipeline] [linux-jdk10] // node
[Pipeline] [linux-jdk10] }
[Pipeline] // parallel
[Pipeline] stage
[Pipeline] { (Notifications)
[Pipeline] echo
Build result: FAILURE
[Pipeline] jiraIssueSelector
[Pipeline] emailext
Reply | Threaded
Open this post in threaded view
|

Build failed in Jenkins: Maven TLP » maven-jar-plugin » master #29

Apache Jenkins Server-2
See https://builds.apache.org/job/maven-box/job/maven-jar-plugin/job/master/29/

No changes.

All tests passed

Build log:
[...truncated 28.47 MB...]
[windows-jdk10] [INFO] [DEBUG]   Included: org.sonatype.sisu:sisu-inject-bean:jar:1.4.2
[windows-jdk10] [INFO] [DEBUG]   Included: org.sonatype.sisu:sisu-guice:jar:noaop:2.1.7
[windows-jdk10] [INFO] [DEBUG]   Included: org.sonatype.aether:aether-util:jar:1.7
[windows-jdk10] [INFO] [DEBUG]   Included: org.codehaus.plexus:plexus-interpolation:jar:1.14
[windows-jdk10] [INFO] [DEBUG]   Included: org.codehaus.plexus:plexus-component-annotations:jar:1.7.1
[windows-jdk10] [INFO] [DEBUG]   Included: org.sonatype.plexus:plexus-sec-dispatcher:jar:1.3
[windows-jdk10] [INFO] [DEBUG]   Included: org.sonatype.plexus:plexus-cipher:jar:1.4
[windows-jdk10] [INFO] [DEBUG]   Included: org.apache.maven:maven-archiver:jar:3.2.0
[windows-jdk10] [INFO] [DEBUG]   Included: org.apache.maven.shared:maven-shared-utils:jar:3.2.0
[windows-jdk10] [INFO] [DEBUG]   Included: commons-io:commons-io:jar:2.5
[windows-jdk10] [INFO] [DEBUG]   Included: org.codehaus.plexus:plexus-archiver:jar:3.6.0
[windows-jdk10] [INFO] [DEBUG]   Included: org.codehaus.plexus:plexus-io:jar:3.0.1
[windows-jdk10] [INFO] [DEBUG]   Included: org.apache.commons:commons-compress:jar:1.16.1
[windows-jdk10] [INFO] [DEBUG]   Included: org.objenesis:objenesis:jar:2.6
[windows-jdk10] [INFO] [DEBUG]   Included: org.iq80.snappy:snappy:jar:0.4
[windows-jdk10] [INFO] [DEBUG]   Included: org.tukaani:xz:jar:1.8
[windows-jdk10] [INFO] [DEBUG]   Included: org.codehaus.plexus:plexus-utils:jar:3.1.0
[windows-jdk10] [INFO] [DEBUG] Configuring mojo org.apache.maven.plugins:maven-jar-plugin:3.1.1-SNAPSHOT:jar from plugin realm ClassRealm[plugin>org.apache.maven.plugins:maven-jar-plugin:3.1.1-SNAPSHOT, parent: jdk.internal.loader.ClassLoaders$AppClassLoader@5ef04b5]
[windows-jdk10] [INFO] [DEBUG] Configuring mojo 'org.apache.maven.plugins:maven-jar-plugin:3.1.1-SNAPSHOT:jar' with basic configurator -->
[windows-jdk10] [INFO] [DEBUG]   (f) classesDirectory = F:\jenkins\jenkins-slave\workspace\box_maven-jar-plugin_master-EOL2JTSLPKWLYYEA7ISEGP2JMWPBRZU7FXH6EG3ZDZ25NFJIJ2HQ@2\m\target\it\project-004\target\classes
[windows-jdk10] [INFO] [DEBUG]   (f) finalName = maven-jar-plugin-test-project-004-99.0
[windows-jdk10] [INFO] [DEBUG]   (f) forceCreation = false
[windows-jdk10] [INFO] [DEBUG]   (f) outputDirectory = F:\jenkins\jenkins-slave\workspace\box_maven-jar-plugin_master-EOL2JTSLPKWLYYEA7ISEGP2JMWPBRZU7FXH6EG3ZDZ25NFJIJ2HQ@2\m\target\it\project-004\target
[windows-jdk10] [INFO] [DEBUG]   (f) project = MavenProject: org.apache.maven.plugins:maven-jar-plugin-test-project-004:99.0 @ F:\jenkins\jenkins-slave\workspace\box_maven-jar-plugin_master-EOL2JTSLPKWLYYEA7ISEGP2JMWPBRZU7FXH6EG3ZDZ25NFJIJ2HQ@2\m\target\it\project-004\pom.xml
[windows-jdk10] [INFO] [DEBUG]   (f) session = org.apache.maven.execution.MavenSession@2add4d24
[windows-jdk10] [INFO] [DEBUG]   (f) skipIfEmpty = false
[windows-jdk10] [INFO] [DEBUG]   (f) useDefaultManifestFile = false
[windows-jdk10] [INFO] [DEBUG] -- end configuration --
[windows-jdk10] [INFO] [DEBUG] isUp2date: false (Destination F:\jenkins\jenkins-slave\workspace\box_maven-jar-plugin_master-EOL2JTSLPKWLYYEA7ISEGP2JMWPBRZU7FXH6EG3ZDZ25NFJIJ2HQ@2\m\target\it\project-004\target\maven-jar-plugin-test-project-004-99.0.jar not found.)
[windows-jdk10] [INFO] [INFO] Building jar: F:\jenkins\jenkins-slave\workspace\box_maven-jar-plugin_master-EOL2JTSLPKWLYYEA7ISEGP2JMWPBRZU7FXH6EG3ZDZ25NFJIJ2HQ@2\m\target\it\project-004\target\maven-jar-plugin-test-project-004-99.0.jar
[windows-jdk10] [INFO] [DEBUG] adding directory META-INF/
[windows-jdk10] [INFO] [DEBUG] adding entry META-INF/MANIFEST.MF
[windows-jdk10] [INFO] [DEBUG] adding directory service/
[windows-jdk10] [INFO] [DEBUG] adding directory service/impl/
[windows-jdk10] [INFO] [DEBUG] adding entry notIncluded.xml
[windows-jdk10] [INFO] [DEBUG] adding entry service/impl/TestImplementation.class
[windows-jdk10] [INFO] [DEBUG] adding entry service/TestInterface.class
[windows-jdk10] [INFO] [DEBUG] adding entry TestCompile1.class
[windows-jdk10] [INFO] [DEBUG] adding directory META-INF/maven/
[windows-jdk10] [INFO] [DEBUG] adding directory META-INF/maven/org.apache.maven.plugins/
[windows-jdk10] [INFO] [DEBUG] adding directory META-INF/maven/org.apache.maven.plugins/maven-jar-plugin-test-project-004/
[windows-jdk10] [INFO] [DEBUG] adding entry META-INF/maven/org.apache.maven.plugins/maven-jar-plugin-test-project-004/pom.xml
[windows-jdk10] [INFO] [DEBUG] adding entry META-INF/maven/org.apache.maven.plugins/maven-jar-plugin-test-project-004/pom.properties
[windows-jdk10] [INFO] [INFO]
[windows-jdk10] [INFO] [INFO] --- maven-jar-plugin:3.1.1-SNAPSHOT:jar (default) @ maven-jar-plugin-test-project-004 ---
[windows-jdk10] [INFO] [DEBUG] Configuring mojo org.apache.maven.plugins:maven-jar-plugin:3.1.1-SNAPSHOT:jar from plugin realm ClassRealm[plugin>org.apache.maven.plugins:maven-jar-plugin:3.1.1-SNAPSHOT, parent: jdk.internal.loader.ClassLoaders$AppClassLoader@5ef04b5]
[windows-jdk10] [INFO] [DEBUG] Configuring mojo 'org.apache.maven.plugins:maven-jar-plugin:3.1.1-SNAPSHOT:jar' with basic configurator -->
[windows-jdk10] [INFO] [DEBUG]   (f) classesDirectory = F:\jenkins\jenkins-slave\workspace\box_maven-jar-plugin_master-EOL2JTSLPKWLYYEA7ISEGP2JMWPBRZU7FXH6EG3ZDZ25NFJIJ2HQ@2\m\target\it\project-004\target\classes
[windows-jdk10] [INFO] [DEBUG]   (f) classifier = service
[windows-jdk10] [INFO] [DEBUG]   (f) finalName = maven-jar-plugin-test-project-004-99.0
[windows-jdk10] [INFO] [DEBUG]   (f) forceCreation = false
[windows-jdk10] [INFO] [DEBUG]   (f) includes = [**/service/*]
[windows-jdk10] [INFO] [DEBUG]   (f) outputDirectory = F:\jenkins\jenkins-slave\workspace\box_maven-jar-plugin_master-EOL2JTSLPKWLYYEA7ISEGP2JMWPBRZU7FXH6EG3ZDZ25NFJIJ2HQ@2\m\target\it\project-004\target
[windows-jdk10] [INFO] [DEBUG]   (f) project = MavenProject: org.apache.maven.plugins:maven-jar-plugin-test-project-004:99.0 @ F:\jenkins\jenkins-slave\workspace\box_maven-jar-plugin_master-EOL2JTSLPKWLYYEA7ISEGP2JMWPBRZU7FXH6EG3ZDZ25NFJIJ2HQ@2\m\target\it\project-004\pom.xml
[windows-jdk10] [INFO] [DEBUG]   (f) session = org.apache.maven.execution.MavenSession@2add4d24
[windows-jdk10] [INFO] [DEBUG]   (f) skipIfEmpty = false
[windows-jdk10] [INFO] [DEBUG]   (f) useDefaultManifestFile = false
[windows-jdk10] [INFO] [DEBUG] -- end configuration --
[windows-jdk10] [INFO] [DEBUG] isUp2date: false (Destination F:\jenkins\jenkins-slave\workspace\box_maven-jar-plugin_master-EOL2JTSLPKWLYYEA7ISEGP2JMWPBRZU7FXH6EG3ZDZ25NFJIJ2HQ@2\m\target\it\project-004\target\maven-jar-plugin-test-project-004-99.0-service.jar not found.)
[windows-jdk10] [INFO] [INFO] Building jar: F:\jenkins\jenkins-slave\workspace\box_maven-jar-plugin_master-EOL2JTSLPKWLYYEA7ISEGP2JMWPBRZU7FXH6EG3ZDZ25NFJIJ2HQ@2\m\target\it\project-004\target\maven-jar-plugin-test-project-004-99.0-service.jar
[windows-jdk10] [INFO] [DEBUG] adding directory META-INF/
[windows-jdk10] [INFO] [DEBUG] adding entry META-INF/MANIFEST.MF
[windows-jdk10] [INFO] [DEBUG] adding directory service/
[windows-jdk10] [INFO] [DEBUG] adding directory service/impl/
[windows-jdk10] [INFO] [DEBUG] adding entry service/TestInterface.class
[windows-jdk10] [INFO] [DEBUG] adding directory META-INF/maven/
[windows-jdk10] [INFO] [DEBUG] adding directory META-INF/maven/org.apache.maven.plugins/
[windows-jdk10] [INFO] [DEBUG] adding directory META-INF/maven/org.apache.maven.plugins/maven-jar-plugin-test-project-004/
[windows-jdk10] [INFO] [DEBUG] adding entry META-INF/maven/org.apache.maven.plugins/maven-jar-plugin-test-project-004/pom.xml
[windows-jdk10] [INFO] [DEBUG] adding entry META-INF/maven/org.apache.maven.plugins/maven-jar-plugin-test-project-004/pom.properties
[windows-jdk10] [INFO] [INFO] ------------------------------------------------------------------------
[windows-jdk10] [INFO] [INFO] BUILD SUCCESS
[windows-jdk10] [INFO] [INFO] ------------------------------------------------------------------------
[windows-jdk10] [INFO] [INFO] Total time: 1.560 s
[windows-jdk10] [INFO] [INFO] Finished at: 2018-08-19T20:26:59Z
[windows-jdk10] [INFO] [INFO] Final Memory: 14M/50M
[windows-jdk10] [INFO] [INFO] ------------------------------------------------------------------------
[windows-jdk10] [INFO] run post-build script verify.bsh
[windows-jdk10] [INFO] Running post-build script: f:\jenkins\jenkins-slave\workspace\box_maven-jar-plugin_master-EOL2JTSLPKWLYYEA7ISEGP2JMWPBRZU7FXH6EG3ZDZ25NFJIJ2HQ@2\m\target\it\project-004\verify.bsh
[windows-jdk10] [INFO] Finished post-build script: f:\jenkins\jenkins-slave\workspace\box_maven-jar-plugin_master-EOL2JTSLPKWLYYEA7ISEGP2JMWPBRZU7FXH6EG3ZDZ25NFJIJ2HQ@2\m\target\it\project-004\verify.bsh
[windows-jdk10] [INFO]           project-004\pom.xml .............................. SUCCESS (3.0 s)
[windows-jdk10] [INFO]
[windows-jdk10] [INFO] --- maven-checkstyle-plugin:3.0.0:check (checkstyle-check) @ maven-jar-plugin ---
[windows-jdk10] [INFO] Downloading from central: https://repo.maven.apache.org/maven2/org/apache/maven/shared/maven-shared-resources/2/maven-shared-resources-2.pom
[windows-jdk10] [INFO] Downloaded from central: https://repo.maven.apache.org/maven2/org/apache/maven/shared/maven-shared-resources/2/maven-shared-resources-2.pom (3.0 kB at 422 kB/s)
[windows-jdk10] [INFO] Downloading from central: https://repo.maven.apache.org/maven2/org/codehaus/plexus/plexus-utils/3.0.10/plexus-utils-3.0.10.pom
[windows-jdk10] [INFO] Downloaded from central: https://repo.maven.apache.org/maven2/org/codehaus/plexus/plexus-utils/3.0.10/plexus-utils-3.0.10.pom (3.1 kB at 262 kB/s)
[windows-jdk10] [INFO] Downloading from central: https://repo.maven.apache.org/maven2/org/codehaus/plexus/plexus/3.3/plexus-3.3.pom
[windows-jdk10] [INFO] Downloaded from central: https://repo.maven.apache.org/maven2/org/codehaus/plexus/plexus/3.3/plexus-3.3.pom (20 kB at 2.0 MB/s)
[windows-jdk10] [INFO] Downloading from central: https://repo.maven.apache.org/maven2/org/apache/maven/doxia/doxia-integration-tools/1.6/doxia-integration-tools-1.6.pom
[windows-jdk10] [INFO] Downloaded from central: https://repo.maven.apache.org/maven2/org/apache/maven/doxia/doxia-integration-tools/1.6/doxia-integration-tools-1.6.pom (7.0 kB at 994 kB/s)
[windows-jdk10] [INFO] Downloading from central: https://repo.maven.apache.org/maven2/org/apache/maven/doxia/doxia-tools/3/doxia-tools-3.pom
[windows-jdk10] [INFO] Downloaded from central: https://repo.maven.apache.org/maven2/org/apache/maven/doxia/doxia-tools/3/doxia-tools-3.pom (9.9 kB at 827 kB/s)
[windows-jdk10] [INFO] Downloading from central: https://repo.maven.apache.org/maven2/org/codehaus/plexus/plexus-resources/1.1.0/plexus-resources-1.1.0.pom
[windows-jdk10] [INFO] Downloaded from central: https://repo.maven.apache.org/maven2/org/codehaus/plexus/plexus-resources/1.1.0/plexus-resources-1.1.0.pom (3.2 kB at 530 kB/s)
[windows-jdk10] [INFO] Downloading from central: https://repo.maven.apache.org/maven2/com/puppycrawl/tools/checkstyle/6.18/checkstyle-6.18.pom
[windows-jdk10] [INFO] Downloaded from central: https://repo.maven.apache.org/maven2/com/puppycrawl/tools/checkstyle/6.18/checkstyle-6.18.pom (71 kB at 4.7 MB/s)
[windows-jdk10] [INFO] Downloading from central: https://repo.maven.apache.org/maven2/antlr/antlr/2.7.7/antlr-2.7.7.pom
[windows-jdk10] [INFO] Downloaded from central: https://repo.maven.apache.org/maven2/antlr/antlr/2.7.7/antlr-2.7.7.pom (632 B at 105 kB/s)
[windows-jdk10] [INFO] Downloading from central: https://repo.maven.apache.org/maven2/org/antlr/antlr4-runtime/4.5.3/antlr4-runtime-4.5.3.pom
[windows-jdk10] [INFO] Downloaded from central: https://repo.maven.apache.org/maven2/org/antlr/antlr4-runtime/4.5.3/antlr4-runtime-4.5.3.pom (2.3 kB at 122 kB/s)
[windows-jdk10] [INFO] Downloading from central: https://repo.maven.apache.org/maven2/org/antlr/antlr4-master/4.5.3/antlr4-master-4.5.3.pom
[windows-jdk10] [INFO] Downloaded from central: https://repo.maven.apache.org/maven2/org/antlr/antlr4-master/4.5.3/antlr4-master-4.5.3.pom (3.7 kB at 614 kB/s)
[windows-jdk10] [INFO] Downloading from central: https://repo.maven.apache.org/maven2/commons-beanutils/commons-beanutils/1.9.2/commons-beanutils-1.9.2.pom
[windows-jdk10] [INFO] Downloaded from central: https://repo.maven.apache.org/maven2/commons-beanutils/commons-beanutils/1.9.2/commons-beanutils-1.9.2.pom (14 kB at 1.3 MB/s)
[windows-jdk10] [INFO] Downloading from central: https://repo.maven.apache.org/maven2/org/apache/commons/commons-parent/33/commons-parent-33.pom
[windows-jdk10] [INFO] Downloaded from central: https://repo.maven.apache.org/maven2/org/apache/commons/commons-parent/33/commons-parent-33.pom (53 kB at 3.8 MB/s)
[windows-jdk10] [INFO] Downloading from central: https://repo.maven.apache.org/maven2/commons-cli/commons-cli/1.3.1/commons-cli-1.3.1.pom
[windows-jdk10] [INFO] Downloaded from central: https://repo.maven.apache.org/maven2/commons-cli/commons-cli/1.3.1/commons-cli-1.3.1.pom (10 kB at 1.2 MB/s)
[windows-jdk10] [INFO] Downloading from central: https://repo.maven.apache.org/maven2/com/google/guava/guava/19.0/guava-19.0.pom
[windows-jdk10] [INFO] Downloaded from central: https://repo.maven.apache.org/maven2/com/google/guava/guava/19.0/guava-19.0.pom (6.8 kB at 1.1 MB/s)
[windows-jdk10] [INFO] Downloading from central: https://repo.maven.apache.org/maven2/com/google/guava/guava-parent/19.0/guava-parent-19.0.pom
[windows-jdk10] [INFO] Downloaded from central: https://repo.maven.apache.org/maven2/com/google/guava/guava-parent/19.0/guava-parent-19.0.pom (9.9 kB at 1.1 MB/s)
[windows-jdk10] [INFO] Downloading from central: https://repo.maven.apache.org/maven2/org/sonatype/oss/oss-parent/7/oss-parent-7.pom
[windows-jdk10] [INFO] Downloaded from central: https://repo.maven.apache.org/maven2/org/sonatype/oss/oss-parent/7/oss-parent-7.pom (4.8 kB at 804 kB/s)
[windows-jdk10] [INFO] Downloading from central: https://repo.maven.apache.org/maven2/javax/xml/bind/jaxb-api/2.3.0/jaxb-api-2.3.0.pom
[windows-jdk10] [INFO] Downloaded from central: https://repo.maven.apache.org/maven2/javax/xml/bind/jaxb-api/2.3.0/jaxb-api-2.3.0.pom (23 kB at 2.1 MB/s)
[windows-jdk10] [INFO] Downloading from central: https://repo.maven.apache.org/maven2/javax/xml/bind/jaxb-api-parent/2.3.0/jaxb-api-parent-2.3.0.pom
[windows-jdk10] [INFO] Downloaded from central: https://repo.maven.apache.org/maven2/javax/xml/bind/jaxb-api-parent/2.3.0/jaxb-api-parent-2.3.0.pom (5.6 kB at 940 kB/s)
[windows-jdk10] [INFO] Downloading from central: https://repo.maven.apache.org/maven2/net/java/jvnet-parent/5/jvnet-parent-5.pom
[windows-jdk10] [INFO] Downloaded from central: https://repo.maven.apache.org/maven2/net/java/jvnet-parent/5/jvnet-parent-5.pom (8.9 kB at 295 kB/s)
[windows-jdk10] [INFO] Downloading from central: https://repo.maven.apache.org/maven2/org/apache/maven/shared/maven-shared-resources/2/maven-shared-resources-2.jar
[windows-jdk10] [INFO] Downloading from central: https://repo.maven.apache.org/maven2/commons-digester/commons-digester/1.6/commons-digester-1.6.jar
[windows-jdk10] [INFO] Downloading from central: https://repo.maven.apache.org/maven2/org/apache/maven/doxia/doxia-core/1.2/doxia-core-1.2.jar
[windows-jdk10] [INFO] Downloading from central: https://repo.maven.apache.org/maven2/commons-logging/commons-logging/1.0.4/commons-logging-1.0.4.jar
[windows-jdk10] [INFO] Downloading from central: https://repo.maven.apache.org/maven2/org/apache/maven/doxia/doxia-integration-tools/1.6/doxia-integration-tools-1.6.jar
[windows-jdk10] [INFO] Downloaded from central: https://repo.maven.apache.org/maven2/commons-digester/commons-digester/1.6/commons-digester-1.6.jar (168 kB at 8.4 MB/s)
[windows-jdk10] [INFO] Downloading from central: https://repo.maven.apache.org/maven2/commons-io/commons-io/1.4/commons-io-1.4.jar
[windows-jdk10] [INFO] Downloaded from central: https://repo.maven.apache.org/maven2/org/apache/maven/doxia/doxia-core/1.2/doxia-core-1.2.jar (154 kB at 6.7 MB/s)
[windows-jdk10] [INFO] Downloading from central: https://repo.maven.apache.org/maven2/org/codehaus/plexus/plexus-resources/1.1.0/plexus-resources-1.1.0.jar
[windows-jdk10] [INFO] Downloaded from central: https://repo.maven.apache.org/maven2/commons-logging/commons-logging/1.0.4/commons-logging-1.0.4.jar (38 kB at 1.2 MB/s)
[windows-jdk10] [INFO] Downloading from central: https://repo.maven.apache.org/maven2/com/puppycrawl/tools/checkstyle/6.18/checkstyle-6.18.jar
[windows-jdk10] [INFO] Downloaded from central: https://repo.maven.apache.org/maven2/commons-io/commons-io/1.4/commons-io-1.4.jar (109 kB at 3.3 MB/s)
[windows-jdk10] [INFO] Downloading from central: https://repo.maven.apache.org/maven2/antlr/antlr/2.7.7/antlr-2.7.7.jar
[windows-jdk10] [INFO] Downloaded from central: https://repo.maven.apache.org/maven2/org/apache/maven/shared/maven-shared-resources/2/maven-shared-resources-2.jar (13 kB at 242 kB/s)
[windows-jdk10] [INFO] Downloading from central: https://repo.maven.apache.org/maven2/org/antlr/antlr4-runtime/4.5.3/antlr4-runtime-4.5.3.jar
[windows-jdk10] [INFO] Downloaded from central: https://repo.maven.apache.org/maven2/antlr/antlr/2.7.7/antlr-2.7.7.jar (445 kB at 7.8 MB/s)
[windows-jdk10] [INFO] Downloading from central: https://repo.maven.apache.org/maven2/commons-beanutils/commons-beanutils/1.9.2/commons-beanutils-1.9.2.jar
[windows-jdk10] [INFO] Downloaded from central: https://repo.maven.apache.org/maven2/org/antlr/antlr4-runtime/4.5.3/antlr4-runtime-4.5.3.jar (302 kB at 4.3 MB/s)
[windows-jdk10] [INFO] Downloading from central: https://repo.maven.apache.org/maven2/commons-cli/commons-cli/1.3.1/commons-cli-1.3.1.jar
[windows-jdk10] [INFO] Downloaded from central: https://repo.maven.apache.org/maven2/com/puppycrawl/tools/checkstyle/6.18/checkstyle-6.18.jar (1.2 MB at 16 MB/s)
[windows-jdk10] [INFO] Downloading from central: https://repo.maven.apache.org/maven2/com/google/guava/guava/19.0/guava-19.0.jar
[windows-jdk10] [INFO] Downloaded from central: https://repo.maven.apache.org/maven2/commons-beanutils/commons-beanutils/1.9.2/commons-beanutils-1.9.2.jar (234 kB at 3.0 MB/s)
[windows-jdk10] [INFO] Downloading from central: https://repo.maven.apache.org/maven2/commons-lang/commons-lang/2.1/commons-lang-2.1.jar
[windows-jdk10] [INFO] Downloaded from central: https://repo.maven.apache.org/maven2/commons-cli/commons-cli/1.3.1/commons-cli-1.3.1.jar (53 kB at 609 kB/s)
[windows-jdk10] [INFO] Downloading from central: https://repo.maven.apache.org/maven2/javax/xml/bind/jaxb-api/2.3.0/jaxb-api-2.3.0.jar
[windows-jdk10] [INFO] Downloaded from central: https://repo.maven.apache.org/maven2/commons-lang/commons-lang/2.1/commons-lang-2.1.jar (208 kB at 2.3 MB/s)
[windows-jdk10] [INFO] Downloaded from central: https://repo.maven.apache.org/maven2/javax/xml/bind/jaxb-api/2.3.0/jaxb-api-2.3.0.jar (126 kB at 1.2 MB/s)
[windows-jdk10] [INFO] Downloaded from central: https://repo.maven.apache.org/maven2/com/google/guava/guava/19.0/guava-19.0.jar (2.3 MB at 18 MB/s)
[windows-jdk10] [INFO] Downloaded from central: https://repo.maven.apache.org/maven2/org/codehaus/plexus/plexus-resources/1.1.0/plexus-resources-1.1.0.jar (23 kB at 148 kB/s)
[windows-jdk10] [INFO] Downloaded from central: https://repo.maven.apache.org/maven2/org/apache/maven/doxia/doxia-integration-tools/1.6/doxia-integration-tools-1.6.jar (45 kB at 261 kB/s)
[windows-jdk10] [INFO]
[windows-jdk10] [INFO] --- maven-invoker-plugin:3.1.0:verify (integration-test) @ maven-jar-plugin ---
[windows-jdk10] [INFO] -------------------------------------------------
[windows-jdk10] [INFO] Build Summary:
[windows-jdk10] [INFO]   Passed: 24, Failed: 0, Errors: 0, Skipped: 0
[windows-jdk10] [INFO] -------------------------------------------------
[windows-jdk10] [INFO] ------------------------------------------------------------------------
[windows-jdk10] [INFO] BUILD SUCCESS
[windows-jdk10] [INFO] ------------------------------------------------------------------------
[windows-jdk10] [INFO] Total time: 03:03 min
[windows-jdk10] [INFO] Finished at: 2018-08-19T20:27:01Z
[windows-jdk10] [INFO] Final Memory: 42M/147M
[windows-jdk10] [INFO] ------------------------------------------------------------------------
[windows-jdk10] [INFO] [jenkins-event-spy] Generated F:\jenkins\jenkins-slave\workspace\box_maven-jar-plugin_master-EOL2JTSLPKWLYYEA7ISEGP2JMWPBRZU7FXH6EG3ZDZ25NFJIJ2HQ@2@tmp\withMavenebd8ad33\maven-spy-20180819-202357-1115690082897341115599.log
[Pipeline] [linux-jdk10] }
[Pipeline] [windows-jdk7] }
[windows-jdk7] [withMaven] invokerPublisher - Archive invoker results for Maven artifact MavenArtifact{org.apache.maven.plugins:maven-jar-plugin::3.1.1-SNAPSHOT(version: 3.1.1-SNAPSHOT, snapshot:false) } generated by PluginInvocation{org.apache.maven.plugins:maven-invoker-plugin:3.1.0@integration-test  integration-test}: m\target\invoker-reports\*.xml
[windows-jdk7] performing MavenInvokerRecorder, reportsFilenamePattern:'**/m\target\invoker-reports/BUILD*.xml', invokerBuildDir:'**/m\target\it'
[windows-jdk7] Found reports:[f:\jenkins\jenkins-slave\workspace\box_maven-jar-plugin_master-EOL2JTSLPKWLYYEA7ISEGP2JMWPBRZU7FXH6EG3ZDZ25NFJIJ2HQ\m\target\invoker-reports\BUILD-MJAR-162.xml, f:\jenkins\jenkins-slave\workspace\box_maven-jar-plugin_master-EOL2JTSLPKWLYYEA7ISEGP2JMWPBRZU7FXH6EG3ZDZ25NFJIJ2HQ\m\target\invoker-reports\BUILD-MJAR-183.xml, f:\jenkins\jenkins-slave\workspace\box_maven-jar-plugin_master-EOL2JTSLPKWLYYEA7ISEGP2JMWPBRZU7FXH6EG3ZDZ25NFJIJ2HQ\m\target\invoker-reports\BUILD-MJAR-198.xml, f:\jenkins\jenkins-slave\workspace\box_maven-jar-plugin_master-EOL2JTSLPKWLYYEA7ISEGP2JMWPBRZU7FXH6EG3ZDZ25NFJIJ2HQ\m\target\invoker-reports\BUILD-MJAR-199-change-classifier.xml, f:\jenkins\jenkins-slave\workspace\box_maven-jar-plugin_master-EOL2JTSLPKWLYYEA7ISEGP2JMWPBRZU7FXH6EG3ZDZ25NFJIJ2HQ\m\target\invoker-reports\BUILD-MJAR-199.xml, f:\jenkins\jenkins-slave\workspace\box_maven-jar-plugin_master-EOL2JTSLPKWLYYEA7ISEGP2JMWPBRZU7FXH6EG3ZDZ25NFJIJ2HQ\m\target\invoker-reports\BUILD-MJAR-210.xml, f:\jenkins\jenkins-slave\workspace\box_maven-jar-plugin_master-EOL2JTSLPKWLYYEA7ISEGP2JMWPBRZU7FXH6EG3ZDZ25NFJIJ2HQ\m\target\invoker-reports\BUILD-MJAR-228.xml, f:\jenkins\jenkins-slave\workspace\box_maven-jar-plugin_master-EOL2JTSLPKWLYYEA7ISEGP2JMWPBRZU7FXH6EG3ZDZ25NFJIJ2HQ\m\target\invoker-reports\BUILD-MJAR-30-excludes.xml, f:\jenkins\jenkins-slave\workspace\box_maven-jar-plugin_master-EOL2JTSLPKWLYYEA7ISEGP2JMWPBRZU7FXH6EG3ZDZ25NFJIJ2HQ\m\target\invoker-reports\BUILD-MJAR-30-fullcontent.xml, f:\jenkins\jenkins-slave\workspace\box_maven-jar-plugin_master-EOL2JTSLPKWLYYEA7ISEGP2JMWPBRZU7FXH6EG3ZDZ25NFJIJ2HQ\m\target\invoker-reports\BUILD-MJAR-30-include.xml, f:\jenkins\jenkins-slave\workspace\box_maven-jar-plugin_master-EOL2JTSLPKWLYYEA7ISEGP2JMWPBRZU7FXH6EG3ZDZ25NFJIJ2HQ\m\target\invoker-reports\BUILD-MJAR-60.xml, f:\jenkins\jenkins-slave\workspace\box_maven-jar-plugin_master-EOL2JTSLPKWLYYEA7ISEGP2JMWPBRZU7FXH6EG3ZDZ25NFJIJ2HQ\m\target\invoker-reports\BUILD-MJAR-70-no-recreation.xml, f:\jenkins\jenkins-slave\workspace\box_maven-jar-plugin_master-EOL2JTSLPKWLYYEA7ISEGP2JMWPBRZU7FXH6EG3ZDZ25NFJIJ2HQ\m\target\invoker-reports\BUILD-MJAR-70-recreation.xml, f:\jenkins\jenkins-slave\workspace\box_maven-jar-plugin_master-EOL2JTSLPKWLYYEA7ISEGP2JMWPBRZU7FXH6EG3ZDZ25NFJIJ2HQ\m\target\invoker-reports\BUILD-MJAR-75.xml, f:\jenkins\jenkins-slave\workspace\box_maven-jar-plugin_master-EOL2JTSLPKWLYYEA7ISEGP2JMWPBRZU7FXH6EG3ZDZ25NFJIJ2HQ\m\target\invoker-reports\BUILD-MJAR-80-exclude.xml, f:\jenkins\jenkins-slave\workspace\box_maven-jar-plugin_master-EOL2JTSLPKWLYYEA7ISEGP2JMWPBRZU7FXH6EG3ZDZ25NFJIJ2HQ\m\target\invoker-reports\BUILD-MJAR-80-fullcontent.xml, f:\jenkins\jenkins-slave\workspace\box_maven-jar-plugin_master-EOL2JTSLPKWLYYEA7ISEGP2JMWPBRZU7FXH6EG3ZDZ25NFJIJ2HQ\m\target\invoker-reports\BUILD-MJAR-80-include.xml, f:\jenkins\jenkins-slave\workspace\box_maven-jar-plugin_master-EOL2JTSLPKWLYYEA7ISEGP2JMWPBRZU7FXH6EG3ZDZ25NFJIJ2HQ\m\target\invoker-reports\BUILD-MJAR-82.xml, f:\jenkins\jenkins-slave\workspace\box_maven-jar-plugin_master-EOL2JTSLPKWLYYEA7ISEGP2JMWPBRZU7FXH6EG3ZDZ25NFJIJ2HQ\m\target\invoker-reports\BUILD-manifest-content.xml, f:\jenkins\jenkins-slave\workspace\box_maven-jar-plugin_master-EOL2JTSLPKWLYYEA7ISEGP2JMWPBRZU7FXH6EG3ZDZ25NFJIJ2HQ\m\target\invoker-reports\BUILD-mjar-139.xml, f:\jenkins\jenkins-slave\workspace\box_maven-jar-plugin_master-EOL2JTSLPKWLYYEA7ISEGP2JMWPBRZU7FXH6EG3ZDZ25NFJIJ2HQ\m\target\invoker-reports\BUILD-mjar-71-01.xml, f:\jenkins\jenkins-slave\workspace\box_maven-jar-plugin_master-EOL2JTSLPKWLYYEA7ISEGP2JMWPBRZU7FXH6EG3ZDZ25NFJIJ2HQ\m\target\invoker-reports\BUILD-mjar-71-02.xml, f:\jenkins\jenkins-slave\workspace\box_maven-jar-plugin_master-EOL2JTSLPKWLYYEA7ISEGP2JMWPBRZU7FXH6EG3ZDZ25NFJIJ2HQ\m\target\invoker-reports\BUILD-mjar-90.xml, f:\jenkins\jenkins-slave\workspace\box_maven-jar-plugin_master-EOL2JTSLPKWLYYEA7ISEGP2JMWPBRZU7FXH6EG3ZDZ25NFJIJ2HQ\m\target\invoker-reports\BUILD-project-004.xml]
[windows-jdk7] Found logs:[f:\jenkins\jenkins-slave\workspace\box_maven-jar-plugin_master-EOL2JTSLPKWLYYEA7ISEGP2JMWPBRZU7FXH6EG3ZDZ25NFJIJ2HQ\m\target\it\MJAR-162\build.log, f:\jenkins\jenkins-slave\workspace\box_maven-jar-plugin_master-EOL2JTSLPKWLYYEA7ISEGP2JMWPBRZU7FXH6EG3ZDZ25NFJIJ2HQ\m\target\it\MJAR-183\build.log, f:\jenkins\jenkins-slave\workspace\box_maven-jar-plugin_master-EOL2JTSLPKWLYYEA7ISEGP2JMWPBRZU7FXH6EG3ZDZ25NFJIJ2HQ\m\target\it\MJAR-198\build.log, f:\jenkins\jenkins-slave\workspace\box_maven-jar-plugin_master-EOL2JTSLPKWLYYEA7ISEGP2JMWPBRZU7FXH6EG3ZDZ25NFJIJ2HQ\m\target\it\MJAR-199-change-classifier\build.log, f:\jenkins\jenkins-slave\workspace\box_maven-jar-plugin_master-EOL2JTSLPKWLYYEA7ISEGP2JMWPBRZU7FXH6EG3ZDZ25NFJIJ2HQ\m\target\it\MJAR-199\build.log, f:\jenkins\jenkins-slave\workspace\box_maven-jar-plugin_master-EOL2JTSLPKWLYYEA7ISEGP2JMWPBRZU7FXH6EG3ZDZ25NFJIJ2HQ\m\target\it\MJAR-210\build.log, f:\jenkins\jenkins-slave\workspace\box_maven-jar-plugin_master-EOL2JTSLPKWLYYEA7ISEGP2JMWPBRZU7FXH6EG3ZDZ25NFJIJ2HQ\m\target\it\MJAR-228\build.log, f:\jenkins\jenkins-slave\workspace\box_maven-jar-plugin_master-EOL2JTSLPKWLYYEA7ISEGP2JMWPBRZU7FXH6EG3ZDZ25NFJIJ2HQ\m\target\it\MJAR-30-excludes\build.log, f:\jenkins\jenkins-slave\workspace\box_maven-jar-plugin_master-EOL2JTSLPKWLYYEA7ISEGP2JMWPBRZU7FXH6EG3ZDZ25NFJIJ2HQ\m\target\it\MJAR-30-fullcontent\build.log, f:\jenkins\jenkins-slave\workspace\box_maven-jar-plugin_master-EOL2JTSLPKWLYYEA7ISEGP2JMWPBRZU7FXH6EG3ZDZ25NFJIJ2HQ\m\target\it\MJAR-30-include\build.log, f:\jenkins\jenkins-slave\workspace\box_maven-jar-plugin_master-EOL2JTSLPKWLYYEA7ISEGP2JMWPBRZU7FXH6EG3ZDZ25NFJIJ2HQ\m\target\it\MJAR-60\build.log, f:\jenkins\jenkins-slave\workspace\box_maven-jar-plugin_master-EOL2JTSLPKWLYYEA7ISEGP2JMWPBRZU7FXH6EG3ZDZ25NFJIJ2HQ\m\target\it\MJAR-70-no-recreation\build.log, f:\jenkins\jenkins-slave\workspace\box_maven-jar-plugin_master-EOL2JTSLPKWLYYEA7ISEGP2JMWPBRZU7FXH6EG3ZDZ25NFJIJ2HQ\m\target\it\MJAR-70-recreation\build.log, f:\jenkins\jenkins-slave\workspace\box_maven-jar-plugin_master-EOL2JTSLPKWLYYEA7ISEGP2JMWPBRZU7FXH6EG3ZDZ25NFJIJ2HQ\m\target\it\MJAR-75\build.log, f:\jenkins\jenkins-slave\workspace\box_maven-jar-plugin_master-EOL2JTSLPKWLYYEA7ISEGP2JMWPBRZU7FXH6EG3ZDZ25NFJIJ2HQ\m\target\it\MJAR-80-exclude\build.log, f:\jenkins\jenkins-slave\workspace\box_maven-jar-plugin_master-EOL2JTSLPKWLYYEA7ISEGP2JMWPBRZU7FXH6EG3ZDZ25NFJIJ2HQ\m\target\it\MJAR-80-fullcontent\build.log, f:\jenkins\jenkins-slave\workspace\box_maven-jar-plugin_master-EOL2JTSLPKWLYYEA7ISEGP2JMWPBRZU7FXH6EG3ZDZ25NFJIJ2HQ\m\target\it\MJAR-80-include\build.log, f:\jenkins\jenkins-slave\workspace\box_maven-jar-plugin_master-EOL2JTSLPKWLYYEA7ISEGP2JMWPBRZU7FXH6EG3ZDZ25NFJIJ2HQ\m\target\it\MJAR-82\build.log, f:\jenkins\jenkins-slave\workspace\box_maven-jar-plugin_master-EOL2JTSLPKWLYYEA7ISEGP2JMWPBRZU7FXH6EG3ZDZ25NFJIJ2HQ\m\target\it\manifest-content\build.log, f:\jenkins\jenkins-slave\workspace\box_maven-jar-plugin_master-EOL2JTSLPKWLYYEA7ISEGP2JMWPBRZU7FXH6EG3ZDZ25NFJIJ2HQ\m\target\it\mjar-139\build.log, f:\jenkins\jenkins-slave\workspace\box_maven-jar-plugin_master-EOL2JTSLPKWLYYEA7ISEGP2JMWPBRZU7FXH6EG3ZDZ25NFJIJ2HQ\m\target\it\mjar-71-01\build.log, f:\jenkins\jenkins-slave\workspace\box_maven-jar-plugin_master-EOL2JTSLPKWLYYEA7ISEGP2JMWPBRZU7FXH6EG3ZDZ25NFJIJ2HQ\m\target\it\mjar-71-02\build.log, f:\jenkins\jenkins-slave\workspace\box_maven-jar-plugin_master-EOL2JTSLPKWLYYEA7ISEGP2JMWPBRZU7FXH6EG3ZDZ25NFJIJ2HQ\m\target\it\mjar-90\build.log, f:\jenkins\jenkins-slave\workspace\box_maven-jar-plugin_master-EOL2JTSLPKWLYYEA7ISEGP2JMWPBRZU7FXH6EG3ZDZ25NFJIJ2HQ\m\target\it\project-004\build.log]
[windows-jdk7] Finished parsing Maven Invoker results (found 24)
[windows-jdk7] [withMaven] junitPublisher - Archive test results for Maven artifact org.apache.maven.plugins:maven-jar-plugin:3.1.1-SNAPSHOT generated by maven-surefire-plugin:test (default-test): m\target\surefire-reports\*.xml
[windows-jdk7] Recording test results
[Pipeline] [windows-jdk8] }
[windows-jdk8] [withMaven] invokerPublisher - Archive invoker results for Maven artifact MavenArtifact{org.apache.maven.plugins:maven-jar-plugin::3.1.1-SNAPSHOT(version: 3.1.1-SNAPSHOT, snapshot:false) } generated by PluginInvocation{org.apache.maven.plugins:maven-invoker-plugin:3.1.0@integration-test  integration-test}: m\target\invoker-reports\*.xml
[windows-jdk8] performing MavenInvokerRecorder, reportsFilenamePattern:'**/m\target\invoker-reports/BUILD*.xml', invokerBuildDir:'**/m\target\it'
[windows-jdk8] Found reports:[f:\jenkins\jenkins-slave\workspace\box_maven-jar-plugin_master-EOL2JTSLPKWLYYEA7ISEGP2JMWPBRZU7FXH6EG3ZDZ25NFJIJ2HQ\m\target\invoker-reports\BUILD-MJAR-162.xml, f:\jenkins\jenkins-slave\workspace\box_maven-jar-plugin_master-EOL2JTSLPKWLYYEA7ISEGP2JMWPBRZU7FXH6EG3ZDZ25NFJIJ2HQ\m\target\invoker-reports\BUILD-MJAR-183.xml, f:\jenkins\jenkins-slave\workspace\box_maven-jar-plugin_master-EOL2JTSLPKWLYYEA7ISEGP2JMWPBRZU7FXH6EG3ZDZ25NFJIJ2HQ\m\target\invoker-reports\BUILD-MJAR-198.xml, f:\jenkins\jenkins-slave\workspace\box_maven-jar-plugin_master-EOL2JTSLPKWLYYEA7ISEGP2JMWPBRZU7FXH6EG3ZDZ25NFJIJ2HQ\m\target\invoker-reports\BUILD-MJAR-199-change-classifier.xml, f:\jenkins\jenkins-slave\workspace\box_maven-jar-plugin_master-EOL2JTSLPKWLYYEA7ISEGP2JMWPBRZU7FXH6EG3ZDZ25NFJIJ2HQ\m\target\invoker-reports\BUILD-MJAR-199.xml, f:\jenkins\jenkins-slave\workspace\box_maven-jar-plugin_master-EOL2JTSLPKWLYYEA7ISEGP2JMWPBRZU7FXH6EG3ZDZ25NFJIJ2HQ\m\target\invoker-reports\BUILD-MJAR-210.xml, f:\jenkins\jenkins-slave\workspace\box_maven-jar-plugin_master-EOL2JTSLPKWLYYEA7ISEGP2JMWPBRZU7FXH6EG3ZDZ25NFJIJ2HQ\m\target\invoker-reports\BUILD-MJAR-228.xml, f:\jenkins\jenkins-slave\workspace\box_maven-jar-plugin_master-EOL2JTSLPKWLYYEA7ISEGP2JMWPBRZU7FXH6EG3ZDZ25NFJIJ2HQ\m\target\invoker-reports\BUILD-MJAR-30-excludes.xml, f:\jenkins\jenkins-slave\workspace\box_maven-jar-plugin_master-EOL2JTSLPKWLYYEA7ISEGP2JMWPBRZU7FXH6EG3ZDZ25NFJIJ2HQ\m\target\invoker-reports\BUILD-MJAR-30-fullcontent.xml, f:\jenkins\jenkins-slave\workspace\box_maven-jar-plugin_master-EOL2JTSLPKWLYYEA7ISEGP2JMWPBRZU7FXH6EG3ZDZ25NFJIJ2HQ\m\target\invoker-reports\BUILD-MJAR-30-include.xml, f:\jenkins\jenkins-slave\workspace\box_maven-jar-plugin_master-EOL2JTSLPKWLYYEA7ISEGP2JMWPBRZU7FXH6EG3ZDZ25NFJIJ2HQ\m\target\invoker-reports\BUILD-MJAR-60.xml, f:\jenkins\jenkins-slave\workspace\box_maven-jar-plugin_master-EOL2JTSLPKWLYYEA7ISEGP2JMWPBRZU7FXH6EG3ZDZ25NFJIJ2HQ\m\target\invoker-reports\BUILD-MJAR-70-no-recreation.xml, f:\jenkins\jenkins-slave\workspace\box_maven-jar-plugin_master-EOL2JTSLPKWLYYEA7ISEGP2JMWPBRZU7FXH6EG3ZDZ25NFJIJ2HQ\m\target\invoker-reports\BUILD-MJAR-70-recreation.xml, f:\jenkins\jenkins-slave\workspace\box_maven-jar-plugin_master-EOL2JTSLPKWLYYEA7ISEGP2JMWPBRZU7FXH6EG3ZDZ25NFJIJ2HQ\m\target\invoker-reports\BUILD-MJAR-75.xml, f:\jenkins\jenkins-slave\workspace\box_maven-jar-plugin_master-EOL2JTSLPKWLYYEA7ISEGP2JMWPBRZU7FXH6EG3ZDZ25NFJIJ2HQ\m\target\invoker-reports\BUILD-MJAR-80-exclude.xml, f:\jenkins\jenkins-slave\workspace\box_maven-jar-plugin_master-EOL2JTSLPKWLYYEA7ISEGP2JMWPBRZU7FXH6EG3ZDZ25NFJIJ2HQ\m\target\invoker-reports\BUILD-MJAR-80-fullcontent.xml, f:\jenkins\jenkins-slave\workspace\box_maven-jar-plugin_master-EOL2JTSLPKWLYYEA7ISEGP2JMWPBRZU7FXH6EG3ZDZ25NFJIJ2HQ\m\target\invoker-reports\BUILD-MJAR-80-include.xml, f:\jenkins\jenkins-slave\workspace\box_maven-jar-plugin_master-EOL2JTSLPKWLYYEA7ISEGP2JMWPBRZU7FXH6EG3ZDZ25NFJIJ2HQ\m\target\invoker-reports\BUILD-MJAR-82.xml, f:\jenkins\jenkins-slave\workspace\box_maven-jar-plugin_master-EOL2JTSLPKWLYYEA7ISEGP2JMWPBRZU7FXH6EG3ZDZ25NFJIJ2HQ\m\target\invoker-reports\BUILD-manifest-content.xml, f:\jenkins\jenkins-slave\workspace\box_maven-jar-plugin_master-EOL2JTSLPKWLYYEA7ISEGP2JMWPBRZU7FXH6EG3ZDZ25NFJIJ2HQ\m\target\invoker-reports\BUILD-mjar-139.xml, f:\jenkins\jenkins-slave\workspace\box_maven-jar-plugin_master-EOL2JTSLPKWLYYEA7ISEGP2JMWPBRZU7FXH6EG3ZDZ25NFJIJ2HQ\m\target\invoker-reports\BUILD-mjar-71-01.xml, f:\jenkins\jenkins-slave\workspace\box_maven-jar-plugin_master-EOL2JTSLPKWLYYEA7ISEGP2JMWPBRZU7FXH6EG3ZDZ25NFJIJ2HQ\m\target\invoker-reports\BUILD-mjar-71-02.xml, f:\jenkins\jenkins-slave\workspace\box_maven-jar-plugin_master-EOL2JTSLPKWLYYEA7ISEGP2JMWPBRZU7FXH6EG3ZDZ25NFJIJ2HQ\m\target\invoker-reports\BUILD-mjar-90.xml, f:\jenkins\jenkins-slave\workspace\box_maven-jar-plugin_master-EOL2JTSLPKWLYYEA7ISEGP2JMWPBRZU7FXH6EG3ZDZ25NFJIJ2HQ\m\target\invoker-reports\BUILD-project-004.xml]
[windows-jdk8] Found logs:[f:\jenkins\jenkins-slave\workspace\box_maven-jar-plugin_master-EOL2JTSLPKWLYYEA7ISEGP2JMWPBRZU7FXH6EG3ZDZ25NFJIJ2HQ\m\target\it\MJAR-162\build.log, f:\jenkins\jenkins-slave\workspace\box_maven-jar-plugin_master-EOL2JTSLPKWLYYEA7ISEGP2JMWPBRZU7FXH6EG3ZDZ25NFJIJ2HQ\m\target\it\MJAR-183\build.log, f:\jenkins\jenkins-slave\workspace\box_maven-jar-plugin_master-EOL2JTSLPKWLYYEA7ISEGP2JMWPBRZU7FXH6EG3ZDZ25NFJIJ2HQ\m\target\it\MJAR-198\build.log, f:\jenkins\jenkins-slave\workspace\box_maven-jar-plugin_master-EOL2JTSLPKWLYYEA7ISEGP2JMWPBRZU7FXH6EG3ZDZ25NFJIJ2HQ\m\target\it\MJAR-199-change-classifier\build.log, f:\jenkins\jenkins-slave\workspace\box_maven-jar-plugin_master-EOL2JTSLPKWLYYEA7ISEGP2JMWPBRZU7FXH6EG3ZDZ25NFJIJ2HQ\m\target\it\MJAR-199\build.log, f:\jenkins\jenkins-slave\workspace\box_maven-jar-plugin_master-EOL2JTSLPKWLYYEA7ISEGP2JMWPBRZU7FXH6EG3ZDZ25NFJIJ2HQ\m\target\it\MJAR-210\build.log, f:\jenkins\jenkins-slave\workspace\box_maven-jar-plugin_master-EOL2JTSLPKWLYYEA7ISEGP2JMWPBRZU7FXH6EG3ZDZ25NFJIJ2HQ\m\target\it\MJAR-228\build.log, f:\jenkins\jenkins-slave\workspace\box_maven-jar-plugin_master-EOL2JTSLPKWLYYEA7ISEGP2JMWPBRZU7FXH6EG3ZDZ25NFJIJ2HQ\m\target\it\MJAR-30-excludes\build.log, f:\jenkins\jenkins-slave\workspace\box_maven-jar-plugin_master-EOL2JTSLPKWLYYEA7ISEGP2JMWPBRZU7FXH6EG3ZDZ25NFJIJ2HQ\m\target\it\MJAR-30-fullcontent\build.log, f:\jenkins\jenkins-slave\workspace\box_maven-jar-plugin_master-EOL2JTSLPKWLYYEA7ISEGP2JMWPBRZU7FXH6EG3ZDZ25NFJIJ2HQ\m\target\it\MJAR-30-include\build.log, f:\jenkins\jenkins-slave\workspace\box_maven-jar-plugin_master-EOL2JTSLPKWLYYEA7ISEGP2JMWPBRZU7FXH6EG3ZDZ25NFJIJ2HQ\m\target\it\MJAR-60\build.log, f:\jenkins\jenkins-slave\workspace\box_maven-jar-plugin_master-EOL2JTSLPKWLYYEA7ISEGP2JMWPBRZU7FXH6EG3ZDZ25NFJIJ2HQ\m\target\it\MJAR-70-no-recreation\build.log, f:\jenkins\jenkins-slave\workspace\box_maven-jar-plugin_master-EOL2JTSLPKWLYYEA7ISEGP2JMWPBRZU7FXH6EG3ZDZ25NFJIJ2HQ\m\target\it\MJAR-70-recreation\build.log, f:\jenkins\jenkins-slave\workspace\box_maven-jar-plugin_master-EOL2JTSLPKWLYYEA7ISEGP2JMWPBRZU7FXH6EG3ZDZ25NFJIJ2HQ\m\target\it\MJAR-75\build.log, f:\jenkins\jenkins-slave\workspace\box_maven-jar-plugin_master-EOL2JTSLPKWLYYEA7ISEGP2JMWPBRZU7FXH6EG3ZDZ25NFJIJ2HQ\m\target\it\MJAR-80-exclude\build.log, f:\jenkins\jenkins-slave\workspace\box_maven-jar-plugin_master-EOL2JTSLPKWLYYEA7ISEGP2JMWPBRZU7FXH6EG3ZDZ25NFJIJ2HQ\m\target\it\MJAR-80-fullcontent\build.log, f:\jenkins\jenkins-slave\workspace\box_maven-jar-plugin_master-EOL2JTSLPKWLYYEA7ISEGP2JMWPBRZU7FXH6EG3ZDZ25NFJIJ2HQ\m\target\it\MJAR-80-include\build.log, f:\jenkins\jenkins-slave\workspace\box_maven-jar-plugin_master-EOL2JTSLPKWLYYEA7ISEGP2JMWPBRZU7FXH6EG3ZDZ25NFJIJ2HQ\m\target\it\MJAR-82\build.log, f:\jenkins\jenkins-slave\workspace\box_maven-jar-plugin_master-EOL2JTSLPKWLYYEA7ISEGP2JMWPBRZU7FXH6EG3ZDZ25NFJIJ2HQ\m\target\it\manifest-content\build.log, f:\jenkins\jenkins-slave\workspace\box_maven-jar-plugin_master-EOL2JTSLPKWLYYEA7ISEGP2JMWPBRZU7FXH6EG3ZDZ25NFJIJ2HQ\m\target\it\mjar-139\build.log, f:\jenkins\jenkins-slave\workspace\box_maven-jar-plugin_master-EOL2JTSLPKWLYYEA7ISEGP2JMWPBRZU7FXH6EG3ZDZ25NFJIJ2HQ\m\target\it\mjar-71-01\build.log, f:\jenkins\jenkins-slave\workspace\box_maven-jar-plugin_master-EOL2JTSLPKWLYYEA7ISEGP2JMWPBRZU7FXH6EG3ZDZ25NFJIJ2HQ\m\target\it\mjar-71-02\build.log, f:\jenkins\jenkins-slave\workspace\box_maven-jar-plugin_master-EOL2JTSLPKWLYYEA7ISEGP2JMWPBRZU7FXH6EG3ZDZ25NFJIJ2HQ\m\target\it\mjar-90\build.log, f:\jenkins\jenkins-slave\workspace\box_maven-jar-plugin_master-EOL2JTSLPKWLYYEA7ISEGP2JMWPBRZU7FXH6EG3ZDZ25NFJIJ2HQ\m\target\it\project-004\build.log]
[windows-jdk8] Finished parsing Maven Invoker results (found 24)
[windows-jdk8] [withMaven] junitPublisher - Archive test results for Maven artifact org.apache.maven.plugins:maven-jar-plugin:3.1.1-SNAPSHOT generated by maven-surefire-plugin:test (default-test): m\target\surefire-reports\*.xml
[windows-jdk8] Recording test results
[Pipeline] [windows-jdk9] }
[windows-jdk9] [withMaven] invokerPublisher - Archive invoker results for Maven artifact MavenArtifact{org.apache.maven.plugins:maven-jar-plugin::3.1.1-SNAPSHOT(version: 3.1.1-SNAPSHOT, snapshot:false) } generated by PluginInvocation{org.apache.maven.plugins:maven-invoker-plugin:3.1.0@integration-test  integration-test}: m\target\invoker-reports\*.xml
[windows-jdk9] performing MavenInvokerRecorder, reportsFilenamePattern:'**/m\target\invoker-reports/BUILD*.xml', invokerBuildDir:'**/m\target\it'
[windows-jdk9] Found reports:[f:\jenkins\jenkins-slave\workspace\box_maven-jar-plugin_master-EOL2JTSLPKWLYYEA7ISEGP2JMWPBRZU7FXH6EG3ZDZ25NFJIJ2HQ\m\target\invoker-reports\BUILD-MJAR-162.xml, f:\jenkins\jenkins-slave\workspace\box_maven-jar-plugin_master-EOL2JTSLPKWLYYEA7ISEGP2JMWPBRZU7FXH6EG3ZDZ25NFJIJ2HQ\m\target\invoker-reports\BUILD-MJAR-183.xml, f:\jenkins\jenkins-slave\workspace\box_maven-jar-plugin_master-EOL2JTSLPKWLYYEA7ISEGP2JMWPBRZU7FXH6EG3ZDZ25NFJIJ2HQ\m\target\invoker-reports\BUILD-MJAR-198.xml, f:\jenkins\jenkins-slave\workspace\box_maven-jar-plugin_master-EOL2JTSLPKWLYYEA7ISEGP2JMWPBRZU7FXH6EG3ZDZ25NFJIJ2HQ\m\target\invoker-reports\BUILD-MJAR-199-change-classifier.xml, f:\jenkins\jenkins-slave\workspace\box_maven-jar-plugin_master-EOL2JTSLPKWLYYEA7ISEGP2JMWPBRZU7FXH6EG3ZDZ25NFJIJ2HQ\m\target\invoker-reports\BUILD-MJAR-199.xml, f:\jenkins\jenkins-slave\workspace\box_maven-jar-plugin_master-EOL2JTSLPKWLYYEA7ISEGP2JMWPBRZU7FXH6EG3ZDZ25NFJIJ2HQ\m\target\invoker-reports\BUILD-MJAR-210.xml, f:\jenkins\jenkins-slave\workspace\box_maven-jar-plugin_master-EOL2JTSLPKWLYYEA7ISEGP2JMWPBRZU7FXH6EG3ZDZ25NFJIJ2HQ\m\target\invoker-reports\BUILD-MJAR-228.xml, f:\jenkins\jenkins-slave\workspace\box_maven-jar-plugin_master-EOL2JTSLPKWLYYEA7ISEGP2JMWPBRZU7FXH6EG3ZDZ25NFJIJ2HQ\m\target\invoker-reports\BUILD-MJAR-30-excludes.xml, f:\jenkins\jenkins-slave\workspace\box_maven-jar-plugin_master-EOL2JTSLPKWLYYEA7ISEGP2JMWPBRZU7FXH6EG3ZDZ25NFJIJ2HQ\m\target\invoker-reports\BUILD-MJAR-30-fullcontent.xml, f:\jenkins\jenkins-slave\workspace\box_maven-jar-plugin_master-EOL2JTSLPKWLYYEA7ISEGP2JMWPBRZU7FXH6EG3ZDZ25NFJIJ2HQ\m\target\invoker-reports\BUILD-MJAR-30-include.xml, f:\jenkins\jenkins-slave\workspace\box_maven-jar-plugin_master-EOL2JTSLPKWLYYEA7ISEGP2JMWPBRZU7FXH6EG3ZDZ25NFJIJ2HQ\m\target\invoker-reports\BUILD-MJAR-60.xml, f:\jenkins\jenkins-slave\workspace\box_maven-jar-plugin_master-EOL2JTSLPKWLYYEA7ISEGP2JMWPBRZU7FXH6EG3ZDZ25NFJIJ2HQ\m\target\invoker-reports\BUILD-MJAR-70-no-recreation.xml, f:\jenkins\jenkins-slave\workspace\box_maven-jar-plugin_master-EOL2JTSLPKWLYYEA7ISEGP2JMWPBRZU7FXH6EG3ZDZ25NFJIJ2HQ\m\target\invoker-reports\BUILD-MJAR-70-recreation.xml, f:\jenkins\jenkins-slave\workspace\box_maven-jar-plugin_master-EOL2JTSLPKWLYYEA7ISEGP2JMWPBRZU7FXH6EG3ZDZ25NFJIJ2HQ\m\target\invoker-reports\BUILD-MJAR-75.xml, f:\jenkins\jenkins-slave\workspace\box_maven-jar-plugin_master-EOL2JTSLPKWLYYEA7ISEGP2JMWPBRZU7FXH6EG3ZDZ25NFJIJ2HQ\m\target\invoker-reports\BUILD-MJAR-80-exclude.xml, f:\jenkins\jenkins-slave\workspace\box_maven-jar-plugin_master-EOL2JTSLPKWLYYEA7ISEGP2JMWPBRZU7FXH6EG3ZDZ25NFJIJ2HQ\m\target\invoker-reports\BUILD-MJAR-80-fullcontent.xml, f:\jenkins\jenkins-slave\workspace\box_maven-jar-plugin_master-EOL2JTSLPKWLYYEA7ISEGP2JMWPBRZU7FXH6EG3ZDZ25NFJIJ2HQ\m\target\invoker-reports\BUILD-MJAR-80-include.xml, f:\jenkins\jenkins-slave\workspace\box_maven-jar-plugin_master-EOL2JTSLPKWLYYEA7ISEGP2JMWPBRZU7FXH6EG3ZDZ25NFJIJ2HQ\m\target\invoker-reports\BUILD-MJAR-82.xml, f:\jenkins\jenkins-slave\workspace\box_maven-jar-plugin_master-EOL2JTSLPKWLYYEA7ISEGP2JMWPBRZU7FXH6EG3ZDZ25NFJIJ2HQ\m\target\invoker-reports\BUILD-manifest-content.xml, f:\jenkins\jenkins-slave\workspace\box_maven-jar-plugin_master-EOL2JTSLPKWLYYEA7ISEGP2JMWPBRZU7FXH6EG3ZDZ25NFJIJ2HQ\m\target\invoker-reports\BUILD-mjar-139.xml, f:\jenkins\jenkins-slave\workspace\box_maven-jar-plugin_master-EOL2JTSLPKWLYYEA7ISEGP2JMWPBRZU7FXH6EG3ZDZ25NFJIJ2HQ\m\target\invoker-reports\BUILD-mjar-71-01.xml, f:\jenkins\jenkins-slave\workspace\box_maven-jar-plugin_master-EOL2JTSLPKWLYYEA7ISEGP2JMWPBRZU7FXH6EG3ZDZ25NFJIJ2HQ\m\target\invoker-reports\BUILD-mjar-71-02.xml, f:\jenkins\jenkins-slave\workspace\box_maven-jar-plugin_master-EOL2JTSLPKWLYYEA7ISEGP2JMWPBRZU7FXH6EG3ZDZ25NFJIJ2HQ\m\target\invoker-reports\BUILD-mjar-90.xml, f:\jenkins\jenkins-slave\workspace\box_maven-jar-plugin_master-EOL2JTSLPKWLYYEA7ISEGP2JMWPBRZU7FXH6EG3ZDZ25NFJIJ2HQ\m\target\invoker-reports\BUILD-project-004.xml]
[windows-jdk9] Found logs:[f:\jenkins\jenkins-slave\workspace\box_maven-jar-plugin_master-EOL2JTSLPKWLYYEA7ISEGP2JMWPBRZU7FXH6EG3ZDZ25NFJIJ2HQ\m\target\it\MJAR-162\build.log, f:\jenkins\jenkins-slave\workspace\box_maven-jar-plugin_master-EOL2JTSLPKWLYYEA7ISEGP2JMWPBRZU7FXH6EG3ZDZ25NFJIJ2HQ\m\target\it\MJAR-183\build.log, f:\jenkins\jenkins-slave\workspace\box_maven-jar-plugin_master-EOL2JTSLPKWLYYEA7ISEGP2JMWPBRZU7FXH6EG3ZDZ25NFJIJ2HQ\m\target\it\MJAR-198\build.log, f:\jenkins\jenkins-slave\workspace\box_maven-jar-plugin_master-EOL2JTSLPKWLYYEA7ISEGP2JMWPBRZU7FXH6EG3ZDZ25NFJIJ2HQ\m\target\it\MJAR-199-change-classifier\build.log, f:\jenkins\jenkins-slave\workspace\box_maven-jar-plugin_master-EOL2JTSLPKWLYYEA7ISEGP2JMWPBRZU7FXH6EG3ZDZ25NFJIJ2HQ\m\target\it\MJAR-199\build.log, f:\jenkins\jenkins-slave\workspace\box_maven-jar-plugin_master-EOL2JTSLPKWLYYEA7ISEGP2JMWPBRZU7FXH6EG3ZDZ25NFJIJ2HQ\m\target\it\MJAR-210\build.log, f:\jenkins\jenkins-slave\workspace\box_maven-jar-plugin_master-EOL2JTSLPKWLYYEA7ISEGP2JMWPBRZU7FXH6EG3ZDZ25NFJIJ2HQ\m\target\it\MJAR-228\build.log, f:\jenkins\jenkins-slave\workspace\box_maven-jar-plugin_master-EOL2JTSLPKWLYYEA7ISEGP2JMWPBRZU7FXH6EG3ZDZ25NFJIJ2HQ\m\target\it\MJAR-30-excludes\build.log, f:\jenkins\jenkins-slave\workspace\box_maven-jar-plugin_master-EOL2JTSLPKWLYYEA7ISEGP2JMWPBRZU7FXH6EG3ZDZ25NFJIJ2HQ\m\target\it\MJAR-30-fullcontent\build.log, f:\jenkins\jenkins-slave\workspace\box_maven-jar-plugin_master-EOL2JTSLPKWLYYEA7ISEGP2JMWPBRZU7FXH6EG3ZDZ25NFJIJ2HQ\m\target\it\MJAR-30-include\build.log, f:\jenkins\jenkins-slave\workspace\box_maven-jar-plugin_master-EOL2JTSLPKWLYYEA7ISEGP2JMWPBRZU7FXH6EG3ZDZ25NFJIJ2HQ\m\target\it\MJAR-60\build.log, f:\jenkins\jenkins-slave\workspace\box_maven-jar-plugin_master-EOL2JTSLPKWLYYEA7ISEGP2JMWPBRZU7FXH6EG3ZDZ25NFJIJ2HQ\m\target\it\MJAR-70-no-recreation\build.log, f:\jenkins\jenkins-slave\workspace\box_maven-jar-plugin_master-EOL2JTSLPKWLYYEA7ISEGP2JMWPBRZU7FXH6EG3ZDZ25NFJIJ2HQ\m\target\it\MJAR-70-recreation\build.log, f:\jenkins\jenkins-slave\workspace\box_maven-jar-plugin_master-EOL2JTSLPKWLYYEA7ISEGP2JMWPBRZU7FXH6EG3ZDZ25NFJIJ2HQ\m\target\it\MJAR-75\build.log, f:\jenkins\jenkins-slave\workspace\box_maven-jar-plugin_master-EOL2JTSLPKWLYYEA7ISEGP2JMWPBRZU7FXH6EG3ZDZ25NFJIJ2HQ\m\target\it\MJAR-80-exclude\build.log, f:\jenkins\jenkins-slave\workspace\box_maven-jar-plugin_master-EOL2JTSLPKWLYYEA7ISEGP2JMWPBRZU7FXH6EG3ZDZ25NFJIJ2HQ\m\target\it\MJAR-80-fullcontent\build.log, f:\jenkins\jenkins-slave\workspace\box_maven-jar-plugin_master-EOL2JTSLPKWLYYEA7ISEGP2JMWPBRZU7FXH6EG3ZDZ25NFJIJ2HQ\m\target\it\MJAR-80-include\build.log, f:\jenkins\jenkins-slave\workspace\box_maven-jar-plugin_master-EOL2JTSLPKWLYYEA7ISEGP2JMWPBRZU7FXH6EG3ZDZ25NFJIJ2HQ\m\target\it\MJAR-82\build.log, f:\jenkins\jenkins-slave\workspace\box_maven-jar-plugin_master-EOL2JTSLPKWLYYEA7ISEGP2JMWPBRZU7FXH6EG3ZDZ25NFJIJ2HQ\m\target\it\manifest-content\build.log, f:\jenkins\jenkins-slave\workspace\box_maven-jar-plugin_master-EOL2JTSLPKWLYYEA7ISEGP2JMWPBRZU7FXH6EG3ZDZ25NFJIJ2HQ\m\target\it\mjar-139\build.log, f:\jenkins\jenkins-slave\workspace\box_maven-jar-plugin_master-EOL2JTSLPKWLYYEA7ISEGP2JMWPBRZU7FXH6EG3ZDZ25NFJIJ2HQ\m\target\it\mjar-71-01\build.log, f:\jenkins\jenkins-slave\workspace\box_maven-jar-plugin_master-EOL2JTSLPKWLYYEA7ISEGP2JMWPBRZU7FXH6EG3ZDZ25NFJIJ2HQ\m\target\it\mjar-71-02\build.log, f:\jenkins\jenkins-slave\workspace\box_maven-jar-plugin_master-EOL2JTSLPKWLYYEA7ISEGP2JMWPBRZU7FXH6EG3ZDZ25NFJIJ2HQ\m\target\it\mjar-90\build.log, f:\jenkins\jenkins-slave\workspace\box_maven-jar-plugin_master-EOL2JTSLPKWLYYEA7ISEGP2JMWPBRZU7FXH6EG3ZDZ25NFJIJ2HQ\m\target\it\project-004\build.log]
[windows-jdk9] Finished parsing Maven Invoker results (found 24)
[windows-jdk9] [withMaven] junitPublisher - Archive test results for Maven artifact org.apache.maven.plugins:maven-jar-plugin:3.1.1-SNAPSHOT generated by maven-surefire-plugin:test (default-test): m\target\surefire-reports\*.xml
[windows-jdk9] Recording test results
[Pipeline] [linux-jdk10] // node
[Pipeline] [windows-jdk7] // withMaven
[Pipeline] [windows-jdk8] // withMaven
[Pipeline] [windows-jdk9] // withMaven
[Pipeline] [linux-jdk10] }
[Pipeline] [linux-jdk9] cleanWs
[Pipeline] [windows-jdk7] cleanWs
[Pipeline] [windows-jdk8] cleanWs
[Pipeline] [windows-jdk9] cleanWs
[Pipeline] [windows-jdk10] }
[Pipeline] [windows-jdk10] // dir
[linux-jdk9] [WS-CLEANUP] Deleting project workspace...[WS-CLEANUP] done
[windows-jdk7] [WS-CLEANUP] Deleting project workspace...[WS-CLEANUP] done
[windows-jdk8] [WS-CLEANUP] Deleting project workspace...[WS-CLEANUP] done
[windows-jdk9] [WS-CLEANUP] Deleting project workspace...[WS-CLEANUP] done
[Pipeline] [windows-jdk10] }
[windows-jdk10] [withMaven] invokerPublisher - Archive invoker results for Maven artifact MavenArtifact{org.apache.maven.plugins:maven-jar-plugin::3.1.1-SNAPSHOT(version: 3.1.1-SNAPSHOT, snapshot:false) } generated by PluginInvocation{org.apache.maven.plugins:maven-invoker-plugin:3.1.0@integration-test  integration-test}: m\target\invoker-reports\*.xml
[windows-jdk10] performing MavenInvokerRecorder, reportsFilenamePattern:'**/m\target\invoker-reports/BUILD*.xml', invokerBuildDir:'**/m\target\it'
[windows-jdk10] Found reports:[f:\jenkins\jenkins-slave\workspace\box_maven-jar-plugin_master-EOL2JTSLPKWLYYEA7ISEGP2JMWPBRZU7FXH6EG3ZDZ25NFJIJ2HQ@2\m\target\invoker-reports\BUILD-MJAR-162.xml, f:\jenkins\jenkins-slave\workspace\box_maven-jar-plugin_master-EOL2JTSLPKWLYYEA7ISEGP2JMWPBRZU7FXH6EG3ZDZ25NFJIJ2HQ@2\m\target\invoker-reports\BUILD-MJAR-183.xml, f:\jenkins\jenkins-slave\workspace\box_maven-jar-plugin_master-EOL2JTSLPKWLYYEA7ISEGP2JMWPBRZU7FXH6EG3ZDZ25NFJIJ2HQ@2\m\target\invoker-reports\BUILD-MJAR-198.xml, f:\jenkins\jenkins-slave\workspace\box_maven-jar-plugin_master-EOL2JTSLPKWLYYEA7ISEGP2JMWPBRZU7FXH6EG3ZDZ25NFJIJ2HQ@2\m\target\invoker-reports\BUILD-MJAR-199-change-classifier.xml, f:\jenkins\jenkins-slave\workspace\box_maven-jar-plugin_master-EOL2JTSLPKWLYYEA7ISEGP2JMWPBRZU7FXH6EG3ZDZ25NFJIJ2HQ@2\m\target\invoker-reports\BUILD-MJAR-199.xml, f:\jenkins\jenkins-slave\workspace\box_maven-jar-plugin_master-EOL2JTSLPKWLYYEA7ISEGP2JMWPBRZU7FXH6EG3ZDZ25NFJIJ2HQ@2\m\target\invoker-reports\BUILD-MJAR-210.xml, f:\jenkins\jenkins-slave\workspace\box_maven-jar-plugin_master-EOL2JTSLPKWLYYEA7ISEGP2JMWPBRZU7FXH6EG3ZDZ25NFJIJ2HQ@2\m\target\invoker-reports\BUILD-MJAR-228.xml, f:\jenkins\jenkins-slave\workspace\box_maven-jar-plugin_master-EOL2JTSLPKWLYYEA7ISEGP2JMWPBRZU7FXH6EG3ZDZ25NFJIJ2HQ@2\m\target\invoker-reports\BUILD-MJAR-30-excludes.xml, f:\jenkins\jenkins-slave\workspace\box_maven-jar-plugin_master-EOL2JTSLPKWLYYEA7ISEGP2JMWPBRZU7FXH6EG3ZDZ25NFJIJ2HQ@2\m\target\invoker-reports\BUILD-MJAR-30-fullcontent.xml, f:\jenkins\jenkins-slave\workspace\box_maven-jar-plugin_master-EOL2JTSLPKWLYYEA7ISEGP2JMWPBRZU7FXH6EG3ZDZ25NFJIJ2HQ@2\m\target\invoker-reports\BUILD-MJAR-30-include.xml, f:\jenkins\jenkins-slave\workspace\box_maven-jar-plugin_master-EOL2JTSLPKWLYYEA7ISEGP2JMWPBRZU7FXH6EG3ZDZ25NFJIJ2HQ@2\m\target\invoker-reports\BUILD-MJAR-60.xml, f:\jenkins\jenkins-slave\workspace\box_maven-jar-plugin_master-EOL2JTSLPKWLYYEA7ISEGP2JMWPBRZU7FXH6EG3ZDZ25NFJIJ2HQ@2\m\target\invoker-reports\BUILD-MJAR-70-no-recreation.xml, f:\jenkins\jenkins-slave\workspace\box_maven-jar-plugin_master-EOL2JTSLPKWLYYEA7ISEGP2JMWPBRZU7FXH6EG3ZDZ25NFJIJ2HQ@2\m\target\invoker-reports\BUILD-MJAR-70-recreation.xml, f:\jenkins\jenkins-slave\workspace\box_maven-jar-plugin_master-EOL2JTSLPKWLYYEA7ISEGP2JMWPBRZU7FXH6EG3ZDZ25NFJIJ2HQ@2\m\target\invoker-reports\BUILD-MJAR-75.xml, f:\jenkins\jenkins-slave\workspace\box_maven-jar-plugin_master-EOL2JTSLPKWLYYEA7ISEGP2JMWPBRZU7FXH6EG3ZDZ25NFJIJ2HQ@2\m\target\invoker-reports\BUILD-MJAR-80-exclude.xml, f:\jenkins\jenkins-slave\workspace\box_maven-jar-plugin_master-EOL2JTSLPKWLYYEA7ISEGP2JMWPBRZU7FXH6EG3ZDZ25NFJIJ2HQ@2\m\target\invoker-reports\BUILD-MJAR-80-fullcontent.xml, f:\jenkins\jenkins-slave\workspace\box_maven-jar-plugin_master-EOL2JTSLPKWLYYEA7ISEGP2JMWPBRZU7FXH6EG3ZDZ25NFJIJ2HQ@2\m\target\invoker-reports\BUILD-MJAR-80-include.xml, f:\jenkins\jenkins-slave\workspace\box_maven-jar-plugin_master-EOL2JTSLPKWLYYEA7ISEGP2JMWPBRZU7FXH6EG3ZDZ25NFJIJ2HQ@2\m\target\invoker-reports\BUILD-MJAR-82.xml, f:\jenkins\jenkins-slave\workspace\box_maven-jar-plugin_master-EOL2JTSLPKWLYYEA7ISEGP2JMWPBRZU7FXH6EG3ZDZ25NFJIJ2HQ@2\m\target\invoker-reports\BUILD-manifest-content.xml, f:\jenkins\jenkins-slave\workspace\box_maven-jar-plugin_master-EOL2JTSLPKWLYYEA7ISEGP2JMWPBRZU7FXH6EG3ZDZ25NFJIJ2HQ@2\m\target\invoker-reports\BUILD-mjar-139.xml, f:\jenkins\jenkins-slave\workspace\box_maven-jar-plugin_master-EOL2JTSLPKWLYYEA7ISEGP2JMWPBRZU7FXH6EG3ZDZ25NFJIJ2HQ@2\m\target\invoker-reports\BUILD-mjar-71-01.xml, f:\jenkins\jenkins-slave\workspace\box_maven-jar-plugin_master-EOL2JTSLPKWLYYEA7ISEGP2JMWPBRZU7FXH6EG3ZDZ25NFJIJ2HQ@2\m\target\invoker-reports\BUILD-mjar-71-02.xml, f:\jenkins\jenkins-slave\workspace\box_maven-jar-plugin_master-EOL2JTSLPKWLYYEA7ISEGP2JMWPBRZU7FXH6EG3ZDZ25NFJIJ2HQ@2\m\target\invoker-reports\BUILD-mjar-90.xml, f:\jenkins\jenkins-slave\workspace\box_maven-jar-plugin_master-EOL2JTSLPKWLYYEA7ISEGP2JMWPBRZU7FXH6EG3ZDZ25NFJIJ2HQ@2\m\target\invoker-reports\BUILD-project-004.xml]
[windows-jdk10] Found logs:[f:\jenkins\jenkins-slave\workspace\box_maven-jar-plugin_master-EOL2JTSLPKWLYYEA7ISEGP2JMWPBRZU7FXH6EG3ZDZ25NFJIJ2HQ@2\m\target\it\MJAR-162\build.log, f:\jenkins\jenkins-slave\workspace\box_maven-jar-plugin_master-EOL2JTSLPKWLYYEA7ISEGP2JMWPBRZU7FXH6EG3ZDZ25NFJIJ2HQ@2\m\target\it\MJAR-183\build.log, f:\jenkins\jenkins-slave\workspace\box_maven-jar-plugin_master-EOL2JTSLPKWLYYEA7ISEGP2JMWPBRZU7FXH6EG3ZDZ25NFJIJ2HQ@2\m\target\it\MJAR-198\build.log, f:\jenkins\jenkins-slave\workspace\box_maven-jar-plugin_master-EOL2JTSLPKWLYYEA7ISEGP2JMWPBRZU7FXH6EG3ZDZ25NFJIJ2HQ@2\m\target\it\MJAR-199-change-classifier\build.log, f:\jenkins\jenkins-slave\workspace\box_maven-jar-plugin_master-EOL2JTSLPKWLYYEA7ISEGP2JMWPBRZU7FXH6EG3ZDZ25NFJIJ2HQ@2\m\target\it\MJAR-199\build.log, f:\jenkins\jenkins-slave\workspace\box_maven-jar-plugin_master-EOL2JTSLPKWLYYEA7ISEGP2JMWPBRZU7FXH6EG3ZDZ25NFJIJ2HQ@2\m\target\it\MJAR-210\build.log, f:\jenkins\jenkins-slave\workspace\box_maven-jar-plugin_master-EOL2JTSLPKWLYYEA7ISEGP2JMWPBRZU7FXH6EG3ZDZ25NFJIJ2HQ@2\m\target\it\MJAR-228\build.log, f:\jenkins\jenkins-slave\workspace\box_maven-jar-plugin_master-EOL2JTSLPKWLYYEA7ISEGP2JMWPBRZU7FXH6EG3ZDZ25NFJIJ2HQ@2\m\target\it\MJAR-30-excludes\build.log, f:\jenkins\jenkins-slave\workspace\box_maven-jar-plugin_master-EOL2JTSLPKWLYYEA7ISEGP2JMWPBRZU7FXH6EG3ZDZ25NFJIJ2HQ@2\m\target\it\MJAR-30-fullcontent\build.log, f:\jenkins\jenkins-slave\workspace\box_maven-jar-plugin_master-EOL2JTSLPKWLYYEA7ISEGP2JMWPBRZU7FXH6EG3ZDZ25NFJIJ2HQ@2\m\target\it\MJAR-30-include\build.log, f:\jenkins\jenkins-slave\workspace\box_maven-jar-plugin_master-EOL2JTSLPKWLYYEA7ISEGP2JMWPBRZU7FXH6EG3ZDZ25NFJIJ2HQ@2\m\target\it\MJAR-60\build.log, f:\jenkins\jenkins-slave\workspace\box_maven-jar-plugin_master-EOL2JTSLPKWLYYEA7ISEGP2JMWPBRZU7FXH6EG3ZDZ25NFJIJ2HQ@2\m\target\it\MJAR-70-no-recreation\build.log, f:\jenkins\jenkins-slave\workspace\box_maven-jar-plugin_master-EOL2JTSLPKWLYYEA7ISEGP2JMWPBRZU7FXH6EG3ZDZ25NFJIJ2HQ@2\m\target\it\MJAR-70-recreation\build.log, f:\jenkins\jenkins-slave\workspace\box_maven-jar-plugin_master-EOL2JTSLPKWLYYEA7ISEGP2JMWPBRZU7FXH6EG3ZDZ25NFJIJ2HQ@2\m\target\it\MJAR-75\build.log, f:\jenkins\jenkins-slave\workspace\box_maven-jar-plugin_master-EOL2JTSLPKWLYYEA7ISEGP2JMWPBRZU7FXH6EG3ZDZ25NFJIJ2HQ@2\m\target\it\MJAR-80-exclude\build.log, f:\jenkins\jenkins-slave\workspace\box_maven-jar-plugin_master-EOL2JTSLPKWLYYEA7ISEGP2JMWPBRZU7FXH6EG3ZDZ25NFJIJ2HQ@2\m\target\it\MJAR-80-fullcontent\build.log, f:\jenkins\jenkins-slave\workspace\box_maven-jar-plugin_master-EOL2JTSLPKWLYYEA7ISEGP2JMWPBRZU7FXH6EG3ZDZ25NFJIJ2HQ@2\m\target\it\MJAR-80-include\build.log, f:\jenkins\jenkins-slave\workspace\box_maven-jar-plugin_master-EOL2JTSLPKWLYYEA7ISEGP2JMWPBRZU7FXH6EG3ZDZ25NFJIJ2HQ@2\m\target\it\MJAR-82\build.log, f:\jenkins\jenkins-slave\workspace\box_maven-jar-plugin_master-EOL2JTSLPKWLYYEA7ISEGP2JMWPBRZU7FXH6EG3ZDZ25NFJIJ2HQ@2\m\target\it\manifest-content\build.log, f:\jenkins\jenkins-slave\workspace\box_maven-jar-plugin_master-EOL2JTSLPKWLYYEA7ISEGP2JMWPBRZU7FXH6EG3ZDZ25NFJIJ2HQ@2\m\target\it\mjar-139\build.log, f:\jenkins\jenkins-slave\workspace\box_maven-jar-plugin_master-EOL2JTSLPKWLYYEA7ISEGP2JMWPBRZU7FXH6EG3ZDZ25NFJIJ2HQ@2\m\target\it\mjar-71-01\build.log, f:\jenkins\jenkins-slave\workspace\box_maven-jar-plugin_master-EOL2JTSLPKWLYYEA7ISEGP2JMWPBRZU7FXH6EG3ZDZ25NFJIJ2HQ@2\m\target\it\mjar-71-02\build.log, f:\jenkins\jenkins-slave\workspace\box_maven-jar-plugin_master-EOL2JTSLPKWLYYEA7ISEGP2JMWPBRZU7FXH6EG3ZDZ25NFJIJ2HQ@2\m\target\it\mjar-90\build.log, f:\jenkins\jenkins-slave\workspace\box_maven-jar-plugin_master-EOL2JTSLPKWLYYEA7ISEGP2JMWPBRZU7FXH6EG3ZDZ25NFJIJ2HQ@2\m\target\it\project-004\build.log]
[windows-jdk10] Finished parsing Maven Invoker results (found 24)
[windows-jdk10] [withMaven] junitPublisher - Archive test results for Maven artifact org.apache.maven.plugins:maven-jar-plugin:3.1.1-SNAPSHOT generated by maven-surefire-plugin:test (default-test): m\target\surefire-reports\*.xml
[windows-jdk10] Recording test results
[Pipeline] [windows-jdk10] // withMaven
[Pipeline] [linux-jdk9] }
[Pipeline] [windows-jdk7] }
[Pipeline] [windows-jdk8] }
[Pipeline] [windows-jdk9] }
[Pipeline] [windows-jdk10] cleanWs
[Pipeline] [linux-jdk9] // stage
[Pipeline] [windows-jdk7] // stage
[Pipeline] [windows-jdk8] // stage
[Pipeline] [windows-jdk9] // stage
[Pipeline] [linux-jdk9] }
[Pipeline] [windows-jdk7] }
[Pipeline] [windows-jdk8] }
[Pipeline] [windows-jdk9] }
[Pipeline] [linux-jdk9] // node
[Pipeline] [windows-jdk7] // node
[Pipeline] [windows-jdk8] // node
[Pipeline] [windows-jdk9] // node
[Pipeline] [linux-jdk9] }
[linux-jdk9] Failed in branch linux-jdk9
[Pipeline] [windows-jdk7] }
[Pipeline] [windows-jdk8] }
[Pipeline] [windows-jdk9] }
[windows-jdk10] [WS-CLEANUP] Deleting project workspace...[WS-CLEANUP] done
[Pipeline] [windows-jdk10] }
[Pipeline] [windows-jdk10] // stage
[Pipeline] [windows-jdk10] }
[Pipeline] [windows-jdk10] // node
[Pipeline] [windows-jdk10] }
[Pipeline] // parallel
[Pipeline] stage
[Pipeline] { (Notifications)
[Pipeline] echo
Build result: FAILURE
[Pipeline] jiraIssueSelector
[Pipeline] emailext