Build failed in Jenkins: Maven TLP » maven-jar-plugin » MJAR-238 #4

classic Classic list List threaded Threaded
4 messages Options
Reply | Threaded
Open this post in threaded view
|

Build failed in Jenkins: Maven TLP » maven-jar-plugin » MJAR-238 #4

Apache Jenkins Server-2
See https://builds.apache.org/job/maven-box/job/maven-jar-plugin/job/MJAR-238/4/

Changes:

* added a link to asf-gitpubsub-jenkins-plugin
* fixed markup (asciidoc, not markdown...)

All tests passed

Build log:
[...truncated 200183 lines...]
[INFO] [DEBUG]   (f) skipMultiThreadWarning = false
[INFO] [DEBUG]   (f) source = 1.7
[INFO] [DEBUG]   (f) staleMillis = 0
[INFO] [DEBUG]   (f) target = 1.7
[INFO] [DEBUG]   (f) useIncrementalCompilation = true
[INFO] [DEBUG]   (f) verbose = false
[INFO] [DEBUG]   (f) mavenSession = org.apache.maven.execution.MavenSession@4038cd3a
[INFO] [DEBUG]   (f) session = org.apache.maven.execution.MavenSession@4038cd3a
[INFO] [DEBUG] -- end configuration --
[INFO] [DEBUG] Using compiler 'javac'.
[INFO] [INFO] No sources to compile
[INFO] [INFO]
[INFO] [INFO] --- maven-surefire-plugin:2.3:test (default-test) @ maven-jar-plugin-test-project-004 ---
[INFO] [DEBUG] Dependency collection stats: {ConflictMarker.analyzeTime=123100, ConflictMarker.markTime=41100, ConflictMarker.nodeCount=16, ConflictIdSorter.graphTime=22600, ConflictIdSorter.topsortTime=20600, ConflictIdSorter.conflictIdCount=11, ConflictIdSorter.conflictIdCycleCount=0, ConflictResolver.totalTime=403600, ConflictResolver.conflictItemCount=16, DefaultDependencyCollector.collectTime=54012700, DefaultDependencyCollector.transformTime=632200}
[INFO] [DEBUG] org.apache.maven.plugins:maven-surefire-plugin:jar:2.3:
[INFO] [DEBUG]    org.apache.maven:maven-plugin-api:jar:2.0:compile
[INFO] [DEBUG]    org.apache.maven.surefire:surefire-booter:jar:2.3:compile
[INFO] [DEBUG]       org.apache.maven.surefire:surefire-api:jar:2.3:compile
[INFO] [DEBUG]          commons-lang:commons-lang:jar:2.1:compile
[INFO] [DEBUG]       org.codehaus.plexus:plexus-archiver:jar:1.0-alpha-7:compile
[INFO] [DEBUG]          org.codehaus.plexus:plexus-container-default:jar:1.0-alpha-8:compile
[INFO] [DEBUG]             junit:junit:jar:3.8.1:compile
[INFO] [DEBUG]             classworlds:classworlds:jar:1.1-alpha-2:compile
[INFO] [DEBUG]    org.codehaus.plexus:plexus-utils:jar:1.1:compile
[INFO] [DEBUG]    org.apache.maven:maven-artifact:jar:2.0:compile
[INFO] [DEBUG] Created new class realm plugin>org.apache.maven.plugins:maven-surefire-plugin:2.3
[INFO] [DEBUG] Importing foreign packages into class realm plugin>org.apache.maven.plugins:maven-surefire-plugin:2.3
[INFO] [DEBUG]   Imported:  < maven.api
[INFO] [DEBUG] Populating class realm plugin>org.apache.maven.plugins:maven-surefire-plugin:2.3
[INFO] [DEBUG]   Included: org.apache.maven.plugins:maven-surefire-plugin:jar:2.3
[INFO] [DEBUG]   Included: org.apache.maven.surefire:surefire-booter:jar:2.3
[INFO] [DEBUG]   Included: org.apache.maven.surefire:surefire-api:jar:2.3
[INFO] [DEBUG]   Included: commons-lang:commons-lang:jar:2.1
[INFO] [DEBUG]   Included: org.codehaus.plexus:plexus-archiver:jar:1.0-alpha-7
[INFO] [DEBUG]   Included: junit:junit:jar:3.8.1
[INFO] [DEBUG]   Included: org.codehaus.plexus:plexus-utils:jar:1.1
[INFO] [DEBUG] Configuring mojo org.apache.maven.plugins:maven-surefire-plugin:2.3:test from plugin realm ClassRealm[plugin>org.apache.maven.plugins:maven-surefire-plugin:2.3, parent: jdk.internal.loader.ClassLoaders$AppClassLoader@6e5e91e4]
[INFO] [DEBUG] Configuring mojo 'org.apache.maven.plugins:maven-surefire-plugin:2.3:test' with basic configurator -->
[INFO] [DEBUG]   (f) basedir = F:\jenkins\jenkins-slave\workspace\en-box_maven-jar-plugin_MJAR-238@2\windows-jdk11-m3.5.x_build\target\it\project-004
[INFO] [DEBUG]   (f) childDelegation = false
[INFO] [DEBUG]   (f) classesDirectory = F:\jenkins\jenkins-slave\workspace\en-box_maven-jar-plugin_MJAR-238@2\windows-jdk11-m3.5.x_build\target\it\project-004\target\classes
[INFO] [DEBUG]   (f) classpathElements = [F:\jenkins\jenkins-slave\workspace\en-box_maven-jar-plugin_MJAR-238@2\windows-jdk11-m3.5.x_build\target\it\project-004\target\test-classes, F:\jenkins\jenkins-slave\workspace\en-box_maven-jar-plugin_MJAR-238@2\windows-jdk11-m3.5.x_build\target\it\project-004\target\classes]
[INFO] [DEBUG]   (f) disableXmlReport = false
[INFO] [DEBUG]   (f) forkMode = once
[INFO] [DEBUG]   (f) localRepository =       id: local
[INFO]       url: file:///F:/jenkins/jenkins-slave/workspace/en-box_maven-jar-plugin_MJAR-238@2/windows-jdk11-m3.5.x_build/target/local-repo/
[INFO]    layout: default
[INFO] snapshots: [enabled => true, update => always]
[INFO]  releases: [enabled => true, update => always]
[INFO]
[INFO] [DEBUG]   (f) parallel = false
[INFO] [DEBUG]   (f) pluginArtifactMap = {org.apache.maven.plugins:maven-surefire-plugin=org.apache.maven.plugins:maven-surefire-plugin:maven-plugin:2.3:, org.apache.maven:maven-plugin-api=org.apache.maven:maven-plugin-api:jar:2.0:compile, org.apache.maven.surefire:surefire-booter=org.apache.maven.surefire:surefire-booter:jar:2.3:compile, org.apache.maven.surefire:surefire-api=org.apache.maven.surefire:surefire-api:jar:2.3:compile, commons-lang:commons-lang=commons-lang:commons-lang:jar:2.1:compile, org.codehaus.plexus:plexus-archiver=org.codehaus.plexus:plexus-archiver:jar:1.0-alpha-7:compile, org.codehaus.plexus:plexus-container-default=org.codehaus.plexus:plexus-container-default:jar:1.0-alpha-8:compile, junit:junit=junit:junit:jar:3.8.1:compile, classworlds:classworlds=classworlds:classworlds:jar:1.1-alpha-2:compile, org.codehaus.plexus:plexus-utils=org.codehaus.plexus:plexus-utils:jar:1.1:compile, org.apache.maven:maven-artifact=org.apache.maven:maven-artifact:jar:2.0:compile}
[INFO] [DEBUG]   (f) printSummary = true
[INFO] [DEBUG]   (f) projectArtifactMap = {}
[INFO] [DEBUG]   (f) redirectTestOutputToFile = false
[INFO] [DEBUG]   (f) remoteRepositories = [      id: local.central
[INFO]       url: file:///f:/jenkins/jenkins-slave/workspace/.maven_repositories/null
[INFO]    layout: default
[INFO] snapshots: [enabled => true, update => daily]
[INFO]  releases: [enabled => true, update => daily]
[INFO] ,       id: central
[INFO]       url: https://repo.maven.apache.org/maven2
[INFO]    layout: default
[INFO] snapshots: [enabled => false, update => daily]
[INFO]  releases: [enabled => true, update => never]
[INFO] ]
[INFO] [DEBUG]   (f) reportFormat = brief
[INFO] [DEBUG]   (f) reportsDirectory = F:\jenkins\jenkins-slave\workspace\en-box_maven-jar-plugin_MJAR-238@2\windows-jdk11-m3.5.x_build\target\it\project-004\target\surefire-reports
[INFO] [DEBUG]   (f) testClassesDirectory = F:\jenkins\jenkins-slave\workspace\en-box_maven-jar-plugin_MJAR-238@2\windows-jdk11-m3.5.x_build\target\it\project-004\target\test-classes
[INFO] [DEBUG]   (f) testSourceDirectory = F:\jenkins\jenkins-slave\workspace\en-box_maven-jar-plugin_MJAR-238@2\windows-jdk11-m3.5.x_build\target\it\project-004\src\test\java
[INFO] [DEBUG]   (f) threadCount = 5
[INFO] [DEBUG]   (f) trimStackTrace = true
[INFO] [DEBUG]   (f) useFile = true
[INFO] [DEBUG]   (f) useSystemClassLoader = false
[INFO] [DEBUG] -- end configuration --
[INFO] [INFO] No tests to run.
[INFO] [INFO]
[INFO] [INFO] --- maven-jar-plugin:3.1.2-SNAPSHOT:jar (default-jar) @ maven-jar-plugin-test-project-004 ---
[INFO] [DEBUG] Dependency collection stats: {ConflictMarker.analyzeTime=1633300, ConflictMarker.markTime=82100, ConflictMarker.nodeCount=108, ConflictIdSorter.graphTime=1405800, ConflictIdSorter.topsortTime=44200, ConflictIdSorter.conflictIdCount=37, ConflictIdSorter.conflictIdCycleCount=0, ConflictResolver.totalTime=2139400, ConflictResolver.conflictItemCount=97, DefaultDependencyCollector.collectTime=905678600, DefaultDependencyCollector.transformTime=5338300}
[INFO] [DEBUG] org.apache.maven.plugins:maven-jar-plugin:jar:3.1.2-SNAPSHOT:
[INFO] [DEBUG]    org.apache.maven:maven-plugin-api:jar:3.0:compile
[INFO] [DEBUG]       org.apache.maven:maven-model:jar:3.0:compile
[INFO] [DEBUG]       org.sonatype.sisu:sisu-inject-plexus:jar:1.4.2:compile
[INFO] [DEBUG]          org.sonatype.sisu:sisu-inject-bean:jar:1.4.2:compile
[INFO] [DEBUG]             org.sonatype.sisu:sisu-guice:jar:noaop:2.1.7:compile
[INFO] [DEBUG]    org.apache.maven:maven-core:jar:3.0:compile
[INFO] [DEBUG]       org.apache.maven:maven-settings:jar:3.0:compile
[INFO] [DEBUG]       org.apache.maven:maven-settings-builder:jar:3.0:compile
[INFO] [DEBUG]       org.apache.maven:maven-repository-metadata:jar:3.0:compile
[INFO] [DEBUG]       org.apache.maven:maven-model-builder:jar:3.0:compile
[INFO] [DEBUG]       org.apache.maven:maven-aether-provider:jar:3.0:runtime
[INFO] [DEBUG]       org.sonatype.aether:aether-impl:jar:1.7:compile
[INFO] [DEBUG]          org.sonatype.aether:aether-spi:jar:1.7:compile
[INFO] [DEBUG]       org.sonatype.aether:aether-api:jar:1.7:compile
[INFO] [DEBUG]       org.sonatype.aether:aether-util:jar:1.7:compile
[INFO] [DEBUG]       org.codehaus.plexus:plexus-interpolation:jar:1.14:compile
[INFO] [DEBUG]       org.codehaus.plexus:plexus-classworlds:jar:2.2.3:compile
[INFO] [DEBUG]       org.codehaus.plexus:plexus-component-annotations:jar:1.7.1:compile
[INFO] [DEBUG]       org.sonatype.plexus:plexus-sec-dispatcher:jar:1.3:compile
[INFO] [DEBUG]          org.sonatype.plexus:plexus-cipher:jar:1.4:compile
[INFO] [DEBUG]    org.apache.maven:maven-artifact:jar:3.0:compile
[INFO] [DEBUG]    org.apache.maven.shared:file-management:jar:3.0.0:compile
[INFO] [DEBUG]       org.apache.maven.shared:maven-shared-io:jar:3.0.0:compile
[INFO] [DEBUG]          org.apache.maven:maven-compat:jar:3.0:compile
[INFO] [DEBUG]          org.apache.maven.wagon:wagon-provider-api:jar:2.10:compile
[INFO] [DEBUG]       org.apache.maven.shared:maven-shared-utils:jar:3.0.0:compile
[INFO] [DEBUG]          com.google.code.findbugs:jsr305:jar:2.0.1:compile
[INFO] [DEBUG]    org.apache.maven:maven-archiver:jar:3.3.0:compile
[INFO] [DEBUG]       commons-io:commons-io:jar:2.5:compile
[INFO] [DEBUG]    org.codehaus.plexus:plexus-archiver:jar:3.7.0:compile
[INFO] [DEBUG]       org.codehaus.plexus:plexus-io:jar:3.1.0:compile
[INFO] [DEBUG]       org.apache.commons:commons-compress:jar:1.18:compile
[INFO] [DEBUG]       org.iq80.snappy:snappy:jar:0.4:compile
[INFO] [DEBUG]       org.tukaani:xz:jar:1.8:runtime
[INFO] [DEBUG]    org.codehaus.plexus:plexus-utils:jar:3.1.0:compile
[INFO] [DEBUG] Created new class realm plugin>org.apache.maven.plugins:maven-jar-plugin:3.1.2-SNAPSHOT
[INFO] [DEBUG] Importing foreign packages into class realm plugin>org.apache.maven.plugins:maven-jar-plugin:3.1.2-SNAPSHOT
[INFO] [DEBUG]   Imported:  < maven.api
[INFO] [DEBUG] Populating class realm plugin>org.apache.maven.plugins:maven-jar-plugin:3.1.2-SNAPSHOT
[INFO] [DEBUG]   Included: org.apache.maven.plugins:maven-jar-plugin:jar:3.1.2-SNAPSHOT
[INFO] [DEBUG]   Included: org.sonatype.sisu:sisu-inject-bean:jar:1.4.2
[INFO] [DEBUG]   Included: org.sonatype.sisu:sisu-guice:jar:noaop:2.1.7
[INFO] [DEBUG]   Included: org.sonatype.aether:aether-util:jar:1.7
[INFO] [DEBUG]   Included: org.codehaus.plexus:plexus-interpolation:jar:1.14
[INFO] [DEBUG]   Included: org.codehaus.plexus:plexus-component-annotations:jar:1.7.1
[INFO] [DEBUG]   Included: org.sonatype.plexus:plexus-sec-dispatcher:jar:1.3
[INFO] [DEBUG]   Included: org.sonatype.plexus:plexus-cipher:jar:1.4
[INFO] [DEBUG]   Included: org.apache.maven.shared:file-management:jar:3.0.0
[INFO] [DEBUG]   Included: org.apache.maven.shared:maven-shared-io:jar:3.0.0
[INFO] [DEBUG]   Included: org.apache.maven.shared:maven-shared-utils:jar:3.0.0
[INFO] [DEBUG]   Included: com.google.code.findbugs:jsr305:jar:2.0.1
[INFO] [DEBUG]   Included: org.apache.maven:maven-archiver:jar:3.3.0
[INFO] [DEBUG]   Included: commons-io:commons-io:jar:2.5
[INFO] [DEBUG]   Included: org.codehaus.plexus:plexus-archiver:jar:3.7.0
[INFO] [DEBUG]   Included: org.codehaus.plexus:plexus-io:jar:3.1.0
[INFO] [DEBUG]   Included: org.apache.commons:commons-compress:jar:1.18
[INFO] [DEBUG]   Included: org.iq80.snappy:snappy:jar:0.4
[INFO] [DEBUG]   Included: org.tukaani:xz:jar:1.8
[INFO] [DEBUG]   Included: org.codehaus.plexus:plexus-utils:jar:3.1.0
[INFO] [DEBUG] Configuring mojo org.apache.maven.plugins:maven-jar-plugin:3.1.2-SNAPSHOT:jar from plugin realm ClassRealm[plugin>org.apache.maven.plugins:maven-jar-plugin:3.1.2-SNAPSHOT, parent: jdk.internal.loader.ClassLoaders$AppClassLoader@6e5e91e4]
[INFO] [DEBUG] Configuring mojo 'org.apache.maven.plugins:maven-jar-plugin:3.1.2-SNAPSHOT:jar' with basic configurator -->
[INFO] [DEBUG]   (f) classesDirectory = F:\jenkins\jenkins-slave\workspace\en-box_maven-jar-plugin_MJAR-238@2\windows-jdk11-m3.5.x_build\target\it\project-004\target\classes
[INFO] [DEBUG]   (f) finalName = maven-jar-plugin-test-project-004-99.0
[INFO] [DEBUG]   (f) forceCreation = false
[INFO] [DEBUG]   (f) outputDirectory = F:\jenkins\jenkins-slave\workspace\en-box_maven-jar-plugin_MJAR-238@2\windows-jdk11-m3.5.x_build\target\it\project-004\target
[INFO] [DEBUG]   (f) project = MavenProject: org.apache.maven.plugins:maven-jar-plugin-test-project-004:99.0 @ F:\jenkins\jenkins-slave\workspace\en-box_maven-jar-plugin_MJAR-238@2\windows-jdk11-m3.5.x_build\target\it\project-004\pom.xml
[INFO] [DEBUG]   (f) session = org.apache.maven.execution.MavenSession@4038cd3a
[INFO] [DEBUG]   (f) skipIfEmpty = false
[INFO] [DEBUG]   (f) useDefaultManifestFile = false
[INFO] [DEBUG] -- end configuration --
[INFO] [DEBUG] isUp2date: false (Destination F:\jenkins\jenkins-slave\workspace\en-box_maven-jar-plugin_MJAR-238@2\windows-jdk11-m3.5.x_build\target\it\project-004\target\maven-jar-plugin-test-project-004-99.0.jar not found.)
[INFO] [INFO] Building jar: F:\jenkins\jenkins-slave\workspace\en-box_maven-jar-plugin_MJAR-238@2\windows-jdk11-m3.5.x_build\target\it\project-004\target\maven-jar-plugin-test-project-004-99.0.jar
[INFO] [DEBUG] adding directory META-INF/
[INFO] [DEBUG] adding entry META-INF/MANIFEST.MF
[INFO] [DEBUG] adding directory service/
[INFO] [DEBUG] adding directory service/impl/
[INFO] [DEBUG] adding entry notIncluded.xml
[INFO] [DEBUG] adding entry service/impl/TestImplementation.class
[INFO] [DEBUG] adding entry service/TestInterface.class
[INFO] [DEBUG] adding entry TestCompile1.class
[INFO] [DEBUG] adding directory META-INF/maven/
[INFO] [DEBUG] adding directory META-INF/maven/org.apache.maven.plugins/
[INFO] [DEBUG] adding directory META-INF/maven/org.apache.maven.plugins/maven-jar-plugin-test-project-004/
[INFO] [DEBUG] adding entry META-INF/maven/org.apache.maven.plugins/maven-jar-plugin-test-project-004/pom.xml
[INFO] [DEBUG] adding entry META-INF/maven/org.apache.maven.plugins/maven-jar-plugin-test-project-004/pom.properties
[INFO] [INFO]
[INFO] [INFO] --- maven-jar-plugin:3.1.2-SNAPSHOT:jar (default) @ maven-jar-plugin-test-project-004 ---
[INFO] [DEBUG] Configuring mojo org.apache.maven.plugins:maven-jar-plugin:3.1.2-SNAPSHOT:jar from plugin realm ClassRealm[plugin>org.apache.maven.plugins:maven-jar-plugin:3.1.2-SNAPSHOT, parent: jdk.internal.loader.ClassLoaders$AppClassLoader@6e5e91e4]
[INFO] [DEBUG] Configuring mojo 'org.apache.maven.plugins:maven-jar-plugin:3.1.2-SNAPSHOT:jar' with basic configurator -->
[INFO] [DEBUG]   (f) classesDirectory = F:\jenkins\jenkins-slave\workspace\en-box_maven-jar-plugin_MJAR-238@2\windows-jdk11-m3.5.x_build\target\it\project-004\target\classes
[INFO] [DEBUG]   (f) classifier = service
[INFO] [DEBUG]   (f) finalName = maven-jar-plugin-test-project-004-99.0
[INFO] [DEBUG]   (f) forceCreation = false
[INFO] [DEBUG]   (f) includes = [**/service/*]
[INFO] [DEBUG]   (f) outputDirectory = F:\jenkins\jenkins-slave\workspace\en-box_maven-jar-plugin_MJAR-238@2\windows-jdk11-m3.5.x_build\target\it\project-004\target
[INFO] [DEBUG]   (f) project = MavenProject: org.apache.maven.plugins:maven-jar-plugin-test-project-004:99.0 @ F:\jenkins\jenkins-slave\workspace\en-box_maven-jar-plugin_MJAR-238@2\windows-jdk11-m3.5.x_build\target\it\project-004\pom.xml
[INFO] [DEBUG]   (f) session = org.apache.maven.execution.MavenSession@4038cd3a
[INFO] [DEBUG]   (f) skipIfEmpty = false
[INFO] [DEBUG]   (f) useDefaultManifestFile = false
[INFO] [DEBUG] -- end configuration --
[INFO] [DEBUG] isUp2date: false (Destination F:\jenkins\jenkins-slave\workspace\en-box_maven-jar-plugin_MJAR-238@2\windows-jdk11-m3.5.x_build\target\it\project-004\target\maven-jar-plugin-test-project-004-99.0-service.jar not found.)
[INFO] [INFO] Building jar: F:\jenkins\jenkins-slave\workspace\en-box_maven-jar-plugin_MJAR-238@2\windows-jdk11-m3.5.x_build\target\it\project-004\target\maven-jar-plugin-test-project-004-99.0-service.jar
[INFO] [DEBUG] adding directory META-INF/
[INFO] [DEBUG] adding entry META-INF/MANIFEST.MF
[INFO] [DEBUG] adding directory service/
[INFO] [DEBUG] adding directory service/impl/
[INFO] [DEBUG] adding entry service/TestInterface.class
[INFO] [DEBUG] adding directory META-INF/maven/
[INFO] [DEBUG] adding directory META-INF/maven/org.apache.maven.plugins/
[INFO] [DEBUG] adding directory META-INF/maven/org.apache.maven.plugins/maven-jar-plugin-test-project-004/
[INFO] [DEBUG] adding entry META-INF/maven/org.apache.maven.plugins/maven-jar-plugin-test-project-004/pom.xml
[INFO] [DEBUG] adding entry META-INF/maven/org.apache.maven.plugins/maven-jar-plugin-test-project-004/pom.properties
[INFO] [INFO] ------------------------------------------------------------------------
[INFO] [INFO] BUILD SUCCESS
[INFO] [INFO] ------------------------------------------------------------------------
[INFO] [INFO] Total time: 4.537 s
[INFO] [INFO] Finished at: 2019-01-10T20:40:27Z
[INFO] [INFO] Final Memory: 14M/54M
[INFO] [INFO] ------------------------------------------------------------------------
[INFO] run post-build script verify.bsh
[INFO] Running post-build script: f:\jenkins\jenkins-slave\workspace\en-box_maven-jar-plugin_MJAR-238@2\windows-jdk11-m3.5.x_build\target\it\project-004\verify.bsh
[INFO] Finished post-build script: f:\jenkins\jenkins-slave\workspace\en-box_maven-jar-plugin_MJAR-238@2\windows-jdk11-m3.5.x_build\target\it\project-004\verify.bsh
[INFO]           project-004\pom.xml .............................. SUCCESS (7.1 s)
[INFO]
[INFO] --- maven-checkstyle-plugin:3.0.0:check (checkstyle-check) @ maven-jar-plugin ---
[INFO]
[INFO] --- maven-invoker-plugin:3.1.0:verify (integration-test) @ maven-jar-plugin ---
[INFO] -------------------------------------------------
[INFO] Build Summary:
[INFO]   Passed: 26, Failed: 0, Errors: 0, Skipped: 1
[INFO] -------------------------------------------------
[INFO] ------------------------------------------------------------------------
[INFO] BUILD SUCCESS
[INFO] ------------------------------------------------------------------------
[INFO] Total time: 15:36 min
[INFO] Finished at: 2019-01-10T20:40:29Z
[INFO] Final Memory: 38M/137M
[INFO] ------------------------------------------------------------------------
[INFO] [jenkins-event-spy] Generated F:\jenkins\jenkins-slave\workspace\en-box_maven-jar-plugin_MJAR-238@2@tmp\withMaven5d6a3684\maven-spy-20190110-202449-64210140890346622259994.log
[Pipeline] }
[Pipeline] // dir
[Pipeline] }
[withMaven] artifactsPublisher - Archive artifact windows-jdk11-m3.5.x_build\pom.xml under org\apache\maven\plugins\maven-jar-plugin\3.1.2-SNAPSHOT\maven-jar-plugin-3.1.2-SNAPSHOT.pom
[withMaven] artifactsPublisher - Archive artifact windows-jdk11-m3.5.x_build\target\maven-jar-plugin-3.1.2-SNAPSHOT.jar under org\apache\maven\plugins\maven-jar-plugin\3.1.2-SNAPSHOT\maven-jar-plugin-3.1.2-SNAPSHOT.jar
[withMaven] junitPublisher - Archive test results for Maven artifact org.apache.maven.plugins:maven-jar-plugin:maven-plugin:3.1.2-SNAPSHOT generated by maven-surefire-plugin:test (default-test): windows-jdk11-m3.5.x_build\target\surefire-reports\*.xml
Recording test results
[withMaven] openTasksPublisher - Scan Tasks for Maven artifact org.apache.maven.plugins:maven-jar-plugin:maven-plugin:3.1.2-SNAPSHOT in source directory windows-jdk11-m3.5.x_build\src\main\java
[TASKS] Scanning folder 'f:\jenkins\jenkins-slave\workspace\en-box_maven-jar-plugin_MJAR-238@2' for files matching the pattern 'windows-jdk11-m3.5.x_build\src\main\java\**\*' - excludes: null
[TASKS] Found 3 files to scan for tasks
[TASKS] Found 1 open tasks.
Skipping warnings blame since pipelines do not have an SCM link.%n
[TASKS] Computing warning deltas based on reference build #3
[withMaven] invokerPublisher - Archive invoker results for Maven artifact MavenArtifact{org.apache.maven.plugins:maven-jar-plugin:maven-plugin:3.1.2-SNAPSHOT(version: 3.1.2-SNAPSHOT, snapshot:false) } generated by PluginInvocation{org.apache.maven.plugins:maven-invoker-plugin:3.1.0@integration-test  integration-test}: windows-jdk11-m3.5.x_build\target\invoker-reports\*.xml
[withMaven] Publishers: Generated Artifacts Publisher: 658 ms, Junit Publisher: 402 ms, Open Task Scanner Publisher: 317 ms, Invoker Publisher: 66323 ms, Pipeline Graph Publisher: 1 ms
[Pipeline] // withMaven
[Pipeline] }
[Pipeline] // stage
[Pipeline] }
[Pipeline] // ws
[Pipeline] }
[Pipeline] // node
[Pipeline] }
[Pipeline] // parallel
[Pipeline] stage
[Pipeline] { (Notifications)
[Pipeline] echo
Build result: FAILURE
[Pipeline] jiraIssueSelector
[Pipeline] emailext
Reply | Threaded
Open this post in threaded view
|

Build failed in Jenkins: Maven TLP » maven-jar-plugin » MJAR-238 #5

Apache Jenkins Server-2
See https://builds.apache.org/job/maven-box/job/maven-jar-plugin/job/MJAR-238/5/

Changes:

* Add JDK 13 (latest)

All tests passed

Build log:
[...truncated 200736 lines...]
[INFO] [DEBUG]   (f) staleMillis = 0
[INFO] [DEBUG]   (f) target = 1.7
[INFO] [DEBUG]   (f) useIncrementalCompilation = true
[INFO] [DEBUG]   (f) verbose = false
[INFO] [DEBUG]   (f) mavenSession = org.apache.maven.execution.MavenSession@7db534f2
[INFO] [DEBUG]   (f) session = org.apache.maven.execution.MavenSession@7db534f2
[INFO] [DEBUG] -- end configuration --
[INFO] [DEBUG] Using compiler 'javac'.
[INFO] [INFO] No sources to compile
[INFO] [INFO]
[INFO] [INFO] --- maven-surefire-plugin:2.3:test (default-test) @ maven-jar-plugin-test-project-004 ---
[INFO] [DEBUG] Dependency collection stats: {ConflictMarker.analyzeTime=136599, ConflictMarker.markTime=35301, ConflictMarker.nodeCount=16, ConflictIdSorter.graphTime=20501, ConflictIdSorter.topsortTime=14500, ConflictIdSorter.conflictIdCount=11, ConflictIdSorter.conflictIdCycleCount=0, ConflictResolver.totalTime=316901, ConflictResolver.conflictItemCount=16, DefaultDependencyCollector.collectTime=26852400, DefaultDependencyCollector.transformTime=543500}
[INFO] [DEBUG] org.apache.maven.plugins:maven-surefire-plugin:jar:2.3:
[INFO] [DEBUG]    org.apache.maven:maven-plugin-api:jar:2.0:compile
[INFO] [DEBUG]    org.apache.maven.surefire:surefire-booter:jar:2.3:compile
[INFO] [DEBUG]       org.apache.maven.surefire:surefire-api:jar:2.3:compile
[INFO] [DEBUG]          commons-lang:commons-lang:jar:2.1:compile
[INFO] [DEBUG]       org.codehaus.plexus:plexus-archiver:jar:1.0-alpha-7:compile
[INFO] [DEBUG]          org.codehaus.plexus:plexus-container-default:jar:1.0-alpha-8:compile
[INFO] [DEBUG]             junit:junit:jar:3.8.1:compile
[INFO] [DEBUG]             classworlds:classworlds:jar:1.1-alpha-2:compile
[INFO] [DEBUG]    org.codehaus.plexus:plexus-utils:jar:1.1:compile
[INFO] [DEBUG]    org.apache.maven:maven-artifact:jar:2.0:compile
[INFO] [DEBUG] Created new class realm plugin>org.apache.maven.plugins:maven-surefire-plugin:2.3
[INFO] [DEBUG] Importing foreign packages into class realm plugin>org.apache.maven.plugins:maven-surefire-plugin:2.3
[INFO] [DEBUG]   Imported:  < maven.api
[INFO] [DEBUG] Populating class realm plugin>org.apache.maven.plugins:maven-surefire-plugin:2.3
[INFO] [DEBUG]   Included: org.apache.maven.plugins:maven-surefire-plugin:jar:2.3
[INFO] [DEBUG]   Included: org.apache.maven.surefire:surefire-booter:jar:2.3
[INFO] [DEBUG]   Included: org.apache.maven.surefire:surefire-api:jar:2.3
[INFO] [DEBUG]   Included: commons-lang:commons-lang:jar:2.1
[INFO] [DEBUG]   Included: org.codehaus.plexus:plexus-archiver:jar:1.0-alpha-7
[INFO] [DEBUG]   Included: junit:junit:jar:3.8.1
[INFO] [DEBUG]   Included: org.codehaus.plexus:plexus-utils:jar:1.1
[INFO] [DEBUG] Configuring mojo org.apache.maven.plugins:maven-surefire-plugin:2.3:test from plugin realm ClassRealm[plugin>org.apache.maven.plugins:maven-surefire-plugin:2.3, parent: sun.misc.Launcher$AppClassLoader@33909752]
[INFO] [DEBUG] Configuring mojo 'org.apache.maven.plugins:maven-surefire-plugin:2.3:test' with basic configurator -->
[INFO] [DEBUG]   (f) basedir = F:\jenkins\jenkins-slave\workspace\en-box_maven-jar-plugin_MJAR-238@2\windows-jdk8-m3.5.x_build\target\it\project-004
[INFO] [DEBUG]   (f) childDelegation = false
[INFO] [DEBUG]   (f) classesDirectory = F:\jenkins\jenkins-slave\workspace\en-box_maven-jar-plugin_MJAR-238@2\windows-jdk8-m3.5.x_build\target\it\project-004\target\classes
[INFO] [DEBUG]   (f) classpathElements = [F:\jenkins\jenkins-slave\workspace\en-box_maven-jar-plugin_MJAR-238@2\windows-jdk8-m3.5.x_build\target\it\project-004\target\test-classes, F:\jenkins\jenkins-slave\workspace\en-box_maven-jar-plugin_MJAR-238@2\windows-jdk8-m3.5.x_build\target\it\project-004\target\classes]
[INFO] [DEBUG]   (f) disableXmlReport = false
[INFO] [DEBUG]   (f) forkMode = once
[INFO] [DEBUG]   (f) localRepository =       id: local
[INFO]       url: file:///F:/jenkins/jenkins-slave/workspace/en-box_maven-jar-plugin_MJAR-238@2/windows-jdk8-m3.5.x_build/target/local-repo/
[INFO]    layout: default
[INFO] snapshots: [enabled => true, update => always]
[INFO]  releases: [enabled => true, update => always]
[INFO]
[INFO] [DEBUG]   (f) parallel = false
[INFO] [DEBUG]   (f) pluginArtifactMap = {org.apache.maven.plugins:maven-surefire-plugin=org.apache.maven.plugins:maven-surefire-plugin:maven-plugin:2.3:, org.apache.maven:maven-plugin-api=org.apache.maven:maven-plugin-api:jar:2.0:compile, org.apache.maven.surefire:surefire-booter=org.apache.maven.surefire:surefire-booter:jar:2.3:compile, org.apache.maven.surefire:surefire-api=org.apache.maven.surefire:surefire-api:jar:2.3:compile, commons-lang:commons-lang=commons-lang:commons-lang:jar:2.1:compile, org.codehaus.plexus:plexus-archiver=org.codehaus.plexus:plexus-archiver:jar:1.0-alpha-7:compile, org.codehaus.plexus:plexus-container-default=org.codehaus.plexus:plexus-container-default:jar:1.0-alpha-8:compile, junit:junit=junit:junit:jar:3.8.1:compile, classworlds:classworlds=classworlds:classworlds:jar:1.1-alpha-2:compile, org.codehaus.plexus:plexus-utils=org.codehaus.plexus:plexus-utils:jar:1.1:compile, org.apache.maven:maven-artifact=org.apache.maven:maven-artifact:jar:2.0:compile}
[INFO] [DEBUG]   (f) printSummary = true
[INFO] [DEBUG]   (f) projectArtifactMap = {}
[INFO] [DEBUG]   (f) redirectTestOutputToFile = false
[INFO] [DEBUG]   (f) remoteRepositories = [      id: local.central
[INFO]       url: file:///f:/jenkins/jenkins-slave/workspace/.maven_repositories/null
[INFO]    layout: default
[INFO] snapshots: [enabled => true, update => daily]
[INFO]  releases: [enabled => true, update => daily]
[INFO] ,       id: central
[INFO]       url: https://repo.maven.apache.org/maven2
[INFO]    layout: default
[INFO] snapshots: [enabled => false, update => daily]
[INFO]  releases: [enabled => true, update => never]
[INFO] ]
[INFO] [DEBUG]   (f) reportFormat = brief
[INFO] [DEBUG]   (f) reportsDirectory = F:\jenkins\jenkins-slave\workspace\en-box_maven-jar-plugin_MJAR-238@2\windows-jdk8-m3.5.x_build\target\it\project-004\target\surefire-reports
[INFO] [DEBUG]   (f) testClassesDirectory = F:\jenkins\jenkins-slave\workspace\en-box_maven-jar-plugin_MJAR-238@2\windows-jdk8-m3.5.x_build\target\it\project-004\target\test-classes
[INFO] [DEBUG]   (f) testSourceDirectory = F:\jenkins\jenkins-slave\workspace\en-box_maven-jar-plugin_MJAR-238@2\windows-jdk8-m3.5.x_build\target\it\project-004\src\test\java
[INFO] [DEBUG]   (f) threadCount = 5
[INFO] [DEBUG]   (f) trimStackTrace = true
[INFO] [DEBUG]   (f) useFile = true
[INFO] [DEBUG]   (f) useSystemClassLoader = false
[INFO] [DEBUG] -- end configuration --
[INFO] [INFO] No tests to run.
[INFO] [INFO]
[INFO] [INFO] --- maven-jar-plugin:3.1.2-SNAPSHOT:jar (default-jar) @ maven-jar-plugin-test-project-004 ---
[INFO] [DEBUG] Dependency collection stats: {ConflictMarker.analyzeTime=140301, ConflictMarker.markTime=71400, ConflictMarker.nodeCount=108, ConflictIdSorter.graphTime=159701, ConflictIdSorter.topsortTime=43700, ConflictIdSorter.conflictIdCount=37, ConflictIdSorter.conflictIdCycleCount=0, ConflictResolver.totalTime=1030700, ConflictResolver.conflictItemCount=97, DefaultDependencyCollector.collectTime=254079900, DefaultDependencyCollector.transformTime=1474100}
[INFO] [DEBUG] org.apache.maven.plugins:maven-jar-plugin:jar:3.1.2-SNAPSHOT:
[INFO] [DEBUG]    org.apache.maven:maven-plugin-api:jar:3.0:compile
[INFO] [DEBUG]       org.apache.maven:maven-model:jar:3.0:compile
[INFO] [DEBUG]       org.sonatype.sisu:sisu-inject-plexus:jar:1.4.2:compile
[INFO] [DEBUG]          org.sonatype.sisu:sisu-inject-bean:jar:1.4.2:compile
[INFO] [DEBUG]             org.sonatype.sisu:sisu-guice:jar:noaop:2.1.7:compile
[INFO] [DEBUG]    org.apache.maven:maven-core:jar:3.0:compile
[INFO] [DEBUG]       org.apache.maven:maven-settings:jar:3.0:compile
[INFO] [DEBUG]       org.apache.maven:maven-settings-builder:jar:3.0:compile
[INFO] [DEBUG]       org.apache.maven:maven-repository-metadata:jar:3.0:compile
[INFO] [DEBUG]       org.apache.maven:maven-model-builder:jar:3.0:compile
[INFO] [DEBUG]       org.apache.maven:maven-aether-provider:jar:3.0:runtime
[INFO] [DEBUG]       org.sonatype.aether:aether-impl:jar:1.7:compile
[INFO] [DEBUG]          org.sonatype.aether:aether-spi:jar:1.7:compile
[INFO] [DEBUG]       org.sonatype.aether:aether-api:jar:1.7:compile
[INFO] [DEBUG]       org.sonatype.aether:aether-util:jar:1.7:compile
[INFO] [DEBUG]       org.codehaus.plexus:plexus-interpolation:jar:1.14:compile
[INFO] [DEBUG]       org.codehaus.plexus:plexus-classworlds:jar:2.2.3:compile
[INFO] [DEBUG]       org.codehaus.plexus:plexus-component-annotations:jar:1.7.1:compile
[INFO] [DEBUG]       org.sonatype.plexus:plexus-sec-dispatcher:jar:1.3:compile
[INFO] [DEBUG]          org.sonatype.plexus:plexus-cipher:jar:1.4:compile
[INFO] [DEBUG]    org.apache.maven:maven-artifact:jar:3.0:compile
[INFO] [DEBUG]    org.apache.maven.shared:file-management:jar:3.0.0:compile
[INFO] [DEBUG]       org.apache.maven.shared:maven-shared-io:jar:3.0.0:compile
[INFO] [DEBUG]          org.apache.maven:maven-compat:jar:3.0:compile
[INFO] [DEBUG]          org.apache.maven.wagon:wagon-provider-api:jar:2.10:compile
[INFO] [DEBUG]       org.apache.maven.shared:maven-shared-utils:jar:3.0.0:compile
[INFO] [DEBUG]          com.google.code.findbugs:jsr305:jar:2.0.1:compile
[INFO] [DEBUG]    org.apache.maven:maven-archiver:jar:3.3.0:compile
[INFO] [DEBUG]       commons-io:commons-io:jar:2.5:compile
[INFO] [DEBUG]    org.codehaus.plexus:plexus-archiver:jar:3.7.0:compile
[INFO] [DEBUG]       org.codehaus.plexus:plexus-io:jar:3.1.0:compile
[INFO] [DEBUG]       org.apache.commons:commons-compress:jar:1.18:compile
[INFO] [DEBUG]       org.iq80.snappy:snappy:jar:0.4:compile
[INFO] [DEBUG]       org.tukaani:xz:jar:1.8:runtime
[INFO] [DEBUG]    org.codehaus.plexus:plexus-utils:jar:3.1.0:compile
[INFO] [DEBUG] Created new class realm plugin>org.apache.maven.plugins:maven-jar-plugin:3.1.2-SNAPSHOT
[INFO] [DEBUG] Importing foreign packages into class realm plugin>org.apache.maven.plugins:maven-jar-plugin:3.1.2-SNAPSHOT
[INFO] [DEBUG]   Imported:  < maven.api
[INFO] [DEBUG] Populating class realm plugin>org.apache.maven.plugins:maven-jar-plugin:3.1.2-SNAPSHOT
[INFO] [DEBUG]   Included: org.apache.maven.plugins:maven-jar-plugin:jar:3.1.2-SNAPSHOT
[INFO] [DEBUG]   Included: org.sonatype.sisu:sisu-inject-bean:jar:1.4.2
[INFO] [DEBUG]   Included: org.sonatype.sisu:sisu-guice:jar:noaop:2.1.7
[INFO] [DEBUG]   Included: org.sonatype.aether:aether-util:jar:1.7
[INFO] [DEBUG]   Included: org.codehaus.plexus:plexus-interpolation:jar:1.14
[INFO] [DEBUG]   Included: org.codehaus.plexus:plexus-component-annotations:jar:1.7.1
[INFO] [DEBUG]   Included: org.sonatype.plexus:plexus-sec-dispatcher:jar:1.3
[INFO] [DEBUG]   Included: org.sonatype.plexus:plexus-cipher:jar:1.4
[INFO] [DEBUG]   Included: org.apache.maven.shared:file-management:jar:3.0.0
[INFO] [DEBUG]   Included: org.apache.maven.shared:maven-shared-io:jar:3.0.0
[INFO] [DEBUG]   Included: org.apache.maven.shared:maven-shared-utils:jar:3.0.0
[INFO] [DEBUG]   Included: com.google.code.findbugs:jsr305:jar:2.0.1
[INFO] [DEBUG]   Included: org.apache.maven:maven-archiver:jar:3.3.0
[INFO] [DEBUG]   Included: commons-io:commons-io:jar:2.5
[INFO] [DEBUG]   Included: org.codehaus.plexus:plexus-archiver:jar:3.7.0
[INFO] [DEBUG]   Included: org.codehaus.plexus:plexus-io:jar:3.1.0
[INFO] [DEBUG]   Included: org.apache.commons:commons-compress:jar:1.18
[INFO] [DEBUG]   Included: org.iq80.snappy:snappy:jar:0.4
[INFO] [DEBUG]   Included: org.tukaani:xz:jar:1.8
[INFO] [DEBUG]   Included: org.codehaus.plexus:plexus-utils:jar:3.1.0
[INFO] [DEBUG] Configuring mojo org.apache.maven.plugins:maven-jar-plugin:3.1.2-SNAPSHOT:jar from plugin realm ClassRealm[plugin>org.apache.maven.plugins:maven-jar-plugin:3.1.2-SNAPSHOT, parent: sun.misc.Launcher$AppClassLoader@33909752]
[INFO] [DEBUG] Configuring mojo 'org.apache.maven.plugins:maven-jar-plugin:3.1.2-SNAPSHOT:jar' with basic configurator -->
[INFO] [DEBUG]   (f) classesDirectory = F:\jenkins\jenkins-slave\workspace\en-box_maven-jar-plugin_MJAR-238@2\windows-jdk8-m3.5.x_build\target\it\project-004\target\classes
[INFO] [DEBUG]   (f) finalName = maven-jar-plugin-test-project-004-99.0
[INFO] [DEBUG]   (f) forceCreation = false
[INFO] [DEBUG]   (f) outputDirectory = F:\jenkins\jenkins-slave\workspace\en-box_maven-jar-plugin_MJAR-238@2\windows-jdk8-m3.5.x_build\target\it\project-004\target
[INFO] [DEBUG]   (f) project = MavenProject: org.apache.maven.plugins:maven-jar-plugin-test-project-004:99.0 @ F:\jenkins\jenkins-slave\workspace\en-box_maven-jar-plugin_MJAR-238@2\windows-jdk8-m3.5.x_build\target\it\project-004\pom.xml
[INFO] [DEBUG]   (f) session = org.apache.maven.execution.MavenSession@7db534f2
[INFO] [DEBUG]   (f) skipIfEmpty = false
[INFO] [DEBUG]   (f) useDefaultManifestFile = false
[INFO] [DEBUG] -- end configuration --
[INFO] [DEBUG] isUp2date: false (Destination F:\jenkins\jenkins-slave\workspace\en-box_maven-jar-plugin_MJAR-238@2\windows-jdk8-m3.5.x_build\target\it\project-004\target\maven-jar-plugin-test-project-004-99.0.jar not found.)
[INFO] [INFO] Building jar: F:\jenkins\jenkins-slave\workspace\en-box_maven-jar-plugin_MJAR-238@2\windows-jdk8-m3.5.x_build\target\it\project-004\target\maven-jar-plugin-test-project-004-99.0.jar
[INFO] [DEBUG] adding directory META-INF/
[INFO] [DEBUG] adding entry META-INF/MANIFEST.MF
[INFO] [DEBUG] adding directory service/
[INFO] [DEBUG] adding directory service/impl/
[INFO] [DEBUG] adding entry notIncluded.xml
[INFO] [DEBUG] adding entry service/impl/TestImplementation.class
[INFO] [DEBUG] adding entry service/TestInterface.class
[INFO] [DEBUG] adding entry TestCompile1.class
[INFO] [DEBUG] adding directory META-INF/maven/
[INFO] [DEBUG] adding directory META-INF/maven/org.apache.maven.plugins/
[INFO] [DEBUG] adding directory META-INF/maven/org.apache.maven.plugins/maven-jar-plugin-test-project-004/
[INFO] [DEBUG] adding entry META-INF/maven/org.apache.maven.plugins/maven-jar-plugin-test-project-004/pom.xml
[INFO] [DEBUG] adding entry META-INF/maven/org.apache.maven.plugins/maven-jar-plugin-test-project-004/pom.properties
[INFO] [INFO]
[INFO] [INFO] --- maven-jar-plugin:3.1.2-SNAPSHOT:jar (default) @ maven-jar-plugin-test-project-004 ---
[INFO] [DEBUG] Configuring mojo org.apache.maven.plugins:maven-jar-plugin:3.1.2-SNAPSHOT:jar from plugin realm ClassRealm[plugin>org.apache.maven.plugins:maven-jar-plugin:3.1.2-SNAPSHOT, parent: sun.misc.Launcher$AppClassLoader@33909752]
[INFO] [DEBUG] Configuring mojo 'org.apache.maven.plugins:maven-jar-plugin:3.1.2-SNAPSHOT:jar' with basic configurator -->
[INFO] [DEBUG]   (f) classesDirectory = F:\jenkins\jenkins-slave\workspace\en-box_maven-jar-plugin_MJAR-238@2\windows-jdk8-m3.5.x_build\target\it\project-004\target\classes
[INFO] [DEBUG]   (f) classifier = service
[INFO] [DEBUG]   (f) finalName = maven-jar-plugin-test-project-004-99.0
[INFO] [DEBUG]   (f) forceCreation = false
[INFO] [DEBUG]   (f) includes = [**/service/*]
[INFO] [DEBUG]   (f) outputDirectory = F:\jenkins\jenkins-slave\workspace\en-box_maven-jar-plugin_MJAR-238@2\windows-jdk8-m3.5.x_build\target\it\project-004\target
[INFO] [DEBUG]   (f) project = MavenProject: org.apache.maven.plugins:maven-jar-plugin-test-project-004:99.0 @ F:\jenkins\jenkins-slave\workspace\en-box_maven-jar-plugin_MJAR-238@2\windows-jdk8-m3.5.x_build\target\it\project-004\pom.xml
[INFO] [DEBUG]   (f) session = org.apache.maven.execution.MavenSession@7db534f2
[INFO] [DEBUG]   (f) skipIfEmpty = false
[INFO] [DEBUG]   (f) useDefaultManifestFile = false
[INFO] [DEBUG] -- end configuration --
[INFO] [DEBUG] isUp2date: false (Destination F:\jenkins\jenkins-slave\workspace\en-box_maven-jar-plugin_MJAR-238@2\windows-jdk8-m3.5.x_build\target\it\project-004\target\maven-jar-plugin-test-project-004-99.0-service.jar not found.)
[INFO] [INFO] Building jar: F:\jenkins\jenkins-slave\workspace\en-box_maven-jar-plugin_MJAR-238@2\windows-jdk8-m3.5.x_build\target\it\project-004\target\maven-jar-plugin-test-project-004-99.0-service.jar
[INFO] [DEBUG] adding directory META-INF/
[INFO] [DEBUG] adding entry META-INF/MANIFEST.MF
[INFO] [DEBUG] adding directory service/
[INFO] [DEBUG] adding directory service/impl/
[INFO] [DEBUG] adding entry service/TestInterface.class
[INFO] [DEBUG] adding directory META-INF/maven/
[INFO] [DEBUG] adding directory META-INF/maven/org.apache.maven.plugins/
[INFO] [DEBUG] adding directory META-INF/maven/org.apache.maven.plugins/maven-jar-plugin-test-project-004/
[INFO] [DEBUG] adding entry META-INF/maven/org.apache.maven.plugins/maven-jar-plugin-test-project-004/pom.xml
[INFO] [DEBUG] adding entry META-INF/maven/org.apache.maven.plugins/maven-jar-plugin-test-project-004/pom.properties
[INFO] [INFO] ------------------------------------------------------------------------
[INFO] [INFO] BUILD SUCCESS
[INFO] [INFO] ------------------------------------------------------------------------
[INFO] [INFO] Total time: 2.052 s
[INFO] [INFO] Finished at: 2019-01-11T22:10:12Z
[INFO] [INFO] Final Memory: 18M/209M
[INFO] [INFO] ------------------------------------------------------------------------
[INFO] Picked up JAVA_TOOL_OPTIONS: -Dmaven.ext.class.path="f:\jenkins\jenkins-slave\workspace\en-box_maven-jar-plugin_MJAR-238@2@tmp\withMavenac31e2d8\pipeline-maven-spy.jar" -Dorg.jenkinsci.plugins.pipeline.maven.reportsFolder="f:\jenkins\jenkins-slave\workspace\en-box_maven-jar-plugin_MJAR-238@2@tmp\withMavenac31e2d8"
[INFO] run post-build script verify.bsh
[INFO] Running post-build script: f:\jenkins\jenkins-slave\workspace\en-box_maven-jar-plugin_MJAR-238@2\windows-jdk8-m3.5.x_build\target\it\project-004\verify.bsh
[INFO] Finished post-build script: f:\jenkins\jenkins-slave\workspace\en-box_maven-jar-plugin_MJAR-238@2\windows-jdk8-m3.5.x_build\target\it\project-004\verify.bsh
[INFO]           project-004\pom.xml .............................. SUCCESS (3.5 s)
[INFO]
[INFO] --- maven-checkstyle-plugin:3.0.0:check (checkstyle-check) @ maven-jar-plugin ---
[INFO]
[INFO] --- maven-invoker-plugin:3.1.0:verify (integration-test) @ maven-jar-plugin ---
[INFO] -------------------------------------------------
[INFO] Build Summary:
[INFO]   Passed: 26, Failed: 0, Errors: 0, Skipped: 1
[INFO] -------------------------------------------------
[INFO] ------------------------------------------------------------------------
[INFO] BUILD SUCCESS
[INFO] ------------------------------------------------------------------------
[INFO] Total time: 09:01 min
[INFO] Finished at: 2019-01-11T22:10:13Z
[INFO] Final Memory: 48M/680M
[INFO] ------------------------------------------------------------------------
[INFO] [jenkins-event-spy] Generated F:\jenkins\jenkins-slave\workspace\en-box_maven-jar-plugin_MJAR-238@2@tmp\withMavenac31e2d8\maven-spy-20190111-220112-1745172536166436884062.log
Picked up JAVA_TOOL_OPTIONS: -Dmaven.ext.class.path="f:\jenkins\jenkins-slave\workspace\en-box_maven-jar-plugin_MJAR-238@2@tmp\withMavenac31e2d8\pipeline-maven-spy.jar" -Dorg.jenkinsci.plugins.pipeline.maven.reportsFolder="f:\jenkins\jenkins-slave\workspace\en-box_maven-jar-plugin_MJAR-238@2@tmp\withMavenac31e2d8"
[Pipeline] }
[Pipeline] // dir
[Pipeline] }
[withMaven] artifactsPublisher - Archive artifact windows-jdk8-m3.5.x_build\pom.xml under org\apache\maven\plugins\maven-jar-plugin\3.1.2-SNAPSHOT\maven-jar-plugin-3.1.2-SNAPSHOT.pom
[withMaven] artifactsPublisher - Archive artifact windows-jdk8-m3.5.x_build\target\maven-jar-plugin-3.1.2-SNAPSHOT.jar under org\apache\maven\plugins\maven-jar-plugin\3.1.2-SNAPSHOT\maven-jar-plugin-3.1.2-SNAPSHOT.jar
[withMaven] junitPublisher - Archive test results for Maven artifact org.apache.maven.plugins:maven-jar-plugin:maven-plugin:3.1.2-SNAPSHOT generated by maven-surefire-plugin:test (default-test): windows-jdk8-m3.5.x_build\target\surefire-reports\*.xml
Recording test results
[withMaven] openTasksPublisher - Scan Tasks for Maven artifact org.apache.maven.plugins:maven-jar-plugin:maven-plugin:3.1.2-SNAPSHOT in source directory windows-jdk8-m3.5.x_build\src\main\java
[TASKS] Scanning folder 'f:\jenkins\jenkins-slave\workspace\en-box_maven-jar-plugin_MJAR-238@2' for files matching the pattern 'windows-jdk8-m3.5.x_build\src\main\java\**\*' - excludes: null
[TASKS] Found 3 files to scan for tasks
[TASKS] Found 1 open tasks.
Skipping warnings blame since pipelines do not have an SCM link.%n
[TASKS] Computing warning deltas based on reference build #3
[withMaven] invokerPublisher - Archive invoker results for Maven artifact MavenArtifact{org.apache.maven.plugins:maven-jar-plugin:maven-plugin:3.1.2-SNAPSHOT(version: 3.1.2-SNAPSHOT, snapshot:false) } generated by PluginInvocation{org.apache.maven.plugins:maven-invoker-plugin:3.1.0@integration-test  integration-test}: windows-jdk8-m3.5.x_build\target\invoker-reports\*.xml
[withMaven] Publishers: Generated Artifacts Publisher: 647 ms, Junit Publisher: 387 ms, Open Task Scanner Publisher: 320 ms, Dependencies Fingerprint Publisher: 10 ms, Invoker Publisher: 21437 ms, Pipeline Graph Publisher: 1 ms
[Pipeline] // withMaven
[Pipeline] }
[Pipeline] // stage
[Pipeline] }
[Pipeline] // ws
[Pipeline] }
[Pipeline] // node
[Pipeline] }
[Pipeline] // parallel
[Pipeline] stage
[Pipeline] { (Notifications)
[Pipeline] echo
Build result: FAILURE
[Pipeline] jiraIssueSelector
[Pipeline] emailext
Reply | Threaded
Open this post in threaded view
|

Build failed in Jenkins: Maven TLP » maven-jar-plugin » MJAR-238 #6

Apache Jenkins Server-2
See https://builds.apache.org/job/maven-box/job/maven-jar-plugin/job/MJAR-238/6/

No changes.

All tests passed

Build log:
[...truncated 125787 lines...]
[INFO] [DEBUG]   (s) includeEmptyDirs = false
[INFO] [DEBUG]   (s) outputDirectory = /home/jenkins/jenkins-slave/workspace/en-box_maven-jar-plugin_MJAR-238@2/linux-jdk7-m3.3.x_build/target/it/MJAR-70-recreation/target/classes
[INFO] [DEBUG]   (s) overwrite = false
[INFO] [DEBUG]   (f) project = MavenProject: org.apache.maven.plugins:MJAR-70-recreation:1.0-SNAPSHOT @ /home/jenkins/jenkins-slave/workspace/en-box_maven-jar-plugin_MJAR-238@2/linux-jdk7-m3.3.x_build/target/it/MJAR-70-recreation/pom.xml
[INFO] [DEBUG]   (s) resources = [Resource {targetPath: null, filtering: false, FileSet {directory: /home/jenkins/jenkins-slave/workspace/en-box_maven-jar-plugin_MJAR-238@2/linux-jdk7-m3.3.x_build/target/it/MJAR-70-recreation/src/main/resources, PatternSet [includes: {}, excludes: {}]}}]
[INFO] [DEBUG]   (f) session = org.apache.maven.execution.MavenSession@14b89cc2
[INFO] [DEBUG]   (f) supportMultiLineFiltering = false
[INFO] [DEBUG]   (f) useBuildFilters = true
[INFO] [DEBUG]   (s) useDefaultDelimiters = true
[INFO] [DEBUG] -- end configuration --
[INFO] [DEBUG] properties used {env.JAVA_TOOL_OPTIONS=-Dmaven.ext.class.path="/home/jenkins/jenkins-slave/workspace/en-box_maven-jar-plugin_MJAR-238@2@tmp/withMavene85910e2/pipeline-maven-spy.jar" -Dorg.jenkinsci.plugins.pipeline.maven.reportsFolder="/home/jenkins/jenkins-slave/workspace/en-box_maven-jar-plugin_MJAR-238@2@tmp/withMavene85910e2" , java.vendor=Oracle Corporation, env.RUN_DISPLAY_URL=https://builds.apache.org/job/maven-box/job/maven-jar-plugin/job/MJAR-238/6/display/redirect, env.JENKINS_SERVER_COOKIE=durable-d16ecb7835f3ede81e648b291a04d5ff, org.jenkinsci.plugins.pipeline.maven.reportsFolder=/home/jenkins/jenkins-slave/workspace/en-box_maven-jar-plugin_MJAR-238@2@tmp/withMavene85910e2, sun.java.launcher=SUN_STANDARD, sun.management.compiler=HotSpot 64-Bit Tiered Compilers, env.MVN_CMD_DIR=/home/jenkins/jenkins-slave/workspace/en-box_maven-jar-plugin_MJAR-238@2@tmp/withMavene85910e2, os.name=Linux, sun.boot.class.path=/usr/local/asfpackages/java/jdk1.7.0_80/jre/lib/resources.jar:/usr/local/asfpackages/java/jdk1.7.0_80/jre/lib/rt.jar:/usr/local/asfpackages/java/jdk1.7.0_80/jre/lib/sunrsasign.jar:/usr/local/asfpackages/java/jdk1.7.0_80/jre/lib/jsse.jar:/usr/local/asfpackages/java/jdk1.7.0_80/jre/lib/jce.jar:/usr/local/asfpackages/java/jdk1.7.0_80/jre/lib/charsets.jar:/usr/local/asfpackages/java/jdk1.7.0_80/jre/lib/jfr.jar:/usr/local/asfpackages/java/jdk1.7.0_80/jre/classes, env.JOB_DISPLAY_URL=https://builds.apache.org/job/maven-box/job/maven-jar-plugin/job/MJAR-238/display/redirect, env.PWD=/home/jenkins/jenkins-slave/workspace/en-box_maven-jar-plugin_MJAR-238@2/linux-jdk7-m3.3.x_build/target/it/MJAR-70-recreation, env.LANG=en_US, java.vm.specification.vendor=Oracle Corporation, java.runtime.version=1.7.0_80-b15, env.MAVEN_CONFIG=--batch-mode --show-version "-Dmaven.repo.local=/home/jenkins/jenkins-slave/workspace/.maven_repositories/null" , env.BUILD_DISPLAY_NAME=#6, https.protocols=TLSv1.2, user.name=jenkins, env._=/home/jenkins/jenkins-slave/workspace/en-box_maven-jar-plugin_MJAR-238@2@tmp/withMavene85910e2/mvn, maven.build.version=Apache Maven 3.3.9 (bb52d8502b132ec0a5a3f4c09453c07478323dc5; 2015-11-10T16:41:47+00:00), env.USER=jenkins, env.SHELL=/bin/bash, env.NLSPATH=/usr/dt/lib/nls/msg/%L/%N.cat, maven.repo.local=/home/jenkins/jenkins-slave/workspace/en-box_maven-jar-plugin_MJAR-238@2/linux-jdk7-m3.3.x_build/target/local-repo, env.PATH=/home/jenkins/tools/java/latest1.7/bin:/home/jenkins/jenkins-slave/workspace/en-box_maven-jar-plugin_MJAR-238@2@tmp/withMavene85910e2:/usr/local/sbin:/usr/local/bin:/usr/sbin:/usr/bin:/sbin:/bin:/snap/bin, user.language=en, sun.boot.library.path=/usr/local/asfpackages/java/jdk1.7.0_80/jre/lib/amd64, classworlds.conf=/home/jenkins/tools/maven/apache-maven-3.3.9/bin/m2.conf, env.SSH_CONNECTION=195.201.213.130 58180 67.195.81.174 22, java.version=1.7.0_80, env.SSH_CLIENT=195.201.213.130 58180 22, user.timezone=Etc/UTC, env.NODE_NAME=H39, sun.arch.data.model=64, java.endorsed.dirs=/usr/local/asfpackages/java/jdk1.7.0_80/jre/lib/endorsed, env.MVN_CMD=/home/jenkins/jenkins-slave/workspace/en-box_maven-jar-plugin_MJAR-238@2@tmp/withMavene85910e2/mvn, sun.cpu.isalist=, env.JOB_BASE_NAME=MJAR-238, sun.jnu.encoding=ISO-8859-1, file.encoding.pkg=sun.io, env.SHLVL=2, file.separator=/, java.specification.name=Java Platform API Specification, java.class.version=51.0, org.slf4j.simpleLogger.defaultLogLevel=debug, user.country=US, env.BUILD_NUMBER=6, java.home=/usr/local/asfpackages/java/jdk1.7.0_80/jre, java.vm.info=mixed mode, env.LOGNAME=jenkins, os.version=4.4.0-137-generic, env.NIX_LABEL=ubuntu, env.HUDSON_COOKIE=83ffab96-6df5-411b-bea9-1b884f636b9f, maven.compiler.target=1.7, path.separator=:, env.WIN_LABEL=Windows, java.vm.version=24.80-b11, maven.ext.class.path=/home/jenkins/jenkins-slave/workspace/en-box_maven-jar-plugin_MJAR-238@2@tmp/withMavene85910e2/pipeline-maven-spy.jar, env.RUN_CHANGES_DISPLAY_URL=https://builds.apache.org/job/maven-box/job/maven-jar-plugin/job/MJAR-238/6/display/redirect?page=changes, env.JOB_NAME=maven-box/maven-jar-plugin/MJAR-238, env.JAVA_HOME=/home/jenkins/tools/java/latest1.7, java.awt.printerjob=sun.print.PSPrinterJob, sun.io.unicode.encoding=UnicodeLittle, awt.toolkit=sun.awt.X11.XToolkit, env.HUDSON_URL=https://builds.apache.org/, env.BUILD_TAG=jenkins-maven-box-maven-jar-plugin-MJAR-238-6, user.home=/home/jenkins, env.JENKINS_HOME=/x1/jenkins/jenkins-home, env.JOB_URL=https://builds.apache.org/job/maven-box/job/maven-jar-plugin/job/MJAR-238/, env.OLDPWD=/home/jenkins/jenkins-slave/workspace/en-box_maven-jar-plugin_MJAR-238@2/linux-jdk7-m3.3.x_build/target/it/MJAR-70-recreation, java.specification.vendor=Oracle Corporation, env.M2_HOME=/home/jenkins/tools/maven/apache-maven-3.3.9, java.library.path=/usr/java/packages/lib/amd64:/usr/lib64:/lib64:/lib:/usr/lib, java.vendor.url=http://java.oracle.com/, env.JENKINS_NODE_COOKIE=fadf92a8-b631-460b-b6a2-9665eb9baa88, env.MAVEN_CMD_LINE_ARGS=--batch-mode --show-version "-Dmaven.repo.local=/home/jenkins/jenkins-slave/workspace/.maven_repositories/null"  -B -X -D maven.repo.local=/home/jenkins/jenkins-slave/workspace/en-box_maven-jar-plugin_MJAR-238@2/linux-jdk7-m3.3.x_build/target/local-repo -s /home/jenkins/jenkins-slave/workspace/en-box_maven-jar-plugin_MJAR-238@2/linux-jdk7-m3.3.x_build/target/it/interpolated-settings.xml -D https.protocols=TLSv1.2 -D maven.compiler.source=1.7 -D maven.compiler.target=1.7 clean integration-test package, env.HUDSON_HOME=/x1/jenkins/jenkins-home, env.HUDSON_SERVER_COOKIE=f4ebd1e6b0d976e8, java.vm.vendor=Oracle Corporation, maven.home=/home/jenkins/tools/maven/apache-maven-3.3.9, java.runtime.name=Java(TM) SE Runtime Environment, sun.java.command=org.codehaus.plexus.classworlds.launcher.Launcher -B -X -D maven.repo.local=/home/jenkins/jenkins-slave/workspace/en-box_maven-jar-plugin_MJAR-238@2/linux-jdk7-m3.3.x_build/target/local-repo -s /home/jenkins/jenkins-slave/workspace/en-box_maven-jar-plugin_MJAR-238@2/linux-jdk7-m3.3.x_build/target/it/interpolated-settings.xml -D https.protocols=TLSv1.2 -D maven.compiler.source=1.7 -D maven.compiler.target=1.7 clean integration-test package, java.class.path=/home/jenkins/tools/maven/apache-maven-3.3.9/boot/plexus-classworlds-2.5.2.jar, env.EXECUTOR_NUMBER=1, env.MAVEN_TERMINATE_CMD=on, env.XDG_SESSION_ID=48, env.JENKINS_MAVEN_AGENT_DISABLED=true, maven.version=3.3.9, env.XFILESEARCHPATH=/usr/dt/app-defaults/%L/Dt, java.vm.specification.name=Java Virtual Machine Specification, env.BRANCH_NAME=MJAR-238, java.vm.specification.version=1.7, sun.cpu.endian=little, sun.os.patch.level=unknown, env.HOME=/home/jenkins, java.io.tmpdir=/tmp, env.BUILD_URL=https://builds.apache.org/job/maven-box/job/maven-jar-plugin/job/MJAR-238/6/, java.vendor.url.bug=http://bugreport.sun.com/bugreport/, maven.multiModuleProjectDirectory=/home/jenkins/jenkins-slave/workspace/en-box_maven-jar-plugin_MJAR-238@2/linux-jdk7-m3.3.x_build/target/it/MJAR-70-recreation, maven.compiler.source=1.7, os.arch=amd64, java.awt.graphicsenv=sun.awt.X11GraphicsEnvironment, java.ext.dirs=/usr/local/asfpackages/java/jdk1.7.0_80/jre/lib/ext:/usr/java/packages/lib/ext, env.XDG_RUNTIME_DIR=/run/user/910, env.MAVEN_HOME=/home/jenkins/tools/maven/apache-maven-3.3.9, user.dir=/home/jenkins/jenkins-slave/workspace/en-box_maven-jar-plugin_MJAR-238@2/linux-jdk7-m3.3.x_build/target/it/MJAR-70-recreation, env.BUILD_ID=6, line.separator=
[INFO] , env.JENKINS_URL=https://builds.apache.org/, java.vm.name=Java HotSpot(TM) 64-Bit Server VM, file.encoding=ISO-8859-1, env.MAIL=/var/mail/jenkins, env.WORKSPACE=/home/jenkins/jenkins-slave/workspace/en-box_maven-jar-plugin_MJAR-238@2, env.STAGE_NAME=Build linux-jdk7-m3.3.x_build, java.specification.version=1.7, env.NODE_LABELS=H39 ubuntu xenial, env.MAVEN_PROJECTBASEDIR=/home/jenkins/jenkins-slave/workspace/en-box_maven-jar-plugin_MJAR-238@2/linux-jdk7-m3.3.x_build/target/it/MJAR-70-recreation}
[INFO] [WARNING] Using platform encoding (ISO-8859-1 actually) to copy filtered resources, i.e. build is platform dependent!
[INFO] [DEBUG] resource with targetPath null
[INFO] directory /home/jenkins/jenkins-slave/workspace/en-box_maven-jar-plugin_MJAR-238@2/linux-jdk7-m3.3.x_build/target/it/MJAR-70-recreation/src/main/resources
[INFO] excludes []
[INFO] includes []
[INFO] [INFO] skip non existing resourceDirectory /home/jenkins/jenkins-slave/workspace/en-box_maven-jar-plugin_MJAR-238@2/linux-jdk7-m3.3.x_build/target/it/MJAR-70-recreation/src/main/resources
[INFO] [DEBUG] no use filter components
[INFO] [INFO]
[INFO] [INFO] --- maven-compiler-plugin:3.1:compile (default-compile) @ MJAR-70-recreation ---
[INFO] [DEBUG] Configuring mojo org.apache.maven.plugins:maven-compiler-plugin:3.1:compile from plugin realm ClassRealm[plugin>org.apache.maven.plugins:maven-compiler-plugin:3.1, parent: sun.misc.Launcher$AppClassLoader@1a1a7aa4]
[INFO] [DEBUG] Configuring mojo 'org.apache.maven.plugins:maven-compiler-plugin:3.1:compile' with basic configurator -->
[INFO] [DEBUG]   (f) basedir = /home/jenkins/jenkins-slave/workspace/en-box_maven-jar-plugin_MJAR-238@2/linux-jdk7-m3.3.x_build/target/it/MJAR-70-recreation
[INFO] [DEBUG]   (f) buildDirectory = /home/jenkins/jenkins-slave/workspace/en-box_maven-jar-plugin_MJAR-238@2/linux-jdk7-m3.3.x_build/target/it/MJAR-70-recreation/target
[INFO] [DEBUG]   (f) classpathElements = [/home/jenkins/jenkins-slave/workspace/en-box_maven-jar-plugin_MJAR-238@2/linux-jdk7-m3.3.x_build/target/it/MJAR-70-recreation/target/classes]
[INFO] [DEBUG]   (f) compileSourceRoots = [/home/jenkins/jenkins-slave/workspace/en-box_maven-jar-plugin_MJAR-238@2/linux-jdk7-m3.3.x_build/target/it/MJAR-70-recreation/src/main/java]
[INFO] [DEBUG]   (f) compilerId = javac
[INFO] [DEBUG]   (f) debug = true
[INFO] [DEBUG]   (f) failOnError = true
[INFO] [DEBUG]   (f) forceJavacCompilerUse = false
[INFO] [DEBUG]   (f) fork = false
[INFO] [DEBUG]   (f) generatedSourcesDirectory = /home/jenkins/jenkins-slave/workspace/en-box_maven-jar-plugin_MJAR-238@2/linux-jdk7-m3.3.x_build/target/it/MJAR-70-recreation/target/generated-sources/annotations
[INFO] [DEBUG]   (f) mojoExecution = org.apache.maven.plugins:maven-compiler-plugin:3.1:compile {execution: default-compile}
[INFO] [DEBUG]   (f) optimize = false
[INFO] [DEBUG]   (f) outputDirectory = /home/jenkins/jenkins-slave/workspace/en-box_maven-jar-plugin_MJAR-238@2/linux-jdk7-m3.3.x_build/target/it/MJAR-70-recreation/target/classes
[INFO] [DEBUG]   (f) projectArtifact = org.apache.maven.plugins:MJAR-70-recreation:jar:1.0-SNAPSHOT
[INFO] [DEBUG]   (f) showDeprecation = false
[INFO] [DEBUG]   (f) showWarnings = false
[INFO] [DEBUG]   (f) skipMultiThreadWarning = false
[INFO] [DEBUG]   (f) source = 1.7
[INFO] [DEBUG]   (f) staleMillis = 0
[INFO] [DEBUG]   (f) target = 1.7
[INFO] [DEBUG]   (f) useIncrementalCompilation = true
[INFO] [DEBUG]   (f) verbose = false
[INFO] [DEBUG]   (f) mavenSession = org.apache.maven.execution.MavenSession@14b89cc2
[INFO] [DEBUG]   (f) session = org.apache.maven.execution.MavenSession@14b89cc2
[INFO] [DEBUG] -- end configuration --
[INFO] [DEBUG] Using compiler 'javac'.
[INFO] [DEBUG] Source directories: [/home/jenkins/jenkins-slave/workspace/en-box_maven-jar-plugin_MJAR-238@2/linux-jdk7-m3.3.x_build/target/it/MJAR-70-recreation/src/main/java]
[INFO] [DEBUG] Classpath: [/home/jenkins/jenkins-slave/workspace/en-box_maven-jar-plugin_MJAR-238@2/linux-jdk7-m3.3.x_build/target/it/MJAR-70-recreation/target/classes]
[INFO] [DEBUG] Output directory: /home/jenkins/jenkins-slave/workspace/en-box_maven-jar-plugin_MJAR-238@2/linux-jdk7-m3.3.x_build/target/it/MJAR-70-recreation/target/classes
[INFO] [DEBUG] CompilerReuseStrategy: reuseCreated
[INFO] [DEBUG] useIncrementalCompilation enabled
[INFO] [INFO] Nothing to compile - all classes are up to date
[INFO] [INFO]
[INFO] [INFO] --- maven-resources-plugin:2.6:testResources (default-testResources) @ MJAR-70-recreation ---
[INFO] [DEBUG] Configuring mojo org.apache.maven.plugins:maven-resources-plugin:2.6:testResources from plugin realm ClassRealm[plugin>org.apache.maven.plugins:maven-resources-plugin:2.6, parent: sun.misc.Launcher$AppClassLoader@1a1a7aa4]
[INFO] [DEBUG] Configuring mojo 'org.apache.maven.plugins:maven-resources-plugin:2.6:testResources' with basic configurator -->
[INFO] [DEBUG]   (f) buildFilters = []
[INFO] [DEBUG]   (f) escapeWindowsPaths = true
[INFO] [DEBUG]   (s) includeEmptyDirs = false
[INFO] [DEBUG]   (s) outputDirectory = /home/jenkins/jenkins-slave/workspace/en-box_maven-jar-plugin_MJAR-238@2/linux-jdk7-m3.3.x_build/target/it/MJAR-70-recreation/target/test-classes
[INFO] [DEBUG]   (s) overwrite = false
[INFO] [DEBUG]   (f) project = MavenProject: org.apache.maven.plugins:MJAR-70-recreation:1.0-SNAPSHOT @ /home/jenkins/jenkins-slave/workspace/en-box_maven-jar-plugin_MJAR-238@2/linux-jdk7-m3.3.x_build/target/it/MJAR-70-recreation/pom.xml
[INFO] [DEBUG]   (s) resources = [Resource {targetPath: null, filtering: false, FileSet {directory: /home/jenkins/jenkins-slave/workspace/en-box_maven-jar-plugin_MJAR-238@2/linux-jdk7-m3.3.x_build/target/it/MJAR-70-recreation/src/test/resources, PatternSet [includes: {}, excludes: {}]}}]
[INFO] [DEBUG]   (f) session = org.apache.maven.execution.MavenSession@14b89cc2
[INFO] [DEBUG]   (f) supportMultiLineFiltering = false
[INFO] [DEBUG]   (f) useBuildFilters = true
[INFO] [DEBUG]   (s) useDefaultDelimiters = true
[INFO] [DEBUG] -- end configuration --
[INFO] [DEBUG] properties used {env.JAVA_TOOL_OPTIONS=-Dmaven.ext.class.path="/home/jenkins/jenkins-slave/workspace/en-box_maven-jar-plugin_MJAR-238@2@tmp/withMavene85910e2/pipeline-maven-spy.jar" -Dorg.jenkinsci.plugins.pipeline.maven.reportsFolder="/home/jenkins/jenkins-slave/workspace/en-box_maven-jar-plugin_MJAR-238@2@tmp/withMavene85910e2" , java.vendor=Oracle Corporation, env.RUN_DISPLAY_URL=https://builds.apache.org/job/maven-box/job/maven-jar-plugin/job/MJAR-238/6/display/redirect, env.JENKINS_SERVER_COOKIE=durable-d16ecb7835f3ede81e648b291a04d5ff, org.jenkinsci.plugins.pipeline.maven.reportsFolder=/home/jenkins/jenkins-slave/workspace/en-box_maven-jar-plugin_MJAR-238@2@tmp/withMavene85910e2, sun.java.launcher=SUN_STANDARD, sun.management.compiler=HotSpot 64-Bit Tiered Compilers, env.MVN_CMD_DIR=/home/jenkins/jenkins-slave/workspace/en-box_maven-jar-plugin_MJAR-238@2@tmp/withMavene85910e2, os.name=Linux, sun.boot.class.path=/usr/local/asfpackages/java/jdk1.7.0_80/jre/lib/resources.jar:/usr/local/asfpackages/java/jdk1.7.0_80/jre/lib/rt.jar:/usr/local/asfpackages/java/jdk1.7.0_80/jre/lib/sunrsasign.jar:/usr/local/asfpackages/java/jdk1.7.0_80/jre/lib/jsse.jar:/usr/local/asfpackages/java/jdk1.7.0_80/jre/lib/jce.jar:/usr/local/asfpackages/java/jdk1.7.0_80/jre/lib/charsets.jar:/usr/local/asfpackages/java/jdk1.7.0_80/jre/lib/jfr.jar:/usr/local/asfpackages/java/jdk1.7.0_80/jre/classes, env.JOB_DISPLAY_URL=https://builds.apache.org/job/maven-box/job/maven-jar-plugin/job/MJAR-238/display/redirect, env.PWD=/home/jenkins/jenkins-slave/workspace/en-box_maven-jar-plugin_MJAR-238@2/linux-jdk7-m3.3.x_build/target/it/MJAR-70-recreation, env.LANG=en_US, java.vm.specification.vendor=Oracle Corporation, java.runtime.version=1.7.0_80-b15, env.MAVEN_CONFIG=--batch-mode --show-version "-Dmaven.repo.local=/home/jenkins/jenkins-slave/workspace/.maven_repositories/null" , env.BUILD_DISPLAY_NAME=#6, https.protocols=TLSv1.2, user.name=jenkins, env._=/home/jenkins/jenkins-slave/workspace/en-box_maven-jar-plugin_MJAR-238@2@tmp/withMavene85910e2/mvn, maven.build.version=Apache Maven 3.3.9 (bb52d8502b132ec0a5a3f4c09453c07478323dc5; 2015-11-10T16:41:47+00:00), env.USER=jenkins, env.SHELL=/bin/bash, env.NLSPATH=/usr/dt/lib/nls/msg/%L/%N.cat, maven.repo.local=/home/jenkins/jenkins-slave/workspace/en-box_maven-jar-plugin_MJAR-238@2/linux-jdk7-m3.3.x_build/target/local-repo, env.PATH=/home/jenkins/tools/java/latest1.7/bin:/home/jenkins/jenkins-slave/workspace/en-box_maven-jar-plugin_MJAR-238@2@tmp/withMavene85910e2:/usr/local/sbin:/usr/local/bin:/usr/sbin:/usr/bin:/sbin:/bin:/snap/bin, user.language=en, sun.boot.library.path=/usr/local/asfpackages/java/jdk1.7.0_80/jre/lib/amd64, classworlds.conf=/home/jenkins/tools/maven/apache-maven-3.3.9/bin/m2.conf, env.SSH_CONNECTION=195.201.213.130 58180 67.195.81.174 22, java.version=1.7.0_80, env.SSH_CLIENT=195.201.213.130 58180 22, user.timezone=Etc/UTC, env.NODE_NAME=H39, sun.arch.data.model=64, java.endorsed.dirs=/usr/local/asfpackages/java/jdk1.7.0_80/jre/lib/endorsed, env.MVN_CMD=/home/jenkins/jenkins-slave/workspace/en-box_maven-jar-plugin_MJAR-238@2@tmp/withMavene85910e2/mvn, sun.cpu.isalist=, env.JOB_BASE_NAME=MJAR-238, sun.jnu.encoding=ISO-8859-1, file.encoding.pkg=sun.io, env.SHLVL=2, file.separator=/, java.specification.name=Java Platform API Specification, java.class.version=51.0, org.slf4j.simpleLogger.defaultLogLevel=debug, user.country=US, env.BUILD_NUMBER=6, java.home=/usr/local/asfpackages/java/jdk1.7.0_80/jre, java.vm.info=mixed mode, env.LOGNAME=jenkins, os.version=4.4.0-137-generic, env.NIX_LABEL=ubuntu, env.HUDSON_COOKIE=83ffab96-6df5-411b-bea9-1b884f636b9f, maven.compiler.target=1.7, path.separator=:, env.WIN_LABEL=Windows, java.vm.version=24.80-b11, maven.ext.class.path=/home/jenkins/jenkins-slave/workspace/en-box_maven-jar-plugin_MJAR-238@2@tmp/withMavene85910e2/pipeline-maven-spy.jar, env.RUN_CHANGES_DISPLAY_URL=https://builds.apache.org/job/maven-box/job/maven-jar-plugin/job/MJAR-238/6/display/redirect?page=changes, env.JOB_NAME=maven-box/maven-jar-plugin/MJAR-238, env.JAVA_HOME=/home/jenkins/tools/java/latest1.7, java.awt.printerjob=sun.print.PSPrinterJob, sun.io.unicode.encoding=UnicodeLittle, awt.toolkit=sun.awt.X11.XToolkit, env.HUDSON_URL=https://builds.apache.org/, env.BUILD_TAG=jenkins-maven-box-maven-jar-plugin-MJAR-238-6, user.home=/home/jenkins, env.JENKINS_HOME=/x1/jenkins/jenkins-home, env.JOB_URL=https://builds.apache.org/job/maven-box/job/maven-jar-plugin/job/MJAR-238/, env.OLDPWD=/home/jenkins/jenkins-slave/workspace/en-box_maven-jar-plugin_MJAR-238@2/linux-jdk7-m3.3.x_build/target/it/MJAR-70-recreation, java.specification.vendor=Oracle Corporation, env.M2_HOME=/home/jenkins/tools/maven/apache-maven-3.3.9, java.library.path=/usr/java/packages/lib/amd64:/usr/lib64:/lib64:/lib:/usr/lib, java.vendor.url=http://java.oracle.com/, env.JENKINS_NODE_COOKIE=fadf92a8-b631-460b-b6a2-9665eb9baa88, env.MAVEN_CMD_LINE_ARGS=--batch-mode --show-version "-Dmaven.repo.local=/home/jenkins/jenkins-slave/workspace/.maven_repositories/null"  -B -X -D maven.repo.local=/home/jenkins/jenkins-slave/workspace/en-box_maven-jar-plugin_MJAR-238@2/linux-jdk7-m3.3.x_build/target/local-repo -s /home/jenkins/jenkins-slave/workspace/en-box_maven-jar-plugin_MJAR-238@2/linux-jdk7-m3.3.x_build/target/it/interpolated-settings.xml -D https.protocols=TLSv1.2 -D maven.compiler.source=1.7 -D maven.compiler.target=1.7 clean integration-test package, env.HUDSON_HOME=/x1/jenkins/jenkins-home, env.HUDSON_SERVER_COOKIE=f4ebd1e6b0d976e8, java.vm.vendor=Oracle Corporation, maven.home=/home/jenkins/tools/maven/apache-maven-3.3.9, java.runtime.name=Java(TM) SE Runtime Environment, sun.java.command=org.codehaus.plexus.classworlds.launcher.Launcher -B -X -D maven.repo.local=/home/jenkins/jenkins-slave/workspace/en-box_maven-jar-plugin_MJAR-238@2/linux-jdk7-m3.3.x_build/target/local-repo -s /home/jenkins/jenkins-slave/workspace/en-box_maven-jar-plugin_MJAR-238@2/linux-jdk7-m3.3.x_build/target/it/interpolated-settings.xml -D https.protocols=TLSv1.2 -D maven.compiler.source=1.7 -D maven.compiler.target=1.7 clean integration-test package, java.class.path=/home/jenkins/tools/maven/apache-maven-3.3.9/boot/plexus-classworlds-2.5.2.jar, env.EXECUTOR_NUMBER=1, env.MAVEN_TERMINATE_CMD=on, env.XDG_SESSION_ID=48, env.JENKINS_MAVEN_AGENT_DISABLED=true, maven.version=3.3.9, env.XFILESEARCHPATH=/usr/dt/app-defaults/%L/Dt, java.vm.specification.name=Java Virtual Machine Specification, env.BRANCH_NAME=MJAR-238, java.vm.specification.version=1.7, sun.cpu.endian=little, sun.os.patch.level=unknown, env.HOME=/home/jenkins, java.io.tmpdir=/tmp, env.BUILD_URL=https://builds.apache.org/job/maven-box/job/maven-jar-plugin/job/MJAR-238/6/, java.vendor.url.bug=http://bugreport.sun.com/bugreport/, maven.multiModuleProjectDirectory=/home/jenkins/jenkins-slave/workspace/en-box_maven-jar-plugin_MJAR-238@2/linux-jdk7-m3.3.x_build/target/it/MJAR-70-recreation, maven.compiler.source=1.7, os.arch=amd64, java.awt.graphicsenv=sun.awt.X11GraphicsEnvironment, java.ext.dirs=/usr/local/asfpackages/java/jdk1.7.0_80/jre/lib/ext:/usr/java/packages/lib/ext, env.XDG_RUNTIME_DIR=/run/user/910, env.MAVEN_HOME=/home/jenkins/tools/maven/apache-maven-3.3.9, user.dir=/home/jenkins/jenkins-slave/workspace/en-box_maven-jar-plugin_MJAR-238@2/linux-jdk7-m3.3.x_build/target/it/MJAR-70-recreation, env.BUILD_ID=6, line.separator=
[INFO] , env.JENKINS_URL=https://builds.apache.org/, java.vm.name=Java HotSpot(TM) 64-Bit Server VM, file.encoding=ISO-8859-1, env.MAIL=/var/mail/jenkins, env.WORKSPACE=/home/jenkins/jenkins-slave/workspace/en-box_maven-jar-plugin_MJAR-238@2, env.STAGE_NAME=Build linux-jdk7-m3.3.x_build, java.specification.version=1.7, env.NODE_LABELS=H39 ubuntu xenial, env.MAVEN_PROJECTBASEDIR=/home/jenkins/jenkins-slave/workspace/en-box_maven-jar-plugin_MJAR-238@2/linux-jdk7-m3.3.x_build/target/it/MJAR-70-recreation}
[INFO] [WARNING] Using platform encoding (ISO-8859-1 actually) to copy filtered resources, i.e. build is platform dependent!
[INFO] [DEBUG] resource with targetPath null
[INFO] directory /home/jenkins/jenkins-slave/workspace/en-box_maven-jar-plugin_MJAR-238@2/linux-jdk7-m3.3.x_build/target/it/MJAR-70-recreation/src/test/resources
[INFO] excludes []
[INFO] includes []
[INFO] [INFO] skip non existing resourceDirectory /home/jenkins/jenkins-slave/workspace/en-box_maven-jar-plugin_MJAR-238@2/linux-jdk7-m3.3.x_build/target/it/MJAR-70-recreation/src/test/resources
[INFO] [DEBUG] no use filter components
[INFO] [INFO]
[INFO] [INFO] --- maven-compiler-plugin:3.1:testCompile (default-testCompile) @ MJAR-70-recreation ---
[INFO] [DEBUG] Configuring mojo org.apache.maven.plugins:maven-compiler-plugin:3.1:testCompile from plugin realm ClassRealm[plugin>org.apache.maven.plugins:maven-compiler-plugin:3.1, parent: sun.misc.Launcher$AppClassLoader@1a1a7aa4]
[INFO] [DEBUG] Configuring mojo 'org.apache.maven.plugins:maven-compiler-plugin:3.1:testCompile' with basic configurator -->
[INFO] [DEBUG]   (f) basedir = /home/jenkins/jenkins-slave/workspace/en-box_maven-jar-plugin_MJAR-238@2/linux-jdk7-m3.3.x_build/target/it/MJAR-70-recreation
[INFO] [DEBUG]   (f) buildDirectory = /home/jenkins/jenkins-slave/workspace/en-box_maven-jar-plugin_MJAR-238@2/linux-jdk7-m3.3.x_build/target/it/MJAR-70-recreation/target
[INFO] [DEBUG]   (f) classpathElements = [/home/jenkins/jenkins-slave/workspace/en-box_maven-jar-plugin_MJAR-238@2/linux-jdk7-m3.3.x_build/target/it/MJAR-70-recreation/target/test-classes, /home/jenkins/jenkins-slave/workspace/en-box_maven-jar-plugin_MJAR-238@2/linux-jdk7-m3.3.x_build/target/it/MJAR-70-recreation/target/classes]
[INFO] [DEBUG]   (f) compileSourceRoots = [/home/jenkins/jenkins-slave/workspace/en-box_maven-jar-plugin_MJAR-238@2/linux-jdk7-m3.3.x_build/target/it/MJAR-70-recreation/src/test/java]
[INFO] [DEBUG]   (f) compilerId = javac
[INFO] [DEBUG]   (f) debug = true
[INFO] [DEBUG]   (f) failOnError = true
[INFO] [DEBUG]   (f) forceJavacCompilerUse = false
[INFO] [DEBUG]   (f) fork = false
[INFO] [DEBUG]   (f) generatedTestSourcesDirectory = /home/jenkins/jenkins-slave/workspace/en-box_maven-jar-plugin_MJAR-238@2/linux-jdk7-m3.3.x_build/target/it/MJAR-70-recreation/target/generated-test-sources/test-annotations
[INFO] [DEBUG]   (f) mojoExecution = org.apache.maven.plugins:maven-compiler-plugin:3.1:testCompile {execution: default-testCompile}
[INFO] [DEBUG]   (f) optimize = false
[INFO] [DEBUG]   (f) outputDirectory = /home/jenkins/jenkins-slave/workspace/en-box_maven-jar-plugin_MJAR-238@2/linux-jdk7-m3.3.x_build/target/it/MJAR-70-recreation/target/test-classes
[INFO] [DEBUG]   (f) showDeprecation = false
[INFO] [DEBUG]   (f) showWarnings = false
[INFO] [DEBUG]   (f) skipMultiThreadWarning = false
[INFO] [DEBUG]   (f) source = 1.7
[INFO] [DEBUG]   (f) staleMillis = 0
[INFO] [DEBUG]   (f) target = 1.7
[INFO] [DEBUG]   (f) useIncrementalCompilation = true
[INFO] [DEBUG]   (f) verbose = false
[INFO] [DEBUG]   (f) mavenSession = org.apache.maven.execution.MavenSession@14b89cc2
[INFO] [DEBUG]   (f) session = org.apache.maven.execution.MavenSession@14b89cc2
[INFO] [DEBUG] -- end configuration --
[INFO] [DEBUG] Using compiler 'javac'.
[INFO] [INFO] No sources to compile
[INFO] [INFO]
[INFO] [INFO] --- maven-surefire-plugin:2.12.4:test (default-test) @ MJAR-70-recreation ---
[INFO] [DEBUG] Configuring mojo org.apache.maven.plugins:maven-surefire-plugin:2.12.4:test from plugin realm ClassRealm[plugin>org.apache.maven.plugins:maven-surefire-plugin:2.12.4, parent: sun.misc.Launcher$AppClassLoader@1a1a7aa4]
[INFO] [DEBUG] Configuring mojo 'org.apache.maven.plugins:maven-surefire-plugin:2.12.4:test' with basic configurator -->
[INFO] [DEBUG]   (s) basedir = /home/jenkins/jenkins-slave/workspace/en-box_maven-jar-plugin_MJAR-238@2/linux-jdk7-m3.3.x_build/target/it/MJAR-70-recreation
[INFO] [DEBUG]   (s) childDelegation = false
[INFO] [DEBUG]   (s) classesDirectory = /home/jenkins/jenkins-slave/workspace/en-box_maven-jar-plugin_MJAR-238@2/linux-jdk7-m3.3.x_build/target/it/MJAR-70-recreation/target/classes
[INFO] [DEBUG]   (s) disableXmlReport = false
[INFO] [DEBUG]   (s) enableAssertions = true
[INFO] [DEBUG]   (s) forkMode = once
[INFO] [DEBUG]   (s) junitArtifactName = junit:junit
[INFO] [DEBUG]   (s) localRepository =       id: local
[INFO]       url: file:///home/jenkins/jenkins-slave/workspace/en-box_maven-jar-plugin_MJAR-238@2/linux-jdk7-m3.3.x_build/target/local-repo/
[INFO]    layout: default
[INFO] snapshots: [enabled => true, update => always]
[INFO]  releases: [enabled => true, update => always]
[INFO]
[INFO] [DEBUG]   (f) parallelMavenExecution = false
[INFO] [DEBUG]   (s) perCoreThreadCount = true
[INFO] [DEBUG]   (s) pluginArtifactMap = {org.apache.maven.plugins:maven-surefire-plugin=org.apache.maven.plugins:maven-surefire-plugin:maven-plugin:2.12.4:, org.apache.maven:maven-plugin-api=org.apache.maven:maven-plugin-api:jar:2.0.9:compile, org.apache.maven.surefire:surefire-booter=org.apache.maven.surefire:surefire-booter:jar:2.12.4:compile, org.apache.maven.surefire:surefire-api=org.apache.maven.surefire:surefire-api:jar:2.12.4:compile, org.apache.maven.surefire:maven-surefire-common=org.apache.maven.surefire:maven-surefire-common:jar:2.12.4:compile, org.apache.commons:commons-lang3=org.apache.commons:commons-lang3:jar:3.1:compile, org.apache.maven.shared:maven-common-artifact-filters=org.apache.maven.shared:maven-common-artifact-filters:jar:1.3:compile, org.codehaus.plexus:plexus-utils=org.codehaus.plexus:plexus-utils:jar:3.0.8:compile, org.apache.maven:maven-artifact=org.apache.maven:maven-artifact:jar:2.0.9:compile, org.apache.maven:maven-project=org.apache.maven:maven-project:jar:2.0.9:compile, org.apache.maven:maven-settings=org.apache.maven:maven-settings:jar:2.0.9:compile, org.apache.maven:maven-profile=org.apache.maven:maven-profile:jar:2.0.9:compile, org.apache.maven:maven-model=org.apache.maven:maven-model:jar:2.0.9:compile, org.apache.maven:maven-artifact-manager=org.apache.maven:maven-artifact-manager:jar:2.0.9:compile, org.apache.maven:maven-plugin-registry=org.apache.maven:maven-plugin-registry:jar:2.0.9:compile, org.codehaus.plexus:plexus-container-default=org.codehaus.plexus:plexus-container-default:jar:1.0-alpha-9-stable-1:compile, org.apache.maven:maven-core=org.apache.maven:maven-core:jar:2.0.9:compile, org.apache.maven:maven-plugin-parameter-documenter=org.apache.maven:maven-plugin-parameter-documenter:jar:2.0.9:compile, org.apache.maven.reporting:maven-reporting-api=org.apache.maven.reporting:maven-reporting-api:jar:2.0.9:compile, org.apache.maven:maven-repository-metadata=org.apache.maven:maven-repository-metadata:jar:2.0.9:compile, org.apache.maven:maven-error-diagnostics=org.apache.maven:maven-error-diagnostics:jar:2.0.9:compile, org.apache.maven:maven-plugin-descriptor=org.apache.maven:maven-plugin-descriptor:jar:2.0.9:compile, org.apache.maven:maven-monitor=org.apache.maven:maven-monitor:jar:2.0.9:compile, classworlds:classworlds=classworlds:classworlds:jar:1.1:compile, org.apache.maven:maven-toolchain=org.apache.maven:maven-toolchain:jar:2.0.9:compile, org.apache.maven.plugin-tools:maven-plugin-annotations=org.apache.maven.plugin-tools:maven-plugin-annotations:jar:3.1:compile}
[INFO] [DEBUG]   (f) pluginDescriptor = Component Descriptor: role: 'org.apache.maven.plugin.Mojo', implementation: 'org.apache.maven.plugin.surefire.HelpMojo', role hint: 'org.apache.maven.plugins:maven-surefire-plugin:2.12.4:help'
[INFO] role: 'org.apache.maven.plugin.Mojo', implementation: 'org.apache.maven.plugin.surefire.SurefirePlugin', role hint: 'org.apache.maven.plugins:maven-surefire-plugin:2.12.4:test'
[INFO] ---
[INFO] [DEBUG]   (s) printSummary = true
[INFO] [DEBUG]   (s) projectArtifactMap = {}
[INFO] [DEBUG]   (s) redirectTestOutputToFile = false
[INFO] [DEBUG]   (s) remoteRepositories = [      id: local.central
[INFO]       url: file:///home/jenkins/jenkins-slave/workspace/.maven_repositories/null
[INFO]    layout: default
[INFO] snapshots: [enabled => true, update => daily]
[INFO]  releases: [enabled => true, update => daily]
[INFO] ,       id: central
[INFO]       url: https://repo.maven.apache.org/maven2
[INFO]    layout: default
[INFO] snapshots: [enabled => false, update => daily]
[INFO]  releases: [enabled => true, update => never]
[INFO] ]
[INFO] [DEBUG]   (s) reportFormat = brief
[INFO] [DEBUG]   (s) reportsDirectory = /home/jenkins/jenkins-slave/workspace/en-box_maven-jar-plugin_MJAR-238@2/linux-jdk7-m3.3.x_build/target/it/MJAR-70-recreation/target/surefire-reports
[INFO] [DEBUG]   (s) runOrder = filesystem
[INFO] [DEBUG]   (s) skip = false
[INFO] [DEBUG]   (s) skipTests = false
[INFO] [DEBUG]   (s) testClassesDirectory = /home/jenkins/jenkins-slave/workspace/en-box_maven-jar-plugin_MJAR-238@2/linux-jdk7-m3.3.x_build/target/it/MJAR-70-recreation/target/test-classes
[INFO] [DEBUG]   (s) testFailureIgnore = false
[INFO] [DEBUG]   (s) testNGArtifactName = org.testng:testng
[INFO] [DEBUG]   (s) testSourceDirectory = /home/jenkins/jenkins-slave/workspace/en-box_maven-jar-plugin_MJAR-238@2/linux-jdk7-m3.3.x_build/target/it/MJAR-70-recreation/src/test/java
[INFO] [DEBUG]   (s) trimStackTrace = true
[INFO] [DEBUG]   (s) useFile = true
[INFO] [DEBUG]   (s) useManifestOnlyJar = true
[INFO] [DEBUG]   (s) useSystemClassLoader = true
[INFO] [DEBUG]   (s) useUnlimitedThreads = false
[INFO] [DEBUG]   (s) workingDirectory = /home/jenkins/jenkins-slave/workspace/en-box_maven-jar-plugin_MJAR-238@2/linux-jdk7-m3.3.x_build/target/it/MJAR-70-recreation
[INFO] [DEBUG]   (s) project = MavenProject: org.apache.maven.plugins:MJAR-70-recreation:1.0-SNAPSHOT @ /home/jenkins/jenkins-slave/workspace/en-box_maven-jar-plugin_MJAR-238@2/linux-jdk7-m3.3.x_build/target/it/MJAR-70-recreation/pom.xml
[INFO] [DEBUG]   (s) session = org.apache.maven.execution.MavenSession@14b89cc2
[INFO] [DEBUG] -- end configuration --
[INFO] [INFO] No tests to run.
[INFO] [INFO] Skipping execution of surefire because it has already been run for this configuration
[INFO] [INFO]
[INFO] [INFO] --- maven-jar-plugin:3.1.2-SNAPSHOT:jar (default-jar) @ MJAR-70-recreation ---
[INFO] [DEBUG] Configuring mojo org.apache.maven.plugins:maven-jar-plugin:3.1.2-SNAPSHOT:jar from plugin realm ClassRealm[plugin>org.apache.maven.plugins:maven-jar-plugin:3.1.2-SNAPSHOT, parent: sun.misc.Launcher$AppClassLoader@1a1a7aa4]
[INFO] [DEBUG] Configuring mojo 'org.apache.maven.plugins:maven-jar-plugin:3.1.2-SNAPSHOT:jar' with basic configurator -->
[INFO] [DEBUG]   (f) classesDirectory = /home/jenkins/jenkins-slave/workspace/en-box_maven-jar-plugin_MJAR-238@2/linux-jdk7-m3.3.x_build/target/it/MJAR-70-recreation/target/classes
[INFO] [DEBUG]   (f) finalName = MJAR-70-recreation-1.0-SNAPSHOT
[INFO] [DEBUG]   (f) forceCreation = true
[INFO] [DEBUG]   (f) outputDirectory = /home/jenkins/jenkins-slave/workspace/en-box_maven-jar-plugin_MJAR-238@2/linux-jdk7-m3.3.x_build/target/it/MJAR-70-recreation/target
[INFO] [DEBUG]   (f) project = MavenProject: org.apache.maven.plugins:MJAR-70-recreation:1.0-SNAPSHOT @ /home/jenkins/jenkins-slave/workspace/en-box_maven-jar-plugin_MJAR-238@2/linux-jdk7-m3.3.x_build/target/it/MJAR-70-recreation/pom.xml
[INFO] [DEBUG]   (f) session = org.apache.maven.execution.MavenSession@14b89cc2
[INFO] [DEBUG]   (f) skipIfEmpty = false
[INFO] [DEBUG]   (f) useDefaultManifestFile = false
[INFO] [DEBUG] -- end configuration --
[INFO] [INFO] Building jar: /home/jenkins/jenkins-slave/workspace/en-box_maven-jar-plugin_MJAR-238@2/linux-jdk7-m3.3.x_build/target/it/MJAR-70-recreation/target/MJAR-70-recreation-1.0-SNAPSHOT.jar
[INFO] [DEBUG] adding directory META-INF/
[INFO] [DEBUG] adding entry META-INF/MANIFEST.MF
[INFO] [DEBUG] adding directory myproject/
[INFO] [DEBUG] adding entry myproject/HelloWorld.class
[INFO] [DEBUG] adding directory META-INF/maven/
[INFO] [DEBUG] adding directory META-INF/maven/org.apache.maven.plugins/
[INFO] [DEBUG] adding directory META-INF/maven/org.apache.maven.plugins/MJAR-70-recreation/
[INFO] [DEBUG] adding entry META-INF/maven/org.apache.maven.plugins/MJAR-70-recreation/pom.xml
[INFO] [DEBUG] adding entry META-INF/maven/org.apache.maven.plugins/MJAR-70-recreation/pom.properties
[INFO] [INFO] ------------------------------------------------------------------------
[INFO] [INFO] BUILD SUCCESS
[INFO] [INFO] ------------------------------------------------------------------------
[INFO] [INFO] Total time: 4.642 s
[INFO] [INFO] Finished at: 2019-01-11T22:41:55+00:00
[INFO] [INFO] Final Memory: 31M/1447M
[INFO] [INFO] ------------------------------------------------------------------------
[INFO] run post-build script verify.bsh
[INFO] Running post-build script: /home/jenkins/jenkins-slave/workspace/en-box_maven-jar-plugin_MJAR-238@2/linux-jdk7-m3.3.x_build/target/it/MJAR-70-recreation/verify.bsh
[INFO] Finished post-build script: /home/jenkins/jenkins-slave/workspace/en-box_maven-jar-plugin_MJAR-238@2/linux-jdk7-m3.3.x_build/target/it/MJAR-70-recreation/verify.bsh
[INFO]           MJAR-70-recreation/pom.xml ....................... SUCCESS (6.8 s)
[INFO] Building: MJAR-238-modular-jar-main-class/pom.xml
[INFO]           MJAR-238-modular-jar-main-class/pom.xml .......... SKIPPED due to JRE version
[INFO]
[INFO] --- maven-checkstyle-plugin:3.0.0:check (checkstyle-check) @ maven-jar-plugin ---
[INFO]
[INFO] --- maven-invoker-plugin:3.1.0:verify (integration-test) @ maven-jar-plugin ---
[INFO] -------------------------------------------------
[INFO] Build Summary:
[INFO]   Passed: 26, Failed: 0, Errors: 0, Skipped: 1
[INFO] -------------------------------------------------
[INFO] ------------------------------------------------------------------------
[INFO] BUILD SUCCESS
[INFO] ------------------------------------------------------------------------
[INFO] Total time: 03:56 min
[INFO] Finished at: 2019-01-11T22:41:57+00:00
[INFO] Final Memory: 62M/2583M
[INFO] ------------------------------------------------------------------------
[INFO] [jenkins-event-spy] Generated /home/jenkins/jenkins-slave/workspace/en-box_maven-jar-plugin_MJAR-238@2@tmp/withMavene85910e2/maven-spy-20190111-223800-4867484080111345984744.log
[Pipeline] }
[Pipeline] // dir
[Pipeline] }
[withMaven] artifactsPublisher - Archive artifact linux-jdk7-m3.3.x_build/pom.xml under org/apache/maven/plugins/maven-jar-plugin/3.1.2-SNAPSHOT/maven-jar-plugin-3.1.2-SNAPSHOT.pom
[withMaven] artifactsPublisher - Archive artifact linux-jdk7-m3.3.x_build/target/maven-jar-plugin-3.1.2-SNAPSHOT.jar under org/apache/maven/plugins/maven-jar-plugin/3.1.2-SNAPSHOT/maven-jar-plugin-3.1.2-SNAPSHOT.jar
[withMaven] junitPublisher - Archive test results for Maven artifact org.apache.maven.plugins:maven-jar-plugin:maven-plugin:3.1.2-SNAPSHOT generated by maven-surefire-plugin:test (default-test): linux-jdk7-m3.3.x_build/target/surefire-reports/*.xml
Recording test results
[withMaven] openTasksPublisher - Scan Tasks for Maven artifact org.apache.maven.plugins:maven-jar-plugin:maven-plugin:3.1.2-SNAPSHOT in source directory linux-jdk7-m3.3.x_build/src/main/java
[TASKS] Scanning folder '/home/jenkins/jenkins-slave/workspace/en-box_maven-jar-plugin_MJAR-238@2' for files matching the pattern 'linux-jdk7-m3.3.x_build/src/main/java/**/*' - excludes: null
[TASKS] Found 3 files to scan for tasks
[TASKS] Found 1 open tasks.
Skipping warnings blame since pipelines do not have an SCM link.%n
[TASKS] Computing warning deltas based on reference build #3
[withMaven] invokerPublisher - Archive invoker results for Maven artifact MavenArtifact{org.apache.maven.plugins:maven-jar-plugin:maven-plugin:3.1.2-SNAPSHOT(version: 3.1.2-SNAPSHOT, snapshot:false) } generated by PluginInvocation{org.apache.maven.plugins:maven-invoker-plugin:3.1.0@integration-test  integration-test}: linux-jdk7-m3.3.x_build/target/invoker-reports/*.xml
[withMaven] Publishers: Generated Artifacts Publisher: 1083 ms, Junit Publisher: 633 ms, Open Task Scanner Publisher: 501 ms, Invoker Publisher: 24891 ms, Pipeline Graph Publisher: 1 ms
[Pipeline] // withMaven
[Pipeline] }
[Pipeline] // stage
[Pipeline] }
[Pipeline] // ws
[Pipeline] }
[Pipeline] // node
[Pipeline] }
[Pipeline] // parallel
[Pipeline] stage
[Pipeline] { (Notifications)
[Pipeline] echo
Build result: FAILURE
[Pipeline] jiraIssueSelector
[Pipeline] emailext
Reply | Threaded
Open this post in threaded view
|

Build succeeded in Jenkins: Maven TLP » maven-jar-plugin » MJAR-238 #7

Apache Jenkins Server-2
See https://builds.apache.org/job/maven-box/job/maven-jar-plugin/job/MJAR-238/7/

Changes:

* INFRA-17514, lock to 1 Windows node
* INFRA-17514 testing if this invoker keeps locks on the files.
* INFRA-17514 disable invokerPublisher() This is the root cause for the

All tests passed