Build failed in Jenkins: Maven TLP » maven-invoker-plugin » master #52

classic Classic list List threaded Threaded
4 messages Options
Reply | Threaded
Open this post in threaded view
|

Build failed in Jenkins: Maven TLP » maven-invoker-plugin » master #52

Apache Jenkins Server-2
See https://builds.apache.org/job/maven-box/job/maven-invoker-plugin/job/master/52/

Changes:

* Add JDK 13 (latest)
* [MINVOKER-246] Support hierarchical invoker.properties
* [MINVOKER-246] Support hierarchical invoker.properties
* [MINVOKER-246] Support hierarchical invoker.properties
* [MINVOKER-246] Support hierarchical invoker.properties
* [MINVOKER-246] Support hierarchical invoker.properties
* [MINVOKER-246] Support hierarchical invoker.properties

All tests passed

Build log:
[...truncated 2697 lines...]
[INFO] ------------------------------------------------------------------------
[INFO] [jenkins-event-spy] Generated /home/jenkins/jenkins-slave/workspace/-box_maven-invoker-plugin_master@2@tmp/withMavene50807e7/maven-spy-20190111-201449-336363290943524574476.log
[Pipeline] }
[Pipeline] // dir
[Pipeline] }
[withMaven] artifactsPublisher - Archive artifact linux-jdk7-m3.5.x_build/pom.xml under org/apache/maven/plugins/maven-invoker-plugin/3.1.1-SNAPSHOT/maven-invoker-plugin-3.1.1-SNAPSHOT.pom
[withMaven] artifactsPublisher - Archive artifact linux-jdk7-m3.5.x_build/target/maven-invoker-plugin-3.1.1-SNAPSHOT.jar under org/apache/maven/plugins/maven-invoker-plugin/3.1.1-SNAPSHOT/maven-invoker-plugin-3.1.1-SNAPSHOT.jar
[withMaven] junitPublisher - Archive test results for Maven artifact org.apache.maven.plugins:maven-invoker-plugin:maven-plugin:3.1.1-SNAPSHOT generated by maven-surefire-plugin:test (default-test): linux-jdk7-m3.5.x_build/target/surefire-reports/*.xml
Recording test results
[withMaven] openTasksPublisher - Scan Tasks for Maven artifact org.apache.maven.plugins:maven-invoker-plugin:maven-plugin:3.1.1-SNAPSHOT in source directory linux-jdk7-m3.5.x_build/src/main/java
[TASKS] Scanning folder '/home/jenkins/jenkins-slave/workspace/-box_maven-invoker-plugin_master@2' for files matching the pattern 'linux-jdk7-m3.5.x_build/src/main/java/**/*' - excludes: null
[TASKS] Found 17 files to scan for tasks
[TASKS] Found 7 open tasks.
Skipping warnings blame since pipelines do not have an SCM link.%n
[TASKS] Computing warning deltas based on reference build #51
[withMaven] invokerPublisher - Archive invoker results for Maven artifact MavenArtifact{org.apache.maven.plugins:maven-invoker-plugin:maven-plugin:3.1.1-SNAPSHOT(version: 3.1.1-SNAPSHOT, snapshot:false) } generated by PluginInvocation{org.apache.maven.plugins:maven-invoker-plugin:3.0.1@integration-test  integration-test}: linux-jdk7-m3.5.x_build/target/invoker-reports/*.xml
[INFO]           settings-merge_jdk9+/pom.xml ..................... SUCCESS (9.9 s)
[INFO] Building: script-errors/pom.xml
[INFO] run post-build script verify.bsh
[INFO]           script-errors/pom.xml ............................ SUCCESS (4.9 s)
[INFO] Building: spaces-should-work_non-windows/pom.xml
[INFO] run pre-build script setup.groovy
[INFO] run post-build script verify.bsh
[INFO]           local-repo-path\pom.xml .......................... SUCCESS (17.9 s)
[INFO] Building: local-repo-url\pom.xml
[INFO]           spaces-should-work_non-windows/pom.xml ........... SUCCESS (8.0 s)
[INFO] Building: fail-build/pom.xml
[INFO] run post-build script verify.bsh
[INFO]           fail-build/pom.xml ............................... SUCCESS (6.3 s)
[INFO]
[INFO] --- maven-checkstyle-plugin:3.0.0:check (checkstyle-check) @ maven-invoker-plugin ---
[INFO] There are 4 errors reported by Checkstyle 6.18 with config/maven_checks.xml ruleset.
[INFO] Ignored 4 errors, 0 violation remaining.
[INFO]
[INFO] --- maven-invoker-plugin:3.0.1:verify (integration-test) @ maven-invoker-plugin ---
[INFO] -------------------------------------------------
[INFO] Build Summary:
[INFO]   Passed: 69, Failed: 0, Errors: 0, Skipped: 1
[INFO] -------------------------------------------------
[INFO] ------------------------------------------------------------------------
[INFO] BUILD SUCCESS
[INFO] ------------------------------------------------------------------------
[INFO] Total time: 09:56 min
[INFO] Finished at: 2019-01-11T20:24:47Z
[INFO] ------------------------------------------------------------------------
[INFO] [jenkins-event-spy] Generated /home/jenkins/jenkins-slave/workspace/-box_maven-invoker-plugin_master@2@tmp/withMavenfbe501a1/maven-spy-20190111-201450-3155211130036206826288.log
[Pipeline] }
[Pipeline] // dir
[Pipeline] }
[withMaven] artifactsPublisher - Archive artifact linux-jdk8-m3.5.x_build/pom.xml under org/apache/maven/plugins/maven-invoker-plugin/3.1.1-SNAPSHOT/maven-invoker-plugin-3.1.1-SNAPSHOT.pom
[withMaven] artifactsPublisher - Archive artifact linux-jdk8-m3.5.x_build/target/maven-invoker-plugin-3.1.1-SNAPSHOT.jar under org/apache/maven/plugins/maven-invoker-plugin/3.1.1-SNAPSHOT/maven-invoker-plugin-3.1.1-SNAPSHOT.jar
[INFO] run post-build script verify.groovy
[INFO]           local-repo-url\pom.xml ........................... SUCCESS (16.9 s)
[INFO] Building: MINVOKER-191\pom.xml
[withMaven] junitPublisher - Archive test results for Maven artifact org.apache.maven.plugins:maven-invoker-plugin:maven-plugin:3.1.1-SNAPSHOT generated by maven-surefire-plugin:test (default-test): linux-jdk8-m3.5.x_build/target/surefire-reports/*.xml
Recording test results
[withMaven] openTasksPublisher - Scan Tasks for Maven artifact org.apache.maven.plugins:maven-invoker-plugin:maven-plugin:3.1.1-SNAPSHOT in source directory linux-jdk8-m3.5.x_build/src/main/java
[TASKS] Scanning folder '/home/jenkins/jenkins-slave/workspace/-box_maven-invoker-plugin_master@2' for files matching the pattern 'linux-jdk8-m3.5.x_build/src/main/java/**/*' - excludes: null
[TASKS] Found 17 files to scan for tasks
[TASKS] Found 7 open tasks.
Skipping warnings blame since pipelines do not have an SCM link.%n
[TASKS] Computing warning deltas based on reference build #51
[withMaven] invokerPublisher - Archive invoker results for Maven artifact MavenArtifact{org.apache.maven.plugins:maven-invoker-plugin:maven-plugin:3.1.1-SNAPSHOT(version: 3.1.1-SNAPSHOT, snapshot:false) } generated by PluginInvocation{org.apache.maven.plugins:maven-invoker-plugin:3.0.1@integration-test  integration-test}: linux-jdk8-m3.5.x_build/target/invoker-reports/*.xml
[INFO]           MINVOKER-191\pom.xml ............................. SUCCESS (21.9 s)
[INFO] Building: MINVOKER-243_install-reactor\pom.xml
[withMaven] Publishers: Generated Artifacts Publisher: 1270 ms, Junit Publisher: 2498 ms, Open Task Scanner Publisher: 716 ms, Invoker Publisher: 84214 ms, Pipeline Graph Publisher: 16 ms
[Pipeline] // withMaven
[Pipeline] }
[Pipeline] // stage
[Pipeline] }
[Pipeline] // ws
[Pipeline] }
[Pipeline] // node
[Pipeline] }
[INFO] run post-build script verify.groovy
[INFO]           MINVOKER-243_install-reactor\pom.xml ............. SUCCESS (10.5 s)
[INFO] Building: multiEnvVar\pom.xml
[withMaven] Publishers: Generated Artifacts Publisher: 1142 ms, Junit Publisher: 2499 ms, Open Task Scanner Publisher: 708 ms, Dependencies Fingerprint Publisher: 1 ms, Invoker Publisher: 91421 ms, Pipeline Graph Publisher: 19 ms
[Pipeline] // withMaven
[Pipeline] }
[Pipeline] // stage
[Pipeline] }
[Pipeline] // ws
[Pipeline] }
[Pipeline] // node
[Pipeline] }
[INFO]           multiEnvVar\pom.xml .............................. SUCCESS (17.3 s)
[INFO] Building: not-clone-not-plugin\pom.xml
[withMaven] Publishers: Generated Artifacts Publisher: 1174 ms, Junit Publisher: 2512 ms, Open Task Scanner Publisher: 709 ms, Invoker Publisher: 85169 ms, Pipeline Graph Publisher: 1 ms
[Pipeline] // withMaven
[Pipeline] }
[Pipeline] // stage
[Pipeline] }
[Pipeline] // ws
[Pipeline] }
[Pipeline] // node
[Pipeline] }
[INFO] run post-build script verify.bsh
[INFO]           not-clone-not-plugin\pom.xml ..................... SUCCESS (13.5 s)
[INFO] Building: pom-filtering\pom.xml
[INFO] run post-build script verify.bsh
[INFO]           pom-filtering\pom.xml ............................ SUCCESS (14.8 s)
[INFO] Building: pom-filtering-encoding\pom.xml
[withMaven] Publishers: Generated Artifacts Publisher: 1136 ms, Junit Publisher: 2516 ms, Open Task Scanner Publisher: 984 ms, Invoker Publisher: 85736 ms, Pipeline Graph Publisher: 2 ms
[Pipeline] // withMaven
[Pipeline] }
[Pipeline] // stage
[Pipeline] }
[Pipeline] // ws
[Pipeline] }
[Pipeline] // node
[Pipeline] }
[INFO] run post-build script verify.bsh
[INFO]           pom-filtering-encoding\pom.xml ................... SUCCESS (20.4 s)
[INFO] Building: pom-filtering-reactor\pom.xml
[INFO] run post-build script verify.bsh
[INFO]           pom-filtering-reactor\pom.xml .................... SUCCESS (13.8 s)
[INFO] Building: pom-less-invocation\pom.xml
[INFO] run post-build script verify.bsh
[INFO]           pom-less-invocation\pom.xml ...................... SUCCESS (8.8 s)
[INFO] Building: postbuild-executed-only-once\pom.xml
[INFO] run post-build script verify.bsh
[INFO]           postbuild-executed-only-once\pom.xml ............. SUCCESS (32.9 s)
[INFO] Building: project-cloning\pom.xml
[INFO] run pre-build script setup.bsh
[INFO] run post-build script verify.bsh
[INFO]           project-cloning\pom.xml .......................... SUCCESS (24.1 s)
[INFO] Building: project-cloning-reactor\pom.xml
[INFO] run post-build script verify.bsh
[INFO]           project-cloning-reactor\pom.xml .................. SUCCESS (13.8 s)
[INFO] Building: project-setup\pom.xml
[INFO] run post-build script verify.bsh
[INFO]           project-setup\pom.xml ............................ SUCCESS (36.0 s)
[INFO] Building: script-accessibility\pom.xml
[INFO]           script-accessibility\pom.xml ..................... SUCCESS (23.6 s)
[INFO] Building: script-additional-vars\pom.xml
[INFO]           script-additional-vars\pom.xml ................... SUCCESS (21.7 s)
[INFO] Building: script-class-loading\pom.xml
[INFO]           script-class-loading\pom.xml ..................... SUCCESS (24.8 s)
[INFO] Building: script-classpath-duplicates\pom.xml
[INFO] run post-build script verify.bsh
[INFO]           script-classpath-duplicates\pom.xml .............. SUCCESS (22.6 s)
[INFO] Building: script-context\pom.xml
[INFO] run post-build script verify.bsh
[INFO]           script-context\pom.xml ........................... SUCCESS (21.2 s)
[INFO] Building: script-errors\pom.xml
[INFO] run post-build script verify.bsh
[INFO]           script-errors\pom.xml ............................ SUCCESS (10.5 s)
[INFO] Building: script-global-vars\pom.xml
[INFO]           script-global-vars\pom.xml ....................... SUCCESS (21.1 s)
[INFO] Building: script-interpreter-detection\pom.xml
[INFO] run post-build script verify.bsh
[INFO]           script-interpreter-detection\pom.xml ............. SUCCESS (21.5 s)
[INFO] Building: script-verify-xml\pom.xml
[INFO] run post-build script verify.groovy
[INFO]           script-verify-xml\pom.xml ........................ SUCCESS (9.1 s)
[INFO] Building: selector-conditions\pom.xml
[INFO] run post-build script verify.groovy
[INFO]           selector-conditions\pom.xml ...................... SUCCESS (24.6 s)
[INFO] Building: selector-scripts\pom.xml
[INFO] run pre-build script setup.groovy
[INFO] run post-build script verify.bsh
[INFO]           selector-scripts\pom.xml ......................... SUCCESS (20.5 s)
[INFO] Building: settings-auto-exclude\pom.xml
[INFO]           settings-auto-exclude\pom.xml .................... SUCCESS (13.0 s)
[INFO] Building: settings-inherit\pom.xml
[INFO]           settings-inherit\pom.xml ......................... SUCCESS (16.3 s)
[INFO] Building: settings-merge\pom.xml
[INFO]           settings-merge\pom.xml ........................... SUCCESS (24.6 s)
[INFO] Building: settings-merge-multiexecutions\pom.xml
[INFO]           settings-merge-multiexecutions\pom.xml ........... SUCCESS (23.6 s)
[INFO] Building: settings-merge_jdk9+\pom.xml
[INFO]           settings-merge_jdk9+\pom.xml ..................... SUCCESS (20.3 s)
[INFO] Building: settings-override\pom.xml
[INFO]           settings-override\pom.xml ........................ SUCCESS (17.2 s)
[INFO] Building: skip-install\pom.xml
[INFO] run post-build script verify.bsh
[INFO]           skip-install\pom.xml ............................. SUCCESS (8.2 s)
[INFO] Building: skip-run\pom.xml
[INFO] run post-build script verify.bsh
[INFO]           skip-run\pom.xml ................................. SUCCESS (7.9 s)
[INFO] Building: spaces-should-work_non-windows\pom.xml
[INFO]           spaces-should-work_non-windows\pom.xml ........... SKIPPED due to OS
[INFO] Building: spaces-should-work_windows\pom.xml
[INFO]           spaces-should-work_windows\pom.xml ............... SKIPPED due to Maven version
[INFO] Building: special-characters-should-work\pom.xml
[INFO] run pre-build script setup.groovy
[INFO]           special-characters-should-work\pom.xml ........... SUCCESS (16.2 s)
[INFO] Building: staging-dependencies\pom.xml
[INFO] run post-build script verify.bsh
[INFO]           staging-dependencies\pom.xml ..................... SUCCESS (12.6 s)
[INFO] Building: staging-pom\pom.xml
[INFO] run post-build script verify.bsh
[INFO]           staging-pom\pom.xml .............................. SUCCESS (9.0 s)
[INFO] Building: staging-reactor\pom.xml
[INFO] run post-build script verify.bsh
[INFO]           staging-reactor\pom.xml .......................... SUCCESS (13.7 s)
[INFO] Building: wrongPropertyInterpolation\pom.xml
[INFO]           wrongPropertyInterpolation\pom.xml ............... SUCCESS (31.0 s)
[INFO]
[INFO] --- maven-checkstyle-plugin:3.0.0:check (checkstyle-check) @ maven-invoker-plugin ---
[INFO] There are 4 errors reported by Checkstyle 6.18 with config/maven_checks.xml ruleset.
[INFO] Ignored 4 errors, 0 violation remaining.
[INFO]
[INFO] --- maven-invoker-plugin:3.0.1:verify (integration-test) @ maven-invoker-plugin ---
[INFO] -------------------------------------------------
[INFO] Build Summary:
[INFO]   Passed: 68, Failed: 0, Errors: 0, Skipped: 2
[INFO] -------------------------------------------------
[INFO] ------------------------------------------------------------------------
[INFO] BUILD SUCCESS
[INFO] ------------------------------------------------------------------------
[INFO] Total time: 21:04 min
[INFO] Finished at: 2019-01-11T20:35:55+00:00
[INFO] Final Memory: 61M/1124M
[INFO] ------------------------------------------------------------------------
[INFO] [jenkins-event-spy] Generated F:\jenkins\jenkins-slave\workspace\-box_maven-invoker-plugin_master@3@2@tmp\withMavenaa60178a\maven-spy-20190111-201450-3091170383593427318335.log
Picked up JAVA_TOOL_OPTIONS: -Dmaven.ext.class.path="f:\jenkins\jenkins-slave\workspace\-box_maven-invoker-plugin_master@3@2@tmp\withMavenaa60178a\pipeline-maven-spy.jar" -Dorg.jenkinsci.plugins.pipeline.maven.reportsFolder="f:\jenkins\jenkins-slave\workspace\-box_maven-invoker-plugin_master@3@2@tmp\withMavenaa60178a"
[Pipeline] }
[Pipeline] // dir
[Pipeline] }
[withMaven] artifactsPublisher - Archive artifact windows-jdk7-m3.3.x_build\pom.xml under org\apache\maven\plugins\maven-invoker-plugin\3.1.1-SNAPSHOT\maven-invoker-plugin-3.1.1-SNAPSHOT.pom
[withMaven] artifactsPublisher - Archive artifact windows-jdk7-m3.3.x_build\target\maven-invoker-plugin-3.1.1-SNAPSHOT.jar under org\apache\maven\plugins\maven-invoker-plugin\3.1.1-SNAPSHOT\maven-invoker-plugin-3.1.1-SNAPSHOT.jar
[withMaven] junitPublisher - Archive test results for Maven artifact org.apache.maven.plugins:maven-invoker-plugin:maven-plugin:3.1.1-SNAPSHOT generated by maven-surefire-plugin:test (default-test): windows-jdk7-m3.3.x_build\target\surefire-reports\*.xml
Recording test results
[withMaven] openTasksPublisher - Scan Tasks for Maven artifact org.apache.maven.plugins:maven-invoker-plugin:maven-plugin:3.1.1-SNAPSHOT in source directory windows-jdk7-m3.3.x_build\src\main\java
[TASKS] Scanning folder 'f:\jenkins\jenkins-slave\workspace\-box_maven-invoker-plugin_master@3@2' for files matching the pattern 'windows-jdk7-m3.3.x_build\src\main\java\**\*' - excludes: null
[TASKS] Found 17 files to scan for tasks
[TASKS] Found 7 open tasks.
Skipping warnings blame since pipelines do not have an SCM link.%n
[TASKS] Computing warning deltas based on reference build #51
[withMaven] invokerPublisher - Archive invoker results for Maven artifact MavenArtifact{org.apache.maven.plugins:maven-invoker-plugin:maven-plugin:3.1.1-SNAPSHOT(version: 3.1.1-SNAPSHOT, snapshot:false) } generated by PluginInvocation{org.apache.maven.plugins:maven-invoker-plugin:3.0.1@integration-test  integration-test}: windows-jdk7-m3.3.x_build\target\invoker-reports\*.xml
[withMaven] Publishers: Generated Artifacts Publisher: 171 ms, Junit Publisher: 276 ms, Open Task Scanner Publisher: 155 ms, Invoker Publisher: 36650 ms, Pipeline Graph Publisher: 1 ms
[Pipeline] // withMaven
[Pipeline] }
[Pipeline] // stage
[Pipeline] }
[Pipeline] // ws
[Pipeline] }
[Pipeline] // node
[Pipeline] }
[Pipeline] // parallel
[Pipeline] stage
[Pipeline] { (Notifications)
[Pipeline] echo
Build result: FAILURE
[Pipeline] jiraIssueSelector
[Pipeline] jiraComment
[Pipeline] emailext
Reply | Threaded
Open this post in threaded view
|

Build failed in Jenkins: Maven TLP » maven-invoker-plugin » master #53

Apache Jenkins Server-2
See https://builds.apache.org/job/maven-box/job/maven-invoker-plugin/job/master/53/

Changes:

* [MINVOKER-190] build.log file location causes problems
* [MINVOKER-190] build.log file location causes problems

All tests passed

Build log:
[...truncated 2951 lines...]
[withMaven] Publishers: Generated Artifacts Publisher: 157 ms, Junit Publisher: 267 ms, Open Task Scanner Publisher: 148 ms, Invoker Publisher: 43554 ms, Pipeline Graph Publisher: 1 ms
[Pipeline] // withMaven
[Pipeline] }
[Pipeline] // stage
[Pipeline] }
[Pipeline] // ws
[Pipeline] }
[Pipeline] // node
[Pipeline] }
[INFO]           settings-inherit/pom.xml ......................... SUCCESS (5.3 s)
[INFO] Building: fail-ignore-with-verify/pom.xml
[INFO]           fail-ignore-with-verify/pom.xml .................. SUCCESS (5.0 s)
[INFO] Building: settings-merge_jdk9+/pom.xml
[INFO]           settings-merge_jdk9+/pom.xml ..................... SUCCESS (7.8 s)
[INFO] Building: invocation-spaces/pom.xml
[INFO] run post-build script verify.bsh
[INFO]           invocation-spaces/pom.xml ........................ SUCCESS (7.5 s)
[INFO] Building: not-clone-not-plugin/pom.xml
[INFO] run post-build script verify.bsh
[INFO]           not-clone-not-plugin/pom.xml ..................... SUCCESS (4.8 s)
[INFO] Building: script-verify-xml/pom.xml
[INFO] run post-build script verify.groovy
[INFO]           script-verify-xml/pom.xml ........................ SUCCESS (3.5 s)
[INFO] Building: invocation-debug/pom.xml
[INFO]           MINVOKER-191\pom.xml ............................. SUCCESS (909.7 s)
[INFO] Building: MINVOKER-243_install-reactor\pom.xml
[INFO]           invocation-debug/pom.xml ......................... SUCCESS (6.2 s)
[INFO] Building: pom-filtering/pom.xml
[INFO] run post-build script verify.groovy
[INFO]           MINVOKER-243_install-reactor\pom.xml ............. SUCCESS (6.1 s)
[INFO] Building: multiEnvVar\pom.xml
[INFO] run post-build script verify.bsh
[INFO]           pom-filtering/pom.xml ............................ SUCCESS (5.3 s)
[INFO] Building: script-global-vars/pom.xml
[INFO]           script-global-vars/pom.xml ....................... SUCCESS (7.2 s)
[INFO] Building: selector-scripts/pom.xml
[INFO] run pre-build script setup.groovy
[INFO]           multiEnvVar\pom.xml .............................. SUCCESS (10.9 s)
[INFO] Building: not-clone-not-plugin\pom.xml
[INFO] run post-build script verify.bsh
[INFO]           selector-scripts/pom.xml ......................... SUCCESS (7.0 s)
[INFO] Building: invocation-reactor-indirect/pom.xml
[INFO] run post-build script verify.bsh
[INFO]           not-clone-not-plugin\pom.xml ..................... SUCCESS (8.2 s)
[INFO] Building: pom-filtering\pom.xml
[INFO]           invocation-reactor-indirect/pom.xml .............. SUCCESS (6.7 s)
[INFO] Building: script-class-loading/pom.xml
[INFO] run post-build script verify.bsh
[INFO]           pom-filtering\pom.xml ............................ SUCCESS (8.9 s)
[INFO] Building: pom-filtering-encoding\pom.xml
[INFO]           script-class-loading/pom.xml ..................... SUCCESS (9.0 s)
[INFO] Building: settings-merge-multiexecutions/pom.xml
[INFO] run post-build script verify.bsh
[INFO]           pom-filtering-encoding\pom.xml ................... SUCCESS (12.6 s)
[INFO] Building: pom-filtering-reactor\pom.xml
[INFO]           settings-merge-multiexecutions/pom.xml ........... SUCCESS (9.0 s)
[INFO] Building: invocation-environmentvariable/pom.xml
[INFO]           invocation-environmentvariable/pom.xml ........... SUCCESS (4.8 s)
[INFO] Building: project-cloning-reactor/pom.xml
[INFO] run post-build script verify.bsh
[INFO]           pom-filtering-reactor\pom.xml .................... SUCCESS (9.0 s)
[INFO] Building: pom-less-invocation\pom.xml
[INFO] run post-build script verify.bsh
[INFO]           project-cloning-reactor/pom.xml .................. SUCCESS (4.9 s)
[INFO] Building: exec-timeout-invoker-level/pom.xml
[INFO] run post-build script verify.bsh
[INFO]           pom-less-invocation\pom.xml ...................... SUCCESS (5.6 s)
[INFO] Building: postbuild-executed-only-once\pom.xml
[INFO]           exec-timeout-invoker-level/pom.xml ............... SUCCESS (8.5 s)
[INFO] Building: invocation-cmdline-exclude/pom.xml
[INFO]           invocation-cmdline-exclude/pom.xml ............... SUCCESS (2.9 s)
[INFO] Building: local-repo-path/pom.xml
[INFO] run post-build script verify.bsh
[INFO]           local-repo-path/pom.xml .......................... SUCCESS (6.2 s)
[INFO] Building: script-interpreter-detection/pom.xml
[INFO] run post-build script verify.bsh
[INFO]           script-interpreter-detection/pom.xml ............. SUCCESS (7.7 s)
[INFO] Building: invocation-offline/pom.xml
[INFO] run post-build script verify.bsh
[INFO]           postbuild-executed-only-once\pom.xml ............. SUCCESS (21.2 s)
[INFO] Building: project-cloning\pom.xml
[INFO] run pre-build script setup.bsh
[INFO] run post-build script verify.bsh
[INFO]           invocation-offline/pom.xml ....................... SUCCESS (7.2 s)
[INFO]
[INFO] --- maven-checkstyle-plugin:3.0.0:check (checkstyle-check) @ maven-invoker-plugin ---
[INFO] There are 4 errors reported by Checkstyle 6.18 with config/maven_checks.xml ruleset.
[INFO] Ignored 4 errors, 0 violation remaining.
[INFO]
[INFO] --- maven-invoker-plugin:3.0.1:verify (integration-test) @ maven-invoker-plugin ---
[INFO] -------------------------------------------------
[INFO] Build Summary:
[INFO]   Passed: 69, Failed: 0, Errors: 0, Skipped: 2
[INFO] -------------------------------------------------
[INFO] ------------------------------------------------------------------------
[INFO] BUILD SUCCESS
[INFO] ------------------------------------------------------------------------
[INFO] Total time: 07:37 min
[INFO] Finished at: 2019-01-11T23:06:50Z
[INFO] ------------------------------------------------------------------------
[INFO] [jenkins-event-spy] Generated /home/jenkins/jenkins-slave/workspace/-box_maven-invoker-plugin_master@2@tmp/withMavenbda648a7/maven-spy-20190111-225912-87611941622841913894378.log
[Pipeline] }
[Pipeline] // dir
[Pipeline] }
[withMaven] artifactsPublisher - Archive artifact linux-jdk11-m3.5.x_build/pom.xml under org/apache/maven/plugins/maven-invoker-plugin/3.1.1-SNAPSHOT/maven-invoker-plugin-3.1.1-SNAPSHOT.pom
[withMaven] artifactsPublisher - Archive artifact linux-jdk11-m3.5.x_build/target/maven-invoker-plugin-3.1.1-SNAPSHOT.jar under org/apache/maven/plugins/maven-invoker-plugin/3.1.1-SNAPSHOT/maven-invoker-plugin-3.1.1-SNAPSHOT.jar
[withMaven] junitPublisher - Archive test results for Maven artifact org.apache.maven.plugins:maven-invoker-plugin:maven-plugin:3.1.1-SNAPSHOT generated by maven-surefire-plugin:test (default-test): linux-jdk11-m3.5.x_build/target/surefire-reports/*.xml
Recording test results
[withMaven] openTasksPublisher - Scan Tasks for Maven artifact org.apache.maven.plugins:maven-invoker-plugin:maven-plugin:3.1.1-SNAPSHOT in source directory linux-jdk11-m3.5.x_build/src/main/java
[TASKS] Scanning folder '/home/jenkins/jenkins-slave/workspace/-box_maven-invoker-plugin_master@2' for files matching the pattern 'linux-jdk11-m3.5.x_build/src/main/java/**/*' - excludes: null
[TASKS] Found 17 files to scan for tasks
[TASKS] Found 7 open tasks.
Skipping warnings blame since pipelines do not have an SCM link.%n
[TASKS] Computing warning deltas based on reference build #51
[withMaven] invokerPublisher - Archive invoker results for Maven artifact MavenArtifact{org.apache.maven.plugins:maven-invoker-plugin:maven-plugin:3.1.1-SNAPSHOT(version: 3.1.1-SNAPSHOT, snapshot:false) } generated by PluginInvocation{org.apache.maven.plugins:maven-invoker-plugin:3.0.1@integration-test  integration-test}: linux-jdk11-m3.5.x_build/target/invoker-reports/*.xml
[INFO] run post-build script verify.bsh
[INFO]           project-cloning\pom.xml .......................... SUCCESS (16.1 s)
[INFO] Building: project-cloning-reactor\pom.xml
[INFO] run post-build script verify.bsh
[INFO]           project-cloning-reactor\pom.xml .................. SUCCESS (8.7 s)
[INFO] Building: project-setup\pom.xml
[INFO] run post-build script verify.bsh
[INFO]           project-setup\pom.xml ............................ SUCCESS (22.8 s)
[INFO] Building: script-accessibility\pom.xml
[INFO]           script-accessibility\pom.xml ..................... SUCCESS (14.9 s)
[INFO] Building: script-additional-vars\pom.xml
[INFO]           script-additional-vars\pom.xml ................... SUCCESS (13.3 s)
[INFO] Building: script-class-loading\pom.xml
[INFO]           script-class-loading\pom.xml ..................... SUCCESS (15.5 s)
[INFO] Building: script-classpath-duplicates\pom.xml
[withMaven] Publishers: Generated Artifacts Publisher: 1145 ms, Junit Publisher: 2507 ms, Open Task Scanner Publisher: 852 ms, Invoker Publisher: 88133 ms, Pipeline Graph Publisher: 1 ms
[Pipeline] // withMaven
[Pipeline] }
[Pipeline] // stage
[Pipeline] }
[Pipeline] // ws
[Pipeline] }
[Pipeline] // node
[Pipeline] }
[INFO] run post-build script verify.bsh
[INFO]           script-classpath-duplicates\pom.xml .............. SUCCESS (13.9 s)
[INFO] Building: script-context\pom.xml
[INFO] run post-build script verify.bsh
[INFO]           script-context\pom.xml ........................... SUCCESS (13.8 s)
[INFO] Building: script-errors\pom.xml
[INFO] run post-build script verify.bsh
[INFO]           script-errors\pom.xml ............................ SUCCESS (6.4 s)
[INFO] Building: script-global-vars\pom.xml
[INFO]           script-global-vars\pom.xml ....................... SUCCESS (13.6 s)
[INFO] Building: script-interpreter-detection\pom.xml
[INFO] run post-build script verify.bsh
[INFO]           script-interpreter-detection\pom.xml ............. SUCCESS (13.0 s)
[INFO] Building: script-verify-xml\pom.xml
[INFO] run post-build script verify.groovy
[INFO]           script-verify-xml\pom.xml ........................ SUCCESS (5.6 s)
[INFO] Building: selector-conditions\pom.xml
[INFO] run post-build script verify.groovy
[INFO]           selector-conditions\pom.xml ...................... SUCCESS (17.4 s)
[INFO] Building: selector-scripts\pom.xml
[INFO] run pre-build script setup.groovy
[INFO] run post-build script verify.bsh
[INFO]           selector-scripts\pom.xml ......................... SUCCESS (13.1 s)
[INFO] Building: settings-auto-exclude\pom.xml
[INFO]           settings-auto-exclude\pom.xml .................... SUCCESS (8.6 s)
[INFO] Building: settings-inherit\pom.xml
[INFO]           settings-inherit\pom.xml ......................... SUCCESS (11.3 s)
[INFO] Building: settings-merge\pom.xml
[INFO]           settings-merge\pom.xml ........................... SUCCESS (16.1 s)
[INFO] Building: settings-merge-multiexecutions\pom.xml
[INFO]           settings-merge-multiexecutions\pom.xml ........... SUCCESS (14.7 s)
[INFO] Building: settings-merge_jdk9+\pom.xml
[INFO]           settings-merge_jdk9+\pom.xml ..................... SUCCESS (13.1 s)
[INFO] Building: settings-override\pom.xml
[INFO]           settings-override\pom.xml ........................ SUCCESS (10.8 s)
[INFO] Building: skip-install\pom.xml
[INFO] run post-build script verify.bsh
[INFO]           skip-install\pom.xml ............................. SUCCESS (4.8 s)
[INFO] Building: skip-run\pom.xml
[INFO] run post-build script verify.bsh
[INFO]           skip-run\pom.xml ................................. SUCCESS (4.9 s)
[INFO] Building: spaces-should-work_non-windows\pom.xml
[INFO]           spaces-should-work_non-windows\pom.xml ........... SKIPPED due to OS
[INFO] Building: spaces-should-work_windows\pom.xml
[INFO] run pre-build script setup.groovy
[INFO]           spaces-should-work_windows\pom.xml ............... SUCCESS (10.8 s)
[INFO] Building: special-characters-should-work\pom.xml
[INFO] run pre-build script setup.groovy
[INFO]           special-characters-should-work\pom.xml ........... SUCCESS (10.9 s)
[INFO] Building: staging-dependencies\pom.xml
[INFO] run post-build script verify.bsh
[INFO]           staging-dependencies\pom.xml ..................... SUCCESS (8.4 s)
[INFO] Building: staging-pom\pom.xml
[INFO] run post-build script verify.bsh
[INFO]           staging-pom\pom.xml .............................. SUCCESS (4.8 s)
[INFO] Building: staging-reactor\pom.xml
[INFO] run post-build script verify.bsh
[INFO]           staging-reactor\pom.xml .......................... SUCCESS (7.8 s)
[INFO] Building: wrongPropertyInterpolation\pom.xml
[INFO]           wrongPropertyInterpolation\pom.xml ............... SUCCESS (18.1 s)
[INFO]
[INFO] --- maven-checkstyle-plugin:3.0.0:check (checkstyle-check) @ maven-invoker-plugin ---
[INFO] There are 4 errors reported by Checkstyle 6.18 with config/maven_checks.xml ruleset.
[INFO] Ignored 4 errors, 0 violation remaining.
[INFO]
[INFO] --- maven-invoker-plugin:3.0.1:verify (integration-test) @ maven-invoker-plugin ---
[INFO] -------------------------------------------------
[INFO] Build Summary:
[INFO]   Passed: 70, Failed: 0, Errors: 0, Skipped: 1
[INFO] -------------------------------------------------
[INFO] ------------------------------------------------------------------------
[INFO] BUILD SUCCESS
[INFO] ------------------------------------------------------------------------
[INFO] Total time: 29:07 min
[INFO] Finished at: 2019-01-11T23:12:17Z
[INFO] Final Memory: 59M/1105M
[INFO] ------------------------------------------------------------------------
[INFO] [jenkins-event-spy] Generated F:\jenkins\jenkins-slave\workspace\-box_maven-invoker-plugin_master@2@2@tmp\withMavenf1eb6d57\maven-spy-20190111-224309-8243087501583562573009.log
Picked up JAVA_TOOL_OPTIONS: -Dmaven.ext.class.path="f:\jenkins\jenkins-slave\workspace\-box_maven-invoker-plugin_master@2@2@tmp\withMavenf1eb6d57\pipeline-maven-spy.jar" -Dorg.jenkinsci.plugins.pipeline.maven.reportsFolder="f:\jenkins\jenkins-slave\workspace\-box_maven-invoker-plugin_master@2@2@tmp\withMavenf1eb6d57"
[Pipeline] }
[Pipeline] // dir
[Pipeline] }
[withMaven] artifactsPublisher - Archive artifact windows-jdk8-m3.5.x_build\pom.xml under org\apache\maven\plugins\maven-invoker-plugin\3.1.1-SNAPSHOT\maven-invoker-plugin-3.1.1-SNAPSHOT.pom
[withMaven] artifactsPublisher - Archive artifact windows-jdk8-m3.5.x_build\target\maven-invoker-plugin-3.1.1-SNAPSHOT.jar under org\apache\maven\plugins\maven-invoker-plugin\3.1.1-SNAPSHOT\maven-invoker-plugin-3.1.1-SNAPSHOT.jar
[withMaven] junitPublisher - Archive test results for Maven artifact org.apache.maven.plugins:maven-invoker-plugin:maven-plugin:3.1.1-SNAPSHOT generated by maven-surefire-plugin:test (default-test): windows-jdk8-m3.5.x_build\target\surefire-reports\*.xml
Recording test results
[withMaven] openTasksPublisher - Scan Tasks for Maven artifact org.apache.maven.plugins:maven-invoker-plugin:maven-plugin:3.1.1-SNAPSHOT in source directory windows-jdk8-m3.5.x_build\src\main\java
[TASKS] Scanning folder 'f:\jenkins\jenkins-slave\workspace\-box_maven-invoker-plugin_master@2@2' for files matching the pattern 'windows-jdk8-m3.5.x_build\src\main\java\**\*' - excludes: null
[TASKS] Found 17 files to scan for tasks
[TASKS] Found 7 open tasks.
Skipping warnings blame since pipelines do not have an SCM link.%n
[TASKS] Computing warning deltas based on reference build #51
[withMaven] invokerPublisher - Archive invoker results for Maven artifact MavenArtifact{org.apache.maven.plugins:maven-invoker-plugin:maven-plugin:3.1.1-SNAPSHOT(version: 3.1.1-SNAPSHOT, snapshot:false) } generated by PluginInvocation{org.apache.maven.plugins:maven-invoker-plugin:3.0.1@integration-test  integration-test}: windows-jdk8-m3.5.x_build\target\invoker-reports\*.xml
[withMaven] Publishers: Generated Artifacts Publisher: 134 ms, Junit Publisher: 269 ms, Open Task Scanner Publisher: 127 ms, Invoker Publisher: 24311 ms, Pipeline Graph Publisher: 1 ms
[Pipeline] // withMaven
[Pipeline] }
[Pipeline] // stage
[Pipeline] }
[Pipeline] // ws
[Pipeline] }
[Pipeline] // node
[Pipeline] }
[Pipeline] // parallel
[Pipeline] stage
[Pipeline] { (Notifications)
[Pipeline] echo
Build result: FAILURE
[Pipeline] jiraIssueSelector
[Pipeline] jiraComment
[Pipeline] emailext
Reply | Threaded
Open this post in threaded view
|

Build failed in Jenkins: Maven TLP » maven-invoker-plugin » master #54

Apache Jenkins Server-2
See https://builds.apache.org/job/maven-box/job/maven-invoker-plugin/job/master/54/

Changes:

* [MINVOKER-225] strange message ordering in case of post-build script
* [MINVOKER-225] strange message ordering in case of post-build script
* [MINVOKER-225] strange message ordering in case of post-build script
* [MINVOKER-225] strange message ordering in case of post-build script
* [MINVOKER-225] strange message ordering in case of post-build script
* [MINVOKER-225] strange message ordering in case of post-build script

All tests passed

Build log:
[...truncated 2729 lines...]
[INFO]
[INFO] --- maven-invoker-plugin:3.0.1:verify (integration-test) @ maven-invoker-plugin ---
[INFO] -------------------------------------------------
[INFO] Build Summary:
[INFO]   Passed: 69, Failed: 0, Errors: 0, Skipped: 2
[INFO] -------------------------------------------------
[INFO] ------------------------------------------------------------------------
[INFO] BUILD SUCCESS
[INFO] ------------------------------------------------------------------------
[INFO] Total time: 09:25 min
[INFO] Finished at: 2019-01-12T12:52:54Z
[INFO] ------------------------------------------------------------------------
[INFO] [jenkins-event-spy] Generated /home/jenkins/jenkins-slave/workspace/-box_maven-invoker-plugin_master@2@tmp/withMaven19b4ab6b/maven-spy-20190112-124328-35710032621246297427188.log
[Pipeline] }
[Pipeline] // dir
[Pipeline] }
[withMaven] artifactsPublisher - Archive artifact linux-jdk11-m3.5.x_build/pom.xml under org/apache/maven/plugins/maven-invoker-plugin/3.1.1-SNAPSHOT/maven-invoker-plugin-3.1.1-SNAPSHOT.pom
[withMaven] artifactsPublisher - Archive artifact linux-jdk11-m3.5.x_build/target/maven-invoker-plugin-3.1.1-SNAPSHOT.jar under org/apache/maven/plugins/maven-invoker-plugin/3.1.1-SNAPSHOT/maven-invoker-plugin-3.1.1-SNAPSHOT.jar
[withMaven] junitPublisher - Archive test results for Maven artifact org.apache.maven.plugins:maven-invoker-plugin:maven-plugin:3.1.1-SNAPSHOT generated by maven-surefire-plugin:test (default-test): linux-jdk11-m3.5.x_build/target/surefire-reports/*.xml
Recording test results
[withMaven] openTasksPublisher - Scan Tasks for Maven artifact org.apache.maven.plugins:maven-invoker-plugin:maven-plugin:3.1.1-SNAPSHOT in source directory linux-jdk11-m3.5.x_build/src/main/java
[TASKS] Scanning folder '/home/jenkins/jenkins-slave/workspace/-box_maven-invoker-plugin_master@2' for files matching the pattern 'linux-jdk11-m3.5.x_build/src/main/java/**/*' - excludes: null
[TASKS] Found 17 files to scan for tasks
[TASKS] Found 7 open tasks.
Skipping warnings blame since pipelines do not have an SCM link.%n
[TASKS] Computing warning deltas based on reference build #51
[withMaven] invokerPublisher - Archive invoker results for Maven artifact MavenArtifact{org.apache.maven.plugins:maven-invoker-plugin:maven-plugin:3.1.1-SNAPSHOT(version: 3.1.1-SNAPSHOT, snapshot:false) } generated by PluginInvocation{org.apache.maven.plugins:maven-invoker-plugin:3.0.1@integration-test  integration-test}: linux-jdk11-m3.5.x_build/target/invoker-reports/*.xml
[INFO]           settings-merge-multiexecutions/pom.xml ........... SUCCESS (11.1 s)
[INFO] Building: fail-ignore/pom.xml
[INFO]           fail-ignore/pom.xml .............................. SUCCESS (6.1 s)
[INFO] Building: invocation-cmdline-exclude/pom.xml
[INFO]           invocation-cmdline-exclude/pom.xml ............... SUCCESS (3.7 s)
[INFO]
[INFO] --- maven-checkstyle-plugin:3.0.0:check (checkstyle-check) @ maven-invoker-plugin ---
[INFO] There are 4 errors reported by Checkstyle 6.18 with config/maven_checks.xml ruleset.
[INFO] Ignored 4 errors, 0 violation remaining.
[INFO]
[INFO] --- maven-invoker-plugin:3.0.1:verify (integration-test) @ maven-invoker-plugin ---
[INFO] -------------------------------------------------
[INFO] Build Summary:
[INFO]   Passed: 70, Failed: 0, Errors: 0, Skipped: 1
[INFO] -------------------------------------------------
[INFO] ------------------------------------------------------------------------
[INFO] BUILD SUCCESS
[INFO] ------------------------------------------------------------------------
[INFO] Total time: 09:39 min
[INFO] Finished at: 2019-01-12T12:53:13Z
[INFO] ------------------------------------------------------------------------
[INFO] [jenkins-event-spy] Generated /home/jenkins/jenkins-slave/workspace/-box_maven-invoker-plugin_master@2@tmp/withMaven01014be6/maven-spy-20190112-124333-6996804383730879894782.log
[Pipeline] }
[Pipeline] // dir
[Pipeline] }
[withMaven] artifactsPublisher - Archive artifact linux-jdk7-m3.5.x_build/pom.xml under org/apache/maven/plugins/maven-invoker-plugin/3.1.1-SNAPSHOT/maven-invoker-plugin-3.1.1-SNAPSHOT.pom
[withMaven] artifactsPublisher - Archive artifact linux-jdk7-m3.5.x_build/target/maven-invoker-plugin-3.1.1-SNAPSHOT.jar under org/apache/maven/plugins/maven-invoker-plugin/3.1.1-SNAPSHOT/maven-invoker-plugin-3.1.1-SNAPSHOT.jar
[withMaven] junitPublisher - Archive test results for Maven artifact org.apache.maven.plugins:maven-invoker-plugin:maven-plugin:3.1.1-SNAPSHOT generated by maven-surefire-plugin:test (default-test): linux-jdk7-m3.5.x_build/target/surefire-reports/*.xml
Recording test results
[withMaven] openTasksPublisher - Scan Tasks for Maven artifact org.apache.maven.plugins:maven-invoker-plugin:maven-plugin:3.1.1-SNAPSHOT in source directory linux-jdk7-m3.5.x_build/src/main/java
[TASKS] Scanning folder '/home/jenkins/jenkins-slave/workspace/-box_maven-invoker-plugin_master@2' for files matching the pattern 'linux-jdk7-m3.5.x_build/src/main/java/**/*' - excludes: null
[TASKS] Found 17 files to scan for tasks
[TASKS] Found 7 open tasks.
Skipping warnings blame since pipelines do not have an SCM link.%n
[TASKS] Computing warning deltas based on reference build #51
[withMaven] invokerPublisher - Archive invoker results for Maven artifact MavenArtifact{org.apache.maven.plugins:maven-invoker-plugin:maven-plugin:3.1.1-SNAPSHOT(version: 3.1.1-SNAPSHOT, snapshot:false) } generated by PluginInvocation{org.apache.maven.plugins:maven-invoker-plugin:3.0.1@integration-test  integration-test}: linux-jdk7-m3.5.x_build/target/invoker-reports/*.xml
[withMaven] Publishers: Generated Artifacts Publisher: 1126 ms, Junit Publisher: 2497 ms, Open Task Scanner Publisher: 700 ms, Invoker Publisher: 64933 ms, Pipeline Graph Publisher: 1 ms
[Pipeline] // withMaven
[Pipeline] }
[Pipeline] // stage
[Pipeline] }
[Pipeline] // ws
[Pipeline] }
[Pipeline] // node
[Pipeline] }
[withMaven] Publishers: Generated Artifacts Publisher: 1149 ms, Junit Publisher: 2503 ms, Open Task Scanner Publisher: 699 ms, Invoker Publisher: 96569 ms, Pipeline Graph Publisher: 1 ms
[Pipeline] // withMaven
[Pipeline] }
[Pipeline] // stage
[Pipeline] }
[Pipeline] // ws
[Pipeline] }
[Pipeline] // node
[Pipeline] }
[withMaven] Publishers: Generated Artifacts Publisher: 1142 ms, Junit Publisher: 2508 ms, Open Task Scanner Publisher: 708 ms, Invoker Publisher: 100202 ms, Pipeline Graph Publisher: 1 ms
[Pipeline] // withMaven
[Pipeline] }
[Pipeline] // stage
[Pipeline] }
[Pipeline] // ws
[Pipeline] }
[Pipeline] // node
[Pipeline] }
[withMaven] Publishers: Generated Artifacts Publisher: 1236 ms, Junit Publisher: 2485 ms, Open Task Scanner Publisher: 683 ms, Invoker Publisher: 96077 ms, Pipeline Graph Publisher: 1 ms
[Pipeline] // withMaven
[Pipeline] }
[Pipeline] // stage
[Pipeline] }
[Pipeline] // ws
[Pipeline] }
[Pipeline] // node
[Pipeline] }
[INFO]           MINVOKER-191\pom.xml ............................. SUCCESS (909.4 s)
[INFO] Building: MINVOKER-243_install-reactor\pom.xml
[INFO] run post-build script verify.groovy
[INFO]           MINVOKER-243_install-reactor\pom.xml ............. SUCCESS (5.5 s)
[INFO] Building: multiEnvVar\pom.xml
[INFO]           multiEnvVar\pom.xml .............................. SUCCESS (9.2 s)
[INFO] Building: not-clone-not-plugin\pom.xml
[INFO] run post-build script verify.bsh
[INFO]           not-clone-not-plugin\pom.xml ..................... SUCCESS (7.2 s)
[INFO] Building: pom-filtering\pom.xml
[INFO] run post-build script verify.bsh
[INFO]           pom-filtering\pom.xml ............................ SUCCESS (7.9 s)
[INFO] Building: pom-filtering-encoding\pom.xml
[INFO] run post-build script verify.bsh
[INFO]           pom-filtering-encoding\pom.xml ................... SUCCESS (10.5 s)
[INFO] Building: pom-filtering-reactor\pom.xml
[INFO] run post-build script verify.bsh
[INFO]           pom-filtering-reactor\pom.xml .................... SUCCESS (7.1 s)
[INFO] Building: pom-less-invocation\pom.xml
[INFO] run post-build script verify.bsh
[INFO]           pom-less-invocation\pom.xml ...................... SUCCESS (4.9 s)
[INFO] Building: postbuild-executed-only-once\pom.xml
[INFO] run post-build script verify.bsh
[INFO]           postbuild-executed-only-once\pom.xml ............. SUCCESS (18.4 s)
[INFO] Building: project-cloning\pom.xml
[INFO] run pre-build script setup.bsh
[INFO] run post-build script verify.bsh
[INFO]           project-cloning\pom.xml .......................... SUCCESS (13.0 s)
[INFO] Building: project-cloning-reactor\pom.xml
[INFO] run post-build script verify.bsh
[INFO]           project-cloning-reactor\pom.xml .................. SUCCESS (7.5 s)
[INFO] Building: project-setup\pom.xml
[INFO] run post-build script verify.bsh
[INFO]           project-setup\pom.xml ............................ SUCCESS (18.7 s)
[INFO] Building: script-accessibility\pom.xml
[INFO]           script-accessibility\pom.xml ..................... SUCCESS (12.7 s)
[INFO] Building: script-additional-vars\pom.xml
[INFO]           script-additional-vars\pom.xml ................... SUCCESS (11.0 s)
[INFO] Building: script-class-loading\pom.xml
[INFO]           script-class-loading\pom.xml ..................... SUCCESS (12.8 s)
[INFO] Building: script-classpath-duplicates\pom.xml
[INFO] run post-build script verify.bsh
[INFO]           script-classpath-duplicates\pom.xml .............. SUCCESS (11.1 s)
[INFO] Building: script-context\pom.xml
[INFO] run post-build script verify.bsh
[INFO]           script-context\pom.xml ........................... SUCCESS (11.1 s)
[INFO] Building: script-errors\pom.xml
[INFO] run post-build script verify.bsh
[INFO]           script-errors\pom.xml ............................ SUCCESS (5.7 s)
[INFO] Building: script-global-vars\pom.xml
[INFO]           script-global-vars\pom.xml ....................... SUCCESS (11.2 s)
[INFO] Building: script-interpreter-detection\pom.xml
[INFO] run post-build script verify.bsh
[INFO]           script-interpreter-detection\pom.xml ............. SUCCESS (11.4 s)
[INFO] Building: script-verify-xml\pom.xml
[INFO] run post-build script verify.groovy
[INFO]           script-verify-xml\pom.xml ........................ SUCCESS (4.6 s)
[INFO] Building: selector-conditions\pom.xml
[INFO] run post-build script verify.groovy
[INFO]           selector-conditions\pom.xml ...................... SUCCESS (13.2 s)
[INFO] Building: selector-scripts\pom.xml
[INFO] run pre-build script setup.groovy
[INFO] run post-build script verify.bsh
[INFO]           selector-scripts\pom.xml ......................... SUCCESS (10.6 s)
[INFO] Building: settings-auto-exclude\pom.xml
[INFO]           settings-auto-exclude\pom.xml .................... SUCCESS (7.2 s)
[INFO] Building: settings-inherit\pom.xml
[INFO]           settings-inherit\pom.xml ......................... SUCCESS (9.3 s)
[INFO] Building: settings-merge\pom.xml
[INFO]           settings-merge\pom.xml ........................... SKIPPED due to JRE version
[INFO] Building: settings-merge-multiexecutions\pom.xml
[INFO]           settings-merge-multiexecutions\pom.xml ........... SUCCESS (12.5 s)
[INFO] Building: settings-merge_jdk9+\pom.xml
[INFO]           settings-merge_jdk9+\pom.xml ..................... SUCCESS (11.1 s)
[INFO] Building: settings-override\pom.xml
[INFO]           settings-override\pom.xml ........................ SUCCESS (8.9 s)
[INFO] Building: skip-install\pom.xml
[INFO] run post-build script verify.bsh
[INFO]           skip-install\pom.xml ............................. SUCCESS (4.2 s)
[INFO] Building: skip-run\pom.xml
[INFO] run post-build script verify.bsh
[INFO]           skip-run\pom.xml ................................. SUCCESS (4.2 s)
[INFO] Building: spaces-should-work_non-windows\pom.xml
[INFO]           spaces-should-work_non-windows\pom.xml ........... SKIPPED due to OS
[INFO] Building: spaces-should-work_windows\pom.xml
[INFO] run pre-build script setup.groovy
[INFO]           spaces-should-work_windows\pom.xml ............... SUCCESS (8.8 s)
[INFO] Building: special-characters-should-work\pom.xml
[INFO] run pre-build script setup.groovy
[INFO]           special-characters-should-work\pom.xml ........... SUCCESS (8.7 s)
[INFO] Building: staging-dependencies\pom.xml
[INFO] run post-build script verify.bsh
[INFO]           staging-dependencies\pom.xml ..................... SUCCESS (7.3 s)
[INFO] Building: staging-pom\pom.xml
[INFO] run post-build script verify.bsh
[INFO]           staging-pom\pom.xml .............................. SUCCESS (4.3 s)
[INFO] Building: staging-reactor\pom.xml
[INFO] run post-build script verify.bsh
[INFO]           staging-reactor\pom.xml .......................... SUCCESS (6.6 s)
[INFO] Building: wrongPropertyInterpolation\pom.xml
[INFO]           wrongPropertyInterpolation\pom.xml ............... SUCCESS (16.2 s)
[INFO]
[INFO] --- maven-checkstyle-plugin:3.0.0:check (checkstyle-check) @ maven-invoker-plugin ---
[INFO] There are 4 errors reported by Checkstyle 6.18 with config/maven_checks.xml ruleset.
[INFO] Ignored 4 errors, 0 violation remaining.
[INFO]
[INFO] --- maven-invoker-plugin:3.0.1:verify (integration-test) @ maven-invoker-plugin ---
[INFO] -------------------------------------------------
[INFO] Build Summary:
[INFO]   Passed: 69, Failed: 0, Errors: 0, Skipped: 2
[INFO] -------------------------------------------------
[INFO] ------------------------------------------------------------------------
[INFO] BUILD SUCCESS
[INFO] ------------------------------------------------------------------------
[INFO] Total time: 26:47 min
[INFO] Finished at: 2019-01-12T13:10:15Z
[INFO] Final Memory: 46M/164M
[INFO] ------------------------------------------------------------------------
[INFO] [jenkins-event-spy] Generated F:\jenkins\jenkins-slave\workspace\-box_maven-invoker-plugin_master@3@tmp\withMaven354360ca\maven-spy-20190112-124327-3217721169597887435973.log
[Pipeline] }
[Pipeline] // dir
[Pipeline] }
[withMaven] artifactsPublisher - Archive artifact windows-jdk11-m3.5.x_build\pom.xml under org\apache\maven\plugins\maven-invoker-plugin\3.1.1-SNAPSHOT\maven-invoker-plugin-3.1.1-SNAPSHOT.pom
[withMaven] artifactsPublisher - Archive artifact windows-jdk11-m3.5.x_build\target\maven-invoker-plugin-3.1.1-SNAPSHOT.jar under org\apache\maven\plugins\maven-invoker-plugin\3.1.1-SNAPSHOT\maven-invoker-plugin-3.1.1-SNAPSHOT.jar
[withMaven] junitPublisher - Archive test results for Maven artifact org.apache.maven.plugins:maven-invoker-plugin:maven-plugin:3.1.1-SNAPSHOT generated by maven-surefire-plugin:test (default-test): windows-jdk11-m3.5.x_build\target\surefire-reports\*.xml
Recording test results
[withMaven] openTasksPublisher - Scan Tasks for Maven artifact org.apache.maven.plugins:maven-invoker-plugin:maven-plugin:3.1.1-SNAPSHOT in source directory windows-jdk11-m3.5.x_build\src\main\java
[TASKS] Scanning folder 'f:\jenkins\jenkins-slave\workspace\-box_maven-invoker-plugin_master@3' for files matching the pattern 'windows-jdk11-m3.5.x_build\src\main\java\**\*' - excludes: null
[TASKS] Found 17 files to scan for tasks
[TASKS] Found 7 open tasks.
Skipping warnings blame since pipelines do not have an SCM link.%n
[TASKS] Computing warning deltas based on reference build #51
[withMaven] invokerPublisher - Archive invoker results for Maven artifact MavenArtifact{org.apache.maven.plugins:maven-invoker-plugin:maven-plugin:3.1.1-SNAPSHOT(version: 3.1.1-SNAPSHOT, snapshot:false) } generated by PluginInvocation{org.apache.maven.plugins:maven-invoker-plugin:3.0.1@integration-test  integration-test}: windows-jdk11-m3.5.x_build\target\invoker-reports\*.xml
[withMaven] Publishers: Generated Artifacts Publisher: 262 ms, Junit Publisher: 392 ms, Open Task Scanner Publisher: 181 ms, Invoker Publisher: 45166 ms, Pipeline Graph Publisher: 16 ms
[Pipeline] // withMaven
[Pipeline] }
[Pipeline] // stage
[Pipeline] }
[Pipeline] // ws
[Pipeline] }
[Pipeline] // node
[Pipeline] }
[Pipeline] // parallel
[Pipeline] stage
[Pipeline] { (Notifications)
[Pipeline] echo
Build result: FAILURE
[Pipeline] jiraIssueSelector
[Pipeline] jiraComment
[Pipeline] emailext
Reply | Threaded
Open this post in threaded view
|

Build succeeded in Jenkins: Maven TLP » maven-invoker-plugin » master #55

Apache Jenkins Server-2
See https://builds.apache.org/job/maven-box/job/maven-invoker-plugin/job/master/55/

Changes:

* INFRA-17514, lock to 1 Windows node
* Cause found, back to all Windows nodes
* INFRA-17514 testing if this invoker keeps locks on the files.
* INFRA-17514 disable invokerPublisher() This is the root cause for the

All tests passed