Build failed in Jenkins: Maven TLP » maven-invoker-plugin » master #19

classic Classic list List threaded Threaded
3 messages Options
Reply | Threaded
Open this post in threaded view
|

Build failed in Jenkins: Maven TLP » maven-invoker-plugin » master #19

Apache Jenkins Server-2
See https://builds.apache.org/job/maven-box/job/maven-invoker-plugin/job/master/19/

Changes:

* [MINVOKER-249] InstallMojo extraArtifacts are always downloaded
* [MINVOKER-249] InstallMojo extraArtifacts are always downloaded
* [MINVOKER-249] InstallMojo extraArtifacts are always downloaded
* [MINVOKER-249] InstallMojo extraArtifacts are always downloaded
* [MINVOKER-249] InstallMojo extraArtifacts are always downloaded
* [MINVOKER-249] InstallMojo extraArtifacts are always downloaded
* [MINVOKER-249] InstallMojo extraArtifacts are always downloaded
* [MINVOKER-249] InstallMojo extraArtifacts are always downloaded
* [MINVOKER-249] InstallMojo extraArtifacts are always downloaded
* [MINVOKER-249] InstallMojo extraArtifacts are always downloaded
* [MINVOKER-249] InstallMojo extraArtifacts are always downloaded

All tests passed

Build log:
[...truncated 8492 lines...]
[ERROR] For more information about the errors and possible solutions, please read the following articles:
[ERROR] [Help 1] http://cwiki.apache.org/confluence/display/MAVEN/MojoFailureException
[Pipeline] }
[Pipeline] // dir
[Pipeline] }
[withMaven] junitPublisher - Archive test results for Maven artifact org.apache.maven.plugins:maven-invoker-plugin:maven-plugin:3.2.1-SNAPSHOT generated by maven-surefire-plugin:test (default-test): linux-jdk12-m3.6.x_build/target/surefire-reports/*.xml
Recording test results
[withMaven] openTasksPublisher - Scan Tasks for Maven artifact org.apache.maven.plugins:maven-invoker-plugin:maven-plugin:3.2.1-SNAPSHOT in source directory linux-jdk12-m3.6.x_build/src/main/java
[TASKS] Scanning folder '/home/jenkins/jenkins-slave/workspace/-box_maven-invoker-plugin_master@2' for files matching the pattern 'linux-jdk12-m3.6.x_build/src/main/java/**/*' - excludes: null
[TASKS] Found 17 files to scan for tasks
[TASKS] Found 8 open tasks.
Skipping warnings blame since pipelines do not have an SCM link.%n
[TASKS] Computing warning deltas based on reference build #18
[withMaven] invokerPublisher - Archive invoker results for Maven artifact MavenArtifact{org.apache.maven.plugins:maven-invoker-plugin:maven-plugin:3.2.1-SNAPSHOT(version: 3.2.1-SNAPSHOT, snapshot:false) } generated by PluginInvocation{org.apache.maven.plugins:maven-invoker-plugin:3.2.0@integration-test  integration-test}: linux-jdk12-m3.6.x_build/target/invoker-reports/*.xml
[withMaven] Publishers: Generated Artifacts Publisher: 310 ms, Junit Publisher: 2535 ms, Open Task Scanner Publisher: 877 ms, Invoker Publisher: 72785 ms
[Pipeline] // withMaven
[Pipeline] cleanWs
[WS-CLEANUP] Deleting project workspace...
[WS-CLEANUP] Deferred wipeout is used...
[WS-CLEANUP] done
[Pipeline] cleanWs
[WS-CLEANUP] Deleting project workspace...
[WS-CLEANUP] Deferred wipeout is used...
[WS-CLEANUP] done
[Pipeline] }
[Pipeline] // stage
[Pipeline] }
[Pipeline] // ws
[Pipeline] }
[Pipeline] // node
[Pipeline] }
Failed in branch linux-jdk12-m3.6.x_build
[INFO]           MINVOKER-191\pom.xml ............................. SUCCESS (905.6 s)
[INFO] Building: MINVOKER-196_junit_report_file\pom.xml
[INFO] run post-build script verify.groovy
[INFO]           MINVOKER-196_junit_report_file\pom.xml ........... SUCCESS (8.1 s)
[INFO] Building: MINVOKER-243_install-reactor\pom.xml
[INFO] run post-build script verify.groovy
[INFO]           MINVOKER-243_install-reactor\pom.xml ............. SUCCESS (4.4 s)
[INFO] Building: multiEnvVar\pom.xml
[INFO]           multiEnvVar\pom.xml .............................. SUCCESS (6.9 s)
[INFO] Building: not-clone-not-plugin\pom.xml
[INFO] run post-build script verify.bsh
[INFO]           not-clone-not-plugin\pom.xml ..................... SUCCESS (5.0 s)
[INFO] Building: pom-filtering\pom.xml
[INFO] run post-build script verify.bsh
[INFO]           pom-filtering\pom.xml ............................ SUCCESS (4.5 s)
[INFO] Building: pom-filtering-encoding\pom.xml
[INFO] run post-build script verify.bsh
[INFO]           pom-filtering-encoding\pom.xml ................... SUCCESS (7.0 s)
[INFO] Building: pom-filtering-reactor\pom.xml
[INFO] run post-build script verify.bsh
[INFO]           pom-filtering-reactor\pom.xml .................... SUCCESS (4.9 s)
[INFO] Building: pom-less-invocation\pom.xml
[INFO] run post-build script verify.bsh
[INFO]           pom-less-invocation\pom.xml ...................... SUCCESS (3.5 s)
[INFO] Building: postbuild-executed-only-once\pom.xml
[INFO] run post-build script verify.bsh
[INFO]           postbuild-executed-only-once\pom.xml ............. SUCCESS (16.0 s)
[INFO] Building: project-cloning\pom.xml
[INFO] run pre-build script setup.bsh
[INFO] run post-build script verify.bsh
[INFO]           project-cloning\pom.xml .......................... SUCCESS (8.4 s)
[INFO] Building: project-cloning-reactor\pom.xml
[INFO] run post-build script verify.bsh
[INFO]           project-cloning-reactor\pom.xml .................. SUCCESS (4.8 s)
[INFO] Building: project-setup\pom.xml
[INFO] run post-build script verify.bsh
[INFO]           project-setup\pom.xml ............................ SUCCESS (11.3 s)
[INFO] Building: script-accessibility\pom.xml
[INFO]           script-accessibility\pom.xml ..................... SUCCESS (7.8 s)
[INFO] Building: script-additional-vars\pom.xml
[INFO]           script-additional-vars\pom.xml ................... SUCCESS (7.3 s)
[INFO] Building: script-class-loading\pom.xml
[INFO]           script-class-loading\pom.xml ..................... SUCCESS (8.5 s)
[INFO] Building: script-classpath-duplicates\pom.xml
[INFO] run post-build script verify.bsh
[INFO]           script-classpath-duplicates\pom.xml .............. SUCCESS (8.2 s)
[INFO] Building: script-context\pom.xml
[INFO] run post-build script verify.bsh
[INFO]           script-context\pom.xml ........................... SUCCESS (7.5 s)
[INFO] Building: script-errors\pom.xml
[INFO] run post-build script verify.bsh
[INFO]           script-errors\pom.xml ............................ SUCCESS (3.5 s)
[INFO] Building: script-global-vars\pom.xml
[INFO]           script-global-vars\pom.xml ....................... SUCCESS (7.3 s)
[INFO] Building: script-interpreter-detection\pom.xml
[INFO] run post-build script verify.bsh
[INFO]           script-interpreter-detection\pom.xml ............. SUCCESS (7.7 s)
[INFO] Building: script-verify-xml\pom.xml
[INFO] run post-build script verify.groovy
[INFO]           script-verify-xml\pom.xml ........................ SUCCESS (2.9 s)
[INFO] Building: selector-conditions\pom.xml
[INFO] run post-build script verify.groovy
[INFO]           selector-conditions\pom.xml ...................... SUCCESS (9.3 s)
[INFO] Building: selector-scripts\pom.xml
[INFO] run pre-build script setup.groovy
[INFO] run post-build script verify.bsh
[INFO]           selector-scripts\pom.xml ......................... SUCCESS (6.8 s)
[INFO] Building: settings-auto-exclude\pom.xml
[INFO]           settings-auto-exclude\pom.xml .................... SUCCESS (5.3 s)
[INFO] Building: settings-inherit\pom.xml
[INFO]           settings-inherit\pom.xml ......................... SUCCESS (6.1 s)
[INFO] Building: settings-merge\pom.xml
[INFO]           settings-merge\pom.xml ........................... SUCCESS (11.9 s)
[INFO] Building: settings-merge-multiexecutions\pom.xml
[INFO]           settings-merge-multiexecutions\pom.xml ........... SUCCESS (8.4 s)
[INFO] Building: settings-merge_jdk9+\pom.xml
[INFO]           settings-merge_jdk9+\pom.xml ..................... SUCCESS (9.5 s)
[INFO] Building: settings-override\pom.xml
[INFO]           settings-override\pom.xml ........................ SUCCESS (6.3 s)
[INFO] Building: skip-install\pom.xml
[INFO] run post-build script verify.bsh
[INFO]           skip-install\pom.xml ............................. SUCCESS (3.1 s)
[INFO] Building: skip-run\pom.xml
[INFO] run post-build script verify.bsh
[INFO]           skip-run\pom.xml ................................. SUCCESS (2.8 s)
[INFO] Building: spaces-should-work_non-windows\pom.xml
[INFO]           spaces-should-work_non-windows\pom.xml ........... SKIPPED due to OS
[INFO] Building: spaces-should-work_windows\pom.xml
[INFO] run pre-build script setup.groovy
[INFO]           spaces-should-work_windows\pom.xml ............... SUCCESS (5.9 s)
[INFO] Building: special-characters-should-work\pom.xml
[INFO] run pre-build script setup.groovy
[INFO]           special-characters-should-work\pom.xml ........... SUCCESS (6.0 s)
[INFO] Building: staging-dependencies\pom.xml
[INFO] run post-build script verify.bsh
[INFO]           staging-dependencies\pom.xml ..................... SUCCESS (6.8 s)
[INFO] Building: staging-pom\pom.xml
[INFO] run post-build script verify.bsh
[INFO]           staging-pom\pom.xml .............................. SUCCESS (2.6 s)
[INFO] Building: staging-reactor\pom.xml
[INFO] run post-build script verify.bsh
[INFO]           staging-reactor\pom.xml .......................... SUCCESS (6.3 s)
[INFO] Building: wrongPropertyInterpolation\pom.xml
[INFO]           wrongPropertyInterpolation\pom.xml ............... SUCCESS (19.8 s)
[INFO]
[INFO] --- maven-checkstyle-plugin:3.0.0:check (checkstyle-check) @ maven-invoker-plugin ---
[INFO] There are 4 errors reported by Checkstyle 6.18 with config/maven_checks.xml ruleset.
[INFO] Ignored 4 errors, 0 violation remaining.
[INFO]
[INFO] --- maven-invoker-plugin:3.2.0:verify (integration-test) @ maven-invoker-plugin ---
[INFO] -------------------------------------------------
[INFO] Build Summary:
[INFO]   Passed: 71, Failed: 1, Errors: 0, Skipped: 1
[INFO] -------------------------------------------------
[ERROR] The following builds failed:
[ERROR] *  install-extra-artifacts-local-repo\pom.xml
[INFO] -------------------------------------------------
[INFO] ------------------------------------------------------------------------
[INFO] BUILD FAILURE
[INFO] ------------------------------------------------------------------------
[INFO] Total time: 25:53 min
[INFO] Finished at: 2019-07-26T00:22:59-07:00
[INFO] Final Memory: 62M/1186M
[INFO] ------------------------------------------------------------------------
[INFO] [jenkins-event-spy] Generated F:\jenkins\jenkins-slave\workspace\-box_maven-invoker-plugin_master@3@2@tmp\withMaven96fb0b6f\maven-spy-20190725-235705-7254067986293380070415.log
[ERROR] Failed to execute goal org.apache.maven.plugins:maven-invoker-plugin:3.2.0:verify (integration-test) on project maven-invoker-plugin: 1 build failed. See console output above for details. -> [Help 1]
org.apache.maven.lifecycle.LifecycleExecutionException: Failed to execute goal org.apache.maven.plugins:maven-invoker-plugin:3.2.0:verify (integration-test) on project maven-invoker-plugin: 1 build failed. See console output above for details.
    at org.apache.maven.lifecycle.internal.MojoExecutor.execute (MojoExecutor.java:213)
    at org.apache.maven.lifecycle.internal.MojoExecutor.execute (MojoExecutor.java:154)
    at org.apache.maven.lifecycle.internal.MojoExecutor.execute (MojoExecutor.java:146)
    at org.apache.maven.lifecycle.internal.LifecycleModuleBuilder.buildProject (LifecycleModuleBuilder.java:117)
    at org.apache.maven.lifecycle.internal.LifecycleModuleBuilder.buildProject (LifecycleModuleBuilder.java:81)
    at org.apache.maven.lifecycle.internal.builder.singlethreaded.SingleThreadedBuilder.build (SingleThreadedBuilder.java:51)
    at org.apache.maven.lifecycle.internal.LifecycleStarter.execute (LifecycleStarter.java:128)
    at org.apache.maven.DefaultMaven.doExecute (DefaultMaven.java:309)
    at org.apache.maven.DefaultMaven.doExecute (DefaultMaven.java:194)
    at org.apache.maven.DefaultMaven.execute (DefaultMaven.java:107)
    at org.apache.maven.cli.MavenCli.execute (MavenCli.java:955)
    at org.apache.maven.cli.MavenCli.doMain (MavenCli.java:290)
    at org.apache.maven.cli.MavenCli.main (MavenCli.java:194)
    at sun.reflect.NativeMethodAccessorImpl.invoke0 (Native Method)
    at sun.reflect.NativeMethodAccessorImpl.invoke (NativeMethodAccessorImpl.java:57)
    at sun.reflect.DelegatingMethodAccessorImpl.invoke (DelegatingMethodAccessorImpl.java:43)
    at java.lang.reflect.Method.invoke (Method.java:606)
    at org.codehaus.plexus.classworlds.launcher.Launcher.launchEnhanced (Launcher.java:289)
    at org.codehaus.plexus.classworlds.launcher.Launcher.launch (Launcher.java:229)
    at org.codehaus.plexus.classworlds.launcher.Launcher.mainWithExitCode (Launcher.java:415)
    at org.codehaus.plexus.classworlds.launcher.Launcher.main (Launcher.java:356)
Caused by: org.apache.maven.plugin.MojoFailureException: 1 build failed. See console output above for details.
    at org.apache.maven.plugins.invoker.InvokerSession.handleFailures (InvokerSession.java:260)
    at org.apache.maven.plugins.invoker.VerifyMojo.execute (VerifyMojo.java:140)
    at org.apache.maven.plugin.DefaultBuildPluginManager.executeMojo (DefaultBuildPluginManager.java:134)
    at org.apache.maven.lifecycle.internal.MojoExecutor.execute (MojoExecutor.java:208)
    at org.apache.maven.lifecycle.internal.MojoExecutor.execute (MojoExecutor.java:154)
    at org.apache.maven.lifecycle.internal.MojoExecutor.execute (MojoExecutor.java:146)
    at org.apache.maven.lifecycle.internal.LifecycleModuleBuilder.buildProject (LifecycleModuleBuilder.java:117)
    at org.apache.maven.lifecycle.internal.LifecycleModuleBuilder.buildProject (LifecycleModuleBuilder.java:81)
    at org.apache.maven.lifecycle.internal.builder.singlethreaded.SingleThreadedBuilder.build (SingleThreadedBuilder.java:51)
    at org.apache.maven.lifecycle.internal.LifecycleStarter.execute (LifecycleStarter.java:128)
    at org.apache.maven.DefaultMaven.doExecute (DefaultMaven.java:309)
    at org.apache.maven.DefaultMaven.doExecute (DefaultMaven.java:194)
    at org.apache.maven.DefaultMaven.execute (DefaultMaven.java:107)
    at org.apache.maven.cli.MavenCli.execute (MavenCli.java:955)
    at org.apache.maven.cli.MavenCli.doMain (MavenCli.java:290)
    at org.apache.maven.cli.MavenCli.main (MavenCli.java:194)
    at sun.reflect.NativeMethodAccessorImpl.invoke0 (Native Method)
    at sun.reflect.NativeMethodAccessorImpl.invoke (NativeMethodAccessorImpl.java:57)
    at sun.reflect.DelegatingMethodAccessorImpl.invoke (DelegatingMethodAccessorImpl.java:43)
    at java.lang.reflect.Method.invoke (Method.java:606)
    at org.codehaus.plexus.classworlds.launcher.Launcher.launchEnhanced (Launcher.java:289)
    at org.codehaus.plexus.classworlds.launcher.Launcher.launch (Launcher.java:229)
    at org.codehaus.plexus.classworlds.launcher.Launcher.mainWithExitCode (Launcher.java:415)
    at org.codehaus.plexus.classworlds.launcher.Launcher.main (Launcher.java:356)
[ERROR]
[ERROR] Re-run Maven using the -X switch to enable full debug logging.
[ERROR]
[ERROR] For more information about the errors and possible solutions, please read the following articles:
[ERROR] [Help 1] http://cwiki.apache.org/confluence/display/MAVEN/MojoFailureException
Picked up JAVA_TOOL_OPTIONS: -Dmaven.ext.class.path="f:\jenkins\jenkins-slave\workspace\-box_maven-invoker-plugin_master@3@2@tmp\withMaven96fb0b6f\pipeline-maven-spy.jar" -Dorg.jenkinsci.plugins.pipeline.maven.reportsFolder="f:\jenkins\jenkins-slave\workspace\-box_maven-invoker-plugin_master@3@2@tmp\withMaven96fb0b6f"
[Pipeline] }
[Pipeline] // dir
[Pipeline] }
[withMaven] junitPublisher - Archive test results for Maven artifact org.apache.maven.plugins:maven-invoker-plugin:maven-plugin:3.2.1-SNAPSHOT generated by maven-surefire-plugin:test (default-test): windows-jdk7-m3.5.x_build\target\surefire-reports\*.xml
Recording test results
[withMaven] openTasksPublisher - Scan Tasks for Maven artifact org.apache.maven.plugins:maven-invoker-plugin:maven-plugin:3.2.1-SNAPSHOT in source directory windows-jdk7-m3.5.x_build\src\main\java
[TASKS] Scanning folder 'f:\jenkins\jenkins-slave\workspace\-box_maven-invoker-plugin_master@3@2' for files matching the pattern 'windows-jdk7-m3.5.x_build\src\main\java\**\*' - excludes: null
[TASKS] Found 17 files to scan for tasks
[TASKS] Found 8 open tasks.
Skipping warnings blame since pipelines do not have an SCM link.%n
[TASKS] Computing warning deltas based on reference build #18
[withMaven] invokerPublisher - Archive invoker results for Maven artifact MavenArtifact{org.apache.maven.plugins:maven-invoker-plugin:maven-plugin:3.2.1-SNAPSHOT(version: 3.2.1-SNAPSHOT, snapshot:false) } generated by PluginInvocation{org.apache.maven.plugins:maven-invoker-plugin:3.2.0@integration-test  integration-test}: windows-jdk7-m3.5.x_build\target\invoker-reports\*.xml
[withMaven] Publishers: Generated Artifacts Publisher: 12 ms, Junit Publisher: 154 ms, Open Task Scanner Publisher: 120 ms, Invoker Publisher: 29259 ms
[Pipeline] // withMaven
[Pipeline] cleanWs
[WS-CLEANUP] Deleting project workspace...
[WS-CLEANUP] Deferred wipeout is used...
[WS-CLEANUP] done
[Pipeline] cleanWs
[WS-CLEANUP] Deleting project workspace...
[WS-CLEANUP] Deferred wipeout is used...
[WS-CLEANUP] done
[Pipeline] }
[Pipeline] // stage
[Pipeline] }
[Pipeline] // ws
[Pipeline] }
[Pipeline] // node
[Pipeline] }
Failed in branch windows-jdk7-m3.5.x_build
[Pipeline] // parallel
[Pipeline] stage
[Pipeline] { (Notifications)
[Pipeline] echo
Build result: FAILURE
[Pipeline] jiraIssueSelector
[Pipeline] jiraComment
[Pipeline] emailext
Reply | Threaded
Open this post in threaded view
|

Build failed in Jenkins: Maven TLP » maven-invoker-plugin » master #20

Apache Jenkins Server-2
See https://builds.apache.org/job/maven-box/job/maven-invoker-plugin/job/master/20/

Changes:

* download this pom first locally as we use it in the extra artifacts
* download this pom first locally as we use it in the extra artifacts
* download this pom first locally as we use it in the extra artifacts
* download this pom first locally as we use it in the extra artifacts
* download this pom first locally as we use it in the extra artifacts
* download this pom first locally as we use it in the extra artifacts
* download this pom first locally as we use it in the extra artifacts
* download this pom first locally as we use it in the extra artifacts
* download this pom first locally as we use it in the extra artifacts
* download this pom first locally as we use it in the extra artifacts
* download this pom first locally as we use it in the extra artifacts
* download this pom first locally as we use it in the extra artifacts
* download this pom first locally as we use it in the extra artifacts
* download this pom first locally as we use it in the extra artifacts
* download this pom first locally as we use it in the extra artifacts
* download this pom first locally as we use it in the extra artifacts

All tests passed

Build log:
[...truncated 8480 lines...]
[WS-CLEANUP] Deleting project workspace...
[WS-CLEANUP] Deferred wipeout is used...
[WS-CLEANUP] done
[Pipeline] cleanWs
[WS-CLEANUP] Deleting project workspace...
[WS-CLEANUP] Deferred wipeout is used...
[WS-CLEANUP] done
[Pipeline] }
[Pipeline] // stage
[Pipeline] }
[Pipeline] // ws
[Pipeline] }
[Pipeline] // node
[Pipeline] }
Failed in branch windows-jdk12-m3.6.x_build
[withMaven] Publishers: Generated Artifacts Publisher: 12 ms, Junit Publisher: 125 ms, Open Task Scanner Publisher: 109 ms, Invoker Publisher: 32160 ms
[Pipeline] // withMaven
[Pipeline] cleanWs
[WS-CLEANUP] Deleting project workspace...
[WS-CLEANUP] Deferred wipeout is used...
[WS-CLEANUP] done
[Pipeline] cleanWs
[WS-CLEANUP] Deleting project workspace...
[WS-CLEANUP] Deferred wipeout is used...
[WS-CLEANUP] done
[Pipeline] }
[Pipeline] // stage
[Pipeline] }
[Pipeline] // ws
[Pipeline] }
[Pipeline] // node
[Pipeline] }
Failed in branch windows-jdk11-m3.6.x_build
[INFO]           MINVOKER-191\pom.xml ............................. SUCCESS (906.0 s)
[INFO] Building: MINVOKER-196_junit_report_file\pom.xml
[INFO] run post-build script verify.groovy
[INFO]           MINVOKER-196_junit_report_file\pom.xml ........... SUCCESS (9.2 s)
[INFO] Building: MINVOKER-243_install-reactor\pom.xml
[INFO] run post-build script verify.groovy
[INFO]           MINVOKER-243_install-reactor\pom.xml ............. SUCCESS (5.4 s)
[INFO] Building: multiEnvVar\pom.xml
[INFO]           multiEnvVar\pom.xml .............................. SUCCESS (8.8 s)
[INFO] Building: not-clone-not-plugin\pom.xml
[INFO] run post-build script verify.bsh
[INFO]           not-clone-not-plugin\pom.xml ..................... SUCCESS (6.7 s)
[INFO] Building: pom-filtering\pom.xml
[INFO] run post-build script verify.bsh
[INFO]           pom-filtering\pom.xml ............................ SUCCESS (7.3 s)
[INFO] Building: pom-filtering-encoding\pom.xml
[INFO] run post-build script verify.bsh
[INFO]           pom-filtering-encoding\pom.xml ................... SUCCESS (9.6 s)
[INFO] Building: pom-filtering-reactor\pom.xml
[INFO] run post-build script verify.bsh
[INFO]           pom-filtering-reactor\pom.xml .................... SUCCESS (6.4 s)
[INFO] Building: pom-less-invocation\pom.xml
[INFO] run post-build script verify.bsh
[INFO]           pom-less-invocation\pom.xml ...................... SUCCESS (4.5 s)
[INFO] Building: postbuild-executed-only-once\pom.xml
[INFO] run post-build script verify.bsh
[INFO]           postbuild-executed-only-once\pom.xml ............. SUCCESS (18.1 s)
[INFO] Building: project-cloning\pom.xml
[INFO] run pre-build script setup.bsh
[INFO] run post-build script verify.bsh
[INFO]           project-cloning\pom.xml .......................... SUCCESS (11.1 s)
[INFO] Building: project-cloning-reactor\pom.xml
[INFO] run post-build script verify.bsh
[INFO]           project-cloning-reactor\pom.xml .................. SUCCESS (5.7 s)
[INFO] Building: project-setup\pom.xml
[INFO] run post-build script verify.bsh
[INFO]           project-setup\pom.xml ............................ SUCCESS (15.6 s)
[INFO] Building: script-accessibility\pom.xml
[INFO]           script-accessibility\pom.xml ..................... SUCCESS (10.5 s)
[INFO] Building: script-additional-vars\pom.xml
[INFO]           script-additional-vars\pom.xml ................... SUCCESS (9.7 s)
[INFO] Building: script-class-loading\pom.xml
[INFO]           script-class-loading\pom.xml ..................... SUCCESS (11.0 s)
[INFO] Building: script-classpath-duplicates\pom.xml
[INFO] run post-build script verify.bsh
[INFO]           script-classpath-duplicates\pom.xml .............. SUCCESS (10.0 s)
[INFO] Building: script-context\pom.xml
[INFO] run post-build script verify.bsh
[INFO]           script-context\pom.xml ........................... SUCCESS (9.0 s)
[INFO] Building: script-errors\pom.xml
[INFO] run post-build script verify.bsh
[INFO]           script-errors\pom.xml ............................ SUCCESS (4.9 s)
[INFO] Building: script-global-vars\pom.xml
[INFO]           script-global-vars\pom.xml ....................... SUCCESS (8.9 s)
[INFO] Building: script-interpreter-detection\pom.xml
[INFO] run post-build script verify.bsh
[INFO]           script-interpreter-detection\pom.xml ............. SUCCESS (9.1 s)
[INFO] Building: script-verify-xml\pom.xml
[INFO] run post-build script verify.groovy
[INFO]           script-verify-xml\pom.xml ........................ SUCCESS (4.2 s)
[INFO] Building: selector-conditions\pom.xml
[INFO] run post-build script verify.groovy
[INFO]           selector-conditions\pom.xml ...................... SUCCESS (11.9 s)
[INFO] Building: selector-scripts\pom.xml
[INFO] run pre-build script setup.groovy
[INFO] run post-build script verify.bsh
[INFO]           selector-scripts\pom.xml ......................... SUCCESS (9.7 s)
[INFO] Building: settings-auto-exclude\pom.xml
[INFO]           settings-auto-exclude\pom.xml .................... SUCCESS (6.7 s)
[INFO] Building: settings-inherit\pom.xml
[INFO]           settings-inherit\pom.xml ......................... SUCCESS (9.8 s)
[INFO] Building: settings-merge\pom.xml
[INFO]           settings-merge\pom.xml ........................... SUCCESS (16.0 s)
[INFO] Building: settings-merge-multiexecutions\pom.xml
[INFO]           settings-merge-multiexecutions\pom.xml ........... SUCCESS (13.1 s)
[INFO] Building: settings-merge_jdk9+\pom.xml
[INFO]           settings-merge_jdk9+\pom.xml ..................... SUCCESS (12.9 s)
[INFO] Building: settings-override\pom.xml
[INFO]           settings-override\pom.xml ........................ SUCCESS (8.3 s)
[INFO] Building: skip-install\pom.xml
[INFO] run post-build script verify.bsh
[INFO]           skip-install\pom.xml ............................. SUCCESS (4.3 s)
[INFO] Building: skip-run\pom.xml
[INFO] run post-build script verify.bsh
[INFO]           skip-run\pom.xml ................................. SUCCESS (4.2 s)
[INFO] Building: spaces-should-work_non-windows\pom.xml
[INFO]           spaces-should-work_non-windows\pom.xml ........... SKIPPED due to OS
[INFO] Building: spaces-should-work_windows\pom.xml
[INFO] run pre-build script setup.groovy
[INFO]           spaces-should-work_windows\pom.xml ............... SUCCESS (7.9 s)
[INFO] Building: special-characters-should-work\pom.xml
[INFO] run pre-build script setup.groovy
[INFO]           special-characters-should-work\pom.xml ........... SUCCESS (8.6 s)
[INFO] Building: staging-dependencies\pom.xml
[INFO] run post-build script verify.bsh
[INFO]           staging-dependencies\pom.xml ..................... SUCCESS (8.1 s)
[INFO] Building: staging-pom\pom.xml
[INFO] run post-build script verify.bsh
[INFO]           staging-pom\pom.xml .............................. SUCCESS (4.2 s)
[INFO] Building: staging-reactor\pom.xml
[INFO] run post-build script verify.bsh
[INFO]           staging-reactor\pom.xml .......................... SUCCESS (7.6 s)
[INFO] Building: wrongPropertyInterpolation\pom.xml
[INFO]           wrongPropertyInterpolation\pom.xml ............... SUCCESS (25.7 s)
[INFO]
[INFO] --- maven-checkstyle-plugin:3.0.0:check (checkstyle-check) @ maven-invoker-plugin ---
[INFO] There are 4 errors reported by Checkstyle 6.18 with config/maven_checks.xml ruleset.
[INFO] Ignored 4 errors, 0 violation remaining.
[INFO]
[INFO] --- maven-invoker-plugin:3.2.0:verify (integration-test) @ maven-invoker-plugin ---
[INFO] -------------------------------------------------
[INFO] Build Summary:
[INFO]   Passed: 71, Failed: 1, Errors: 0, Skipped: 1
[INFO] -------------------------------------------------
[ERROR] The following builds failed:
[ERROR] *  install-extra-artifacts-local-repo\pom.xml
[INFO] -------------------------------------------------
[INFO] ------------------------------------------------------------------------
[INFO] BUILD FAILURE
[INFO] ------------------------------------------------------------------------
[INFO] Total time: 27:03 min
[INFO] Finished at: 2019-07-26T02:00:39-07:00
[INFO] Final Memory: 62M/1491M
[INFO] ------------------------------------------------------------------------
[INFO] [jenkins-event-spy] Generated F:\jenkins\jenkins-slave\workspace\-box_maven-invoker-plugin_master@3@tmp\withMaven66c07fa0\maven-spy-20190726-013336-755307585462462188779.log
[ERROR] Failed to execute goal org.apache.maven.plugins:maven-invoker-plugin:3.2.0:verify (integration-test) on project maven-invoker-plugin: 1 build failed. See console output above for details. -> [Help 1]
org.apache.maven.lifecycle.LifecycleExecutionException: Failed to execute goal org.apache.maven.plugins:maven-invoker-plugin:3.2.0:verify (integration-test) on project maven-invoker-plugin: 1 build failed. See console output above for details.
    at org.apache.maven.lifecycle.internal.MojoExecutor.execute (MojoExecutor.java:213)
    at org.apache.maven.lifecycle.internal.MojoExecutor.execute (MojoExecutor.java:154)
    at org.apache.maven.lifecycle.internal.MojoExecutor.execute (MojoExecutor.java:146)
    at org.apache.maven.lifecycle.internal.LifecycleModuleBuilder.buildProject (LifecycleModuleBuilder.java:117)
    at org.apache.maven.lifecycle.internal.LifecycleModuleBuilder.buildProject (LifecycleModuleBuilder.java:81)
    at org.apache.maven.lifecycle.internal.builder.singlethreaded.SingleThreadedBuilder.build (SingleThreadedBuilder.java:51)
    at org.apache.maven.lifecycle.internal.LifecycleStarter.execute (LifecycleStarter.java:128)
    at org.apache.maven.DefaultMaven.doExecute (DefaultMaven.java:309)
    at org.apache.maven.DefaultMaven.doExecute (DefaultMaven.java:194)
    at org.apache.maven.DefaultMaven.execute (DefaultMaven.java:107)
    at org.apache.maven.cli.MavenCli.execute (MavenCli.java:955)
    at org.apache.maven.cli.MavenCli.doMain (MavenCli.java:290)
    at org.apache.maven.cli.MavenCli.main (MavenCli.java:194)
    at sun.reflect.NativeMethodAccessorImpl.invoke0 (Native Method)
    at sun.reflect.NativeMethodAccessorImpl.invoke (NativeMethodAccessorImpl.java:57)
    at sun.reflect.DelegatingMethodAccessorImpl.invoke (DelegatingMethodAccessorImpl.java:43)
    at java.lang.reflect.Method.invoke (Method.java:606)
    at org.codehaus.plexus.classworlds.launcher.Launcher.launchEnhanced (Launcher.java:289)
    at org.codehaus.plexus.classworlds.launcher.Launcher.launch (Launcher.java:229)
    at org.codehaus.plexus.classworlds.launcher.Launcher.mainWithExitCode (Launcher.java:415)
    at org.codehaus.plexus.classworlds.launcher.Launcher.main (Launcher.java:356)
Caused by: org.apache.maven.plugin.MojoFailureException: 1 build failed. See console output above for details.
    at org.apache.maven.plugins.invoker.InvokerSession.handleFailures (InvokerSession.java:260)
    at org.apache.maven.plugins.invoker.VerifyMojo.execute (VerifyMojo.java:140)
    at org.apache.maven.plugin.DefaultBuildPluginManager.executeMojo (DefaultBuildPluginManager.java:134)
    at org.apache.maven.lifecycle.internal.MojoExecutor.execute (MojoExecutor.java:208)
    at org.apache.maven.lifecycle.internal.MojoExecutor.execute (MojoExecutor.java:154)
    at org.apache.maven.lifecycle.internal.MojoExecutor.execute (MojoExecutor.java:146)
    at org.apache.maven.lifecycle.internal.LifecycleModuleBuilder.buildProject (LifecycleModuleBuilder.java:117)
    at org.apache.maven.lifecycle.internal.LifecycleModuleBuilder.buildProject (LifecycleModuleBuilder.java:81)
    at org.apache.maven.lifecycle.internal.builder.singlethreaded.SingleThreadedBuilder.build (SingleThreadedBuilder.java:51)
    at org.apache.maven.lifecycle.internal.LifecycleStarter.execute (LifecycleStarter.java:128)
    at org.apache.maven.DefaultMaven.doExecute (DefaultMaven.java:309)
    at org.apache.maven.DefaultMaven.doExecute (DefaultMaven.java:194)
    at org.apache.maven.DefaultMaven.execute (DefaultMaven.java:107)
    at org.apache.maven.cli.MavenCli.execute (MavenCli.java:955)
    at org.apache.maven.cli.MavenCli.doMain (MavenCli.java:290)
    at org.apache.maven.cli.MavenCli.main (MavenCli.java:194)
    at sun.reflect.NativeMethodAccessorImpl.invoke0 (Native Method)
    at sun.reflect.NativeMethodAccessorImpl.invoke (NativeMethodAccessorImpl.java:57)
    at sun.reflect.DelegatingMethodAccessorImpl.invoke (DelegatingMethodAccessorImpl.java:43)
    at java.lang.reflect.Method.invoke (Method.java:606)
    at org.codehaus.plexus.classworlds.launcher.Launcher.launchEnhanced (Launcher.java:289)
    at org.codehaus.plexus.classworlds.launcher.Launcher.launch (Launcher.java:229)
    at org.codehaus.plexus.classworlds.launcher.Launcher.mainWithExitCode (Launcher.java:415)
    at org.codehaus.plexus.classworlds.launcher.Launcher.main (Launcher.java:356)
[ERROR]
[ERROR] Re-run Maven using the -X switch to enable full debug logging.
[ERROR]
[ERROR] For more information about the errors and possible solutions, please read the following articles:
[ERROR] [Help 1] http://cwiki.apache.org/confluence/display/MAVEN/MojoFailureException
Picked up JAVA_TOOL_OPTIONS: -Dmaven.ext.class.path="f:\jenkins\jenkins-slave\workspace\-box_maven-invoker-plugin_master@3@tmp\withMaven66c07fa0\pipeline-maven-spy.jar" -Dorg.jenkinsci.plugins.pipeline.maven.reportsFolder="f:\jenkins\jenkins-slave\workspace\-box_maven-invoker-plugin_master@3@tmp\withMaven66c07fa0"
[Pipeline] }
[Pipeline] // dir
[Pipeline] }
[withMaven] junitPublisher - Archive test results for Maven artifact org.apache.maven.plugins:maven-invoker-plugin:maven-plugin:3.2.1-SNAPSHOT generated by maven-surefire-plugin:test (default-test): windows-jdk7-m3.5.x_build\target\surefire-reports\*.xml
Recording test results
[withMaven] openTasksPublisher - Scan Tasks for Maven artifact org.apache.maven.plugins:maven-invoker-plugin:maven-plugin:3.2.1-SNAPSHOT in source directory windows-jdk7-m3.5.x_build\src\main\java
[TASKS] Scanning folder 'f:\jenkins\jenkins-slave\workspace\-box_maven-invoker-plugin_master@3' for files matching the pattern 'windows-jdk7-m3.5.x_build\src\main\java\**\*' - excludes: null
[TASKS] Found 17 files to scan for tasks
[TASKS] Found 8 open tasks.
Skipping warnings blame since pipelines do not have an SCM link.%n
[TASKS] Computing warning deltas based on reference build #18
[withMaven] invokerPublisher - Archive invoker results for Maven artifact MavenArtifact{org.apache.maven.plugins:maven-invoker-plugin:maven-plugin:3.2.1-SNAPSHOT(version: 3.2.1-SNAPSHOT, snapshot:false) } generated by PluginInvocation{org.apache.maven.plugins:maven-invoker-plugin:3.2.0@integration-test  integration-test}: windows-jdk7-m3.5.x_build\target\invoker-reports\*.xml
[withMaven] Publishers: Generated Artifacts Publisher: 12 ms, Junit Publisher: 139 ms, Open Task Scanner Publisher: 117 ms, Invoker Publisher: 36583 ms
[Pipeline] // withMaven
[Pipeline] cleanWs
[WS-CLEANUP] Deleting project workspace...
[WS-CLEANUP] Deferred wipeout is used...
[WS-CLEANUP] done
[Pipeline] cleanWs
[WS-CLEANUP] Deleting project workspace...
[WS-CLEANUP] Deferred wipeout is used...
[WS-CLEANUP] done
[Pipeline] }
[Pipeline] // stage
[Pipeline] }
[Pipeline] // ws
[Pipeline] }
[Pipeline] // node
[Pipeline] }
Failed in branch windows-jdk7-m3.5.x_build
[Pipeline] // parallel
[Pipeline] stage
[Pipeline] { (Notifications)
[Pipeline] echo
Build result: FAILURE
[Pipeline] jiraIssueSelector
[Pipeline] emailext
Reply | Threaded
Open this post in threaded view
|

Build succeeded in Jenkins: Maven TLP » maven-invoker-plugin » master #21

Apache Jenkins Server-2
See https://builds.apache.org/job/maven-box/job/maven-invoker-plugin/job/master/21/

Changes:

* exclude nodes with MAVEN_OPTS issues
* exclude more nodes with MAVEN_OPTS issues
* exclude more nodes with MAVEN_OPTS issues
* stop avoiding nodes with MAVEN_OPTS issue
* added archives
* added archives fix
* print disk space usage
* sh 'df -hT'
* Revert "download this pom first locally as we use it in the extra
* Revert "[MINVOKER-249] InstallMojo extraArtifacts are always downloaded
* Revert "download this pom first locally as we use it in the extra
* Revert "[MINVOKER-249] InstallMojo extraArtifacts are always downloaded
* Revert "download this pom first locally as we use it in the extra
* Revert "[MINVOKER-249] InstallMojo extraArtifacts are always downloaded
* Revert "download this pom first locally as we use it in the extra
* Revert "[MINVOKER-249] InstallMojo extraArtifacts are always downloaded
* Revert "download this pom first locally as we use it in the extra
* Revert "[MINVOKER-249] InstallMojo extraArtifacts are always downloaded
* Revert "download this pom first locally as we use it in the extra
* Revert "[MINVOKER-249] InstallMojo extraArtifacts are always downloaded
* Revert "download this pom first locally as we use it in the extra
* Revert "[MINVOKER-249] InstallMojo extraArtifacts are always downloaded
* Revert "download this pom first locally as we use it in the extra
* Revert "[MINVOKER-249] InstallMojo extraArtifacts are always downloaded
* Revert "download this pom first locally as we use it in the extra
* Revert "[MINVOKER-249] InstallMojo extraArtifacts are always downloaded
* Revert "download this pom first locally as we use it in the extra
* Revert "[MINVOKER-249] InstallMojo extraArtifacts are always downloaded
* Revert "download this pom first locally as we use it in the extra
* Revert "[MINVOKER-249] InstallMojo extraArtifacts are always downloaded
* Revert "download this pom first locally as we use it in the extra
* Revert "[MINVOKER-249] InstallMojo extraArtifacts are always downloaded
* Revert "download this pom first locally as we use it in the extra
* Revert "[MINVOKER-249] InstallMojo extraArtifacts are always downloaded
* Revert "download this pom first locally as we use it in the extra
* Revert "[MINVOKER-249] InstallMojo extraArtifacts are always downloaded

All tests passed