Build failed in Jenkins: Maven TLP » maven-invoker-plugin » MINVOKER-249_install_mojo_download_from_local_repo #4

classic Classic list List threaded Threaded
3 messages Options
Reply | Threaded
Open this post in threaded view
|

Build failed in Jenkins: Maven TLP » maven-invoker-plugin » MINVOKER-249_install_mojo_download_from_local_repo #4

Apache Jenkins Server-2
See https://builds.apache.org/job/maven-box/job/maven-invoker-plugin/job/MINVOKER-249_install_mojo_download_from_local_repo/4/

No changes.

No tests ran.

Build log:
[...truncated 3874 lines...]
    at org.apache.maven.plugin.DefaultBuildPluginManager.executeMojo (DefaultBuildPluginManager.java:137)
    at org.apache.maven.lifecycle.internal.MojoExecutor.execute (MojoExecutor.java:210)
    at org.apache.maven.lifecycle.internal.MojoExecutor.execute (MojoExecutor.java:156)
    at org.apache.maven.lifecycle.internal.MojoExecutor.execute (MojoExecutor.java:148)
    at org.apache.maven.lifecycle.internal.LifecycleModuleBuilder.buildProject (LifecycleModuleBuilder.java:117)
    at org.apache.maven.lifecycle.internal.LifecycleModuleBuilder.buildProject (LifecycleModuleBuilder.java:81)
    at org.apache.maven.lifecycle.internal.builder.singlethreaded.SingleThreadedBuilder.build (SingleThreadedBuilder.java:56)
    at org.apache.maven.lifecycle.internal.LifecycleStarter.execute (LifecycleStarter.java:128)
    at org.apache.maven.DefaultMaven.doExecute (DefaultMaven.java:305)
    at org.apache.maven.DefaultMaven.doExecute (DefaultMaven.java:192)
    at org.apache.maven.DefaultMaven.execute (DefaultMaven.java:105)
    at org.apache.maven.cli.MavenCli.execute (MavenCli.java:956)
    at org.apache.maven.cli.MavenCli.doMain (MavenCli.java:288)
    at org.apache.maven.cli.MavenCli.main (MavenCli.java:192)
    at jdk.internal.reflect.NativeMethodAccessorImpl.invoke0 (Native Method)
    at jdk.internal.reflect.NativeMethodAccessorImpl.invoke (NativeMethodAccessorImpl.java:62)
    at jdk.internal.reflect.DelegatingMethodAccessorImpl.invoke (DelegatingMethodAccessorImpl.java:43)
    at java.lang.reflect.Method.invoke (Method.java:567)
    at org.codehaus.plexus.classworlds.launcher.Launcher.launchEnhanced (Launcher.java:289)
    at org.codehaus.plexus.classworlds.launcher.Launcher.launch (Launcher.java:229)
    at org.codehaus.plexus.classworlds.launcher.Launcher.mainWithExitCode (Launcher.java:415)
    at org.codehaus.plexus.classworlds.launcher.Launcher.main (Launcher.java:356)
[ERROR]
[ERROR] Re-run Maven using the -X switch to enable full debug logging.
[ERROR]
[ERROR] For more information about the errors and possible solutions, please read the following articles:
[ERROR] [Help 1] http://cwiki.apache.org/confluence/display/MAVEN/MojoFailureException
[Pipeline] }
[Pipeline] // dir
[Pipeline] }
[withMaven] openTasksPublisher - Scan Tasks for Maven artifact org.apache.maven.plugins:maven-invoker-plugin:maven-plugin:3.2.1-SNAPSHOT in source directory linux-jdk12-m3.6.x_build/src/main/java
[TASKS] Scanning folder '/home/jenkins/jenkins-slave/workspace/ll_mojo_download_from_local_repo@2' for files matching the pattern 'linux-jdk12-m3.6.x_build/src/main/java/**/*' - excludes: null
[TASKS] Found 17 files to scan for tasks
[TASKS] Found 8 open tasks.
Skipping warnings blame since pipelines do not have an SCM link.%n
[TASKS] Computing warning deltas based on reference build #3
[withMaven] Publishers: Generated Artifacts Publisher: 311 ms, Open Task Scanner Publisher: 1045 ms
[Pipeline] // withMaven
[Pipeline] cleanWs
[WS-CLEANUP] Deleting project workspace...
[WS-CLEANUP] Deferred wipeout is used...
[WS-CLEANUP] done
[Pipeline] cleanWs
[WS-CLEANUP] Deleting project workspace...
[WS-CLEANUP] Deferred wipeout is used...
[WS-CLEANUP] done
[Pipeline] }
[Pipeline] // stage
[Pipeline] }
[Pipeline] // ws
[Pipeline] }
[Pipeline] // node
[Pipeline] }
Failed in branch linux-jdk12-m3.6.x_build
Apache Maven 3.6.0 (97c98ec64a1fdfee7767ce5ffb20918da4f719f3; 2018-10-24T18:41:47Z)
Maven home: /home/jenkins/tools/maven/apache-maven-3.6.0
Java version: 13, vendor: Oracle Corporation, runtime: /usr/local/asfpackages/java/openjdk-13-ea+33
Default locale: en_US, platform encoding: ISO-8859-1
OS name: "linux", version: "4.4.0-138-generic", arch: "amd64", family: "unix"
[INFO] [jenkins-event-spy] Generate /home/jenkins/jenkins-slave/workspace/ll_mojo_download_from_local_repo@2@tmp/withMaven7c59439f/maven-spy-20190902-021457-77294394257881337577.log.tmp ...
[INFO] Error stacktraces are turned on.
[INFO] Scanning for projects...
[INFO]
[INFO] -----------< org.apache.maven.plugins:maven-invoker-plugin >------------
[INFO] Building Apache Maven Invoker Plugin 3.2.1-SNAPSHOT
[INFO] ----------------------------[ maven-plugin ]----------------------------
[INFO]
[INFO] --- maven-clean-plugin:3.1.0:clean (default-clean) @ maven-invoker-plugin ---
[INFO]
[INFO] --- maven-enforcer-plugin:1.4.1:enforce (enforce-maven-version) @ maven-invoker-plugin ---
[INFO]
[INFO] --- maven-enforcer-plugin:1.4.1:enforce (enforce-bytecode-version) @ maven-invoker-plugin ---
[INFO]
[INFO] --- maven-enforcer-plugin:1.4.1:enforce (ban-known-bad-maven-versions) @ maven-invoker-plugin ---
[INFO]
[INFO] --- maven-enforcer-plugin:1.4.1:enforce (ensure-no-container-api) @ maven-invoker-plugin ---
[INFO]
[INFO] --- apache-rat-plugin:0.12:check (rat-check) @ maven-invoker-plugin ---
[INFO] Enabled default license matchers.
[INFO] Will parse SCM ignores for exclusions...
[INFO] Parsing exclusions from /home/jenkins/jenkins-slave/workspace/ll_mojo_download_from_local_repo@2/linux-jdk13-m3.6.x_build/.gitignore
[INFO] Finished adding exclusions from SCM ignore files.
[INFO] 71 implicit excludes (use -debug for more details).
[INFO] Exclude: src/it/staging-dependencies/repo/**/*
[INFO] Exclude: src/it/**/*.txt
[INFO] Exclude: src/test/**/*.txt
[INFO] Exclude: .repository/**
[INFO] Exclude: .maven/spy.log
[INFO] Exclude: dependency-reduced-pom.xml
[INFO] Exclude: .java-version
[INFO] 467 resources included (use -debug for more details)
[INFO] Rat check: Summary over all files. Unapproved: 0, unknown: 0, generated: 0, approved: 467 licenses.
[INFO]
[INFO] --- maven-plugin-plugin:3.5.2:helpmojo (generate-helpmojo) @ maven-invoker-plugin ---
[INFO] Using 'UTF-8' encoding to read mojo source files.
[INFO] java-javadoc mojo extractor found 0 mojo descriptor.
[INFO] java-annotations mojo extractor found 0 mojo descriptor.
[INFO]
[INFO] --- modello-maven-plugin:1.9.1:xpp3-reader (standard) @ maven-invoker-plugin ---
[INFO] outputDirectory: /home/jenkins/jenkins-slave/workspace/ll_mojo_download_from_local_repo@2/linux-jdk13-m3.6.x_build/target/generated-sources/modello
[INFO] Working on model: src/main/mdo/invocation.mdo
[INFO] Generating current version: 1.0.0
[INFO]
[INFO] --- modello-maven-plugin:1.9.1:xpp3-writer (standard) @ maven-invoker-plugin ---
[INFO] outputDirectory: /home/jenkins/jenkins-slave/workspace/ll_mojo_download_from_local_repo@2/linux-jdk13-m3.6.x_build/target/generated-sources/modello
[INFO] Working on model: src/main/mdo/invocation.mdo
[INFO] Generating current version: 1.0.0
[INFO]
[INFO] --- modello-maven-plugin:1.9.1:java (standard) @ maven-invoker-plugin ---
[INFO] outputDirectory: /home/jenkins/jenkins-slave/workspace/ll_mojo_download_from_local_repo@2/linux-jdk13-m3.6.x_build/target/generated-sources/modello
[INFO] Working on model: src/main/mdo/invocation.mdo
[INFO] Generating current version: 1.0.0
[INFO]
[INFO] --- maven-remote-resources-plugin:1.5:process (process-resource-bundles) @ maven-invoker-plugin ---
[INFO]
[INFO] --- maven-resources-plugin:3.1.0:resources (default-resources) @ maven-invoker-plugin ---
[INFO] Using 'UTF-8' encoding to copy filtered resources.
[INFO] Copying 4 resources
[INFO] Copying 3 resources
[INFO]
[INFO] --- maven-compiler-plugin:3.7.0:compile (default-compile) @ maven-invoker-plugin ---
[INFO] Changes detected - recompiling the module!
[INFO] Compiling 21 source files to /home/jenkins/jenkins-slave/workspace/ll_mojo_download_from_local_repo@2/linux-jdk13-m3.6.x_build/target/classes
[INFO] /home/jenkins/jenkins-slave/workspace/ll_mojo_download_from_local_repo@2/linux-jdk13-m3.6.x_build/src/main/java/org/apache/maven/plugins/invoker/InstallMojo.java: /home/jenkins/jenkins-slave/workspace/ll_mojo_download_from_local_repo@2/linux-jdk13-m3.6.x_build/src/main/java/org/apache/maven/plugins/invoker/InstallMojo.java uses or overrides a deprecated API.
[INFO] /home/jenkins/jenkins-slave/workspace/ll_mojo_download_from_local_repo@2/linux-jdk13-m3.6.x_build/src/main/java/org/apache/maven/plugins/invoker/InstallMojo.java: Recompile with -Xlint:deprecation for details.
[INFO] /home/jenkins/jenkins-slave/workspace/ll_mojo_download_from_local_repo@2/linux-jdk13-m3.6.x_build/target/generated-sources/modello/org/apache/maven/plugins/invoker/model/io/xpp3/BuildJobXpp3Reader.java: /home/jenkins/jenkins-slave/workspace/ll_mojo_download_from_local_repo@2/linux-jdk13-m3.6.x_build/target/generated-sources/modello/org/apache/maven/plugins/invoker/model/io/xpp3/BuildJobXpp3Reader.java uses unchecked or unsafe operations.
[INFO] /home/jenkins/jenkins-slave/workspace/ll_mojo_download_from_local_repo@2/linux-jdk13-m3.6.x_build/target/generated-sources/modello/org/apache/maven/plugins/invoker/model/io/xpp3/BuildJobXpp3Reader.java: Recompile with -Xlint:unchecked for details.
[INFO] -------------------------------------------------------------
[ERROR] COMPILATION ERROR :
[INFO] -------------------------------------------------------------
[ERROR] /home/jenkins/jenkins-slave/workspace/ll_mojo_download_from_local_repo@2/linux-jdk13-m3.6.x_build/src/main/java/org/apache/maven/plugins/invoker/InstallMojo.java:[648,13] cannot find symbol
  symbol:   class List
  location: class org.apache.maven.plugins.invoker.InstallMojo
[ERROR] /home/jenkins/jenkins-slave/workspace/ll_mojo_download_from_local_repo@2/linux-jdk13-m3.6.x_build/src/main/java/org/apache/maven/plugins/invoker/InstallMojo.java:[650,9] cannot find symbol
  symbol:   class List
  location: class org.apache.maven.plugins.invoker.InstallMojo
[ERROR] /home/jenkins/jenkins-slave/workspace/ll_mojo_download_from_local_repo@2/linux-jdk13-m3.6.x_build/src/main/java/org/apache/maven/plugins/invoker/InstallMojo.java:[650,40] cannot find symbol
  symbol:   class ArrayList
  location: class org.apache.maven.plugins.invoker.InstallMojo
[INFO] 3 errors
[INFO] -------------------------------------------------------------
[INFO] ------------------------------------------------------------------------
[INFO] BUILD FAILURE
[INFO] ------------------------------------------------------------------------
[INFO] Total time:  03:29 min
[INFO] Finished at: 2019-09-02T02:18:30Z
[INFO] ------------------------------------------------------------------------
[INFO] [jenkins-event-spy] Generated /home/jenkins/jenkins-slave/workspace/ll_mojo_download_from_local_repo@2@tmp/withMaven7c59439f/maven-spy-20190902-021457-77294394257881337577.log
[ERROR] Failed to execute goal org.apache.maven.plugins:maven-compiler-plugin:3.7.0:compile (default-compile) on project maven-invoker-plugin: Compilation failure: Compilation failure:
[ERROR] /home/jenkins/jenkins-slave/workspace/ll_mojo_download_from_local_repo@2/linux-jdk13-m3.6.x_build/src/main/java/org/apache/maven/plugins/invoker/InstallMojo.java:[648,13] cannot find symbol
[ERROR]   symbol:   class List
[ERROR]   location: class org.apache.maven.plugins.invoker.InstallMojo
[ERROR] /home/jenkins/jenkins-slave/workspace/ll_mojo_download_from_local_repo@2/linux-jdk13-m3.6.x_build/src/main/java/org/apache/maven/plugins/invoker/InstallMojo.java:[650,9] cannot find symbol
[ERROR]   symbol:   class List
[ERROR]   location: class org.apache.maven.plugins.invoker.InstallMojo
[ERROR] /home/jenkins/jenkins-slave/workspace/ll_mojo_download_from_local_repo@2/linux-jdk13-m3.6.x_build/src/main/java/org/apache/maven/plugins/invoker/InstallMojo.java:[650,40] cannot find symbol
[ERROR]   symbol:   class ArrayList
[ERROR]   location: class org.apache.maven.plugins.invoker.InstallMojo
[ERROR] -> [Help 1]
org.apache.maven.lifecycle.LifecycleExecutionException: Failed to execute goal org.apache.maven.plugins:maven-compiler-plugin:3.7.0:compile (default-compile) on project maven-invoker-plugin: Compilation failure
    at org.apache.maven.lifecycle.internal.MojoExecutor.execute (MojoExecutor.java:215)
    at org.apache.maven.lifecycle.internal.MojoExecutor.execute (MojoExecutor.java:156)
    at org.apache.maven.lifecycle.internal.MojoExecutor.execute (MojoExecutor.java:148)
    at org.apache.maven.lifecycle.internal.LifecycleModuleBuilder.buildProject (LifecycleModuleBuilder.java:117)
    at org.apache.maven.lifecycle.internal.LifecycleModuleBuilder.buildProject (LifecycleModuleBuilder.java:81)
    at org.apache.maven.lifecycle.internal.builder.singlethreaded.SingleThreadedBuilder.build (SingleThreadedBuilder.java:56)
    at org.apache.maven.lifecycle.internal.LifecycleStarter.execute (LifecycleStarter.java:128)
    at org.apache.maven.DefaultMaven.doExecute (DefaultMaven.java:305)
    at org.apache.maven.DefaultMaven.doExecute (DefaultMaven.java:192)
    at org.apache.maven.DefaultMaven.execute (DefaultMaven.java:105)
    at org.apache.maven.cli.MavenCli.execute (MavenCli.java:956)
    at org.apache.maven.cli.MavenCli.doMain (MavenCli.java:288)
    at org.apache.maven.cli.MavenCli.main (MavenCli.java:192)
    at jdk.internal.reflect.NativeMethodAccessorImpl.invoke0 (Native Method)
    at jdk.internal.reflect.NativeMethodAccessorImpl.invoke (NativeMethodAccessorImpl.java:62)
    at jdk.internal.reflect.DelegatingMethodAccessorImpl.invoke (DelegatingMethodAccessorImpl.java:43)
    at java.lang.reflect.Method.invoke (Method.java:567)
    at org.codehaus.plexus.classworlds.launcher.Launcher.launchEnhanced (Launcher.java:289)
    at org.codehaus.plexus.classworlds.launcher.Launcher.launch (Launcher.java:229)
    at org.codehaus.plexus.classworlds.launcher.Launcher.mainWithExitCode (Launcher.java:415)
    at org.codehaus.plexus.classworlds.launcher.Launcher.main (Launcher.java:356)
Caused by: org.apache.maven.plugin.compiler.CompilationFailureException: Compilation failure
    at org.apache.maven.plugin.compiler.AbstractCompilerMojo.execute (AbstractCompilerMojo.java:1161)
    at org.apache.maven.plugin.compiler.CompilerMojo.execute (CompilerMojo.java:168)
    at org.apache.maven.plugin.DefaultBuildPluginManager.executeMojo (DefaultBuildPluginManager.java:137)
    at org.apache.maven.lifecycle.internal.MojoExecutor.execute (MojoExecutor.java:210)
    at org.apache.maven.lifecycle.internal.MojoExecutor.execute (MojoExecutor.java:156)
    at org.apache.maven.lifecycle.internal.MojoExecutor.execute (MojoExecutor.java:148)
    at org.apache.maven.lifecycle.internal.LifecycleModuleBuilder.buildProject (LifecycleModuleBuilder.java:117)
    at org.apache.maven.lifecycle.internal.LifecycleModuleBuilder.buildProject (LifecycleModuleBuilder.java:81)
    at org.apache.maven.lifecycle.internal.builder.singlethreaded.SingleThreadedBuilder.build (SingleThreadedBuilder.java:56)
    at org.apache.maven.lifecycle.internal.LifecycleStarter.execute (LifecycleStarter.java:128)
    at org.apache.maven.DefaultMaven.doExecute (DefaultMaven.java:305)
    at org.apache.maven.DefaultMaven.doExecute (DefaultMaven.java:192)
    at org.apache.maven.DefaultMaven.execute (DefaultMaven.java:105)
    at org.apache.maven.cli.MavenCli.execute (MavenCli.java:956)
    at org.apache.maven.cli.MavenCli.doMain (MavenCli.java:288)
    at org.apache.maven.cli.MavenCli.main (MavenCli.java:192)
    at jdk.internal.reflect.NativeMethodAccessorImpl.invoke0 (Native Method)
    at jdk.internal.reflect.NativeMethodAccessorImpl.invoke (NativeMethodAccessorImpl.java:62)
    at jdk.internal.reflect.DelegatingMethodAccessorImpl.invoke (DelegatingMethodAccessorImpl.java:43)
    at java.lang.reflect.Method.invoke (Method.java:567)
    at org.codehaus.plexus.classworlds.launcher.Launcher.launchEnhanced (Launcher.java:289)
    at org.codehaus.plexus.classworlds.launcher.Launcher.launch (Launcher.java:229)
    at org.codehaus.plexus.classworlds.launcher.Launcher.mainWithExitCode (Launcher.java:415)
    at org.codehaus.plexus.classworlds.launcher.Launcher.main (Launcher.java:356)
[ERROR]
[ERROR] Re-run Maven using the -X switch to enable full debug logging.
[ERROR]
[ERROR] For more information about the errors and possible solutions, please read the following articles:
[ERROR] [Help 1] http://cwiki.apache.org/confluence/display/MAVEN/MojoFailureException
[Pipeline] }
[Pipeline] // dir
[Pipeline] }
[withMaven] openTasksPublisher - Scan Tasks for Maven artifact org.apache.maven.plugins:maven-invoker-plugin:maven-plugin:3.2.1-SNAPSHOT in source directory linux-jdk13-m3.6.x_build/src/main/java
[TASKS] Scanning folder '/home/jenkins/jenkins-slave/workspace/ll_mojo_download_from_local_repo@2' for files matching the pattern 'linux-jdk13-m3.6.x_build/src/main/java/**/*' - excludes: null
[TASKS] Found 17 files to scan for tasks
[TASKS] Found 8 open tasks.
Skipping warnings blame since pipelines do not have an SCM link.%n
[TASKS] Computing warning deltas based on reference build #3
[withMaven] Publishers: Generated Artifacts Publisher: 312 ms, Open Task Scanner Publisher: 1006 ms
[Pipeline] // withMaven
[Pipeline] cleanWs
[WS-CLEANUP] Deleting project workspace...
[WS-CLEANUP] Deferred wipeout is used...
[WS-CLEANUP] done
[Pipeline] cleanWs
[WS-CLEANUP] Deleting project workspace...
[WS-CLEANUP] Deferred wipeout is used...
[WS-CLEANUP] done
[Pipeline] }
[Pipeline] // stage
[Pipeline] }
[Pipeline] // ws
[Pipeline] }
[Pipeline] // node
[Pipeline] }
Failed in branch linux-jdk13-m3.6.x_build
[Pipeline] // parallel
[Pipeline] stage
[Pipeline] { (Notifications)
[Pipeline] echo
Build result: FAILURE
[Pipeline] jiraIssueSelector
[Pipeline] echo
The authors of changes [].
[Pipeline] echo
Sending email ...
[Pipeline] emailext
Reply | Threaded
Open this post in threaded view
|

Build failed in Jenkins: Maven TLP » maven-invoker-plugin » MINVOKER-249_install_mojo_download_from_local_repo #5

Apache Jenkins Server-2
See https://builds.apache.org/job/maven-box/job/maven-invoker-plugin/job/MINVOKER-249_install_mojo_download_from_local_repo/5/

No changes.

No tests ran.

Build log:
[...truncated 3887 lines...]
[ERROR]
[ERROR] For more information about the errors and possible solutions, please read the following articles:
[ERROR] [Help 1] http://cwiki.apache.org/confluence/display/MAVEN/MojoFailureException
[TASKS] Computing warning deltas based on reference build #3
[Pipeline] }
[Pipeline] // dir
[withMaven] Publishers: Generated Artifacts Publisher: 10 ms, Open Task Scanner Publisher: 89 ms
[INFO] Changes detected - recompiling the module!
[withMaven] Publishers: Generated Artifacts Publisher: 316 ms, Open Task Scanner Publisher: 994 ms[INFO] Compiling 21 source files to f:\jenkins\jenkins-slave\workspace\ll_mojo_download_from_local_repo@3\windows-jdk7-m3.5.x_build\target\classes

[Pipeline] }
[WS-CLEANUP] Deleting project workspace...
[WS-CLEANUP] Deferred wipeout is used...
[Pipeline] // withMaven
[withMaven] openTasksPublisher - Scan Tasks for Maven artifact org.apache.maven.plugins:maven-invoker-plugin:maven-plugin:3.2.1-SNAPSHOT in source directory windows-jdk13-m3.6.x_build\src\main\java
[Pipeline] cleanWs
[WS-CLEANUP] Deleting project workspace...
[WS-CLEANUP] Deferred wipeout is used...
[TASKS] Scanning folder 'f:\jenkins\jenkins-slave\workspace\ll_mojo_download_from_local_repo@2' for files matching the pattern 'windows-jdk13-m3.6.x_build\src\main\java\**\*' - excludes: null
[TASKS] Found 17 files to scan for tasks
[TASKS] Found 8 open tasks.
Skipping warnings blame since pipelines do not have an SCM link.%n
[TASKS] Computing warning deltas based on reference build #3
[Pipeline] // withMaven
[WS-CLEANUP] done
[Pipeline] cleanWs
[Pipeline] cleanWs
[withMaven] Publishers: Generated Artifacts Publisher: 20 ms, Open Task Scanner Publisher: 75 ms
[WS-CLEANUP] Deleting project workspace...
[WS-CLEANUP] Deferred wipeout is used...
[Pipeline] // withMaven
[WS-CLEANUP] done
[withMaven] openTasksPublisher - Scan Tasks for Maven artifact org.apache.maven.plugins:maven-invoker-plugin:maven-plugin:3.2.1-SNAPSHOT in source directory linux-jdk7-m3.3.x_build/src/main/java
[Pipeline] cleanWs
[WS-CLEANUP] Deleting project workspace...
[WS-CLEANUP] Deferred wipeout is used...
[Pipeline] }
[WS-CLEANUP] done
[Pipeline] // stage
[Pipeline] }
[Pipeline] cleanWs
[WS-CLEANUP] Deleting project workspace...
[WS-CLEANUP] Deferred wipeout is used...
[Pipeline] // ws
[Pipeline] // withMaven
[WS-CLEANUP] done
[Pipeline] }
[WS-CLEANUP] done
[Pipeline] cleanWs
[Pipeline] // node
[Pipeline] }
Failed in branch windows-jdk11-m3.6.x_build
[Pipeline] }
[Pipeline] }
[TASKS] Scanning folder '/home/jenkins/jenkins-slave/workspace/ll_mojo_download_from_local_repo@2@2' for files matching the pattern 'linux-jdk7-m3.3.x_build/src/main/java/**/*' - excludes: null
[TASKS] Found 17 files to scan for tasks
[TASKS] Found 8 open tasks.
Skipping warnings blame since pipelines do not have an SCM link.%n
[TASKS] Computing warning deltas based on reference build #3
[Pipeline] // stage
[Pipeline] }
[WS-CLEANUP] Deleting project workspace...
[WS-CLEANUP] Deferred wipeout is used...
[Pipeline] // stage
[Pipeline] }
[Pipeline] // ws
[Pipeline] }
[Pipeline] // ws
[Pipeline] }
[Pipeline] // node
[Pipeline] }
Failed in branch windows-jdk13-m3.6.x_build
[Pipeline] // node
[Pipeline] }
[WS-CLEANUP] Deleting project workspace...
[WS-CLEANUP] Deferred wipeout is used...
Failed in branch linux-jdk8-m3.6.x_build
[WS-CLEANUP] done
[Pipeline] cleanWs
[WS-CLEANUP] done
[Pipeline] cleanWs
[WS-CLEANUP] Deleting project workspace...
[WS-CLEANUP] Deferred wipeout is used...
[WS-CLEANUP] Deleting project workspace...
[WS-CLEANUP] Deferred wipeout is used...
[WS-CLEANUP] done
[Pipeline] }
[INFO] /f:/jenkins/jenkins-slave/workspace/ll_mojo_download_from_local_repo@3/windows-jdk7-m3.5.x_build/src/main/java/org/apache/maven/plugins/invoker/InstallMojo.java: f:\jenkins\jenkins-slave\workspace\ll_mojo_download_from_local_repo@3\windows-jdk7-m3.5.x_build\src\main\java\org\apache\maven\plugins\invoker\InstallMojo.java uses or overrides a deprecated API.
[INFO] /f:/jenkins/jenkins-slave/workspace/ll_mojo_download_from_local_repo@3/windows-jdk7-m3.5.x_build/src/main/java/org/apache/maven/plugins/invoker/InstallMojo.java: Recompile with -Xlint:deprecation for details.
[INFO] /f:/jenkins/jenkins-slave/workspace/ll_mojo_download_from_local_repo@3/windows-jdk7-m3.5.x_build/target/generated-sources/modello/org/apache/maven/plugins/invoker/model/io/xpp3/BuildJobXpp3Reader.java: f:\jenkins\jenkins-slave\workspace\ll_mojo_download_from_local_repo@3\windows-jdk7-m3.5.x_build\target\generated-sources\modello\org\apache\maven\plugins\invoker\model\io\xpp3\BuildJobXpp3Reader.java uses unchecked or unsafe operations.
[INFO] /f:/jenkins/jenkins-slave/workspace/ll_mojo_download_from_local_repo@3/windows-jdk7-m3.5.x_build/target/generated-sources/modello/org/apache/maven/plugins/invoker/model/io/xpp3/BuildJobXpp3Reader.java: Recompile with -Xlint:unchecked for details.
[INFO] -------------------------------------------------------------
[ERROR] COMPILATION ERROR :
[INFO] -------------------------------------------------------------
[ERROR] /f:/jenkins/jenkins-slave/workspace/ll_mojo_download_from_local_repo@3/windows-jdk7-m3.5.x_build/src/main/java/org/apache/maven/plugins/invoker/InstallMojo.java:[648,13] cannot find symbol
  symbol:   class List
  location: class org.apache.maven.plugins.invoker.InstallMojo
[ERROR] /f:/jenkins/jenkins-slave/workspace/ll_mojo_download_from_local_repo@3/windows-jdk7-m3.5.x_build/src/main/java/org/apache/maven/plugins/invoker/InstallMojo.java:[650,9] cannot find symbol
  symbol:   class List
  location: class org.apache.maven.plugins.invoker.InstallMojo
[ERROR] /f:/jenkins/jenkins-slave/workspace/ll_mojo_download_from_local_repo@3/windows-jdk7-m3.5.x_build/src/main/java/org/apache/maven/plugins/invoker/InstallMojo.java:[650,40] cannot find symbol
  symbol:   class ArrayList
  location: class org.apache.maven.plugins.invoker.InstallMojo
[INFO] 3 errors
[INFO] -------------------------------------------------------------
[INFO] ------------------------------------------------------------------------
[INFO] BUILD FAILURE
[INFO] ------------------------------------------------------------------------
[INFO] Total time: 12.941 s
[INFO] Finished at: 2019-09-01T19:20:29-07:00
[Pipeline] // stage
[Pipeline] }
[Pipeline] // ws
[withMaven] Publishers: Generated Artifacts Publisher: 309 ms, Open Task Scanner Publisher: 853 ms
[Pipeline] }
[Pipeline] // node
[Pipeline] }
Failed in branch linux-jdk7-m3.6.x_build
[WS-CLEANUP] done
[Pipeline] }
[Pipeline] // stage
[Pipeline] }
[Pipeline] // ws
[INFO] Final Memory: 43M/703M
[INFO] ------------------------------------------------------------------------
[INFO] [jenkins-event-spy] Generated F:\jenkins\jenkins-slave\workspace\ll_mojo_download_from_local_repo@3@tmp\withMavenade3e7ff\maven-spy-20190901-192015-7417653279315192934473.log
[ERROR] Failed to execute goal org.apache.maven.plugins:maven-compiler-plugin:3.7.0:compile (default-compile) on project maven-invoker-plugin: Compilation failure: Compilation failure:
[ERROR] /f:/jenkins/jenkins-slave/workspace/ll_mojo_download_from_local_repo@3/windows-jdk7-m3.5.x_build/src/main/java/org/apache/maven/plugins/invoker/InstallMojo.java:[648,13] cannot find symbol
[ERROR]   symbol:   class List
[ERROR]   location: class org.apache.maven.plugins.invoker.InstallMojo
[ERROR] /f:/jenkins/jenkins-slave/workspace/ll_mojo_download_from_local_repo@3/windows-jdk7-m3.5.x_build/src/main/java/org/apache/maven/plugins/invoker/InstallMojo.java:[650,9] cannot find symbol
[ERROR]   symbol:   class List
[ERROR]   location: class org.apache.maven.plugins.invoker.InstallMojo
[ERROR] /f:/jenkins/jenkins-slave/workspace/ll_mojo_download_from_local_repo@3/windows-jdk7-m3.5.x_build/src/main/java/org/apache/maven/plugins/invoker/InstallMojo.java:[650,40] cannot find symbol
[ERROR]   symbol:   class ArrayList
[ERROR]   location: class org.apache.maven.plugins.invoker.InstallMojo
[ERROR] -> [Help 1]
org.apache.maven.lifecycle.LifecycleExecutionException: Failed to execute goal org.apache.maven.plugins:maven-compiler-plugin:3.7.0:compile (default-compile) on project maven-invoker-plugin: Compilation failure
    at org.apache.maven.lifecycle.internal.MojoExecutor.execute (MojoExecutor.java:213)
    at org.apache.maven.lifecycle.internal.MojoExecutor.execute (MojoExecutor.java:154)
    at org.apache.maven.lifecycle.internal.MojoExecutor.execute (MojoExecutor.java:146)
    at org.apache.maven.lifecycle.internal.LifecycleModuleBuilder.buildProject (LifecycleModuleBuilder.java:117)
    at org.apache.maven.lifecycle.internal.LifecycleModuleBuilder.buildProject (LifecycleModuleBuilder.java:81)
    at org.apache.maven.lifecycle.internal.builder.singlethreaded.SingleThreadedBuilder.build (SingleThreadedBuilder.java:51)
    at org.apache.maven.lifecycle.internal.LifecycleStarter.execute (LifecycleStarter.java:128)
    at org.apache.maven.DefaultMaven.doExecute (DefaultMaven.java:309)
    at org.apache.maven.DefaultMaven.doExecute (DefaultMaven.java:194)
    at org.apache.maven.DefaultMaven.execute (DefaultMaven.java:107)
    at org.apache.maven.cli.MavenCli.execute (MavenCli.java:955)
    at org.apache.maven.cli.MavenCli.doMain (MavenCli.java:290)
    at org.apache.maven.cli.MavenCli.main (MavenCli.java:194)
    at sun.reflect.NativeMethodAccessorImpl.invoke0 (Native Method)
    at sun.reflect.NativeMethodAccessorImpl.invoke (NativeMethodAccessorImpl.java:57)
    at sun.reflect.DelegatingMethodAccessorImpl.invoke (DelegatingMethodAccessorImpl.java:43)
    at java.lang.reflect.Method.invoke (Method.java:606)
    at org.codehaus.plexus.classworlds.launcher.Launcher.launchEnhanced (Launcher.java:289)
    at org.codehaus.plexus.classworlds.launcher.Launcher.launch (Launcher.java:229)
    at org.codehaus.plexus.classworlds.launcher.Launcher.mainWithExitCode (Launcher.java:415)
    at org.codehaus.plexus.classworlds.launcher.Launcher.main (Launcher.java:356)
Caused by: org.apache.maven.plugin.compiler.CompilationFailureException: Compilation failure
    at org.apache.maven.plugin.compiler.AbstractCompilerMojo.execute (AbstractCompilerMojo.java:1161)
    at org.apache.maven.plugin.compiler.CompilerMojo.execute (CompilerMojo.java:168)
    at org.apache.maven.plugin.DefaultBuildPluginManager.executeMojo (DefaultBuildPluginManager.java:134)
    at org.apache.maven.lifecycle.internal.MojoExecutor.execute (MojoExecutor.java:208)
    at org.apache.maven.lifecycle.internal.MojoExecutor.execute (MojoExecutor.java:154)
    at org.apache.maven.lifecycle.internal.MojoExecutor.execute (MojoExecutor.java:146)
    at org.apache.maven.lifecycle.internal.LifecycleModuleBuilder.buildProject (LifecycleModuleBuilder.java:117)
    at org.apache.maven.lifecycle.internal.LifecycleModuleBuilder.buildProject (LifecycleModuleBuilder.java:81)
    at org.apache.maven.lifecycle.internal.builder.singlethreaded.SingleThreadedBuilder.build (SingleThreadedBuilder.java:51)
    at org.apache.maven.lifecycle.internal.LifecycleStarter.execute (LifecycleStarter.java:128)
    at org.apache.maven.DefaultMaven.doExecute (DefaultMaven.java:309)
    at org.apache.maven.DefaultMaven.doExecute (DefaultMaven.java:194)
    at org.apache.maven.DefaultMaven.execute (DefaultMaven.java:107)
    at org.apache.maven.cli.MavenCli.execute (MavenCli.java:955)
    at org.apache.maven.cli.MavenCli.doMain (MavenCli.java:290)
    at org.apache.maven.cli.MavenCli.main (MavenCli.java:194)
    at sun.reflect.NativeMethodAccessorImpl.invoke0 (Native Method)
    at sun.reflect.NativeMethodAccessorImpl.invoke (NativeMethodAccessorImpl.java:57)
    at sun.reflect.DelegatingMethodAccessorImpl.invoke (DelegatingMethodAccessorImpl.java:43)
    at java.lang.reflect.Method.invoke (Method.java:606)
    at org.codehaus.plexus.classworlds.launcher.Launcher.launchEnhanced (Launcher.java:289)
    at org.codehaus.plexus.classworlds.launcher.Launcher.launch (Launcher.java:229)
    at org.codehaus.plexus.classworlds.launcher.Launcher.mainWithExitCode (Launcher.java:415)
    at org.codehaus.plexus.classworlds.launcher.Launcher.main (Launcher.java:356)
[ERROR]
[ERROR] Re-run Maven using the -X switch to enable full debug logging.
[ERROR]
[ERROR] For more information about the errors and possible solutions, please read the following articles:
[ERROR] [Help 1] http://cwiki.apache.org/confluence/display/MAVEN/MojoFailureException
Picked up JAVA_TOOL_OPTIONS: -Dmaven.ext.class.path="f:\jenkins\jenkins-slave\workspace\ll_mojo_download_from_local_repo@3@tmp\withMavenade3e7ff\pipeline-maven-spy.jar" -Dorg.jenkinsci.plugins.pipeline.maven.reportsFolder="f:\jenkins\jenkins-slave\workspace\ll_mojo_download_from_local_repo@3@tmp\withMavenade3e7ff"
[Pipeline] }
[Pipeline] // node
[Pipeline] }
Failed in branch linux-jdk7-m3.5.x_build
[Pipeline] // withMaven
[Pipeline] cleanWs
[Pipeline] }
[Pipeline] // dir
[Pipeline] }
[withMaven] openTasksPublisher - Scan Tasks for Maven artifact org.apache.maven.plugins:maven-invoker-plugin:maven-plugin:3.2.1-SNAPSHOT in source directory windows-jdk7-m3.5.x_build\src\main\java
[WS-CLEANUP] Deleting project workspace...
[WS-CLEANUP] Deferred wipeout is used...
[TASKS] Scanning folder 'f:\jenkins\jenkins-slave\workspace\ll_mojo_download_from_local_repo@3' for files matching the pattern 'windows-jdk7-m3.5.x_build\src\main\java\**\*' - excludes: null
[TASKS] Found 17 files to scan for tasks
[TASKS] Found 8 open tasks.
Skipping warnings blame since pipelines do not have an SCM link.%n
[TASKS] Computing warning deltas based on reference build #3
[withMaven] Publishers: Generated Artifacts Publisher: 12 ms, Open Task Scanner Publisher: 102 ms
[Pipeline] // withMaven
[Pipeline] cleanWs
[WS-CLEANUP] Deleting project workspace...
[WS-CLEANUP] Deferred wipeout is used...
[WS-CLEANUP] done
[Pipeline] cleanWs
[WS-CLEANUP] Deleting project workspace...
[WS-CLEANUP] Deferred wipeout is used...
[WS-CLEANUP] done
[Pipeline] }
[Pipeline] // stage
[Pipeline] }
[Pipeline] // ws
[WS-CLEANUP] done
[Pipeline] }
[Pipeline] // node
[Pipeline] }
Failed in branch windows-jdk7-m3.5.x_build
[Pipeline] cleanWs
[WS-CLEANUP] Deleting project workspace...
[WS-CLEANUP] Deferred wipeout is used...
[WS-CLEANUP] done
[Pipeline] }
[Pipeline] // stage
[Pipeline] }
[Pipeline] // ws
[Pipeline] }
[Pipeline] // node
[Pipeline] }
Failed in branch linux-jdk7-m3.3.x_build
[Pipeline] // parallel
[Pipeline] stage
[Pipeline] { (Notifications)
[Pipeline] echo
Build result: FAILURE
[Pipeline] jiraIssueSelector
[Pipeline] echo
The authors of changes [].
[Pipeline] echo
Sending email ...
[Pipeline] emailext
Reply | Threaded
Open this post in threaded view
|

Build succeeded in Jenkins: Maven TLP » maven-invoker-plugin » MINVOKER-249_install_mojo_download_from_local_repo #6

Apache Jenkins Server-2
See https://builds.apache.org/job/maven-box/job/maven-invoker-plugin/job/MINVOKER-249_install_mojo_download_from_local_repo/6/

Changes:

* oops fix compilation
* touch to trigger build:
* oops fix compilation
* touch to trigger build:
* oops fix compilation
* touch to trigger build:
* oops fix compilation
* touch to trigger build:
* oops fix compilation
* touch to trigger build:
* oops fix compilation
* touch to trigger build:

All tests passed