Build failed in Jenkins: Maven TLP » maven-invoker-plugin » MINVOKER-249_install_mojo_download_from_local_repo #1

classic Classic list List threaded Threaded
3 messages Options
Reply | Threaded
Open this post in threaded view
|

Build failed in Jenkins: Maven TLP » maven-invoker-plugin » MINVOKER-249_install_mojo_download_from_local_repo #1

Apache Jenkins Server-2
See https://builds.apache.org/job/maven-box/job/maven-invoker-plugin/job/MINVOKER-249_install_mojo_download_from_local_repo/1/

No changes.

All tests passed

Build log:
[...truncated 8723 lines...]
[ERROR]
[ERROR] For more information about the errors and possible solutions, please read the following articles:
[ERROR] [Help 1] http://cwiki.apache.org/confluence/display/MAVEN/MojoFailureException
[Pipeline] }
[Pipeline] // dir
[Pipeline] }
[Fast Archiver] No prior successful build to compare, so performing full copy of artifacts
[withMaven] junitPublisher - Archive test results for Maven artifact org.apache.maven.plugins:maven-invoker-plugin:maven-plugin:3.2.1-SNAPSHOT generated by maven-surefire-plugin:test (default-test): linux-jdk13-m3.6.x_build/target/surefire-reports/*.xml
Recording test results
[withMaven] openTasksPublisher - Scan Tasks for Maven artifact org.apache.maven.plugins:maven-invoker-plugin:maven-plugin:3.2.1-SNAPSHOT in source directory linux-jdk13-m3.6.x_build/src/main/java
[TASKS] Scanning folder '/home/jenkins/jenkins-slave/workspace/ll_mojo_download_from_local_repo@2' for files matching the pattern 'linux-jdk13-m3.6.x_build/src/main/java/**/*' - excludes: null
[TASKS] Found 17 files to scan for tasks
[TASKS] Found 8 open tasks.
Skipping warnings blame since pipelines do not have an SCM link.%n
[withMaven] invokerPublisher - Archive invoker results for Maven artifact MavenArtifact{org.apache.maven.plugins:maven-invoker-plugin:maven-plugin:3.2.1-SNAPSHOT(version: 3.2.1-SNAPSHOT, snapshot:false) } generated by PluginInvocation{org.apache.maven.plugins:maven-invoker-plugin:3.2.0@integration-test  integration-test}: linux-jdk13-m3.6.x_build/target/invoker-reports/*.xml
[withMaven] Publishers: Generated Artifacts Publisher: 159 ms, Junit Publisher: 2579 ms, Open Task Scanner Publisher: 878 ms, Invoker Publisher: 70312 ms
[Pipeline] // withMaven
[Pipeline] cleanWs
[WS-CLEANUP] Deleting project workspace...
[WS-CLEANUP] Deferred wipeout is used...
[WS-CLEANUP] done
[Pipeline] cleanWs
[WS-CLEANUP] Deleting project workspace...
[WS-CLEANUP] Deferred wipeout is used...
[WS-CLEANUP] done
[Pipeline] }
[Pipeline] // stage
[Pipeline] }
[Pipeline] // ws
[Pipeline] }
[Pipeline] // node
[Pipeline] }
Failed in branch linux-jdk13-m3.6.x_build
[INFO]           MINVOKER-191\pom.xml ............................. SUCCESS (908.8 s)
[INFO] Building: MINVOKER-196_junit_report_file\pom.xml
[INFO] run post-build script verify.groovy
[INFO]           MINVOKER-196_junit_report_file\pom.xml ........... SUCCESS (11.6 s)
[INFO] Building: MINVOKER-243_install-reactor\pom.xml
[INFO] run post-build script verify.groovy
[INFO]           MINVOKER-243_install-reactor\pom.xml ............. SUCCESS (6.5 s)
[INFO] Building: multiEnvVar\pom.xml
[INFO]           multiEnvVar\pom.xml .............................. SUCCESS (9.8 s)
[INFO] Building: not-clone-not-plugin\pom.xml
[INFO] run post-build script verify.bsh
[INFO]           not-clone-not-plugin\pom.xml ..................... SUCCESS (7.3 s)
[INFO] Building: pom-filtering\pom.xml
[INFO] run post-build script verify.bsh
[INFO]           pom-filtering\pom.xml ............................ SUCCESS (7.5 s)
[INFO] Building: pom-filtering-encoding\pom.xml
[INFO] run post-build script verify.bsh
[INFO]           pom-filtering-encoding\pom.xml ................... SUCCESS (10.5 s)
[INFO] Building: pom-filtering-reactor\pom.xml
[INFO] run post-build script verify.bsh
[INFO]           pom-filtering-reactor\pom.xml .................... SUCCESS (8.1 s)
[INFO] Building: pom-less-invocation\pom.xml
[INFO] run post-build script verify.bsh
[INFO]           pom-less-invocation\pom.xml ...................... SUCCESS (5.3 s)
[INFO] Building: postbuild-executed-only-once\pom.xml
[INFO] run post-build script verify.bsh
[INFO]           postbuild-executed-only-once\pom.xml ............. SUCCESS (22.0 s)
[INFO] Building: project-cloning\pom.xml
[INFO] run pre-build script setup.bsh
[INFO] run post-build script verify.bsh
[INFO]           project-cloning\pom.xml .......................... SUCCESS (12.9 s)
[INFO] Building: project-cloning-reactor\pom.xml
[INFO] run post-build script verify.bsh
[INFO]           project-cloning-reactor\pom.xml .................. SUCCESS (7.3 s)
[INFO] Building: project-setup\pom.xml
[INFO] run post-build script verify.bsh
[INFO]           project-setup\pom.xml ............................ SUCCESS (18.4 s)
[INFO] Building: script-accessibility\pom.xml
[INFO]           script-accessibility\pom.xml ..................... SUCCESS (12.3 s)
[INFO] Building: script-additional-vars\pom.xml
[INFO]           script-additional-vars\pom.xml ................... SUCCESS (11.1 s)
[INFO] Building: script-class-loading\pom.xml
[INFO]           script-class-loading\pom.xml ..................... SUCCESS (12.2 s)
[INFO] Building: script-classpath-duplicates\pom.xml
[INFO] run post-build script verify.bsh
[INFO]           script-classpath-duplicates\pom.xml .............. SUCCESS (11.5 s)
[INFO] Building: script-context\pom.xml
[INFO] run post-build script verify.bsh
[INFO]           script-context\pom.xml ........................... SUCCESS (10.4 s)
[INFO] Building: script-errors\pom.xml
[INFO] run post-build script verify.bsh
[INFO]           script-errors\pom.xml ............................ SUCCESS (5.5 s)
[INFO] Building: script-global-vars\pom.xml
[INFO]           script-global-vars\pom.xml ....................... SUCCESS (11.0 s)
[INFO] Building: script-interpreter-detection\pom.xml
[INFO] run post-build script verify.bsh
[INFO]           script-interpreter-detection\pom.xml ............. SUCCESS (10.4 s)
[INFO] Building: script-verify-xml\pom.xml
[INFO] run post-build script verify.groovy
[INFO]           script-verify-xml\pom.xml ........................ SUCCESS (3.5 s)
[INFO] Building: selector-conditions\pom.xml
[INFO] run post-build script verify.groovy
[INFO]           selector-conditions\pom.xml ...................... SUCCESS (13.2 s)
[INFO] Building: selector-scripts\pom.xml
[INFO] run pre-build script setup.groovy
[INFO] run post-build script verify.bsh
[INFO]           selector-scripts\pom.xml ......................... SUCCESS (10.5 s)
[INFO] Building: settings-auto-exclude\pom.xml
[INFO]           settings-auto-exclude\pom.xml .................... SUCCESS (7.6 s)
[INFO] Building: settings-inherit\pom.xml
[INFO]           settings-inherit\pom.xml ......................... SUCCESS (9.7 s)
[INFO] Building: settings-merge\pom.xml
[INFO]           settings-merge\pom.xml ........................... SUCCESS (18.1 s)
[INFO] Building: settings-merge-multiexecutions\pom.xml
[INFO]           settings-merge-multiexecutions\pom.xml ........... SUCCESS (12.8 s)
[INFO] Building: settings-merge_jdk9+\pom.xml
[INFO]           settings-merge_jdk9+\pom.xml ..................... SUCCESS (14.9 s)
[INFO] Building: settings-override\pom.xml
[INFO]           settings-override\pom.xml ........................ SUCCESS (8.1 s)
[INFO] Building: skip-install\pom.xml
[INFO] run post-build script verify.bsh
[INFO]           skip-install\pom.xml ............................. SUCCESS (3.8 s)
[INFO] Building: skip-run\pom.xml
[INFO] run post-build script verify.bsh
[INFO]           skip-run\pom.xml ................................. SUCCESS (3.5 s)
[INFO] Building: spaces-should-work_non-windows\pom.xml
[INFO]           spaces-should-work_non-windows\pom.xml ........... SKIPPED due to OS
[INFO] Building: spaces-should-work_windows\pom.xml
[INFO] run pre-build script setup.groovy
[INFO]           spaces-should-work_windows\pom.xml ............... SUCCESS (8.9 s)
[INFO] Building: special-characters-should-work\pom.xml
[INFO] run pre-build script setup.groovy
[INFO]           special-characters-should-work\pom.xml ........... SUCCESS (8.0 s)
[INFO] Building: staging-dependencies\pom.xml
[INFO] run post-build script verify.bsh
[INFO]           staging-dependencies\pom.xml ..................... SUCCESS (8.7 s)
[INFO] Building: staging-pom\pom.xml
[INFO] run post-build script verify.bsh
[INFO]           staging-pom\pom.xml .............................. SUCCESS (4.3 s)
[INFO] Building: staging-reactor\pom.xml
[INFO] run post-build script verify.bsh
[INFO]           staging-reactor\pom.xml .......................... SUCCESS (8.5 s)
[INFO] Building: wrongPropertyInterpolation\pom.xml
[INFO]           wrongPropertyInterpolation\pom.xml ............... SUCCESS (32.0 s)
[INFO]
[INFO] --- maven-checkstyle-plugin:3.0.0:check (checkstyle-check) @ maven-invoker-plugin ---
[INFO] There are 4 errors reported by Checkstyle 6.18 with config/maven_checks.xml ruleset.
[INFO] Ignored 4 errors, 0 violation remaining.
[INFO]
[INFO] --- maven-invoker-plugin:3.2.0:verify (integration-test) @ maven-invoker-plugin ---
[INFO] -------------------------------------------------
[INFO] Build Summary:
[INFO]   Passed: 71, Failed: 1, Errors: 0, Skipped: 1
[INFO] -------------------------------------------------
[ERROR] The following builds failed:
[ERROR] *  install-extra-artifacts-local-repo\pom.xml
[INFO] -------------------------------------------------
[INFO] ------------------------------------------------------------------------
[INFO] BUILD FAILURE
[INFO] ------------------------------------------------------------------------
[INFO] Total time: 29:41 min
[INFO] Finished at: 2019-07-28T23:47:52-07:00
[INFO] Final Memory: 99M/1485M
[INFO] ------------------------------------------------------------------------
[INFO] [jenkins-event-spy] Generated F:\jenkins\jenkins-slave\workspace\ll_mojo_download_from_local_repo@3@tmp\withMaven04a1e152\maven-spy-20190728-231810-7096322209753289986165.log
[ERROR] Failed to execute goal org.apache.maven.plugins:maven-invoker-plugin:3.2.0:verify (integration-test) on project maven-invoker-plugin: 1 build failed. See console output above for details. -> [Help 1]
org.apache.maven.lifecycle.LifecycleExecutionException: Failed to execute goal org.apache.maven.plugins:maven-invoker-plugin:3.2.0:verify (integration-test) on project maven-invoker-plugin: 1 build failed. See console output above for details.
    at org.apache.maven.lifecycle.internal.MojoExecutor.execute (MojoExecutor.java:213)
    at org.apache.maven.lifecycle.internal.MojoExecutor.execute (MojoExecutor.java:154)
    at org.apache.maven.lifecycle.internal.MojoExecutor.execute (MojoExecutor.java:146)
    at org.apache.maven.lifecycle.internal.LifecycleModuleBuilder.buildProject (LifecycleModuleBuilder.java:117)
    at org.apache.maven.lifecycle.internal.LifecycleModuleBuilder.buildProject (LifecycleModuleBuilder.java:81)
    at org.apache.maven.lifecycle.internal.builder.singlethreaded.SingleThreadedBuilder.build (SingleThreadedBuilder.java:51)
    at org.apache.maven.lifecycle.internal.LifecycleStarter.execute (LifecycleStarter.java:128)
    at org.apache.maven.DefaultMaven.doExecute (DefaultMaven.java:309)
    at org.apache.maven.DefaultMaven.doExecute (DefaultMaven.java:194)
    at org.apache.maven.DefaultMaven.execute (DefaultMaven.java:107)
    at org.apache.maven.cli.MavenCli.execute (MavenCli.java:955)
    at org.apache.maven.cli.MavenCli.doMain (MavenCli.java:290)
    at org.apache.maven.cli.MavenCli.main (MavenCli.java:194)
    at sun.reflect.NativeMethodAccessorImpl.invoke0 (Native Method)
    at sun.reflect.NativeMethodAccessorImpl.invoke (NativeMethodAccessorImpl.java:57)
    at sun.reflect.DelegatingMethodAccessorImpl.invoke (DelegatingMethodAccessorImpl.java:43)
    at java.lang.reflect.Method.invoke (Method.java:606)
    at org.codehaus.plexus.classworlds.launcher.Launcher.launchEnhanced (Launcher.java:289)
    at org.codehaus.plexus.classworlds.launcher.Launcher.launch (Launcher.java:229)
    at org.codehaus.plexus.classworlds.launcher.Launcher.mainWithExitCode (Launcher.java:415)
    at org.codehaus.plexus.classworlds.launcher.Launcher.main (Launcher.java:356)
Caused by: org.apache.maven.plugin.MojoFailureException: 1 build failed. See console output above for details.
    at org.apache.maven.plugins.invoker.InvokerSession.handleFailures (InvokerSession.java:260)
    at org.apache.maven.plugins.invoker.VerifyMojo.execute (VerifyMojo.java:140)
    at org.apache.maven.plugin.DefaultBuildPluginManager.executeMojo (DefaultBuildPluginManager.java:134)
    at org.apache.maven.lifecycle.internal.MojoExecutor.execute (MojoExecutor.java:208)
    at org.apache.maven.lifecycle.internal.MojoExecutor.execute (MojoExecutor.java:154)
    at org.apache.maven.lifecycle.internal.MojoExecutor.execute (MojoExecutor.java:146)
    at org.apache.maven.lifecycle.internal.LifecycleModuleBuilder.buildProject (LifecycleModuleBuilder.java:117)
    at org.apache.maven.lifecycle.internal.LifecycleModuleBuilder.buildProject (LifecycleModuleBuilder.java:81)
    at org.apache.maven.lifecycle.internal.builder.singlethreaded.SingleThreadedBuilder.build (SingleThreadedBuilder.java:51)
    at org.apache.maven.lifecycle.internal.LifecycleStarter.execute (LifecycleStarter.java:128)
    at org.apache.maven.DefaultMaven.doExecute (DefaultMaven.java:309)
    at org.apache.maven.DefaultMaven.doExecute (DefaultMaven.java:194)
    at org.apache.maven.DefaultMaven.execute (DefaultMaven.java:107)
    at org.apache.maven.cli.MavenCli.execute (MavenCli.java:955)
    at org.apache.maven.cli.MavenCli.doMain (MavenCli.java:290)
    at org.apache.maven.cli.MavenCli.main (MavenCli.java:194)
    at sun.reflect.NativeMethodAccessorImpl.invoke0 (Native Method)
    at sun.reflect.NativeMethodAccessorImpl.invoke (NativeMethodAccessorImpl.java:57)
    at sun.reflect.DelegatingMethodAccessorImpl.invoke (DelegatingMethodAccessorImpl.java:43)
    at java.lang.reflect.Method.invoke (Method.java:606)
    at org.codehaus.plexus.classworlds.launcher.Launcher.launchEnhanced (Launcher.java:289)
    at org.codehaus.plexus.classworlds.launcher.Launcher.launch (Launcher.java:229)
    at org.codehaus.plexus.classworlds.launcher.Launcher.mainWithExitCode (Launcher.java:415)
    at org.codehaus.plexus.classworlds.launcher.Launcher.main (Launcher.java:356)
[ERROR]
[ERROR] Re-run Maven using the -X switch to enable full debug logging.
[ERROR]
[ERROR] For more information about the errors and possible solutions, please read the following articles:
[ERROR] [Help 1] http://cwiki.apache.org/confluence/display/MAVEN/MojoFailureException
Picked up JAVA_TOOL_OPTIONS: -Dmaven.ext.class.path="f:\jenkins\jenkins-slave\workspace\ll_mojo_download_from_local_repo@3@tmp\withMaven04a1e152\pipeline-maven-spy.jar" -Dorg.jenkinsci.plugins.pipeline.maven.reportsFolder="f:\jenkins\jenkins-slave\workspace\ll_mojo_download_from_local_repo@3@tmp\withMaven04a1e152"
[Pipeline] }
[Pipeline] // dir
[Pipeline] }
[Fast Archiver] No prior successful build to compare, so performing full copy of artifacts
[withMaven] junitPublisher - Archive test results for Maven artifact org.apache.maven.plugins:maven-invoker-plugin:maven-plugin:3.2.1-SNAPSHOT generated by maven-surefire-plugin:test (default-test): windows-jdk7-m3.5.x_build\target\surefire-reports\*.xml
Recording test results
[withMaven] openTasksPublisher - Scan Tasks for Maven artifact org.apache.maven.plugins:maven-invoker-plugin:maven-plugin:3.2.1-SNAPSHOT in source directory windows-jdk7-m3.5.x_build\src\main\java
[TASKS] Scanning folder 'f:\jenkins\jenkins-slave\workspace\ll_mojo_download_from_local_repo@3' for files matching the pattern 'windows-jdk7-m3.5.x_build\src\main\java\**\*' - excludes: null
[TASKS] Found 17 files to scan for tasks
[TASKS] Found 8 open tasks.
Skipping warnings blame since pipelines do not have an SCM link.%n
[withMaven] invokerPublisher - Archive invoker results for Maven artifact MavenArtifact{org.apache.maven.plugins:maven-invoker-plugin:maven-plugin:3.2.1-SNAPSHOT(version: 3.2.1-SNAPSHOT, snapshot:false) } generated by PluginInvocation{org.apache.maven.plugins:maven-invoker-plugin:3.2.0@integration-test  integration-test}: windows-jdk7-m3.5.x_build\target\invoker-reports\*.xml
[withMaven] Publishers: Generated Artifacts Publisher: 7 ms, Junit Publisher: 140 ms, Open Task Scanner Publisher: 101 ms, Invoker Publisher: 34151 ms
[Pipeline] // withMaven
[Pipeline] cleanWs
[WS-CLEANUP] Deleting project workspace...
[WS-CLEANUP] Deferred wipeout is used...
[WS-CLEANUP] done
[Pipeline] cleanWs
[WS-CLEANUP] Deleting project workspace...
[WS-CLEANUP] Deferred wipeout is used...
[WS-CLEANUP] done
[Pipeline] }
[Pipeline] // stage
[Pipeline] }
[Pipeline] // ws
[Pipeline] }
[Pipeline] // node
[Pipeline] }
Failed in branch windows-jdk7-m3.5.x_build
[Pipeline] // parallel
[Pipeline] stage
[Pipeline] { (Notifications)
[Pipeline] echo
Build result: FAILURE
[Pipeline] jiraIssueSelector
[Pipeline] emailext
Reply | Threaded
Open this post in threaded view
|

Build failed in Jenkins: Maven TLP » maven-invoker-plugin » MINVOKER-249_install_mojo_download_from_local_repo #2

Apache Jenkins Server-2
See https://builds.apache.org/job/maven-box/job/maven-invoker-plugin/job/MINVOKER-249_install_mojo_download_from_local_repo/2/

Changes:

* [INFRA-18734] Jenkins builds fail on email notifications due to unknown
* Scripts not permitted to use staticMethod
* excluded message body from the log message
* NotSerializableException: hudson.plugins.git.GitChangeSetList
* investigating permissions to the call 'ChangeSetList.author'
* NotSerializableException: hudson.plugins.git.GitChangeSetList
* [INFRA-18734] Jenkins builds fail on email notifications due to unknown
* Prevent Caused: java.io.NotSerializableException: hudson.model.User
* [INFRA-18734] Jenkins builds fail on email notifications due to unknown
* last() cannot be called on []
* [improvement] currentBuild.changeSets can be referenced as changes
* moved the fix of INFRA-18734 to jenkinsNotify
* ${env.EXECUTOR_NUMBER} returns null
* inline env.BRANCH_NAME directly in IF statement
* used env.EXECUTOR_NUMBER
* moved "def localRepo ..." to the stage execution block

All tests passed

Build log:
[...truncated 8876 lines...]
[Pipeline] }
[Pipeline] // stage
[Pipeline] }
[Pipeline] // ws
[Pipeline] }
[Pipeline] // node
[Pipeline] }
Failed in branch windows-jdk12-m3.6.x_build
[INFO] run post-build script verify.bsh
[INFO]           staging-dependencies\pom.xml ..................... SUCCESS (6.8 s)
[INFO] Building: staging-pom\pom.xml
[INFO] run post-build script verify.bsh
[INFO]           staging-pom\pom.xml .............................. SUCCESS (3.3 s)
[INFO] Building: staging-reactor\pom.xml
[INFO]           special-characters-should-work\pom.xml ........... SUCCESS (7.8 s)
[INFO] Building: staging-dependencies\pom.xml
[INFO] run post-build script verify.bsh
[INFO]           staging-reactor\pom.xml .......................... SUCCESS (6.3 s)
[INFO] Building: wrongPropertyInterpolation\pom.xml
[INFO] run post-build script verify.bsh
[INFO]           staging-dependencies\pom.xml ..................... SUCCESS (7.7 s)
[INFO] Building: staging-pom\pom.xml
[INFO] run post-build script verify.bsh
[INFO]           staging-pom\pom.xml .............................. SUCCESS (4.6 s)
[INFO] Building: staging-reactor\pom.xml
[INFO] run post-build script verify.bsh
[INFO]           staging-reactor\pom.xml .......................... SUCCESS (7.3 s)
[INFO] Building: wrongPropertyInterpolation\pom.xml
[INFO]           wrongPropertyInterpolation\pom.xml ............... SUCCESS (17.7 s)
[INFO]
[INFO] --- maven-checkstyle-plugin:3.0.0:check (checkstyle-check) @ maven-invoker-plugin ---
[INFO] There are 4 errors reported by Checkstyle 6.18 with config/maven_checks.xml ruleset.
[INFO] Ignored 4 errors, 0 violation remaining.
[INFO]
[INFO] --- maven-invoker-plugin:3.2.0:verify (integration-test) @ maven-invoker-plugin ---
[INFO] -------------------------------------------------
[INFO] Build Summary:
[INFO]   Passed: 70, Failed: 1, Errors: 0, Skipped: 2
[INFO] -------------------------------------------------
[ERROR] The following builds failed:
[ERROR] *  install-extra-artifacts-local-repo\pom.xml
[INFO] -------------------------------------------------
[INFO] ------------------------------------------------------------------------
[INFO] BUILD FAILURE
[INFO] ------------------------------------------------------------------------
[INFO] Total time:  09:54 min
[INFO] Finished at: 2019-08-28T06:24:44-07:00
[INFO] ------------------------------------------------------------------------
[INFO] [jenkins-event-spy] Generated F:\jenkins\jenkins-slave\workspace\ll_mojo_download_from_local_repo@2@tmp\withMaven48477c70\maven-spy-20190828-061450-5594196110404617894164.log
[ERROR] Failed to execute goal org.apache.maven.plugins:maven-invoker-plugin:3.2.0:verify (integration-test) on project maven-invoker-plugin: 1 build failed. See console output above for details. -> [Help 1]
org.apache.maven.lifecycle.LifecycleExecutionException: Failed to execute goal org.apache.maven.plugins:maven-invoker-plugin:3.2.0:verify (integration-test) on project maven-invoker-plugin: 1 build failed. See console output above for details.
    at org.apache.maven.lifecycle.internal.MojoExecutor.execute (MojoExecutor.java:215)
    at org.apache.maven.lifecycle.internal.MojoExecutor.execute (MojoExecutor.java:156)
    at org.apache.maven.lifecycle.internal.MojoExecutor.execute (MojoExecutor.java:148)
    at org.apache.maven.lifecycle.internal.LifecycleModuleBuilder.buildProject (LifecycleModuleBuilder.java:117)
    at org.apache.maven.lifecycle.internal.LifecycleModuleBuilder.buildProject (LifecycleModuleBuilder.java:81)
    at org.apache.maven.lifecycle.internal.builder.singlethreaded.SingleThreadedBuilder.build (SingleThreadedBuilder.java:56)
    at org.apache.maven.lifecycle.internal.LifecycleStarter.execute (LifecycleStarter.java:128)
    at org.apache.maven.DefaultMaven.doExecute (DefaultMaven.java:305)
    at org.apache.maven.DefaultMaven.doExecute (DefaultMaven.java:192)
    at org.apache.maven.DefaultMaven.execute (DefaultMaven.java:105)
    at org.apache.maven.cli.MavenCli.execute (MavenCli.java:956)
    at org.apache.maven.cli.MavenCli.doMain (MavenCli.java:288)
    at org.apache.maven.cli.MavenCli.main (MavenCli.java:192)
    at jdk.internal.reflect.NativeMethodAccessorImpl.invoke0 (Native Method)
    at jdk.internal.reflect.NativeMethodAccessorImpl.invoke (NativeMethodAccessorImpl.java:62)
    at jdk.internal.reflect.DelegatingMethodAccessorImpl.invoke (DelegatingMethodAccessorImpl.java:43)
    at java.lang.reflect.Method.invoke (Method.java:567)
    at org.codehaus.plexus.classworlds.launcher.Launcher.launchEnhanced (Launcher.java:289)
    at org.codehaus.plexus.classworlds.launcher.Launcher.launch (Launcher.java:229)
    at org.codehaus.plexus.classworlds.launcher.Launcher.mainWithExitCode (Launcher.java:415)
    at org.codehaus.plexus.classworlds.launcher.Launcher.main (Launcher.java:356)
Caused by: org.apache.maven.plugin.MojoFailureException: 1 build failed. See console output above for details.
    at org.apache.maven.plugins.invoker.InvokerSession.handleFailures (InvokerSession.java:260)
    at org.apache.maven.plugins.invoker.VerifyMojo.execute (VerifyMojo.java:140)
    at org.apache.maven.plugin.DefaultBuildPluginManager.executeMojo (DefaultBuildPluginManager.java:137)
    at org.apache.maven.lifecycle.internal.MojoExecutor.execute (MojoExecutor.java:210)
    at org.apache.maven.lifecycle.internal.MojoExecutor.execute (MojoExecutor.java:156)
    at org.apache.maven.lifecycle.internal.MojoExecutor.execute (MojoExecutor.java:148)
    at org.apache.maven.lifecycle.internal.LifecycleModuleBuilder.buildProject (LifecycleModuleBuilder.java:117)
    at org.apache.maven.lifecycle.internal.LifecycleModuleBuilder.buildProject (LifecycleModuleBuilder.java:81)
    at org.apache.maven.lifecycle.internal.builder.singlethreaded.SingleThreadedBuilder.build (SingleThreadedBuilder.java:56)
    at org.apache.maven.lifecycle.internal.LifecycleStarter.execute (LifecycleStarter.java:128)
    at org.apache.maven.DefaultMaven.doExecute (DefaultMaven.java:305)
    at org.apache.maven.DefaultMaven.doExecute (DefaultMaven.java:192)
    at org.apache.maven.DefaultMaven.execute (DefaultMaven.java:105)
    at org.apache.maven.cli.MavenCli.execute (MavenCli.java:956)
    at org.apache.maven.cli.MavenCli.doMain (MavenCli.java:288)
    at org.apache.maven.cli.MavenCli.main (MavenCli.java:192)
    at jdk.internal.reflect.NativeMethodAccessorImpl.invoke0 (Native Method)
    at jdk.internal.reflect.NativeMethodAccessorImpl.invoke (NativeMethodAccessorImpl.java:62)
    at jdk.internal.reflect.DelegatingMethodAccessorImpl.invoke (DelegatingMethodAccessorImpl.java:43)
    at java.lang.reflect.Method.invoke (Method.java:567)
    at org.codehaus.plexus.classworlds.launcher.Launcher.launchEnhanced (Launcher.java:289)
    at org.codehaus.plexus.classworlds.launcher.Launcher.launch (Launcher.java:229)
    at org.codehaus.plexus.classworlds.launcher.Launcher.mainWithExitCode (Launcher.java:415)
    at org.codehaus.plexus.classworlds.launcher.Launcher.main (Launcher.java:356)
[ERROR]
[ERROR] Re-run Maven using the -X switch to enable full debug logging.
[ERROR]
[ERROR] For more information about the errors and possible solutions, please read the following articles:
[ERROR] [Help 1] http://cwiki.apache.org/confluence/display/MAVEN/MojoFailureException
[Pipeline] }
[Pipeline] // dir
[Pipeline] }
[Fast Archiver] No prior successful build to compare, so performing full copy of artifacts
[withMaven] junitPublisher - Archive test results for Maven artifact org.apache.maven.plugins:maven-invoker-plugin:maven-plugin:3.2.1-SNAPSHOT generated by maven-surefire-plugin:test (default-test): windows-jdk13-m3.6.x_build\target\surefire-reports\*.xml
Recording test results
[withMaven] openTasksPublisher - Scan Tasks for Maven artifact org.apache.maven.plugins:maven-invoker-plugin:maven-plugin:3.2.1-SNAPSHOT in source directory windows-jdk13-m3.6.x_build\src\main\java
[TASKS] Scanning folder 'f:\jenkins\jenkins-slave\workspace\ll_mojo_download_from_local_repo@2' for files matching the pattern 'windows-jdk13-m3.6.x_build\src\main\java\**\*' - excludes: null
[TASKS] Found 17 files to scan for tasks
[TASKS] Found 8 open tasks.
Skipping warnings blame since pipelines do not have an SCM link.%n
[withMaven] invokerPublisher - Archive invoker results for Maven artifact MavenArtifact{org.apache.maven.plugins:maven-invoker-plugin:maven-plugin:3.2.1-SNAPSHOT(version: 3.2.1-SNAPSHOT, snapshot:false) } generated by PluginInvocation{org.apache.maven.plugins:maven-invoker-plugin:3.2.0@integration-test  integration-test}: windows-jdk13-m3.6.x_build\target\invoker-reports\*.xml
[INFO]           wrongPropertyInterpolation\pom.xml ............... SUCCESS (21.7 s)
[INFO]
[INFO] --- maven-checkstyle-plugin:3.0.0:check (checkstyle-check) @ maven-invoker-plugin ---
[INFO] There are 4 errors reported by Checkstyle 6.18 with config/maven_checks.xml ruleset.
[INFO] Ignored 4 errors, 0 violation remaining.
[INFO]
[INFO] --- maven-invoker-plugin:3.2.0:verify (integration-test) @ maven-invoker-plugin ---
[INFO] -------------------------------------------------
[INFO] Build Summary:
[INFO]   Passed: 71, Failed: 1, Errors: 0, Skipped: 1
[INFO] -------------------------------------------------
[ERROR] The following builds failed:
[ERROR] *  install-extra-artifacts-local-repo\pom.xml
[INFO] -------------------------------------------------
[INFO] ------------------------------------------------------------------------
[INFO] BUILD FAILURE
[INFO] ------------------------------------------------------------------------
[INFO] Total time: 27:02 min
[INFO] Finished at: 2019-08-28T06:25:04-07:00
[INFO] Final Memory: 56M/917M
[INFO] ------------------------------------------------------------------------
[INFO] [jenkins-event-spy] Generated F:\jenkins\jenkins-slave\workspace\ll_mojo_download_from_local_repo@2@tmp\withMaven72986dbd\maven-spy-20190828-055802-3592711951558131169442.log
[ERROR] Failed to execute goal org.apache.maven.plugins:maven-invoker-plugin:3.2.0:verify (integration-test) on project maven-invoker-plugin: 1 build failed. See console output above for details. -> [Help 1]
org.apache.maven.lifecycle.LifecycleExecutionException: Failed to execute goal org.apache.maven.plugins:maven-invoker-plugin:3.2.0:verify (integration-test) on project maven-invoker-plugin: 1 build failed. See console output above for details.
    at org.apache.maven.lifecycle.internal.MojoExecutor.execute (MojoExecutor.java:213)
    at org.apache.maven.lifecycle.internal.MojoExecutor.execute (MojoExecutor.java:154)
    at org.apache.maven.lifecycle.internal.MojoExecutor.execute (MojoExecutor.java:146)
    at org.apache.maven.lifecycle.internal.LifecycleModuleBuilder.buildProject (LifecycleModuleBuilder.java:117)
    at org.apache.maven.lifecycle.internal.LifecycleModuleBuilder.buildProject (LifecycleModuleBuilder.java:81)
    at org.apache.maven.lifecycle.internal.builder.singlethreaded.SingleThreadedBuilder.build (SingleThreadedBuilder.java:51)
    at org.apache.maven.lifecycle.internal.LifecycleStarter.execute (LifecycleStarter.java:128)
    at org.apache.maven.DefaultMaven.doExecute (DefaultMaven.java:309)
    at org.apache.maven.DefaultMaven.doExecute (DefaultMaven.java:194)
    at org.apache.maven.DefaultMaven.execute (DefaultMaven.java:107)
    at org.apache.maven.cli.MavenCli.execute (MavenCli.java:955)
    at org.apache.maven.cli.MavenCli.doMain (MavenCli.java:290)
    at org.apache.maven.cli.MavenCli.main (MavenCli.java:194)
    at sun.reflect.NativeMethodAccessorImpl.invoke0 (Native Method)
    at sun.reflect.NativeMethodAccessorImpl.invoke (NativeMethodAccessorImpl.java:57)
    at sun.reflect.DelegatingMethodAccessorImpl.invoke (DelegatingMethodAccessorImpl.java:43)
    at java.lang.reflect.Method.invoke (Method.java:606)
    at org.codehaus.plexus.classworlds.launcher.Launcher.launchEnhanced (Launcher.java:289)
    at org.codehaus.plexus.classworlds.launcher.Launcher.launch (Launcher.java:229)
    at org.codehaus.plexus.classworlds.launcher.Launcher.mainWithExitCode (Launcher.java:415)
    at org.codehaus.plexus.classworlds.launcher.Launcher.main (Launcher.java:356)
Caused by: org.apache.maven.plugin.MojoFailureException: 1 build failed. See console output above for details.
    at org.apache.maven.plugins.invoker.InvokerSession.handleFailures (InvokerSession.java:260)
    at org.apache.maven.plugins.invoker.VerifyMojo.execute (VerifyMojo.java:140)
    at org.apache.maven.plugin.DefaultBuildPluginManager.executeMojo (DefaultBuildPluginManager.java:134)
    at org.apache.maven.lifecycle.internal.MojoExecutor.execute (MojoExecutor.java:208)
    at org.apache.maven.lifecycle.internal.MojoExecutor.execute (MojoExecutor.java:154)
    at org.apache.maven.lifecycle.internal.MojoExecutor.execute (MojoExecutor.java:146)
    at org.apache.maven.lifecycle.internal.LifecycleModuleBuilder.buildProject (LifecycleModuleBuilder.java:117)
    at org.apache.maven.lifecycle.internal.LifecycleModuleBuilder.buildProject (LifecycleModuleBuilder.java:81)
    at org.apache.maven.lifecycle.internal.builder.singlethreaded.SingleThreadedBuilder.build (SingleThreadedBuilder.java:51)
    at org.apache.maven.lifecycle.internal.LifecycleStarter.execute (LifecycleStarter.java:128)
    at org.apache.maven.DefaultMaven.doExecute (DefaultMaven.java:309)
    at org.apache.maven.DefaultMaven.doExecute (DefaultMaven.java:194)
    at org.apache.maven.DefaultMaven.execute (DefaultMaven.java:107)
    at org.apache.maven.cli.MavenCli.execute (MavenCli.java:955)
    at org.apache.maven.cli.MavenCli.doMain (MavenCli.java:290)
    at org.apache.maven.cli.MavenCli.main (MavenCli.java:194)
    at sun.reflect.NativeMethodAccessorImpl.invoke0 (Native Method)
    at sun.reflect.NativeMethodAccessorImpl.invoke (NativeMethodAccessorImpl.java:57)
    at sun.reflect.DelegatingMethodAccessorImpl.invoke (DelegatingMethodAccessorImpl.java:43)
    at java.lang.reflect.Method.invoke (Method.java:606)
    at org.codehaus.plexus.classworlds.launcher.Launcher.launchEnhanced (Launcher.java:289)
    at org.codehaus.plexus.classworlds.launcher.Launcher.launch (Launcher.java:229)
    at org.codehaus.plexus.classworlds.launcher.Launcher.mainWithExitCode (Launcher.java:415)
    at org.codehaus.plexus.classworlds.launcher.Launcher.main (Launcher.java:356)
[ERROR]
[ERROR] Re-run Maven using the -X switch to enable full debug logging.
[ERROR]
[ERROR] For more information about the errors and possible solutions, please read the following articles:
[ERROR] [Help 1] http://cwiki.apache.org/confluence/display/MAVEN/MojoFailureException
Picked up JAVA_TOOL_OPTIONS: -Dmaven.ext.class.path="f:\jenkins\jenkins-slave\workspace\ll_mojo_download_from_local_repo@2@tmp\withMaven72986dbd\pipeline-maven-spy.jar" -Dorg.jenkinsci.plugins.pipeline.maven.reportsFolder="f:\jenkins\jenkins-slave\workspace\ll_mojo_download_from_local_repo@2@tmp\withMaven72986dbd"
[Pipeline] }
[Pipeline] // dir
[Pipeline] }
[Fast Archiver] No prior successful build to compare, so performing full copy of artifacts
[withMaven] junitPublisher - Archive test results for Maven artifact org.apache.maven.plugins:maven-invoker-plugin:maven-plugin:3.2.1-SNAPSHOT generated by maven-surefire-plugin:test (default-test): windows-jdk7-m3.5.x_build\target\surefire-reports\*.xml
Recording test results
[withMaven] openTasksPublisher - Scan Tasks for Maven artifact org.apache.maven.plugins:maven-invoker-plugin:maven-plugin:3.2.1-SNAPSHOT in source directory windows-jdk7-m3.5.x_build\src\main\java
[TASKS] Scanning folder 'f:\jenkins\jenkins-slave\workspace\ll_mojo_download_from_local_repo@2' for files matching the pattern 'windows-jdk7-m3.5.x_build\src\main\java\**\*' - excludes: null
[TASKS] Found 17 files to scan for tasks
[TASKS] Found 8 open tasks.
Skipping warnings blame since pipelines do not have an SCM link.%n
[withMaven] invokerPublisher - Archive invoker results for Maven artifact MavenArtifact{org.apache.maven.plugins:maven-invoker-plugin:maven-plugin:3.2.1-SNAPSHOT(version: 3.2.1-SNAPSHOT, snapshot:false) } generated by PluginInvocation{org.apache.maven.plugins:maven-invoker-plugin:3.2.0@integration-test  integration-test}: windows-jdk7-m3.5.x_build\target\invoker-reports\*.xml
[withMaven] Publishers: Generated Artifacts Publisher: 6 ms, Junit Publisher: 135 ms, Open Task Scanner Publisher: 78 ms, Invoker Publisher: 22089 ms
[Pipeline] // withMaven
[Pipeline] cleanWs
[WS-CLEANUP] Deleting project workspace...
[WS-CLEANUP] Deferred wipeout is used...
[WS-CLEANUP] done
[Pipeline] cleanWs
[WS-CLEANUP] Deleting project workspace...
[WS-CLEANUP] Deferred wipeout is used...
[WS-CLEANUP] done
[Pipeline] }
[Pipeline] // stage
[Pipeline] }
[Pipeline] // ws
[Pipeline] }
[Pipeline] // node
[Pipeline] }
Failed in branch windows-jdk13-m3.6.x_build
[withMaven] Publishers: Generated Artifacts Publisher: 7 ms, Junit Publisher: 142 ms, Open Task Scanner Publisher: 92 ms, Invoker Publisher: 34323 ms
[Pipeline] // withMaven
[Pipeline] cleanWs
[WS-CLEANUP] Deleting project workspace...
[WS-CLEANUP] Deferred wipeout is used...
[WS-CLEANUP] done
[Pipeline] cleanWs
[WS-CLEANUP] Deleting project workspace...
[WS-CLEANUP] Deferred wipeout is used...
[WS-CLEANUP] done
[Pipeline] }
[Pipeline] // stage
[Pipeline] }
[Pipeline] // ws
[Pipeline] }
[Pipeline] // node
[Pipeline] }
Failed in branch windows-jdk7-m3.5.x_build
[Pipeline] // parallel
[Pipeline] stage
[Pipeline] { (Notifications)
[Pipeline] echo
Build result: FAILURE
[Pipeline] jiraIssueSelector
[Pipeline] echo
The authors of changes [tibordigana, rfscholte].
[Pipeline] echo
Sending email ...
[Pipeline] emailext
Reply | Threaded
Open this post in threaded view
|

Build succeeded in Jenkins: Maven TLP » maven-invoker-plugin » MINVOKER-249_install_mojo_download_from_local_repo #3

Apache Jenkins Server-2
See https://builds.apache.org/job/maven-box/job/maven-invoker-plugin/job/MINVOKER-249_install_mojo_download_from_local_repo/3/

Changes:

* fix the it test
* fix the it test
* fix the it test
* fix the it test
* fix the it test
* fix the it test
* fix the it test
* fix the it test
* fix the it test
* fix the it test
* fix the it test
* fix the it test
* fix the it test
* fix the it test
* fix the it test

All tests passed