Build failed in Jenkins: Maven TLP » maven-invoker-plugin » MINVOKER-244 #1

classic Classic list List threaded Threaded
3 messages Options
Reply | Threaded
Open this post in threaded view
|

Build failed in Jenkins: Maven TLP » maven-invoker-plugin » MINVOKER-244 #1

Apache Jenkins Server-2
See https://builds.apache.org/job/maven-box/job/maven-invoker-plugin/job/MINVOKER-244/1/

No changes.

No tests ran.

Build log:
[...truncated 1.96 MB...]
[linux-jdk10] [INFO] Downloaded from central: https://repo.maven.apache.org/maven2/org/apache/maven/maven-project/2.0.8/maven-project-2.0.8.pom (2.7 kB at 246 kB/s)
[linux-jdk10] [INFO] Downloading from central: https://repo.maven.apache.org/maven2/org/apache/maven/maven-settings/2.0.8/maven-settings-2.0.8.pom
[linux-jdk10] [INFO] Downloaded from central: https://repo.maven.apache.org/maven2/org/apache/maven/maven-settings/2.0.8/maven-settings-2.0.8.pom (2.1 kB at 187 kB/s)
[linux-jdk10] [INFO] Downloading from central: https://repo.maven.apache.org/maven2/org/apache/maven/maven-profile/2.0.8/maven-profile-2.0.8.pom
[linux-jdk10] [INFO] Downloaded from central: https://repo.maven.apache.org/maven2/org/apache/maven/maven-profile/2.0.8/maven-profile-2.0.8.pom (2.0 kB at 204 kB/s)
[linux-jdk10] [INFO] Downloading from central: https://repo.maven.apache.org/maven2/org/apache/maven/maven-artifact-manager/2.0.8/maven-artifact-manager-2.0.8.pom
[linux-jdk10] [INFO] Downloaded from central: https://repo.maven.apache.org/maven2/org/apache/maven/maven-artifact-manager/2.0.8/maven-artifact-manager-2.0.8.pom (2.7 kB at 245 kB/s)
[linux-jdk10] [INFO] Downloading from central: https://repo.maven.apache.org/maven2/org/apache/maven/maven-repository-metadata/2.0.8/maven-repository-metadata-2.0.8.pom
[linux-jdk10] [INFO] Downloaded from central: https://repo.maven.apache.org/maven2/org/apache/maven/maven-repository-metadata/2.0.8/maven-repository-metadata-2.0.8.pom (1.9 kB at 190 kB/s)
[linux-jdk10] [INFO] Downloading from central: https://repo.maven.apache.org/maven2/org/apache/maven/maven-plugin-registry/2.0.8/maven-plugin-registry-2.0.8.pom
[linux-jdk10] [INFO] Downloaded from central: https://repo.maven.apache.org/maven2/org/apache/maven/maven-plugin-registry/2.0.8/maven-plugin-registry-2.0.8.pom (2.0 kB at 200 kB/s)
[linux-jdk10] [INFO] Downloading from central: https://repo.maven.apache.org/maven2/org/apache/maven/maven-plugin-api/2.0.8/maven-plugin-api-2.0.8.pom
[linux-jdk10] [INFO] Downloaded from central: https://repo.maven.apache.org/maven2/org/apache/maven/maven-plugin-api/2.0.8/maven-plugin-api-2.0.8.pom (1.5 kB at 136 kB/s)
[linux-jdk10] [INFO] Downloading from central: https://repo.maven.apache.org/maven2/junit/junit/3.8.2/junit-3.8.2.pom
[linux-jdk10] [INFO] Downloaded from central: https://repo.maven.apache.org/maven2/junit/junit/3.8.2/junit-3.8.2.pom (747 B at 68 kB/s)
[linux-jdk10] [INFO] Downloading from central: https://repo.maven.apache.org/maven2/org/codehaus/plexus/plexus-utils/2.1/plexus-utils-2.1.pom
[linux-jdk10] [INFO] Downloaded from central: https://repo.maven.apache.org/maven2/org/codehaus/plexus/plexus-utils/2.1/plexus-utils-2.1.pom (4.0 kB at 336 kB/s)
[linux-jdk10] [INFO] Downloading from central: https://repo.maven.apache.org/maven2/org/apache/maven/shared/maven-filtering/1.1/maven-filtering-1.1.pom
[linux-jdk10] [INFO] Downloaded from central: https://repo.maven.apache.org/maven2/org/apache/maven/shared/maven-filtering/1.1/maven-filtering-1.1.pom (5.8 kB at 526 kB/s)
[linux-jdk10] [INFO] Downloading from central: https://repo.maven.apache.org/maven2/org/apache/maven/maven-project/2.0.6/maven-project-2.0.6.pom
[linux-jdk10] [INFO] Downloaded from central: https://repo.maven.apache.org/maven2/org/apache/maven/maven-project/2.0.6/maven-project-2.0.6.pom (2.6 kB at 240 kB/s)
[linux-jdk10] [INFO] Downloading from central: https://repo.maven.apache.org/maven2/org/apache/maven/maven-settings/2.0.6/maven-settings-2.0.6.pom
[linux-jdk10] [INFO] Downloaded from central: https://repo.maven.apache.org/maven2/org/apache/maven/maven-settings/2.0.6/maven-settings-2.0.6.pom (2.0 kB at 182 kB/s)
[linux-jdk10] [INFO] Downloading from central: https://repo.maven.apache.org/maven2/org/apache/maven/maven-model/2.0.6/maven-model-2.0.6.pom
[linux-jdk10] [INFO] Downloaded from central: https://repo.maven.apache.org/maven2/org/apache/maven/maven-model/2.0.6/maven-model-2.0.6.pom (3.0 kB at 254 kB/s)
[linux-jdk10] [INFO] Downloading from central: https://repo.maven.apache.org/maven2/org/apache/maven/maven-profile/2.0.6/maven-profile-2.0.6.pom
[linux-jdk10] [INFO] Downloaded from central: https://repo.maven.apache.org/maven2/org/apache/maven/maven-profile/2.0.6/maven-profile-2.0.6.pom (2.0 kB at 152 kB/s)
[linux-jdk10] [INFO] Downloading from central: https://repo.maven.apache.org/maven2/org/apache/maven/maven-artifact-manager/2.0.6/maven-artifact-manager-2.0.6.pom
[linux-jdk10] [INFO] Downloaded from central: https://repo.maven.apache.org/maven2/org/apache/maven/maven-artifact-manager/2.0.6/maven-artifact-manager-2.0.6.pom (2.6 kB at 218 kB/s)
[linux-jdk10] [INFO] Downloading from central: https://repo.maven.apache.org/maven2/org/apache/maven/maven-repository-metadata/2.0.6/maven-repository-metadata-2.0.6.pom
[linux-jdk10] [INFO] Downloaded from central: https://repo.maven.apache.org/maven2/org/apache/maven/maven-repository-metadata/2.0.6/maven-repository-metadata-2.0.6.pom (1.9 kB at 168 kB/s)
[linux-jdk10] [INFO] Downloading from central: https://repo.maven.apache.org/maven2/org/apache/maven/maven-artifact/2.0.6/maven-artifact-2.0.6.pom
[linux-jdk10] [INFO] Downloaded from central: https://repo.maven.apache.org/maven2/org/apache/maven/maven-artifact/2.0.6/maven-artifact-2.0.6.pom (1.6 kB at 131 kB/s)
[linux-jdk10] [INFO] Downloading from central: https://repo.maven.apache.org/maven2/org/apache/maven/maven-plugin-registry/2.0.6/maven-plugin-registry-2.0.6.pom
[linux-jdk10] [INFO] Downloaded from central: https://repo.maven.apache.org/maven2/org/apache/maven/maven-plugin-registry/2.0.6/maven-plugin-registry-2.0.6.pom (1.9 kB at 177 kB/s)
[linux-jdk10] [INFO] Downloading from central: https://repo.maven.apache.org/maven2/org/apache/maven/maven-core/2.0.6/maven-core-2.0.6.pom
[linux-jdk10] [INFO] Downloaded from central: https://repo.maven.apache.org/maven2/org/apache/maven/maven-core/2.0.6/maven-core-2.0.6.pom (6.7 kB at 610 kB/s)
[linux-jdk10] [INFO] Downloading from central: https://repo.maven.apache.org/maven2/org/apache/maven/maven-plugin-parameter-documenter/2.0.6/maven-plugin-parameter-documenter-2.0.6.pom
[linux-jdk10] [INFO] Downloaded from central: https://repo.maven.apache.org/maven2/org/apache/maven/maven-plugin-parameter-documenter/2.0.6/maven-plugin-parameter-documenter-2.0.6.pom (1.9 kB at 174 kB/s)
[linux-jdk10] [INFO] Downloading from central: https://repo.maven.apache.org/maven2/org/apache/maven/reporting/maven-reporting-api/2.0.6/maven-reporting-api-2.0.6.pom
[linux-jdk10] [INFO] Downloaded from central: https://repo.maven.apache.org/maven2/org/apache/maven/reporting/maven-reporting-api/2.0.6/maven-reporting-api-2.0.6.pom (1.8 kB at 159 kB/s)
[linux-jdk10] [INFO] Downloading from central: https://repo.maven.apache.org/maven2/org/apache/maven/reporting/maven-reporting/2.0.6/maven-reporting-2.0.6.pom
[linux-jdk10] [INFO] Downloaded from central: https://repo.maven.apache.org/maven2/org/apache/maven/reporting/maven-reporting/2.0.6/maven-reporting-2.0.6.pom (1.4 kB at 120 kB/s)
[linux-jdk10] [INFO] Downloading from central: https://repo.maven.apache.org/maven2/org/apache/maven/doxia/doxia-sink-api/1.0-alpha-7/doxia-sink-api-1.0-alpha-7.pom
[linux-jdk10] [INFO] Downloaded from central: https://repo.maven.apache.org/maven2/org/apache/maven/doxia/doxia-sink-api/1.0-alpha-7/doxia-sink-api-1.0-alpha-7.pom (424 B at 39 kB/s)
[linux-jdk10] [INFO] Downloading from central: https://repo.maven.apache.org/maven2/org/apache/maven/doxia/doxia/1.0-alpha-7/doxia-1.0-alpha-7.pom
[linux-jdk10] [INFO] Downloaded from central: https://repo.maven.apache.org/maven2/org/apache/maven/doxia/doxia/1.0-alpha-7/doxia-1.0-alpha-7.pom (3.9 kB at 391 kB/s)
[linux-jdk10] [INFO] Downloading from central: https://repo.maven.apache.org/maven2/org/apache/maven/maven-error-diagnostics/2.0.6/maven-error-diagnostics-2.0.6.pom
[linux-jdk10] [INFO] Downloaded from central: https://repo.maven.apache.org/maven2/org/apache/maven/maven-error-diagnostics/2.0.6/maven-error-diagnostics-2.0.6.pom (1.7 kB at 155 kB/s)
[linux-jdk10] [INFO] Downloading from central: https://repo.maven.apache.org/maven2/commons-cli/commons-cli/1.0/commons-cli-1.0.pom
[linux-jdk10] [INFO] Downloaded from central: https://repo.maven.apache.org/maven2/commons-cli/commons-cli/1.0/commons-cli-1.0.pom (2.1 kB at 175 kB/s)
[linux-jdk10] [INFO] Downloading from central: https://repo.maven.apache.org/maven2/org/apache/maven/maven-plugin-descriptor/2.0.6/maven-plugin-descriptor-2.0.6.pom
[linux-jdk10] [INFO] Downloaded from central: https://repo.maven.apache.org/maven2/org/apache/maven/maven-plugin-descriptor/2.0.6/maven-plugin-descriptor-2.0.6.pom (2.0 kB at 183 kB/s)
[linux-jdk10] [INFO] Downloading from central: https://repo.maven.apache.org/maven2/org/apache/maven/maven-monitor/2.0.6/maven-monitor-2.0.6.pom
[linux-jdk10] [INFO] Downloaded from central: https://repo.maven.apache.org/maven2/org/apache/maven/maven-monitor/2.0.6/maven-monitor-2.0.6.pom (1.3 kB at 125 kB/s)
[linux-jdk10] [INFO] Downloading from central: https://repo.maven.apache.org/maven2/org/codehaus/plexus/plexus-interpolation/1.12/plexus-interpolation-1.12.pom
[linux-jdk10] [INFO] Downloaded from central: https://repo.maven.apache.org/maven2/org/codehaus/plexus/plexus-interpolation/1.12/plexus-interpolation-1.12.pom (889 B at 89 kB/s)
[linux-jdk10] [INFO] Downloading from central: https://repo.maven.apache.org/maven2/org/sonatype/plexus/plexus-build-api/0.0.4/plexus-build-api-0.0.4.pom
[linux-jdk10] [INFO] Downloaded from central: https://repo.maven.apache.org/maven2/org/sonatype/plexus/plexus-build-api/0.0.4/plexus-build-api-0.0.4.pom (2.9 kB at 260 kB/s)
[linux-jdk10] [INFO] Downloading from central: https://repo.maven.apache.org/maven2/org/sonatype/spice/spice-parent/10/spice-parent-10.pom
[linux-jdk10] [INFO] Downloaded from central: https://repo.maven.apache.org/maven2/org/sonatype/spice/spice-parent/10/spice-parent-10.pom (3.0 kB at 274 kB/s)
[linux-jdk10] [INFO] Downloading from central: https://repo.maven.apache.org/maven2/org/sonatype/forge/forge-parent/3/forge-parent-3.pom
[linux-jdk10] [INFO] Downloaded from central: https://repo.maven.apache.org/maven2/org/sonatype/forge/forge-parent/3/forge-parent-3.pom (5.0 kB at 458 kB/s)
[linux-jdk10] [INFO] Downloading from central: https://repo.maven.apache.org/maven2/org/codehaus/plexus/plexus-utils/1.5.8/plexus-utils-1.5.8.pom
[linux-jdk10] [INFO] Downloaded from central: https://repo.maven.apache.org/maven2/org/codehaus/plexus/plexus-utils/1.5.8/plexus-utils-1.5.8.pom (8.1 kB at 733 kB/s)
[linux-jdk10] [INFO] Downloading from central: https://repo.maven.apache.org/maven2/org/codehaus/plexus/plexus-resources/1.0-alpha-7/plexus-resources-1.0-alpha-7.pom
[linux-jdk10] [INFO] Downloaded from central: https://repo.maven.apache.org/maven2/org/codehaus/plexus/plexus-resources/1.0-alpha-7/plexus-resources-1.0-alpha-7.pom (1.4 kB at 124 kB/s)
[linux-jdk10] [INFO] Downloading from central: https://repo.maven.apache.org/maven2/org/codehaus/plexus/plexus-components/1.1.17/plexus-components-1.1.17.pom
[linux-jdk10] [INFO] Downloaded from central: https://repo.maven.apache.org/maven2/org/codehaus/plexus/plexus-components/1.1.17/plexus-components-1.1.17.pom (5.2 kB at 474 kB/s)
[linux-jdk10] [INFO] Downloading from central: https://repo.maven.apache.org/maven2/org/apache/maven/shared/maven-artifact-resolver/1.0/maven-artifact-resolver-1.0.jar
[linux-jdk10] [INFO] Downloading from central: https://repo.maven.apache.org/maven2/org/sonatype/plexus/plexus-build-api/0.0.4/plexus-build-api-0.0.4.jar
[linux-jdk10] [INFO] Downloading from central: https://repo.maven.apache.org/maven2/org/apache/maven/shared/maven-filtering/1.1/maven-filtering-1.1.jar
[linux-jdk10] [INFO] Downloading from central: https://repo.maven.apache.org/maven2/org/codehaus/plexus/plexus-interpolation/1.12/plexus-interpolation-1.12.jar
[linux-jdk10] [INFO] Downloading from central: https://repo.maven.apache.org/maven2/org/codehaus/plexus/plexus-resources/1.0-alpha-7/plexus-resources-1.0-alpha-7.jar
[linux-jdk10] [INFO] Downloaded from central: https://repo.maven.apache.org/maven2/org/apache/maven/shared/maven-artifact-resolver/1.0/maven-artifact-resolver-1.0.jar (14 kB at 970 kB/s)
[linux-jdk10] [INFO] Downloaded from central: https://repo.maven.apache.org/maven2/org/codehaus/plexus/plexus-resources/1.0-alpha-7/plexus-resources-1.0-alpha-7.jar (23 kB at 1.7 MB/s)
[linux-jdk10] [INFO] Downloaded from central: https://repo.maven.apache.org/maven2/org/apache/maven/shared/maven-filtering/1.1/maven-filtering-1.1.jar (43 kB at 3.1 MB/s)
[linux-jdk10] [INFO] Downloaded from central: https://repo.maven.apache.org/maven2/org/sonatype/plexus/plexus-build-api/0.0.4/plexus-build-api-0.0.4.jar (6.8 kB at 486 kB/s)
[linux-jdk10] [INFO] Downloaded from central: https://repo.maven.apache.org/maven2/org/codehaus/plexus/plexus-interpolation/1.12/plexus-interpolation-1.12.jar (61 kB at 4.1 MB/s)
[linux-jdk10] [INFO] Downloading from central: https://repo.maven.apache.org/maven2/org/codehaus/plexus/plexus-utils/1.5.15/plexus-utils-1.5.15.jar
[linux-jdk10] [INFO] Downloaded from central: https://repo.maven.apache.org/maven2/org/codehaus/plexus/plexus-utils/1.5.15/plexus-utils-1.5.15.jar (228 kB at 7.1 MB/s)
[linux-jdk10] [INFO] Downloading from central: https://repo.maven.apache.org/maven2/org/apache/apache-jar-resource-bundle/1.4/apache-jar-resource-bundle-1.4.jar
[linux-jdk10] [INFO] Downloaded from central: https://repo.maven.apache.org/maven2/org/apache/apache-jar-resource-bundle/1.4/apache-jar-resource-bundle-1.4.jar (12 kB at 1.0 MB/s)
[linux-jdk10] [INFO]
[linux-jdk10] [INFO] --- maven-resources-plugin:3.1.0:resources (default-resources) @ maven-invoker-plugin ---
[linux-jdk10] [INFO] Downloading from central: https://repo.maven.apache.org/maven2/org/apache/maven/shared/maven-filtering/3.1.1/maven-filtering-3.1.1.pom
[linux-jdk10] [INFO] Downloaded from central: https://repo.maven.apache.org/maven2/org/apache/maven/shared/maven-filtering/3.1.1/maven-filtering-3.1.1.pom (5.7 kB at 474 kB/s)
[linux-jdk10] [INFO] Downloading from central: https://repo.maven.apache.org/maven2/org/apache/maven/shared/maven-shared-utils/3.0.0/maven-shared-utils-3.0.0.pom
[linux-jdk10] [INFO] Downloaded from central: https://repo.maven.apache.org/maven2/org/apache/maven/shared/maven-shared-utils/3.0.0/maven-shared-utils-3.0.0.pom (5.6 kB at 508 kB/s)
[linux-jdk10] [INFO] Downloading from central: https://repo.maven.apache.org/maven2/commons-io/commons-io/2.4/commons-io-2.4.pom
[linux-jdk10] [INFO] Downloaded from central: https://repo.maven.apache.org/maven2/commons-io/commons-io/2.4/commons-io-2.4.pom (10 kB at 1.0 MB/s)
[linux-jdk10] [INFO] Downloading from central: https://repo.maven.apache.org/maven2/org/apache/commons/commons-parent/25/commons-parent-25.pom
[linux-jdk10] [INFO] Downloaded from central: https://repo.maven.apache.org/maven2/org/apache/commons/commons-parent/25/commons-parent-25.pom (48 kB at 4.0 MB/s)
[linux-jdk10] [INFO] Downloading from central: https://repo.maven.apache.org/maven2/org/codehaus/plexus/plexus-interpolation/1.22/plexus-interpolation-1.22.pom
[linux-jdk10] [INFO] Downloaded from central: https://repo.maven.apache.org/maven2/org/codehaus/plexus/plexus-interpolation/1.22/plexus-interpolation-1.22.pom (1.5 kB at 140 kB/s)
[linux-jdk10] [INFO] Downloading from central: https://repo.maven.apache.org/maven2/org/codehaus/plexus/plexus-components/1.3.1/plexus-components-1.3.1.pom
[linux-jdk10] [INFO] Downloaded from central: https://repo.maven.apache.org/maven2/org/codehaus/plexus/plexus-components/1.3.1/plexus-components-1.3.1.pom (3.1 kB at 255 kB/s)
[linux-jdk10] [INFO] Downloading from central: https://repo.maven.apache.org/maven2/org/apache/maven/shared/maven-filtering/3.1.1/maven-filtering-3.1.1.jar
[linux-jdk10] [INFO] Downloading from central: https://repo.maven.apache.org/maven2/org/apache/maven/shared/maven-shared-utils/3.0.0/maven-shared-utils-3.0.0.jar
[linux-jdk10] [INFO] Downloaded from central: https://repo.maven.apache.org/maven2/org/apache/maven/shared/maven-filtering/3.1.1/maven-filtering-3.1.1.jar (51 kB at 3.6 MB/s)
[linux-jdk10] [INFO] Downloaded from central: https://repo.maven.apache.org/maven2/org/apache/maven/shared/maven-shared-utils/3.0.0/maven-shared-utils-3.0.0.jar (155 kB at 8.1 MB/s)
[linux-jdk10] [INFO] Using 'UTF-8' encoding to copy filtered resources.
[linux-jdk10] [INFO] Copying 4 resources
[linux-jdk10] [INFO] Copying 3 resources
[linux-jdk10] [INFO]
[linux-jdk10] [INFO] --- maven-compiler-plugin:3.7.0:compile (default-compile) @ maven-invoker-plugin ---
[linux-jdk10] [INFO] Downloading from central: https://repo.maven.apache.org/maven2/org/codehaus/plexus/plexus-component-annotations/1.6/plexus-component-annotations-1.6.pom
[linux-jdk10] [INFO] Downloaded from central: https://repo.maven.apache.org/maven2/org/codehaus/plexus/plexus-component-annotations/1.6/plexus-component-annotations-1.6.pom (748 B at 62 kB/s)
[linux-jdk10] [INFO] Downloading from central: https://repo.maven.apache.org/maven2/org/codehaus/plexus/plexus-containers/1.6/plexus-containers-1.6.pom
[linux-jdk10] [INFO] Downloaded from central: https://repo.maven.apache.org/maven2/org/codehaus/plexus/plexus-containers/1.6/plexus-containers-1.6.pom (3.8 kB at 342 kB/s)
[linux-jdk10] [INFO] Downloading from central: https://repo.maven.apache.org/maven2/org/codehaus/plexus/plexus/3.3.2/plexus-3.3.2.pom
[linux-jdk10] [INFO] Downloaded from central: https://repo.maven.apache.org/maven2/org/codehaus/plexus/plexus/3.3.2/plexus-3.3.2.pom (22 kB at 2.0 MB/s)
[linux-jdk10] [INFO] Downloading from central: https://repo.maven.apache.org/maven2/org/apache/maven/shared/maven-shared-incremental/1.1/maven-shared-incremental-1.1.pom
[linux-jdk10] [INFO] Downloaded from central: https://repo.maven.apache.org/maven2/org/apache/maven/shared/maven-shared-incremental/1.1/maven-shared-incremental-1.1.pom (4.7 kB at 431 kB/s)
[linux-jdk10] [INFO] Downloading from central: https://repo.maven.apache.org/maven2/org/apache/maven/shared/maven-shared-utils/0.1/maven-shared-utils-0.1.pom
[linux-jdk10] [INFO] Downloaded from central: https://repo.maven.apache.org/maven2/org/apache/maven/shared/maven-shared-utils/0.1/maven-shared-utils-0.1.pom (4.0 kB at 368 kB/s)
[linux-jdk10] [INFO] Downloading from central: https://repo.maven.apache.org/maven2/org/codehaus/plexus/plexus-java/0.9.2/plexus-java-0.9.2.pom
[linux-jdk10] [INFO] Downloaded from central: https://repo.maven.apache.org/maven2/org/codehaus/plexus/plexus-java/0.9.2/plexus-java-0.9.2.pom (2.4 kB at 222 kB/s)
[linux-jdk10] [INFO] Downloading from central: https://repo.maven.apache.org/maven2/org/codehaus/plexus/plexus-languages/0.9.2/plexus-languages-0.9.2.pom
[linux-jdk10] [INFO] Downloaded from central: https://repo.maven.apache.org/maven2/org/codehaus/plexus/plexus-languages/0.9.2/plexus-languages-0.9.2.pom (2.3 kB at 207 kB/s)
[linux-jdk10] [INFO] Downloading from central: https://repo.maven.apache.org/maven2/org/ow2/asm/asm/6.0_BETA/asm-6.0_BETA.pom
[linux-jdk10] [INFO] Downloaded from central: https://repo.maven.apache.org/maven2/org/ow2/asm/asm/6.0_BETA/asm-6.0_BETA.pom (1.9 kB at 176 kB/s)
[linux-jdk10] [INFO] Downloading from central: https://repo.maven.apache.org/maven2/org/ow2/asm/asm-parent/6.0_BETA/asm-parent-6.0_BETA.pom
[linux-jdk10] [INFO] Downloaded from central: https://repo.maven.apache.org/maven2/org/ow2/asm/asm-parent/6.0_BETA/asm-parent-6.0_BETA.pom (5.5 kB at 550 kB/s)
[linux-jdk10] [INFO] Downloading from central: https://repo.maven.apache.org/maven2/org/ow2/ow2/1.3/ow2-1.3.pom
[linux-jdk10] [INFO] Downloaded from central: https://repo.maven.apache.org/maven2/org/ow2/ow2/1.3/ow2-1.3.pom (9.5 kB at 864 kB/s)
[linux-jdk10] [INFO] Downloading from central: https://repo.maven.apache.org/maven2/com/thoughtworks/qdox/qdox/2.0-M7/qdox-2.0-M7.pom
[linux-jdk10] [INFO] Downloaded from central: https://repo.maven.apache.org/maven2/com/thoughtworks/qdox/qdox/2.0-M7/qdox-2.0-M7.pom (16 kB at 1.4 MB/s)
[linux-jdk10] [INFO] Downloading from central: https://repo.maven.apache.org/maven2/org/codehaus/plexus/plexus-compiler-api/2.8.2/plexus-compiler-api-2.8.2.pom
[linux-jdk10] [INFO] Downloaded from central: https://repo.maven.apache.org/maven2/org/codehaus/plexus/plexus-compiler-api/2.8.2/plexus-compiler-api-2.8.2.pom (867 B at 79 kB/s)
[linux-jdk10] [INFO] Downloading from central: https://repo.maven.apache.org/maven2/org/codehaus/plexus/plexus-compiler/2.8.2/plexus-compiler-2.8.2.pom
[linux-jdk10] [INFO] Downloaded from central: https://repo.maven.apache.org/maven2/org/codehaus/plexus/plexus-compiler/2.8.2/plexus-compiler-2.8.2.pom (4.9 kB at 488 kB/s)
[linux-jdk10] [INFO] Downloading from central: https://repo.maven.apache.org/maven2/org/codehaus/plexus/plexus-compiler-manager/2.8.2/plexus-compiler-manager-2.8.2.pom
[linux-jdk10] [INFO] Downloaded from central: https://repo.maven.apache.org/maven2/org/codehaus/plexus/plexus-compiler-manager/2.8.2/plexus-compiler-manager-2.8.2.pom (692 B at 63 kB/s)
[linux-jdk10] [INFO] Downloading from central: https://repo.maven.apache.org/maven2/org/codehaus/plexus/plexus-compiler-javac/2.8.2/plexus-compiler-javac-2.8.2.pom
[linux-jdk10] [INFO] Downloaded from central: https://repo.maven.apache.org/maven2/org/codehaus/plexus/plexus-compiler-javac/2.8.2/plexus-compiler-javac-2.8.2.pom (771 B at 64 kB/s)
[linux-jdk10] [INFO] Downloading from central: https://repo.maven.apache.org/maven2/org/codehaus/plexus/plexus-compilers/2.8.2/plexus-compilers-2.8.2.pom
[linux-jdk10] [INFO] Downloaded from central: https://repo.maven.apache.org/maven2/org/codehaus/plexus/plexus-compilers/2.8.2/plexus-compilers-2.8.2.pom (1.3 kB at 112 kB/s)
[linux-jdk10] [INFO] Downloading from central: https://repo.maven.apache.org/maven2/org/codehaus/plexus/plexus-component-annotations/1.6/plexus-component-annotations-1.6.jar
[linux-jdk10] [INFO] Downloading from central: https://repo.maven.apache.org/maven2/org/apache/maven/shared/maven-shared-utils/3.1.0/maven-shared-utils-3.1.0.jar
[linux-jdk10] [INFO] Downloading from central: https://repo.maven.apache.org/maven2/org/codehaus/plexus/plexus-java/0.9.2/plexus-java-0.9.2.jar
[linux-jdk10] [INFO] Downloading from central: https://repo.maven.apache.org/maven2/org/apache/maven/shared/maven-shared-incremental/1.1/maven-shared-incremental-1.1.jar
[linux-jdk10] [INFO] Downloading from central: https://repo.maven.apache.org/maven2/org/ow2/asm/asm/6.0_BETA/asm-6.0_BETA.jar
[linux-jdk10] [INFO] Downloaded from central: https://repo.maven.apache.org/maven2/org/codehaus/plexus/plexus-component-annotations/1.6/plexus-component-annotations-1.6.jar (4.3 kB at 305 kB/s)
[linux-jdk10] [INFO] Downloading from central: https://repo.maven.apache.org/maven2/com/thoughtworks/qdox/qdox/2.0-M7/qdox-2.0-M7.jar
[linux-jdk10] [INFO] Downloaded from central: https://repo.maven.apache.org/maven2/org/codehaus/plexus/plexus-java/0.9.2/plexus-java-0.9.2.jar (31 kB at 2.2 MB/s)
[linux-jdk10] [INFO] Downloading from central: https://repo.maven.apache.org/maven2/org/codehaus/plexus/plexus-compiler-api/2.8.2/plexus-compiler-api-2.8.2.jar
[linux-jdk10] [INFO] Downloaded from central: https://repo.maven.apache.org/maven2/org/apache/maven/shared/maven-shared-utils/3.1.0/maven-shared-utils-3.1.0.jar (164 kB at 10 MB/s)
[linux-jdk10] [INFO] Downloading from central: https://repo.maven.apache.org/maven2/org/codehaus/plexus/plexus-compiler-manager/2.8.2/plexus-compiler-manager-2.8.2.jar
[linux-jdk10] [INFO] Downloaded from central: https://repo.maven.apache.org/maven2/org/ow2/asm/asm/6.0_BETA/asm-6.0_BETA.jar (56 kB at 3.5 MB/s)
[linux-jdk10] [INFO] Downloading from central: https://repo.maven.apache.org/maven2/org/codehaus/plexus/plexus-compiler-javac/2.8.2/plexus-compiler-javac-2.8.2.jar
[linux-jdk10] [INFO] Downloaded from central: https://repo.maven.apache.org/maven2/org/apache/maven/shared/maven-shared-incremental/1.1/maven-shared-incremental-1.1.jar (14 kB at 796 kB/s)
[linux-jdk10] [INFO] Downloaded from central: https://repo.maven.apache.org/maven2/org/codehaus/plexus/plexus-compiler-api/2.8.2/plexus-compiler-api-2.8.2.jar (26 kB at 1.1 MB/s)
[linux-jdk10] [INFO] Downloaded from central: https://repo.maven.apache.org/maven2/org/codehaus/plexus/plexus-compiler-manager/2.8.2/plexus-compiler-manager-2.8.2.jar (4.7 kB at 180 kB/s)
[linux-jdk10] [INFO] Downloaded from central: https://repo.maven.apache.org/maven2/org/codehaus/plexus/plexus-compiler-javac/2.8.2/plexus-compiler-javac-2.8.2.jar (20 kB at 692 kB/s)
[linux-jdk10] [INFO] Downloaded from central: https://repo.maven.apache.org/maven2/com/thoughtworks/qdox/qdox/2.0-M7/qdox-2.0-M7.jar (315 kB at 8.1 MB/s)
[linux-jdk10] [INFO] Changes detected - recompiling the module!
[linux-jdk10] [INFO] Compiling 20 source files to /home/jenkins/jenkins-slave/workspace/invoker-plugin_MINVOKER-244-NG7YUAFH574UIIL65MNYO3XPSEPSH37LV5D5Q6RWZE34ZWUPXEJA/m/target/classes
[linux-jdk10] [INFO] /home/jenkins/jenkins-slave/workspace/invoker-plugin_MINVOKER-244-NG7YUAFH574UIIL65MNYO3XPSEPSH37LV5D5Q6RWZE34ZWUPXEJA/m/src/main/java/org/apache/maven/plugins/invoker/InstallMojo.java: /home/jenkins/jenkins-slave/workspace/invoker-plugin_MINVOKER-244-NG7YUAFH574UIIL65MNYO3XPSEPSH37LV5D5Q6RWZE34ZWUPXEJA/m/src/main/java/org/apache/maven/plugins/invoker/InstallMojo.java uses or overrides a deprecated API.
[linux-jdk10] [INFO] /home/jenkins/jenkins-slave/workspace/invoker-plugin_MINVOKER-244-NG7YUAFH574UIIL65MNYO3XPSEPSH37LV5D5Q6RWZE34ZWUPXEJA/m/src/main/java/org/apache/maven/plugins/invoker/InstallMojo.java: Recompile with -Xlint:deprecation for details.
[linux-jdk10] [INFO] /home/jenkins/jenkins-slave/workspace/invoker-plugin_MINVOKER-244-NG7YUAFH574UIIL65MNYO3XPSEPSH37LV5D5Q6RWZE34ZWUPXEJA/m/target/generated-sources/modello/org/apache/maven/plugins/invoker/model/io/xpp3/BuildJobXpp3Reader.java: /home/jenkins/jenkins-slave/workspace/invoker-plugin_MINVOKER-244-NG7YUAFH574UIIL65MNYO3XPSEPSH37LV5D5Q6RWZE34ZWUPXEJA/m/target/generated-sources/modello/org/apache/maven/plugins/invoker/model/io/xpp3/BuildJobXpp3Reader.java uses unchecked or unsafe operations.
[linux-jdk10] [INFO] /home/jenkins/jenkins-slave/workspace/invoker-plugin_MINVOKER-244-NG7YUAFH574UIIL65MNYO3XPSEPSH37LV5D5Q6RWZE34ZWUPXEJA/m/target/generated-sources/modello/org/apache/maven/plugins/invoker/model/io/xpp3/BuildJobXpp3Reader.java: Recompile with -Xlint:unchecked for details.
[linux-jdk10] [INFO] -------------------------------------------------------------
[linux-jdk10] [ERROR] COMPILATION ERROR :
[linux-jdk10] [INFO] -------------------------------------------------------------
[linux-jdk10] [ERROR] /home/jenkins/jenkins-slave/workspace/invoker-plugin_MINVOKER-244-NG7YUAFH574UIIL65MNYO3XPSEPSH37LV5D5Q6RWZE34ZWUPXEJA/m/src/main/java/org/apache/maven/plugins/invoker/InstallMojo.java:[47,48] package org.apache.maven.shared.artifact.install does not exist
[linux-jdk10] [ERROR] /home/jenkins/jenkins-slave/workspace/invoker-plugin_MINVOKER-244-NG7YUAFH574UIIL65MNYO3XPSEPSH37LV5D5Q6RWZE34ZWUPXEJA/m/src/main/java/org/apache/maven/plugins/invoker/InstallMojo.java:[48,44] package org.apache.maven.shared.dependencies does not exist
[linux-jdk10] [ERROR] /home/jenkins/jenkins-slave/workspace/invoker-plugin_MINVOKER-244-NG7YUAFH574UIIL65MNYO3XPSEPSH37LV5D5Q6RWZE34ZWUPXEJA/m/src/main/java/org/apache/maven/plugins/invoker/InstallMojo.java:[49,52] package org.apache.maven.shared.dependencies.resolve does not exist
[linux-jdk10] [ERROR] /home/jenkins/jenkins-slave/workspace/invoker-plugin_MINVOKER-244-NG7YUAFH574UIIL65MNYO3XPSEPSH37LV5D5Q6RWZE34ZWUPXEJA/m/src/main/java/org/apache/maven/plugins/invoker/InstallMojo.java:[50,52] package org.apache.maven.shared.dependencies.resolve does not exist
[linux-jdk10] [ERROR] /home/jenkins/jenkins-slave/workspace/invoker-plugin_MINVOKER-244-NG7YUAFH574UIIL65MNYO3XPSEPSH37LV5D5Q6RWZE34ZWUPXEJA/m/src/main/java/org/apache/maven/plugins/invoker/InstallMojo.java:[51,42] package org.apache.maven.shared.repository does not exist
[linux-jdk10] [ERROR] /home/jenkins/jenkins-slave/workspace/invoker-plugin_MINVOKER-244-NG7YUAFH574UIIL65MNYO3XPSEPSH37LV5D5Q6RWZE34ZWUPXEJA/m/src/main/java/org/apache/maven/plugins/invoker/InstallMojo.java:[75,13] cannot find symbol
[linux-jdk10]   symbol:   class ArtifactInstaller
[linux-jdk10]   location: class org.apache.maven.plugins.invoker.InstallMojo
[linux-jdk10] [ERROR] /home/jenkins/jenkins-slave/workspace/invoker-plugin_MINVOKER-244-NG7YUAFH574UIIL65MNYO3XPSEPSH37LV5D5Q6RWZE34ZWUPXEJA/m/src/main/java/org/apache/maven/plugins/invoker/InstallMojo.java:[78,13] cannot find symbol
[linux-jdk10]   symbol:   class RepositoryManager
[linux-jdk10]   location: class org.apache.maven.plugins.invoker.InstallMojo
[linux-jdk10] [ERROR] /home/jenkins/jenkins-slave/workspace/invoker-plugin_MINVOKER-244-NG7YUAFH574UIIL65MNYO3XPSEPSH37LV5D5Q6RWZE34ZWUPXEJA/m/src/main/java/org/apache/maven/plugins/invoker/InstallMojo.java:[161,13] cannot find symbol
[linux-jdk10]   symbol:   class DependencyResolver
[linux-jdk10]   location: class org.apache.maven.plugins.invoker.InstallMojo
[linux-jdk10] [ERROR] /home/jenkins/jenkins-slave/workspace/invoker-plugin_MINVOKER-244-NG7YUAFH574UIIL65MNYO3XPSEPSH37LV5D5Q6RWZE34ZWUPXEJA/m/src/main/java/org/apache/maven/plugins/invoker/InstallMojo.java:[603,13] cannot find symbol
[linux-jdk10]   symbol:   class DefaultDependableCoordinate
[linux-jdk10]   location: class org.apache.maven.plugins.invoker.InstallMojo
[linux-jdk10] [ERROR] /home/jenkins/jenkins-slave/workspace/invoker-plugin_MINVOKER-244-NG7YUAFH574UIIL65MNYO3XPSEPSH37LV5D5Q6RWZE34ZWUPXEJA/m/src/main/java/org/apache/maven/plugins/invoker/InstallMojo.java:[603,58] cannot find symbol
[linux-jdk10]   symbol:   class DefaultDependableCoordinate
[linux-jdk10]   location: class org.apache.maven.plugins.invoker.InstallMojo
[linux-jdk10] [ERROR] /home/jenkins/jenkins-slave/workspace/invoker-plugin_MINVOKER-244-NG7YUAFH574UIIL65MNYO3XPSEPSH37LV5D5Q6RWZE34ZWUPXEJA/m/src/main/java/org/apache/maven/plugins/invoker/InstallMojo.java:[614,21] cannot find symbol
[linux-jdk10]   symbol:   class DependencyResolverException
[linux-jdk10]   location: class org.apache.maven.plugins.invoker.InstallMojo
[linux-jdk10] [INFO] 11 errors
[linux-jdk10] [INFO] -------------------------------------------------------------
[linux-jdk10] [INFO] ------------------------------------------------------------------------
[linux-jdk10] [INFO] BUILD FAILURE
[linux-jdk10] [INFO] ------------------------------------------------------------------------
[linux-jdk10] [INFO] Total time: 17.735 s
[linux-jdk10] [INFO] Finished at: 2018-10-13T11:14:07Z
[linux-jdk10] [INFO] ------------------------------------------------------------------------
[linux-jdk10] [INFO] [jenkins-event-spy] Generated /home/jenkins/jenkins-slave/workspace/invoker-plugin_MINVOKER-244-NG7YUAFH574UIIL65MNYO3XPSEPSH37LV5D5Q6RWZE34ZWUPXEJA@tmp/withMaven003f7bde/maven-spy-20181013-111349-807708739084511487092.log
[linux-jdk10] [ERROR] Failed to execute goal org.apache.maven.plugins:maven-compiler-plugin:3.7.0:compile (default-compile) on project maven-invoker-plugin: Compilation failure: Compilation failure:
[linux-jdk10] [ERROR] /home/jenkins/jenkins-slave/workspace/invoker-plugin_MINVOKER-244-NG7YUAFH574UIIL65MNYO3XPSEPSH37LV5D5Q6RWZE34ZWUPXEJA/m/src/main/java/org/apache/maven/plugins/invoker/InstallMojo.java:[47,48] package org.apache.maven.shared.artifact.install does not exist
[linux-jdk10] [ERROR] /home/jenkins/jenkins-slave/workspace/invoker-plugin_MINVOKER-244-NG7YUAFH574UIIL65MNYO3XPSEPSH37LV5D5Q6RWZE34ZWUPXEJA/m/src/main/java/org/apache/maven/plugins/invoker/InstallMojo.java:[48,44] package org.apache.maven.shared.dependencies does not exist
[linux-jdk10] [ERROR] /home/jenkins/jenkins-slave/workspace/invoker-plugin_MINVOKER-244-NG7YUAFH574UIIL65MNYO3XPSEPSH37LV5D5Q6RWZE34ZWUPXEJA/m/src/main/java/org/apache/maven/plugins/invoker/InstallMojo.java:[49,52] package org.apache.maven.shared.dependencies.resolve does not exist
[linux-jdk10] [ERROR] /home/jenkins/jenkins-slave/workspace/invoker-plugin_MINVOKER-244-NG7YUAFH574UIIL65MNYO3XPSEPSH37LV5D5Q6RWZE34ZWUPXEJA/m/src/main/java/org/apache/maven/plugins/invoker/InstallMojo.java:[50,52] package org.apache.maven.shared.dependencies.resolve does not exist
[linux-jdk10] [ERROR] /home/jenkins/jenkins-slave/workspace/invoker-plugin_MINVOKER-244-NG7YUAFH574UIIL65MNYO3XPSEPSH37LV5D5Q6RWZE34ZWUPXEJA/m/src/main/java/org/apache/maven/plugins/invoker/InstallMojo.java:[51,42] package org.apache.maven.shared.repository does not exist
[linux-jdk10] [ERROR] /home/jenkins/jenkins-slave/workspace/invoker-plugin_MINVOKER-244-NG7YUAFH574UIIL65MNYO3XPSEPSH37LV5D5Q6RWZE34ZWUPXEJA/m/src/main/java/org/apache/maven/plugins/invoker/InstallMojo.java:[75,13] cannot find symbol
[linux-jdk10] [ERROR]   symbol:   class ArtifactInstaller
[linux-jdk10] [ERROR]   location: class org.apache.maven.plugins.invoker.InstallMojo
[linux-jdk10] [ERROR] /home/jenkins/jenkins-slave/workspace/invoker-plugin_MINVOKER-244-NG7YUAFH574UIIL65MNYO3XPSEPSH37LV5D5Q6RWZE34ZWUPXEJA/m/src/main/java/org/apache/maven/plugins/invoker/InstallMojo.java:[78,13] cannot find symbol
[linux-jdk10] [ERROR]   symbol:   class RepositoryManager
[linux-jdk10] [ERROR]   location: class org.apache.maven.plugins.invoker.InstallMojo
[linux-jdk10] [ERROR] /home/jenkins/jenkins-slave/workspace/invoker-plugin_MINVOKER-244-NG7YUAFH574UIIL65MNYO3XPSEPSH37LV5D5Q6RWZE34ZWUPXEJA/m/src/main/java/org/apache/maven/plugins/invoker/InstallMojo.java:[161,13] cannot find symbol
[linux-jdk10] [ERROR]   symbol:   class DependencyResolver
[linux-jdk10] [ERROR]   location: class org.apache.maven.plugins.invoker.InstallMojo
[linux-jdk10] [ERROR] /home/jenkins/jenkins-slave/workspace/invoker-plugin_MINVOKER-244-NG7YUAFH574UIIL65MNYO3XPSEPSH37LV5D5Q6RWZE34ZWUPXEJA/m/src/main/java/org/apache/maven/plugins/invoker/InstallMojo.java:[603,13] cannot find symbol
[linux-jdk10] [ERROR]   symbol:   class DefaultDependableCoordinate
[linux-jdk10] [ERROR]   location: class org.apache.maven.plugins.invoker.InstallMojo
[linux-jdk10] [ERROR] /home/jenkins/jenkins-slave/workspace/invoker-plugin_MINVOKER-244-NG7YUAFH574UIIL65MNYO3XPSEPSH37LV5D5Q6RWZE34ZWUPXEJA/m/src/main/java/org/apache/maven/plugins/invoker/InstallMojo.java:[603,58] cannot find symbol
[linux-jdk10] [ERROR]   symbol:   class DefaultDependableCoordinate
[linux-jdk10] [ERROR]   location: class org.apache.maven.plugins.invoker.InstallMojo
[linux-jdk10] [ERROR] /home/jenkins/jenkins-slave/workspace/invoker-plugin_MINVOKER-244-NG7YUAFH574UIIL65MNYO3XPSEPSH37LV5D5Q6RWZE34ZWUPXEJA/m/src/main/java/org/apache/maven/plugins/invoker/InstallMojo.java:[614,21] cannot find symbol
[linux-jdk10] [ERROR]   symbol:   class DependencyResolverException
[linux-jdk10] [ERROR]   location: class org.apache.maven.plugins.invoker.InstallMojo
[linux-jdk10] [ERROR] -> [Help 1]
[linux-jdk10] [ERROR]
[linux-jdk10] [ERROR] To see the full stack trace of the errors, re-run Maven with the -e switch.
[linux-jdk10] [ERROR] Re-run Maven using the -X switch to enable full debug logging.
[linux-jdk10] [ERROR]
[linux-jdk10] [ERROR] For more information about the errors and possible solutions, please read the following articles:
[linux-jdk10] [ERROR] [Help 1] http://cwiki.apache.org/confluence/display/MAVEN/MojoFailureException
[Pipeline] [linux-jdk10] }
[Pipeline] [linux-jdk10] // dir
[Pipeline] [linux-jdk10] }
[Pipeline] [linux-jdk10] // withMaven
[Pipeline] [linux-jdk10] cleanWs
[linux-jdk10] [WS-CLEANUP] Deleting project workspace...[WS-CLEANUP] done
[Pipeline] [linux-jdk10] cleanWs
[linux-jdk10] [WS-CLEANUP] Deleting project workspace...[WS-CLEANUP] done
[Pipeline] [linux-jdk10] }
[Pipeline] [linux-jdk10] // stage
[Pipeline] [linux-jdk10] }
[Pipeline] [linux-jdk10] // node
[Pipeline] [linux-jdk10] }
[linux-jdk10] Failed in branch linux-jdk10
[Pipeline] // parallel
[Pipeline] stage
[Pipeline] { (Notifications)
[Pipeline] echo
Build result: FAILURE
[Pipeline] jiraIssueSelector
[Pipeline] emailext
Reply | Threaded
Open this post in threaded view
|

Build failed in Jenkins: Maven TLP » maven-invoker-plugin » MINVOKER-244 #2

Apache Jenkins Server-2
See https://builds.apache.org/job/maven-box/job/maven-invoker-plugin/job/MINVOKER-244/2/

No changes.

All tests passed

Build log:
[...truncated 2.80 MB...]
[windows-jdk7] [INFO] Building: staging-reactor\pom.xml
[windows-jdk9] [INFO] run post-build script verify.bsh
[windows-jdk9] [INFO]           staging-dependencies\pom.xml ..................... SUCCESS (8.0 s)
[windows-jdk9] [INFO] Building: staging-pom\pom.xml
[windows-jdk7] [INFO] run post-build script verify.bsh
[windows-jdk7] [INFO]           staging-reactor\pom.xml .......................... SUCCESS (7.9 s)
[windows-jdk7] [INFO] Building: wrongPropertyInterpolation\pom.xml
[windows-jdk9] [INFO] run post-build script verify.bsh
[windows-jdk9] [INFO]           staging-pom\pom.xml .............................. SUCCESS (4.4 s)
[windows-jdk9] [INFO] Building: staging-reactor\pom.xml
[windows-jdk9] [INFO] run post-build script verify.bsh
[windows-jdk9] [INFO]           staging-reactor\pom.xml .......................... SUCCESS (6.5 s)
[windows-jdk9] [INFO] Building: wrongPropertyInterpolation\pom.xml
[windows-jdk7] [INFO]           wrongPropertyInterpolation\pom.xml ............... SUCCESS (25.1 s)
[windows-jdk7] [INFO]
[windows-jdk7] [INFO] --- maven-checkstyle-plugin:3.0.0:check (checkstyle-check) @ maven-invoker-plugin ---
[windows-jdk7] [INFO] Downloading from central: https://repo.maven.apache.org/maven2/org/apache/maven/shared/maven-shared-resources/2/maven-shared-resources-2.pom
[windows-jdk7] [INFO] Downloaded from central: https://repo.maven.apache.org/maven2/org/apache/maven/shared/maven-shared-resources/2/maven-shared-resources-2.pom (3.0 kB at 62 kB/s)
[windows-jdk7] [INFO] Downloading from central: https://repo.maven.apache.org/maven2/org/codehaus/plexus/plexus-utils/3.0.10/plexus-utils-3.0.10.pom
[windows-jdk7] [INFO] Downloaded from central: https://repo.maven.apache.org/maven2/org/codehaus/plexus/plexus-utils/3.0.10/plexus-utils-3.0.10.pom (3.1 kB at 150 kB/s)
[windows-jdk7] [INFO] Downloading from central: https://repo.maven.apache.org/maven2/org/codehaus/plexus/plexus/3.3/plexus-3.3.pom
[windows-jdk7] [INFO] Downloaded from central: https://repo.maven.apache.org/maven2/org/codehaus/plexus/plexus/3.3/plexus-3.3.pom (20 kB at 1.0 MB/s)
[windows-jdk7] [INFO] Downloading from central: https://repo.maven.apache.org/maven2/org/apache/maven/doxia/doxia-integration-tools/1.6/doxia-integration-tools-1.6.pom
[windows-jdk7] [INFO] Downloaded from central: https://repo.maven.apache.org/maven2/org/apache/maven/doxia/doxia-integration-tools/1.6/doxia-integration-tools-1.6.pom (7.0 kB at 331 kB/s)
[windows-jdk7] [INFO] Downloading from central: https://repo.maven.apache.org/maven2/org/apache/maven/doxia/doxia-tools/3/doxia-tools-3.pom
[windows-jdk7] [INFO] Downloaded from central: https://repo.maven.apache.org/maven2/org/apache/maven/doxia/doxia-tools/3/doxia-tools-3.pom (9.9 kB at 523 kB/s)
[windows-jdk7] [INFO] Downloading from central: https://repo.maven.apache.org/maven2/org/codehaus/plexus/plexus-resources/1.1.0/plexus-resources-1.1.0.pom
[windows-jdk7] [INFO] Downloaded from central: https://repo.maven.apache.org/maven2/org/codehaus/plexus/plexus-resources/1.1.0/plexus-resources-1.1.0.pom (3.2 kB at 167 kB/s)
[windows-jdk7] [INFO] Downloading from central: https://repo.maven.apache.org/maven2/com/puppycrawl/tools/checkstyle/6.18/checkstyle-6.18.pom
[windows-jdk7] [INFO] Downloaded from central: https://repo.maven.apache.org/maven2/com/puppycrawl/tools/checkstyle/6.18/checkstyle-6.18.pom (71 kB at 2.2 MB/s)
[windows-jdk7] [INFO] Downloading from central: https://repo.maven.apache.org/maven2/antlr/antlr/2.7.7/antlr-2.7.7.pom
[windows-jdk7] [INFO] Downloaded from central: https://repo.maven.apache.org/maven2/antlr/antlr/2.7.7/antlr-2.7.7.pom (632 B at 40 kB/s)
[windows-jdk7] [INFO] Downloading from central: https://repo.maven.apache.org/maven2/org/antlr/antlr4-runtime/4.5.3/antlr4-runtime-4.5.3.pom
[windows-jdk7] [INFO] Downloaded from central: https://repo.maven.apache.org/maven2/org/antlr/antlr4-runtime/4.5.3/antlr4-runtime-4.5.3.pom (2.3 kB at 136 kB/s)
[windows-jdk7] [INFO] Downloading from central: https://repo.maven.apache.org/maven2/org/antlr/antlr4-master/4.5.3/antlr4-master-4.5.3.pom
[windows-jdk7] [INFO] Downloaded from central: https://repo.maven.apache.org/maven2/org/antlr/antlr4-master/4.5.3/antlr4-master-4.5.3.pom (3.7 kB at 217 kB/s)
[windows-jdk7] [INFO] Downloading from central: https://repo.maven.apache.org/maven2/commons-beanutils/commons-beanutils/1.9.2/commons-beanutils-1.9.2.pom
[windows-jdk7] [INFO] Downloaded from central: https://repo.maven.apache.org/maven2/commons-beanutils/commons-beanutils/1.9.2/commons-beanutils-1.9.2.pom (14 kB at 715 kB/s)
[windows-jdk7] [INFO] Downloading from central: https://repo.maven.apache.org/maven2/org/apache/commons/commons-parent/33/commons-parent-33.pom
[windows-jdk7] [INFO] Downloaded from central: https://repo.maven.apache.org/maven2/org/apache/commons/commons-parent/33/commons-parent-33.pom (53 kB at 1.7 MB/s)
[windows-jdk7] [INFO] Downloading from central: https://repo.maven.apache.org/maven2/commons-cli/commons-cli/1.3.1/commons-cli-1.3.1.pom
[windows-jdk7] [INFO] Downloaded from central: https://repo.maven.apache.org/maven2/commons-cli/commons-cli/1.3.1/commons-cli-1.3.1.pom (10 kB at 577 kB/s)
[windows-jdk7] [INFO] Downloading from central: https://repo.maven.apache.org/maven2/com/google/guava/guava/19.0/guava-19.0.pom
[windows-jdk7] [INFO] Downloaded from central: https://repo.maven.apache.org/maven2/com/google/guava/guava/19.0/guava-19.0.pom (6.8 kB at 400 kB/s)
[windows-jdk7] [INFO] Downloading from central: https://repo.maven.apache.org/maven2/com/google/guava/guava-parent/19.0/guava-parent-19.0.pom
[windows-jdk7] [INFO] Downloaded from central: https://repo.maven.apache.org/maven2/com/google/guava/guava-parent/19.0/guava-parent-19.0.pom (9.9 kB at 395 kB/s)
[windows-jdk7] [INFO] Downloading from central: https://repo.maven.apache.org/maven2/org/sonatype/oss/oss-parent/7/oss-parent-7.pom
[windows-jdk7] [INFO] Downloaded from central: https://repo.maven.apache.org/maven2/org/sonatype/oss/oss-parent/7/oss-parent-7.pom (4.8 kB at 241 kB/s)
[windows-jdk7] [INFO] Downloading from central: https://repo.maven.apache.org/maven2/org/apache/maven/shared/maven-shared-resources/2/maven-shared-resources-2.jar
[windows-jdk7] [INFO] Downloading from central: https://repo.maven.apache.org/maven2/org/apache/maven/doxia/doxia-core/1.2/doxia-core-1.2.jar
[windows-jdk7] [INFO] Downloading from central: https://repo.maven.apache.org/maven2/org/apache/maven/doxia/doxia-integration-tools/1.6/doxia-integration-tools-1.6.jar
[windows-jdk7] [INFO] Downloading from central: https://repo.maven.apache.org/maven2/commons-logging/commons-logging/1.0.4/commons-logging-1.0.4.jar
[windows-jdk7] [INFO] Downloading from central: https://repo.maven.apache.org/maven2/commons-digester/commons-digester/1.6/commons-digester-1.6.jar
[windows-jdk7] [INFO] Downloaded from central: https://repo.maven.apache.org/maven2/commons-logging/commons-logging/1.0.4/commons-logging-1.0.4.jar (38 kB at 927 kB/s)
[windows-jdk7] [INFO] Downloading from central: https://repo.maven.apache.org/maven2/commons-io/commons-io/1.4/commons-io-1.4.jar
[windows-jdk7] [INFO] Downloaded from central: https://repo.maven.apache.org/maven2/commons-digester/commons-digester/1.6/commons-digester-1.6.jar (168 kB at 2.8 MB/s)
[windows-jdk7] [INFO] Downloading from central: https://repo.maven.apache.org/maven2/org/codehaus/plexus/plexus-resources/1.1.0/plexus-resources-1.1.0.jar
[windows-jdk7] [INFO] Downloaded from central: https://repo.maven.apache.org/maven2/org/apache/maven/doxia/doxia-core/1.2/doxia-core-1.2.jar (154 kB at 2.4 MB/s)
[windows-jdk7] [INFO] Downloading from central: https://repo.maven.apache.org/maven2/com/puppycrawl/tools/checkstyle/6.18/checkstyle-6.18.jar
[windows-jdk7] [INFO] Downloaded from central: https://repo.maven.apache.org/maven2/commons-io/commons-io/1.4/commons-io-1.4.jar (109 kB at 1.6 MB/s)
[windows-jdk7] [INFO] Downloading from central: https://repo.maven.apache.org/maven2/antlr/antlr/2.7.7/antlr-2.7.7.jar
[windows-jdk7] [INFO] Downloaded from central: https://repo.maven.apache.org/maven2/org/apache/maven/shared/maven-shared-resources/2/maven-shared-resources-2.jar (13 kB at 127 kB/s)
[windows-jdk7] [INFO] Downloading from central: https://repo.maven.apache.org/maven2/org/antlr/antlr4-runtime/4.5.3/antlr4-runtime-4.5.3.jar
[windows-jdk7] [INFO] Downloaded from central: https://repo.maven.apache.org/maven2/antlr/antlr/2.7.7/antlr-2.7.7.jar (445 kB at 4.2 MB/s)
[windows-jdk7] [INFO] Downloading from central: https://repo.maven.apache.org/maven2/commons-beanutils/commons-beanutils/1.9.2/commons-beanutils-1.9.2.jar
[windows-jdk7] [INFO] Downloaded from central: https://repo.maven.apache.org/maven2/com/puppycrawl/tools/checkstyle/6.18/checkstyle-6.18.jar (1.2 MB at 8.3 MB/s)
[windows-jdk7] [INFO] Downloading from central: https://repo.maven.apache.org/maven2/commons-cli/commons-cli/1.3.1/commons-cli-1.3.1.jar
[windows-jdk7] [INFO] Downloaded from central: https://repo.maven.apache.org/maven2/commons-beanutils/commons-beanutils/1.9.2/commons-beanutils-1.9.2.jar (234 kB at 1.6 MB/s)
[windows-jdk7] [INFO] Downloading from central: https://repo.maven.apache.org/maven2/com/google/guava/guava/19.0/guava-19.0.jar
[windows-jdk7] [INFO] Downloaded from central: https://repo.maven.apache.org/maven2/org/antlr/antlr4-runtime/4.5.3/antlr4-runtime-4.5.3.jar (302 kB at 2.0 MB/s)
[windows-jdk7] [INFO] Downloading from central: https://repo.maven.apache.org/maven2/commons-lang/commons-lang/2.1/commons-lang-2.1.jar
[windows-jdk7] [INFO] Downloaded from central: https://repo.maven.apache.org/maven2/commons-cli/commons-cli/1.3.1/commons-cli-1.3.1.jar (53 kB at 315 kB/s)
[windows-jdk7] [INFO] Downloaded from central: https://repo.maven.apache.org/maven2/commons-lang/commons-lang/2.1/commons-lang-2.1.jar (208 kB at 1.2 MB/s)
[windows-jdk7] [INFO] Downloaded from central: https://repo.maven.apache.org/maven2/org/apache/maven/doxia/doxia-integration-tools/1.6/doxia-integration-tools-1.6.jar (45 kB at 229 kB/s)
[windows-jdk7] [INFO] Downloaded from central: https://repo.maven.apache.org/maven2/org/codehaus/plexus/plexus-resources/1.1.0/plexus-resources-1.1.0.jar (23 kB at 109 kB/s)
[windows-jdk7] [INFO] Downloaded from central: https://repo.maven.apache.org/maven2/com/google/guava/guava/19.0/guava-19.0.jar (2.3 MB at 9.3 MB/s)
[windows-jdk9] [INFO]           wrongPropertyInterpolation\pom.xml ............... SUCCESS (16.4 s)
[windows-jdk9] [INFO]
[windows-jdk9] [INFO] --- maven-checkstyle-plugin:3.0.0:check (checkstyle-check) @ maven-invoker-plugin ---
[windows-jdk9] [INFO] Downloading from central: https://repo.maven.apache.org/maven2/org/apache/maven/shared/maven-shared-resources/2/maven-shared-resources-2.pom
[windows-jdk9] [INFO] Downloaded from central: https://repo.maven.apache.org/maven2/org/apache/maven/shared/maven-shared-resources/2/maven-shared-resources-2.pom (3.0 kB at 82 kB/s)
[windows-jdk9] [INFO] Downloading from central: https://repo.maven.apache.org/maven2/org/codehaus/plexus/plexus-utils/3.0.10/plexus-utils-3.0.10.pom
[windows-jdk9] [INFO] Downloaded from central: https://repo.maven.apache.org/maven2/org/codehaus/plexus/plexus-utils/3.0.10/plexus-utils-3.0.10.pom (3.1 kB at 349 kB/s)
[windows-jdk9] [INFO] Downloading from central: https://repo.maven.apache.org/maven2/org/codehaus/plexus/plexus/3.3/plexus-3.3.pom
[windows-jdk9] [INFO] Downloaded from central: https://repo.maven.apache.org/maven2/org/codehaus/plexus/plexus/3.3/plexus-3.3.pom (20 kB at 1.8 MB/s)
[windows-jdk9] [INFO] Downloading from central: https://repo.maven.apache.org/maven2/org/apache/maven/doxia/doxia-integration-tools/1.6/doxia-integration-tools-1.6.pom
[windows-jdk9] [INFO] Downloaded from central: https://repo.maven.apache.org/maven2/org/apache/maven/doxia/doxia-integration-tools/1.6/doxia-integration-tools-1.6.pom (7.0 kB at 870 kB/s)
[windows-jdk9] [INFO] Downloading from central: https://repo.maven.apache.org/maven2/org/apache/maven/doxia/doxia-tools/3/doxia-tools-3.pom
[windows-jdk9] [INFO] Downloaded from central: https://repo.maven.apache.org/maven2/org/apache/maven/doxia/doxia-tools/3/doxia-tools-3.pom (9.9 kB at 414 kB/s)
[windows-jdk9] [INFO] Downloading from central: https://repo.maven.apache.org/maven2/org/codehaus/plexus/plexus-resources/1.1.0/plexus-resources-1.1.0.pom
[windows-jdk9] [INFO] Downloaded from central: https://repo.maven.apache.org/maven2/org/codehaus/plexus/plexus-resources/1.1.0/plexus-resources-1.1.0.pom (3.2 kB at 454 kB/s)
[windows-jdk9] [INFO] Downloading from central: https://repo.maven.apache.org/maven2/com/puppycrawl/tools/checkstyle/6.18/checkstyle-6.18.pom
[windows-jdk9] [INFO] Downloaded from central: https://repo.maven.apache.org/maven2/com/puppycrawl/tools/checkstyle/6.18/checkstyle-6.18.pom (71 kB at 4.2 MB/s)
[windows-jdk9] [INFO] Downloading from central: https://repo.maven.apache.org/maven2/antlr/antlr/2.7.7/antlr-2.7.7.pom
[windows-jdk9] [INFO] Downloaded from central: https://repo.maven.apache.org/maven2/antlr/antlr/2.7.7/antlr-2.7.7.pom (632 B at 90 kB/s)
[windows-jdk9] [INFO] Downloading from central: https://repo.maven.apache.org/maven2/org/antlr/antlr4-runtime/4.5.3/antlr4-runtime-4.5.3.pom
[windows-jdk9] [INFO] Downloaded from central: https://repo.maven.apache.org/maven2/org/antlr/antlr4-runtime/4.5.3/antlr4-runtime-4.5.3.pom (2.3 kB at 330 kB/s)
[windows-jdk9] [INFO] Downloading from central: https://repo.maven.apache.org/maven2/org/antlr/antlr4-master/4.5.3/antlr4-master-4.5.3.pom
[windows-jdk9] [INFO] Downloaded from central: https://repo.maven.apache.org/maven2/org/antlr/antlr4-master/4.5.3/antlr4-master-4.5.3.pom (3.7 kB at 526 kB/s)
[windows-jdk9] [INFO] Downloading from central: https://repo.maven.apache.org/maven2/commons-beanutils/commons-beanutils/1.9.2/commons-beanutils-1.9.2.pom
[windows-jdk9] [INFO] Downloaded from central: https://repo.maven.apache.org/maven2/commons-beanutils/commons-beanutils/1.9.2/commons-beanutils-1.9.2.pom (14 kB at 1.6 MB/s)
[windows-jdk9] [INFO] Downloading from central: https://repo.maven.apache.org/maven2/org/apache/commons/commons-parent/33/commons-parent-33.pom
[windows-jdk9] [INFO] Downloaded from central: https://repo.maven.apache.org/maven2/org/apache/commons/commons-parent/33/commons-parent-33.pom (53 kB at 4.8 MB/s)
[windows-jdk9] [INFO] Downloading from central: https://repo.maven.apache.org/maven2/commons-cli/commons-cli/1.3.1/commons-cli-1.3.1.pom
[windows-jdk9] [INFO] Downloaded from central: https://repo.maven.apache.org/maven2/commons-cli/commons-cli/1.3.1/commons-cli-1.3.1.pom (10 kB at 945 kB/s)
[windows-jdk9] [INFO] Downloading from central: https://repo.maven.apache.org/maven2/com/google/guava/guava/19.0/guava-19.0.pom
[windows-jdk9] [INFO] Downloaded from central: https://repo.maven.apache.org/maven2/com/google/guava/guava/19.0/guava-19.0.pom (6.8 kB at 849 kB/s)
[windows-jdk9] [INFO] Downloading from central: https://repo.maven.apache.org/maven2/com/google/guava/guava-parent/19.0/guava-parent-19.0.pom
[windows-jdk9] [INFO] Downloaded from central: https://repo.maven.apache.org/maven2/com/google/guava/guava-parent/19.0/guava-parent-19.0.pom (9.9 kB at 1.2 MB/s)
[windows-jdk9] [INFO] Downloading from central: https://repo.maven.apache.org/maven2/org/sonatype/oss/oss-parent/7/oss-parent-7.pom
[windows-jdk9] [INFO] Downloaded from central: https://repo.maven.apache.org/maven2/org/sonatype/oss/oss-parent/7/oss-parent-7.pom (4.8 kB at 603 kB/s)
[windows-jdk9] [INFO] Downloading from central: https://repo.maven.apache.org/maven2/javax/xml/bind/jaxb-api/2.3.0/jaxb-api-2.3.0.pom
[windows-jdk9] [INFO] Downloaded from central: https://repo.maven.apache.org/maven2/javax/xml/bind/jaxb-api/2.3.0/jaxb-api-2.3.0.pom (23 kB at 2.6 MB/s)
[windows-jdk9] [INFO] Downloading from central: https://repo.maven.apache.org/maven2/javax/xml/bind/jaxb-api-parent/2.3.0/jaxb-api-parent-2.3.0.pom
[windows-jdk9] [INFO] Downloaded from central: https://repo.maven.apache.org/maven2/javax/xml/bind/jaxb-api-parent/2.3.0/jaxb-api-parent-2.3.0.pom (5.6 kB at 705 kB/s)
[windows-jdk9] [INFO] Downloading from central: https://repo.maven.apache.org/maven2/net/java/jvnet-parent/5/jvnet-parent-5.pom
[windows-jdk9] [INFO] Downloaded from central: https://repo.maven.apache.org/maven2/net/java/jvnet-parent/5/jvnet-parent-5.pom (8.9 kB at 1.1 MB/s)
[windows-jdk9] [INFO] Downloading from central: https://repo.maven.apache.org/maven2/org/apache/maven/shared/maven-shared-resources/2/maven-shared-resources-2.jar
[windows-jdk9] [INFO] Downloading from central: https://repo.maven.apache.org/maven2/commons-logging/commons-logging/1.0.4/commons-logging-1.0.4.jar
[windows-jdk9] [INFO] Downloading from central: https://repo.maven.apache.org/maven2/org/apache/maven/doxia/doxia-integration-tools/1.6/doxia-integration-tools-1.6.jar
[windows-jdk9] [INFO] Downloading from central: https://repo.maven.apache.org/maven2/org/apache/maven/doxia/doxia-core/1.2/doxia-core-1.2.jar
[windows-jdk9] [INFO] Downloading from central: https://repo.maven.apache.org/maven2/commons-digester/commons-digester/1.6/commons-digester-1.6.jar
[windows-jdk9] [INFO] Downloaded from central: https://repo.maven.apache.org/maven2/org/apache/maven/doxia/doxia-core/1.2/doxia-core-1.2.jar (154 kB at 5.7 MB/s)
[windows-jdk9] [INFO] Downloading from central: https://repo.maven.apache.org/maven2/commons-io/commons-io/1.4/commons-io-1.4.jar
[windows-jdk9] [INFO] Downloaded from central: https://repo.maven.apache.org/maven2/commons-logging/commons-logging/1.0.4/commons-logging-1.0.4.jar (38 kB at 1.2 MB/s)
[windows-jdk9] [INFO] Downloading from central: https://repo.maven.apache.org/maven2/org/codehaus/plexus/plexus-resources/1.1.0/plexus-resources-1.1.0.jar
[windows-jdk9] [INFO] Downloaded from central: https://repo.maven.apache.org/maven2/org/apache/maven/shared/maven-shared-resources/2/maven-shared-resources-2.jar (13 kB at 344 kB/s)
[windows-jdk9] [INFO] Downloading from central: https://repo.maven.apache.org/maven2/com/puppycrawl/tools/checkstyle/6.18/checkstyle-6.18.jar
[windows-jdk9] [INFO] Downloaded from central: https://repo.maven.apache.org/maven2/org/codehaus/plexus/plexus-resources/1.1.0/plexus-resources-1.1.0.jar (23 kB at 505 kB/s)
[windows-jdk9] [INFO] Downloading from central: https://repo.maven.apache.org/maven2/antlr/antlr/2.7.7/antlr-2.7.7.jar
[windows-jdk9] [INFO] Downloaded from central: https://repo.maven.apache.org/maven2/org/apache/maven/doxia/doxia-integration-tools/1.6/doxia-integration-tools-1.6.jar (45 kB at 950 kB/s)
[windows-jdk9] [INFO] Downloading from central: https://repo.maven.apache.org/maven2/org/antlr/antlr4-runtime/4.5.3/antlr4-runtime-4.5.3.jar
[windows-jdk9] [INFO] Downloaded from central: https://repo.maven.apache.org/maven2/commons-digester/commons-digester/1.6/commons-digester-1.6.jar (168 kB at 3.4 MB/s)
[windows-jdk9] [INFO] Downloading from central: https://repo.maven.apache.org/maven2/commons-beanutils/commons-beanutils/1.9.2/commons-beanutils-1.9.2.jar
[windows-jdk9] [INFO] Downloaded from central: https://repo.maven.apache.org/maven2/commons-io/commons-io/1.4/commons-io-1.4.jar (109 kB at 2.1 MB/s)
[windows-jdk9] [INFO] Downloading from central: https://repo.maven.apache.org/maven2/commons-cli/commons-cli/1.3.1/commons-cli-1.3.1.jar
[windows-jdk9] [INFO] Downloaded from central: https://repo.maven.apache.org/maven2/commons-cli/commons-cli/1.3.1/commons-cli-1.3.1.jar (53 kB at 589 kB/s)
[windows-jdk9] [INFO] Downloading from central: https://repo.maven.apache.org/maven2/com/google/guava/guava/19.0/guava-19.0.jar
[windows-jdk9] [INFO] Downloaded from central: https://repo.maven.apache.org/maven2/org/antlr/antlr4-runtime/4.5.3/antlr4-runtime-4.5.3.jar (302 kB at 2.9 MB/s)
[windows-jdk9] [INFO] Downloading from central: https://repo.maven.apache.org/maven2/commons-lang/commons-lang/2.1/commons-lang-2.1.jar
[windows-jdk9] [INFO] Downloaded from central: https://repo.maven.apache.org/maven2/commons-beanutils/commons-beanutils/1.9.2/commons-beanutils-1.9.2.jar (234 kB at 2.2 MB/s)
[windows-jdk9] [INFO] Downloading from central: https://repo.maven.apache.org/maven2/javax/xml/bind/jaxb-api/2.3.0/jaxb-api-2.3.0.jar
[windows-jdk9] [INFO] Downloaded from central: https://repo.maven.apache.org/maven2/antlr/antlr/2.7.7/antlr-2.7.7.jar (445 kB at 4.1 MB/s)
[windows-jdk9] [INFO] Downloaded from central: https://repo.maven.apache.org/maven2/com/puppycrawl/tools/checkstyle/6.18/checkstyle-6.18.jar (1.2 MB at 10 MB/s)
[windows-jdk9] [INFO] Downloaded from central: https://repo.maven.apache.org/maven2/commons-lang/commons-lang/2.1/commons-lang-2.1.jar (208 kB at 1.7 MB/s)
[windows-jdk9] [INFO] Downloaded from central: https://repo.maven.apache.org/maven2/javax/xml/bind/jaxb-api/2.3.0/jaxb-api-2.3.0.jar (126 kB at 1.0 MB/s)
[windows-jdk9] [INFO] Downloaded from central: https://repo.maven.apache.org/maven2/com/google/guava/guava/19.0/guava-19.0.jar (2.3 MB at 13 MB/s)
[windows-jdk9] [INFO] There are 2 errors reported by Checkstyle 6.18 with config/maven_checks.xml ruleset.
[windows-jdk9] [INFO] Ignored 2 errors, 0 violation remaining.
[windows-jdk9] [INFO]
[windows-jdk9] [INFO] --- maven-invoker-plugin:3.0.1:verify (integration-test) @ maven-invoker-plugin ---
[windows-jdk9] [INFO] -------------------------------------------------
[windows-jdk9] [INFO] Build Summary:
[windows-jdk9] [INFO]   Passed: 65, Failed: 1, Errors: 0, Skipped: 2
[windows-jdk9] [INFO] -------------------------------------------------
[windows-jdk9] [ERROR] The following builds failed:
[windows-jdk9] [ERROR] *  install-extra-artifacts\pom.xml
[windows-jdk9] [INFO] -------------------------------------------------
[windows-jdk9] [INFO] ------------------------------------------------------------------------
[windows-jdk9] [INFO] BUILD FAILURE
[windows-jdk9] [INFO] ------------------------------------------------------------------------
[windows-jdk9] [INFO] Total time: 29:10 min
[windows-jdk9] [INFO] Finished at: 2018-10-13T11:58:06Z
[windows-jdk9] [INFO] Final Memory: 52M/173M
[windows-jdk9] [INFO] ------------------------------------------------------------------------
[windows-jdk9] [INFO] [jenkins-event-spy] Generated F:\jenkins\jenkins-slave\workspace\invoker-plugin_MINVOKER-244-NG7YUAFH574UIIL65MNYO3XPSEPSH37LV5D5Q6RWZE34ZWUPXEJA@tmp\withMaven0eee354c\maven-spy-20181013-112855-4647170238918263389908.log
[windows-jdk9] [ERROR] Failed to execute goal org.apache.maven.plugins:maven-invoker-plugin:3.0.1:verify (integration-test) on project maven-invoker-plugin: 1 build failed. See console output above for details. -> [Help 1]
[windows-jdk9] [ERROR]
[windows-jdk9] [ERROR] To see the full stack trace of the errors, re-run Maven with the -e switch.
[windows-jdk9] [ERROR] Re-run Maven using the -X switch to enable full debug logging.
[windows-jdk9] [ERROR]
[windows-jdk9] [ERROR] For more information about the errors and possible solutions, please read the following articles:
[windows-jdk9] [ERROR] [Help 1] http://cwiki.apache.org/confluence/display/MAVEN/MojoFailureException
[windows-jdk7] [INFO] There are 2 errors reported by Checkstyle 6.18 with config/maven_checks.xml ruleset.
[windows-jdk7] [INFO] Ignored 2 errors, 0 violation remaining.
[windows-jdk7] [INFO]
[windows-jdk7] [INFO] --- maven-invoker-plugin:3.0.1:verify (integration-test) @ maven-invoker-plugin ---
[windows-jdk7] [INFO] -------------------------------------------------
[windows-jdk7] [INFO] Build Summary:
[windows-jdk7] [INFO]   Passed: 66, Failed: 1, Errors: 0, Skipped: 1
[windows-jdk7] [INFO] -------------------------------------------------
[windows-jdk7] [ERROR] The following builds failed:
[windows-jdk7] [ERROR] *  install-extra-artifacts\pom.xml
[windows-jdk7] [INFO] -------------------------------------------------
[windows-jdk7] [INFO] ------------------------------------------------------------------------
[windows-jdk7] [INFO] BUILD FAILURE
[windows-jdk7] [INFO] ------------------------------------------------------------------------
[windows-jdk7] [INFO] Total time: 29:02 min
[windows-jdk7] [INFO] Finished at: 2018-10-13T04:58:06-07:00
[windows-jdk7] [INFO] Final Memory: 61M/818M
[windows-jdk7] [INFO] ------------------------------------------------------------------------
[windows-jdk7] [INFO] [jenkins-event-spy] Generated F:\jenkins\jenkins-slave\workspace\invoker-plugin_MINVOKER-244-NG7YUAFH574UIIL65MNYO3XPSEPSH37LV5D5Q6RWZE34ZWUPXEJA@tmp\withMaven284aa779\maven-spy-20181013-042903-5987873575284804187000.log
[windows-jdk7] [ERROR] Failed to execute goal org.apache.maven.plugins:maven-invoker-plugin:3.0.1:verify (integration-test) on project maven-invoker-plugin: 1 build failed. See console output above for details. -> [Help 1]
[windows-jdk7] [ERROR]
[windows-jdk7] [ERROR] To see the full stack trace of the errors, re-run Maven with the -e switch.
[windows-jdk7] [ERROR] Re-run Maven using the -X switch to enable full debug logging.
[windows-jdk7] [ERROR]
[windows-jdk7] [ERROR] For more information about the errors and possible solutions, please read the following articles:
[windows-jdk7] [ERROR] [Help 1] http://cwiki.apache.org/confluence/display/MAVEN/MojoFailureException
[windows-jdk7] Picked up JAVA_TOOL_OPTIONS: -Dmaven.ext.class.path="f:\jenkins\jenkins-slave\workspace\invoker-plugin_MINVOKER-244-NG7YUAFH574UIIL65MNYO3XPSEPSH37LV5D5Q6RWZE34ZWUPXEJA@tmp\withMaven284aa779\pipeline-maven-spy.jar" -Dorg.jenkinsci.plugins.pipeline.maven.reportsFolder="f:\jenkins\jenkins-slave\workspace\invoker-plugin_MINVOKER-244-NG7YUAFH574UIIL65MNYO3XPSEPSH37LV5D5Q6RWZE34ZWUPXEJA@tmp\withMaven284aa779"
[Pipeline] [windows-jdk7] }
[Pipeline] [windows-jdk7] // dir
[Pipeline] [windows-jdk7] }
[windows-jdk7] [withMaven] invokerPublisher - Archive invoker results for Maven artifact MavenArtifact{org.apache.maven.plugins:maven-invoker-plugin::3.1.1-SNAPSHOT(version: 3.1.1-SNAPSHOT, snapshot:false) } generated by PluginInvocation{org.apache.maven.plugins:maven-invoker-plugin:3.0.1@integration-test  integration-test}: m\target\invoker-reports\*.xml
[windows-jdk7] performing MavenInvokerRecorder, reportsFilenamePattern:'**/m\target\invoker-reports/BUILD*.xml', invokerBuildDir:'**/m\target\it'
[windows-jdk7] Found reports:[f:\jenkins\jenkins-slave\workspace\invoker-plugin_MINVOKER-244-NG7YUAFH574UIIL65MNYO3XPSEPSH37LV5D5Q6RWZE34ZWUPXEJA\m\target\invoker-reports\BUILD-MINVOKER-191.xml, f:\jenkins\jenkins-slave\workspace\invoker-plugin_MINVOKER-244-NG7YUAFH574UIIL65MNYO3XPSEPSH37LV5D5Q6RWZE34ZWUPXEJA\m\target\invoker-reports\BUILD-clone-clean.xml, f:\jenkins\jenkins-slave\workspace\invoker-plugin_MINVOKER-244-NG7YUAFH574UIIL65MNYO3XPSEPSH37LV5D5Q6RWZE34ZWUPXEJA\m\target\invoker-reports\BUILD-clone-maven-plugin-packaging.xml, f:\jenkins\jenkins-slave\workspace\invoker-plugin_MINVOKER-244-NG7YUAFH574UIIL65MNYO3XPSEPSH37LV5D5Q6RWZE34ZWUPXEJA\m\target\invoker-reports\BUILD-exec-timeout-invoker-level.xml, f:\jenkins\jenkins-slave\workspace\invoker-plugin_MINVOKER-244-NG7YUAFH574UIIL65MNYO3XPSEPSH37LV5D5Q6RWZE34ZWUPXEJA\m\target\invoker-reports\BUILD-exec-timeout-mojo-level.xml, f:\jenkins\jenkins-slave\workspace\invoker-plugin_MINVOKER-244-NG7YUAFH574UIIL65MNYO3XPSEPSH37LV5D5Q6RWZE34ZWUPXEJA\m\target\invoker-reports\BUILD-fail-build-with-verify.xml, f:\jenkins\jenkins-slave\workspace\invoker-plugin_MINVOKER-244-NG7YUAFH574UIIL65MNYO3XPSEPSH37LV5D5Q6RWZE34ZWUPXEJA\m\target\invoker-reports\BUILD-fail-build.xml, f:\jenkins\jenkins-slave\workspace\invoker-plugin_MINVOKER-244-NG7YUAFH574UIIL65MNYO3XPSEPSH37LV5D5Q6RWZE34ZWUPXEJA\m\target\invoker-reports\BUILD-fail-ignore-with-verify.xml, f:\jenkins\jenkins-slave\workspace\invoker-plugin_MINVOKER-244-NG7YUAFH574UIIL65MNYO3XPSEPSH37LV5D5Q6RWZE34ZWUPXEJA\m\target\invoker-reports\BUILD-fail-ignore.xml, f:\jenkins\jenkins-slave\workspace\invoker-plugin_MINVOKER-244-NG7YUAFH574UIIL65MNYO3XPSEPSH37LV5D5Q6RWZE34ZWUPXEJA\m\target\invoker-reports\BUILD-fail-noprojects_integration-test.xml, f:\jenkins\jenkins-slave\workspace\invoker-plugin_MINVOKER-244-NG7YUAFH574UIIL65MNYO3XPSEPSH37LV5D5Q6RWZE34ZWUPXEJA\m\target\invoker-reports\BUILD-fail-noprojects_run.xml, f:\jenkins\jenkins-slave\workspace\invoker-plugin_MINVOKER-244-NG7YUAFH574UIIL65MNYO3XPSEPSH37LV5D5Q6RWZE34ZWUPXEJA\m\target\invoker-reports\BUILD-fail-noprojects_verify.xml, f:\jenkins\jenkins-slave\workspace\invoker-plugin_MINVOKER-244-NG7YUAFH574UIIL65MNYO3XPSEPSH37LV5D5Q6RWZE34ZWUPXEJA\m\target\invoker-reports\BUILD-fail-postbuild.xml, f:\jenkins\jenkins-slave\workspace\invoker-plugin_MINVOKER-244-NG7YUAFH574UIIL65MNYO3XPSEPSH37LV5D5Q6RWZE34ZWUPXEJA\m\target\invoker-reports\BUILD-fail-prebuild.xml, f:\jenkins\jenkins-slave\workspace\invoker-plugin_MINVOKER-244-NG7YUAFH574UIIL65MNYO3XPSEPSH37LV5D5Q6RWZE34ZWUPXEJA\m\target\invoker-reports\BUILD-fail-run-postbuild.xml, f:\jenkins\jenkins-slave\workspace\invoker-plugin_MINVOKER-244-NG7YUAFH574UIIL65MNYO3XPSEPSH37LV5D5Q6RWZE34ZWUPXEJA\m\target\invoker-reports\BUILD-filtering-extensions.xml, f:\jenkins\jenkins-slave\workspace\invoker-plugin_MINVOKER-244-NG7YUAFH574UIIL65MNYO3XPSEPSH37LV5D5Q6RWZE34ZWUPXEJA\m\target\invoker-reports\BUILD-install-extra-artifacts.xml, f:\jenkins\jenkins-slave\workspace\invoker-plugin_MINVOKER-244-NG7YUAFH574UIIL65MNYO3XPSEPSH37LV5D5Q6RWZE34ZWUPXEJA\m\target\invoker-reports\BUILD-integration-test-never-fails.xml, f:\jenkins\jenkins-slave\workspace\invoker-plugin_MINVOKER-244-NG7YUAFH574UIIL65MNYO3XPSEPSH37LV5D5Q6RWZE34ZWUPXEJA\m\target\invoker-reports\BUILD-invocation-cmdline-exclude.xml, f:\jenkins\jenkins-slave\workspace\invoker-plugin_MINVOKER-244-NG7YUAFH574UIIL65MNYO3XPSEPSH37LV5D5Q6RWZE34ZWUPXEJA\m\target\invoker-reports\BUILD-invocation-debug.xml, f:\jenkins\jenkins-slave\workspace\invoker-plugin_MINVOKER-244-NG7YUAFH574UIIL65MNYO3XPSEPSH37LV5D5Q6RWZE34ZWUPXEJA\m\target\invoker-reports\BUILD-invocation-emptyproperty.xml, f:\jenkins\jenkins-slave\workspace\invoker-plugin_MINVOKER-244-NG7YUAFH574UIIL65MNYO3XPSEPSH37LV5D5Q6RWZE34ZWUPXEJA\m\target\invoker-reports\BUILD-invocation-environmentvariable.xml, f:\jenkins\jenkins-slave\workspace\invoker-plugin_MINVOKER-244-NG7YUAFH574UIIL65MNYO3XPSEPSH37LV5D5Q6RWZE34ZWUPXEJA\m\target\invoker-reports\BUILD-invocation-multiple.xml, f:\jenkins\jenkins-slave\workspace\invoker-plugin_MINVOKER-244-NG7YUAFH574UIIL65MNYO3XPSEPSH37LV5D5Q6RWZE34ZWUPXEJA\m\target\invoker-reports\BUILD-invocation-offline.xml, f:\jenkins\jenkins-slave\workspace\invoker-plugin_MINVOKER-244-NG7YUAFH574UIIL65MNYO3XPSEPSH37LV5D5Q6RWZE34ZWUPXEJA\m\target\invoker-reports\BUILD-invocation-project.xml, f:\jenkins\jenkins-slave\workspace\invoker-plugin_MINVOKER-244-NG7YUAFH574UIIL65MNYO3XPSEPSH37LV5D5Q6RWZE34ZWUPXEJA\m\target\invoker-reports\BUILD-invocation-reactor-indirect.xml, f:\jenkins\jenkins-slave\workspace\invoker-plugin_MINVOKER-244-NG7YUAFH574UIIL65MNYO3XPSEPSH37LV5D5Q6RWZE34ZWUPXEJA\m\target\invoker-reports\BUILD-invocation-spaces.xml, f:\jenkins\jenkins-slave\workspace\invoker-plugin_MINVOKER-244-NG7YUAFH574UIIL65MNYO3XPSEPSH37LV5D5Q6RWZE34ZWUPXEJA\m\target\invoker-reports\BUILD-invoker-report.xml, f:\jenkins\jenkins-slave\workspace\invoker-plugin_MINVOKER-244-NG7YUAFH574UIIL65MNYO3XPSEPSH37LV5D5Q6RWZE34ZWUPXEJA\m\target\invoker-reports\BUILD-local-repo-default.xml, f:\jenkins\jenkins-slave\workspace\invoker-plugin_MINVOKER-244-NG7YUAFH574UIIL65MNYO3XPSEPSH37LV5D5Q6RWZE34ZWUPXEJA\m\target\invoker-reports\BUILD-local-repo-isolated.xml, f:\jenkins\jenkins-slave\workspace\invoker-plugin_MINVOKER-244-NG7YUAFH574UIIL65MNYO3XPSEPSH37LV5D5Q6RWZE34ZWUPXEJA\m\target\invoker-reports\BUILD-local-repo-path.xml, f:\jenkins\jenkins-slave\workspace\invoker-plugin_MINVOKER-244-NG7YUAFH574UIIL65MNYO3XPSEPSH37LV5D5Q6RWZE34ZWUPXEJA\m\target\invoker-reports\BUILD-local-repo-url.xml, f:\jenkins\jenkins-slave\workspace\invoker-plugin_MINVOKER-244-NG7YUAFH574UIIL65MNYO3XPSEPSH37LV5D5Q6RWZE34ZWUPXEJA\m\target\invoker-reports\BUILD-multiEnvVar.xml, f:\jenkins\jenkins-slave\workspace\invoker-plugin_MINVOKER-244-NG7YUAFH574UIIL65MNYO3XPSEPSH37LV5D5Q6RWZE34ZWUPXEJA\m\target\invoker-reports\BUILD-not-clone-not-plugin.xml, f:\jenkins\jenkins-slave\workspace\invoker-plugin_MINVOKER-244-NG7YUAFH574UIIL65MNYO3XPSEPSH37LV5D5Q6RWZE34ZWUPXEJA\m\target\invoker-reports\BUILD-pom-filtering-encoding.xml, f:\jenkins\jenkins-slave\workspace\invoker-plugin_MINVOKER-244-NG7YUAFH574UIIL65MNYO3XPSEPSH37LV5D5Q6RWZE34ZWUPXEJA\m\target\invoker-reports\BUILD-pom-filtering-reactor.xml, f:\jenkins\jenkins-slave\workspace\invoker-plugin_MINVOKER-244-NG7YUAFH574UIIL65MNYO3XPSEPSH37LV5D5Q6RWZE34ZWUPXEJA\m\target\invoker-reports\BUILD-pom-filtering.xml, f:\jenkins\jenkins-slave\workspace\invoker-plugin_MINVOKER-244-NG7YUAFH574UIIL65MNYO3XPSEPSH37LV5D5Q6RWZE34ZWUPXEJA\m\target\invoker-reports\BUILD-pom-less-invocation.xml, f:\jenkins\jenkins-slave\workspace\invoker-plugin_MINVOKER-244-NG7YUAFH574UIIL65MNYO3XPSEPSH37LV5D5Q6RWZE34ZWUPXEJA\m\target\invoker-reports\BUILD-postbuild-executed-only-once.xml, f:\jenkins\jenkins-slave\workspace\invoker-plugin_MINVOKER-244-NG7YUAFH574UIIL65MNYO3XPSEPSH37LV5D5Q6RWZE34ZWUPXEJA\m\target\invoker-reports\BUILD-project-cloning-reactor.xml, f:\jenkins\jenkins-slave\workspace\invoker-plugin_MINVOKER-244-NG7YUAFH574UIIL65MNYO3XPSEPSH37LV5D5Q6RWZE34ZWUPXEJA\m\target\invoker-reports\BUILD-project-cloning.xml, f:\jenkins\jenkins-slave\workspace\invoker-plugin_MINVOKER-244-NG7YUAFH574UIIL65MNYO3XPSEPSH37LV5D5Q6RWZE34ZWUPXEJA\m\target\invoker-reports\BUILD-project-setup.xml, f:\jenkins\jenkins-slave\workspace\invoker-plugin_MINVOKER-244-NG7YUAFH574UIIL65MNYO3XPSEPSH37LV5D5Q6RWZE34ZWUPXEJA\m\target\invoker-reports\BUILD-script-accessibility.xml, f:\jenkins\jenkins-slave\workspace\invoker-plugin_MINVOKER-244-NG7YUAFH574UIIL65MNYO3XPSEPSH37LV5D5Q6RWZE34ZWUPXEJA\m\target\invoker-reports\BUILD-script-additional-vars.xml, f:\jenkins\jenkins-slave\workspace\invoker-plugin_MINVOKER-244-NG7YUAFH574UIIL65MNYO3XPSEPSH37LV5D5Q6RWZE34ZWUPXEJA\m\target\invoker-reports\BUILD-script-class-loading.xml, f:\jenkins\jenkins-slave\workspace\invoker-plugin_MINVOKER-244-NG7YUAFH574UIIL65MNYO3XPSEPSH37LV5D5Q6RWZE34ZWUPXEJA\m\target\invoker-reports\BUILD-script-classpath-duplicates.xml, f:\jenkins\jenkins-slave\workspace\invoker-plugin_MINVOKER-244-NG7YUAFH574UIIL65MNYO3XPSEPSH37LV5D5Q6RWZE34ZWUPXEJA\m\target\invoker-reports\BUILD-script-context.xml, f:\jenkins\jenkins-slave\workspace\invoker-plugin_MINVOKER-244-NG7YUAFH574UIIL65MNYO3XPSEPSH37LV5D5Q6RWZE34ZWUPXEJA\m\target\invoker-reports\BUILD-script-errors.xml, f:\jenkins\jenkins-slave\workspace\invoker-plugin_MINVOKER-244-NG7YUAFH574UIIL65MNYO3XPSEPSH37LV5D5Q6RWZE34ZWUPXEJA\m\target\invoker-reports\BUILD-script-global-vars.xml, f:\jenkins\jenkins-slave\workspace\invoker-plugin_MINVOKER-244-NG7YUAFH574UIIL65MNYO3XPSEPSH37LV5D5Q6RWZE34ZWUPXEJA\m\target\invoker-reports\BUILD-script-interpreter-detection.xml, f:\jenkins\jenkins-slave\workspace\invoker-plugin_MINVOKER-244-NG7YUAFH574UIIL65MNYO3XPSEPSH37LV5D5Q6RWZE34ZWUPXEJA\m\target\invoker-reports\BUILD-script-verify-xml.xml, f:\jenkins\jenkins-slave\workspace\invoker-plugin_MINVOKER-244-NG7YUAFH574UIIL65MNYO3XPSEPSH37LV5D5Q6RWZE34ZWUPXEJA\m\target\invoker-reports\BUILD-selector-conditions.xml, f:\jenkins\jenkins-slave\workspace\invoker-plugin_MINVOKER-244-NG7YUAFH574UIIL65MNYO3XPSEPSH37LV5D5Q6RWZE34ZWUPXEJA\m\target\invoker-reports\BUILD-selector-scripts.xml, f:\jenkins\jenkins-slave\workspace\invoker-plugin_MINVOKER-244-NG7YUAFH574UIIL65MNYO3XPSEPSH37LV5D5Q6RWZE34ZWUPXEJA\m\target\invoker-reports\BUILD-settings-auto-exclude.xml, f:\jenkins\jenkins-slave\workspace\invoker-plugin_MINVOKER-244-NG7YUAFH574UIIL65MNYO3XPSEPSH37LV5D5Q6RWZE34ZWUPXEJA\m\target\invoker-reports\BUILD-settings-inherit.xml, f:\jenkins\jenkins-slave\workspace\invoker-plugin_MINVOKER-244-NG7YUAFH574UIIL65MNYO3XPSEPSH37LV5D5Q6RWZE34ZWUPXEJA\m\target\invoker-reports\BUILD-settings-merge-multiexecutions.xml, f:\jenkins\jenkins-slave\workspace\invoker-plugin_MINVOKER-244-NG7YUAFH574UIIL65MNYO3XPSEPSH37LV5D5Q6RWZE34ZWUPXEJA\m\target\invoker-reports\BUILD-settings-merge.xml, f:\jenkins\jenkins-slave\workspace\invoker-plugin_MINVOKER-244-NG7YUAFH574UIIL65MNYO3XPSEPSH37LV5D5Q6RWZE34ZWUPXEJA\m\target\invoker-reports\BUILD-settings-merge_jdk9+.xml, f:\jenkins\jenkins-slave\workspace\invoker-plugin_MINVOKER-244-NG7YUAFH574UIIL65MNYO3XPSEPSH37LV5D5Q6RWZE34ZWUPXEJA\m\target\invoker-reports\BUILD-settings-override.xml, f:\jenkins\jenkins-slave\workspace\invoker-plugin_MINVOKER-244-NG7YUAFH574UIIL65MNYO3XPSEPSH37LV5D5Q6RWZE34ZWUPXEJA\m\target\invoker-reports\BUILD-skip-install.xml, f:\jenkins\jenkins-slave\workspace\invoker-plugin_MINVOKER-244-NG7YUAFH574UIIL65MNYO3XPSEPSH37LV5D5Q6RWZE34ZWUPXEJA\m\target\invoker-reports\BUILD-skip-run.xml, f:\jenkins\jenkins-slave\workspace\invoker-plugin_MINVOKER-244-NG7YUAFH574UIIL65MNYO3XPSEPSH37LV5D5Q6RWZE34ZWUPXEJA\m\target\invoker-reports\BUILD-spaces-should-work_non-windows.xml, f:\jenkins\jenkins-slave\workspace\invoker-plugin_MINVOKER-244-NG7YUAFH574UIIL65MNYO3XPSEPSH37LV5D5Q6RWZE34ZWUPXEJA\m\target\invoker-reports\BUILD-spaces-should-work_windows.xml, f:\jenkins\jenkins-slave\workspace\invoker-plugin_MINVOKER-244-NG7YUAFH574UIIL65MNYO3XPSEPSH37LV5D5Q6RWZE34ZWUPXEJA\m\target\invoker-reports\BUILD-special-characters-should-work.xml, f:\jenkins\jenkins-slave\workspace\invoker-plugin_MINVOKER-244-NG7YUAFH574UIIL65MNYO3XPSEPSH37LV5D5Q6RWZE34ZWUPXEJA\m\target\invoker-reports\BUILD-staging-dependencies.xml, f:\jenkins\jenkins-slave\workspace\invoker-plugin_MINVOKER-244-NG7YUAFH574UIIL65MNYO3XPSEPSH37LV5D5Q6RWZE34ZWUPXEJA\m\target\invoker-reports\BUILD-staging-pom.xml, f:\jenkins\jenkins-slave\workspace\invoker-plugin_MINVOKER-244-NG7YUAFH574UIIL65MNYO3XPSEPSH37LV5D5Q6RWZE34ZWUPXEJA\m\target\invoker-reports\BUILD-staging-reactor.xml, f:\jenkins\jenkins-slave\workspace\invoker-plugin_MINVOKER-244-NG7YUAFH574UIIL65MNYO3XPSEPSH37LV5D5Q6RWZE34ZWUPXEJA\m\target\invoker-reports\BUILD-wrongPropertyInterpolation.xml]
[windows-jdk7] Found logs:[f:\jenkins\jenkins-slave\workspace\invoker-plugin_MINVOKER-244-NG7YUAFH574UIIL65MNYO3XPSEPSH37LV5D5Q6RWZE34ZWUPXEJA\m\target\it\MINVOKER-191\build.log, f:\jenkins\jenkins-slave\workspace\invoker-plugin_MINVOKER-244-NG7YUAFH574UIIL65MNYO3XPSEPSH37LV5D5Q6RWZE34ZWUPXEJA\m\target\it\MINVOKER-191\plugin\target\it\basic\build.log, f:\jenkins\jenkins-slave\workspace\invoker-plugin_MINVOKER-244-NG7YUAFH574UIIL65MNYO3XPSEPSH37LV5D5Q6RWZE34ZWUPXEJA\m\target\it\clone-clean\build.log, f:\jenkins\jenkins-slave\workspace\invoker-plugin_MINVOKER-244-NG7YUAFH574UIIL65MNYO3XPSEPSH37LV5D5Q6RWZE34ZWUPXEJA\m\target\it\clone-clean\target\it\clone-clean\build.log, f:\jenkins\jenkins-slave\workspace\invoker-plugin_MINVOKER-244-NG7YUAFH574UIIL65MNYO3XPSEPSH37LV5D5Q6RWZE34ZWUPXEJA\m\target\it\clone-maven-plugin-packaging\build.log, f:\jenkins\jenkins-slave\workspace\invoker-plugin_MINVOKER-244-NG7YUAFH574UIIL65MNYO3XPSEPSH37LV5D5Q6RWZE34ZWUPXEJA\m\target\it\clone-maven-plugin-packaging\target\it\clone-clean\build.log, f:\jenkins\jenkins-slave\workspace\invoker-plugin_MINVOKER-244-NG7YUAFH574UIIL65MNYO3XPSEPSH37LV5D5Q6RWZE34ZWUPXEJA\m\target\it\exec-timeout-invoker-level\build.log, f:\jenkins\jenkins-slave\workspace\invoker-plugin_MINVOKER-244-NG7YUAFH574UIIL65MNYO3XPSEPSH37LV5D5Q6RWZE34ZWUPXEJA\m\target\it\exec-timeout-invoker-level\target\it\basic\build.log, f:\jenkins\jenkins-slave\workspace\invoker-plugin_MINVOKER-244-NG7YUAFH574UIIL65MNYO3XPSEPSH37LV5D5Q6RWZE34ZWUPXEJA\m\target\it\exec-timeout-mojo-level\build.log, f:\jenkins\jenkins-slave\workspace\invoker-plugin_MINVOKER-244-NG7YUAFH574UIIL65MNYO3XPSEPSH37LV5D5Q6RWZE34ZWUPXEJA\m\target\it\exec-timeout-mojo-level\target\it\basic\build.log, f:\jenkins\jenkins-slave\workspace\invoker-plugin_MINVOKER-244-NG7YUAFH574UIIL65MNYO3XPSEPSH37LV5D5Q6RWZE34ZWUPXEJA\m\target\it\fail-build-with-verify\build.log, f:\jenkins\jenkins-slave\workspace\invoker-plugin_MINVOKER-244-NG7YUAFH574UIIL65MNYO3XPSEPSH37LV5D5Q6RWZE34ZWUPXEJA\m\target\it\fail-build-with-verify\target\it\project\build.log, f:\jenkins\jenkins-slave\workspace\invoker-plugin_MINVOKER-244-NG7YUAFH574UIIL65MNYO3XPSEPSH37LV5D5Q6RWZE34ZWUPXEJA\m\target\it\fail-build\build.log, f:\jenkins\jenkins-slave\workspace\invoker-plugin_MINVOKER-244-NG7YUAFH574UIIL65MNYO3XPSEPSH37LV5D5Q6RWZE34ZWUPXEJA\m\target\it\fail-build\target\it\project\build.log, f:\jenkins\jenkins-slave\workspace\invoker-plugin_MINVOKER-244-NG7YUAFH574UIIL65MNYO3XPSEPSH37LV5D5Q6RWZE34ZWUPXEJA\m\target\it\fail-ignore-with-verify\build.log, f:\jenkins\jenkins-slave\workspace\invoker-plugin_MINVOKER-244-NG7YUAFH574UIIL65MNYO3XPSEPSH37LV5D5Q6RWZE34ZWUPXEJA\m\target\it\fail-ignore-with-verify\target\it\project\build.log, f:\jenkins\jenkins-slave\workspace\invoker-plugin_MINVOKER-244-NG7YUAFH574UIIL65MNYO3XPSEPSH37LV5D5Q6RWZE34ZWUPXEJA\m\target\it\fail-ignore\build.log, f:\jenkins\jenkins-slave\workspace\invoker-plugin_MINVOKER-244-NG7YUAFH574UIIL65MNYO3XPSEPSH37LV5D5Q6RWZE34ZWUPXEJA\m\target\it\fail-ignore\target\it\project\build.log, f:\jenkins\jenkins-slave\workspace\invoker-plugin_MINVOKER-244-NG7YUAFH574UIIL65MNYO3XPSEPSH37LV5D5Q6RWZE34ZWUPXEJA\m\target\it\fail-noprojects_integration-test\build.log, f:\jenkins\jenkins-slave\workspace\invoker-plugin_MINVOKER-244-NG7YUAFH574UIIL65MNYO3XPSEPSH37LV5D5Q6RWZE34ZWUPXEJA\m\target\it\fail-noprojects_run\build.log, f:\jenkins\jenkins-slave\workspace\invoker-plugin_MINVOKER-244-NG7YUAFH574UIIL65MNYO3XPSEPSH37LV5D5Q6RWZE34ZWUPXEJA\m\target\it\fail-noprojects_verify\build.log, f:\jenkins\jenkins-slave\workspace\invoker-plugin_MINVOKER-244-NG7YUAFH574UIIL65MNYO3XPSEPSH37LV5D5Q6RWZE34ZWUPXEJA\m\target\it\fail-postbuild\build.log, f:\jenkins\jenkins-slave\workspace\invoker-plugin_MINVOKER-244-NG7YUAFH574UIIL65MNYO3XPSEPSH37LV5D5Q6RWZE34ZWUPXEJA\m\target\it\fail-postbuild\target\it\project\build.log, f:\jenkins\jenkins-slave\workspace\invoker-plugin_MINVOKER-244-NG7YUAFH574UIIL65MNYO3XPSEPSH37LV5D5Q6RWZE34ZWUPXEJA\m\target\it\fail-prebuild\build.log, f:\jenkins\jenkins-slave\workspace\invoker-plugin_MINVOKER-244-NG7YUAFH574UIIL65MNYO3XPSEPSH37LV5D5Q6RWZE34ZWUPXEJA\m\target\it\fail-prebuild\target\it\project\build.log, f:\jenkins\jenkins-slave\workspace\invoker-plugin_MINVOKER-244-NG7YUAFH574UIIL65MNYO3XPSEPSH37LV5D5Q6RWZE34ZWUPXEJA\m\target\it\fail-run-postbuild\build.log, f:\jenkins\jenkins-slave\workspace\invoker-plugin_MINVOKER-244-NG7YUAFH574UIIL65MNYO3XPSEPSH37LV5D5Q6RWZE34ZWUPXEJA\m\target\it\fail-run-postbuild\target\it\project\build.log, f:\jenkins\jenkins-slave\workspace\invoker-plugin_MINVOKER-244-NG7YUAFH574UIIL65MNYO3XPSEPSH37LV5D5Q6RWZE34ZWUPXEJA\m\target\it\filtering-extensions\build.log, f:\jenkins\jenkins-slave\workspace\invoker-plugin_MINVOKER-244-NG7YUAFH574UIIL65MNYO3XPSEPSH37LV5D5Q6RWZE34ZWUPXEJA\m\target\it\filtering-extensions\target\it\project\build.log, f:\jenkins\jenkins-slave\workspace\invoker-plugin_MINVOKER-244-NG7YUAFH574UIIL65MNYO3XPSEPSH37LV5D5Q6RWZE34ZWUPXEJA\m\target\it\install-extra-artifacts\build.log, f:\jenkins\jenkins-slave\workspace\invoker-plugin_MINVOKER-244-NG7YUAFH574UIIL65MNYO3XPSEPSH37LV5D5Q6RWZE34ZWUPXEJA\m\target\it\integration-test-never-fails\build.log, f:\jenkins\jenkins-slave\workspace\invoker-plugin_MINVOKER-244-NG7YUAFH574UIIL65MNYO3XPSEPSH37LV5D5Q6RWZE34ZWUPXEJA\m\target\it\integration-test-never-fails\target\it\project\build.log, f:\jenkins\jenkins-slave\workspace\invoker-plugin_MINVOKER-244-NG7YUAFH574UIIL65MNYO3XPSEPSH37LV5D5Q6RWZE34ZWUPXEJA\m\target\it\invocation-cmdline-exclude\build.log, f:\jenkins\jenkins-slave\workspace\invoker-plugin_MINVOKER-244-NG7YUAFH574UIIL65MNYO3XPSEPSH37LV5D5Q6RWZE34ZWUPXEJA\m\target\it\invocation-debug\build.log, f:\jenkins\jenkins-slave\workspace\invoker-plugin_MINVOKER-244-NG7YUAFH574UIIL65MNYO3XPSEPSH37LV5D5Q6RWZE34ZWUPXEJA\m\target\it\invocation-debug\src\it\minvoker-142\build.log, f:\jenkins\jenkins-slave\workspace\invoker-plugin_MINVOKER-244-NG7YUAFH574UIIL65MNYO3XPSEPSH37LV5D5Q6RWZE34ZWUPXEJA\m\target\it\invocation-emptyproperty\build.log, f:\jenkins\jenkins-slave\workspace\invoker-plugin_MINVOKER-244-NG7YUAFH574UIIL65MNYO3XPSEPSH37LV5D5Q6RWZE34ZWUPXEJA\m\target\it\invocation-emptyproperty\src\it\minvoker-118\build.log, f:\jenkins\jenkins-slave\workspace\invoker-plugin_MINVOKER-244-NG7YUAFH574UIIL65MNYO3XPSEPSH37LV5D5Q6RWZE34ZWUPXEJA\m\target\it\invocation-environmentvariable\build.log, f:\jenkins\jenkins-slave\workspace\invoker-plugin_MINVOKER-244-NG7YUAFH574UIIL65MNYO3XPSEPSH37LV5D5Q6RWZE34ZWUPXEJA\m\target\it\invocation-environmentvariable\src\it\minvoker-145\build.log, f:\jenkins\jenkins-slave\workspace\invoker-plugin_MINVOKER-244-NG7YUAFH574UIIL65MNYO3XPSEPSH37LV5D5Q6RWZE34ZWUPXEJA\m\target\it\invocation-multiple\build.log, f:\jenkins\jenkins-slave\workspace\invoker-plugin_MINVOKER-244-NG7YUAFH574UIIL65MNYO3XPSEPSH37LV5D5Q6RWZE34ZWUPXEJA\m\target\it\invocation-multiple\target\it\project\build.log, f:\jenkins\jenkins-slave\workspace\invoker-plugin_MINVOKER-244-NG7YUAFH574UIIL65MNYO3XPSEPSH37LV5D5Q6RWZE34ZWUPXEJA\m\target\it\invocation-offline\build.log, f:\jenkins\jenkins-slave\workspace\invoker-plugin_MINVOKER-244-NG7YUAFH574UIIL65MNYO3XPSEPSH37LV5D5Q6RWZE34ZWUPXEJA\m\target\it\invocation-offline\src\it\project\build.log, f:\jenkins\jenkins-slave\workspace\invoker-plugin_MINVOKER-244-NG7YUAFH574UIIL65MNYO3XPSEPSH37LV5D5Q6RWZE34ZWUPXEJA\m\target\it\invocation-project\build.log, f:\jenkins\jenkins-slave\workspace\invoker-plugin_MINVOKER-244-NG7YUAFH574UIIL65MNYO3XPSEPSH37LV5D5Q6RWZE34ZWUPXEJA\m\target\it\invocation-project\target\it\project\build.log, f:\jenkins\jenkins-slave\workspace\invoker-plugin_MINVOKER-244-NG7YUAFH574UIIL65MNYO3XPSEPSH37LV5D5Q6RWZE34ZWUPXEJA\m\target\it\invocation-reactor-indirect\build.log, f:\jenkins\jenkins-slave\workspace\invoker-plugin_MINVOKER-244-NG7YUAFH574UIIL65MNYO3XPSEPSH37LV5D5Q6RWZE34ZWUPXEJA\m\target\it\invocation-reactor-indirect\itests\target\it\basic\build.log, f:\jenkins\jenkins-slave\workspace\invoker-plugin_MINVOKER-244-NG7YUAFH574UIIL65MNYO3XPSEPSH37LV5D5Q6RWZE34ZWUPXEJA\m\target\it\invocation-spaces\build.log, f:\jenkins\jenkins-slave\workspace\invoker-plugin_MINVOKER-244-NG7YUAFH574UIIL65MNYO3XPSEPSH37LV5D5Q6RWZE34ZWUPXEJA\m\target\it\invocation-spaces\target\it projects\project\build.log, f:\jenkins\jenkins-slave\workspace\invoker-plugin_MINVOKER-244-NG7YUAFH574UIIL65MNYO3XPSEPSH37LV5D5Q6RWZE34ZWUPXEJA\m\target\it\invoker-report\build.log, f:\jenkins\jenkins-slave\workspace\invoker-plugin_MINVOKER-244-NG7YUAFH574UIIL65MNYO3XPSEPSH37LV5D5Q6RWZE34ZWUPXEJA\m\target\it\invoker-report\src\it\failure-build\build.log, f:\jenkins\jenkins-slave\workspace\invoker-plugin_MINVOKER-244-NG7YUAFH574UIIL65MNYO3XPSEPSH37LV5D5Q6RWZE34ZWUPXEJA\m\target\it\invoker-report\src\it\failure-post\build.log, f:\jenkins\jenkins-slave\workspace\invoker-plugin_MINVOKER-244-NG7YUAFH574UIIL65MNYO3XPSEPSH37LV5D5Q6RWZE34ZWUPXEJA\m\target\it\invoker-report\src\it\failure-pre\build.log, f:\jenkins\jenkins-slave\workspace\invoker-plugin_MINVOKER-244-NG7YUAFH574UIIL65MNYO3XPSEPSH37LV5D5Q6RWZE34ZWUPXEJA\m\target\it\invoker-report\src\it\success\build.log, f:\jenkins\jenkins-slave\workspace\invoker-plugin_MINVOKER-244-NG7YUAFH574UIIL65MNYO3XPSEPSH37LV5D5Q6RWZE34ZWUPXEJA\m\target\it\local-repo-default\build.log, f:\jenkins\jenkins-slave\workspace\invoker-plugin_MINVOKER-244-NG7YUAFH574UIIL65MNYO3XPSEPSH37LV5D5Q6RWZE34ZWUPXEJA\m\target\it\local-repo-default\target\its\project\build.log, f:\jenkins\jenkins-slave\workspace\invoker-plugin_MINVOKER-244-NG7YUAFH574UIIL65MNYO3XPSEPSH37LV5D5Q6RWZE34ZWUPXEJA\m\target\it\local-repo-isolated\build.log, f:\jenkins\jenkins-slave\workspace\invoker-plugin_MINVOKER-244-NG7YUAFH574UIIL65MNYO3XPSEPSH37LV5D5Q6RWZE34ZWUPXEJA\m\target\it\local-repo-isolated\src\it\project\build.log, f:\jenkins\jenkins-slave\workspace\invoker-plugin_MINVOKER-244-NG7YUAFH574UIIL65MNYO3XPSEPSH37LV5D5Q6RWZE34ZWUPXEJA\m\target\it\local-repo-path\build.log, f:\jenkins\jenkins-slave\workspace\invoker-plugin_MINVOKER-244-NG7YUAFH574UIIL65MNYO3XPSEPSH37LV5D5Q6RWZE34ZWUPXEJA\m\target\it\local-repo-path\src\it\project\build.log, f:\jenkins\jenkins-slave\workspace\invoker-plugin_MINVOKER-244-NG7YUAFH574UIIL65MNYO3XPSEPSH37LV5D5Q6RWZE34ZWUPXEJA\m\target\it\local-repo-url\build.log, f:\jenkins\jenkins-slave\workspace\invoker-plugin_MINVOKER-244-NG7YUAFH574UIIL65MNYO3XPSEPSH37LV5D5Q6RWZE34ZWUPXEJA\m\target\it\local-repo-url\src\it\project\build.log, f:\jenkins\jenkins-slave\workspace\invoker-plugin_MINVOKER-244-NG7YUAFH574UIIL65MNYO3XPSEPSH37LV5D5Q6RWZE34ZWUPXEJA\m\target\it\multiEnvVar\build.log, f:\jenkins\jenkins-slave\workspace\invoker-plugin_MINVOKER-244-NG7YUAFH574UIIL65MNYO3XPSEPSH37LV5D5Q6RWZE34ZWUPXEJA\m\target\it\multiEnvVar\target\it\project\build.log, f:\jenkins\jenkins-slave\workspace\invoker-plugin_MINVOKER-244-NG7YUAFH574UIIL65MNYO3XPSEPSH37LV5D5Q6RWZE34ZWUPXEJA\m\target\it\not-clone-not-plugin\build.log, f:\jenkins\jenkins-slave\workspace\invoker-plugin_MINVOKER-244-NG7YUAFH574UIIL65MNYO3XPSEPSH37LV5D5Q6RWZE34ZWUPXEJA\m\target\it\not-clone-not-plugin\src\it\clone-clean\build.log, f:\jenkins\jenkins-slave\workspace\invoker-plugin_MINVOKER-244-NG7YUAFH574UIIL65MNYO3XPSEPSH37LV5D5Q6RWZE34ZWUPXEJA\m\target\it\pom-filtering-encoding\build.log, f:\jenkins\jenkins-slave\workspace\invoker-plugin_MINVOKER-244-NG7YUAFH574UIIL65MNYO3XPSEPSH37LV5D5Q6RWZE34ZWUPXEJA\m\target\it\pom-filtering-encoding\target\it\latin-1\build.log, f:\jenkins\jenkins-slave\workspace\invoker-plugin_MINVOKER-244-NG7YUAFH574UIIL65MNYO3XPSEPSH37LV5D5Q6RWZE34ZWUPXEJA\m\target\it\pom-filtering-encoding\target\it\utf-8\build.log, f:\jenkins\jenkins-slave\workspace\invoker-plugin_MINVOKER-244-NG7YUAFH574UIIL65MNYO3XPSEPSH37LV5D5Q6RWZE34ZWUPXEJA\m\target\it\pom-filtering-reactor\build.log, f:\jenkins\jenkins-slave\workspace\invoker-plugin_MINVOKER-244-NG7YUAFH574UIIL65MNYO3XPSEPSH37LV5D5Q6RWZE34ZWUPXEJA\m\target\it\pom-filtering-reactor\target\it\mod2-parent\build.log, f:\jenkins\jenkins-slave\workspace\invoker-plugin_MINVOKER-244-NG7YUAFH574UIIL65MNYO3XPSEPSH37LV5D5Q6RWZE34ZWUPXEJA\m\target\it\pom-filtering\build.log, f:\jenkins\jenkins-slave\workspace\invoker-plugin_MINVOKER-244-NG7YUAFH574UIIL65MNYO3XPSEPSH37LV5D5Q6RWZE34ZWUPXEJA\m\target\it\pom-filtering\target\it\project\build.log, f:\jenkins\jenkins-slave\workspace\invoker-plugin_MINVOKER-244-NG7YUAFH574UIIL65MNYO3XPSEPSH37LV5D5Q6RWZE34ZWUPXEJA\m\target\it\pom-less-invocation\build.log, f:\jenkins\jenkins-slave\workspace\invoker-plugin_MINVOKER-244-NG7YUAFH574UIIL65MNYO3XPSEPSH37LV5D5Q6RWZE34ZWUPXEJA\m\target\it\pom-less-invocation\target\it\no-pom\build.log, f:\jenkins\jenkins-slave\workspace\invoker-plugin_MINVOKER-244-NG7YUAFH574UIIL65MNYO3XPSEPSH37LV5D5Q6RWZE34ZWUPXEJA\m\target\it\postbuild-executed-only-once\build.log, f:\jenkins\jenkins-slave\workspace\invoker-plugin_MINVOKER-244-NG7YUAFH574UIIL65MNYO3XPSEPSH37LV5D5Q6RWZE34ZWUPXEJA\m\target\it\postbuild-executed-only-once\target\it\project\build.log, f:\jenkins\jenkins-slave\workspace\invoker-plugin_MINVOKER-244-NG7YUAFH574UIIL65MNYO3XPSEPSH37LV5D5Q6RWZE34ZWUPXEJA\m\target\it\project-cloning-reactor\build.log, f:\jenkins\jenkins-slave\workspace\invoker-plugin_MINVOKER-244-NG7YUAFH574UIIL65MNYO3XPSEPSH37LV5D5Q6RWZE34ZWUPXEJA\m\target\it\project-cloning-reactor\target\it\aggregator\build.log, f:\jenkins\jenkins-slave\workspace\invoker-plugin_MINVOKER-244-NG7YUAFH574UIIL65MNYO3XPSEPSH37LV5D5Q6RWZE34ZWUPXEJA\m\target\it\project-cloning\build.log, f:\jenkins\jenkins-slave\workspace\invoker-plugin_MINVOKER-244-NG7YUAFH574UIIL65MNYO3XPSEPSH37LV5D5Q6RWZE34ZWUPXEJA\m\target\it\project-cloning\target\it\module-1\build.log, f:\jenkins\jenkins-slave\workspace\invoker-plugin_MINVOKER-244-NG7YUAFH574UIIL65MNYO3XPSEPSH37LV5D5Q6RWZE34ZWUPXEJA\m\target\it\project-cloning\target\it\module-1\sub-module\build.log, f:\jenkins\jenkins-slave\workspace\invoker-plugin_MINVOKER-244-NG7YUAFH574UIIL65MNYO3XPSEPSH37LV5D5Q6RWZE34ZWUPXEJA\m\target\it\project-cloning\target\it\module\build.log, f:\jenkins\jenkins-slave\workspace\invoker-plugin_MINVOKER-244-NG7YUAFH574UIIL65MNYO3XPSEPSH37LV5D5Q6RWZE34ZWUPXEJA\m\target\it\project-setup\build.log, f:\jenkins\jenkins-slave\workspace\invoker-plugin_MINVOKER-244-NG7YUAFH574UIIL65MNYO3XPSEPSH37LV5D5Q6RWZE34ZWUPXEJA\m\target\it\project-setup\target\it\project1\build.log, f:\jenkins\jenkins-slave\workspace\invoker-plugin_MINVOKER-244-NG7YUAFH574UIIL65MNYO3XPSEPSH37LV5D5Q6RWZE34ZWUPXEJA\m\target\it\project-setup\target\it\project2\build.log, f:\jenkins\jenkins-slave\workspace\invoker-plugin_MINVOKER-244-NG7YUAFH574UIIL65MNYO3XPSEPSH37LV5D5Q6RWZE34ZWUPXEJA\m\target\it\project-setup\target\it\project3\build.log, f:\jenkins\jenkins-slave\workspace\invoker-plugin_MINVOKER-244-NG7YUAFH574UIIL65MNYO3XPSEPSH37LV5D5Q6RWZE34ZWUPXEJA\m\target\it\project-setup\target\it\project4\build.log, f:\jenkins\jenkins-slave\workspace\invoker-plugin_MINVOKER-244-NG7YUAFH574UIIL65MNYO3XPSEPSH37LV5D5Q6RWZE34ZWUPXEJA\m\target\it\project-setup\target\it\project5\build.log, f:\jenkins\jenkins-slave\workspace\invoker-plugin_MINVOKER-244-NG7YUAFH574UIIL65MNYO3XPSEPSH37LV5D5Q6RWZE34ZWUPXEJA\m\target\it\script-accessibility\build.log, f:\jenkins\jenkins-slave\workspace\invoker-plugin_MINVOKER-244-NG7YUAFH574UIIL65MNYO3XPSEPSH37LV5D5Q6RWZE34ZWUPXEJA\m\target\it\script-accessibility\src\it\beanshell\build.log, f:\jenkins\jenkins-slave\workspace\invoker-plugin_MINVOKER-244-NG7YUAFH574UIIL65MNYO3XPSEPSH37LV5D5Q6RWZE34ZWUPXEJA\m\target\it\script-accessibility\src\it\groovy\build.log, f:\jenkins\jenkins-slave\workspace\invoker-plugin_MINVOKER-244-NG7YUAFH574UIIL65MNYO3XPSEPSH37LV5D5Q6RWZE34ZWUPXEJA\m\target\it\script-additional-vars\build.log, f:\jenkins\jenkins-slave\workspace\invoker-plugin_MINVOKER-244-NG7YUAFH574UIIL65MNYO3XPSEPSH37LV5D5Q6RWZE34ZWUPXEJA\m\target\it\script-additional-vars\src\it\beanshell\build.log, f:\jenkins\jenkins-slave\workspace\invoker-plugin_MINVOKER-244-NG7YUAFH574UIIL65MNYO3XPSEPSH37LV5D5Q6RWZE34ZWUPXEJA\m\target\it\script-additional-vars\src\it\groovy\build.log, f:\jenkins\jenkins-slave\workspace\invoker-plugin_MINVOKER-244-NG7YUAFH574UIIL65MNYO3XPSEPSH37LV5D5Q6RWZE34ZWUPXEJA\m\target\it\script-class-loading\build.log, f:\jenkins\jenkins-slave\workspace\invoker-plugin_MINVOKER-244-NG7YUAFH574UIIL65MNYO3XPSEPSH37LV5D5Q6RWZE34ZWUPXEJA\m\target\it\script-class-loading\src\it\beanshell\build.log, f:\jenkins\jenkins-slave\workspace\invoker-plugin_MINVOKER-244-NG7YUAFH574UIIL65MNYO3XPSEPSH37LV5D5Q6RWZE34ZWUPXEJA\m\target\it\script-class-loading\src\it\groovy\build.log, f:\jenkins\jenkins-slave\workspace\invoker-plugin_MINVOKER-244-NG7YUAFH574UIIL65MNYO3XPSEPSH37LV5D5Q6RWZE34ZWUPXEJA\m\target\it\script-classpath-duplicates\build.log, f:\jenkins\jenkins-slave\workspace\invoker-plugin_MINVOKER-244-NG7YUAFH574UIIL65MNYO3XPSEPSH37LV5D5Q6RWZE34ZWUPXEJA\m\target\it\script-classpath-duplicates\target\it\beanshell\build.log, f:\jenkins\jenkins-slave\workspace\invoker-plugin_MINVOKER-244-NG7YUAFH574UIIL65MNYO3XPSEPSH37LV5D5Q6RWZE34ZWUPXEJA\m\target\it\script-classpath-duplicates\target\it\groovy\build.log, f:\jenkins\jenkins-slave\workspace\invoker-plugin_MINVOKER-244-NG7YUAFH574UIIL65MNYO3XPSEPSH37LV5D5Q6RWZE34ZWUPXEJA\m\target\it\script-context\build.log, f:\jenkins\jenkins-slave\workspace\invoker-plugin_MINVOKER-244-NG7YUAFH574UIIL65MNYO3XPSEPSH37LV5D5Q6RWZE34ZWUPXEJA\m\target\it\script-context\target\its\beanshell\build.log, f:\jenkins\jenkins-slave\workspace\invoker-plugin_MINVOKER-244-NG7YUAFH574UIIL65MNYO3XPSEPSH37LV5D5Q6RWZE34ZWUPXEJA\m\target\it\script-context\target\its\groovy\build.log, f:\jenkins\jenkins-slave\workspace\invoker-plugin_MINVOKER-244-NG7YUAFH574UIIL65MNYO3XPSEPSH37LV5D5Q6RWZE34ZWUPXEJA\m\target\it\script-errors\build.log, f:\jenkins\jenkins-slave\workspace\invoker-plugin_MINVOKER-244-NG7YUAFH574UIIL65MNYO3XPSEPSH37LV5D5Q6RWZE34ZWUPXEJA\m\target\it\script-errors\target\its\beanshell\build.log, f:\jenkins\jenkins-slave\workspace\invoker-plugin_MINVOKER-244-NG7YUAFH574UIIL65MNYO3XPSEPSH37LV5D5Q6RWZE34ZWUPXEJA\m\target\it\script-errors\target\its\groovy\build.log, f:\jenkins\jenkins-slave\workspace\invoker-plugin_MINVOKER-244-NG7YUAFH574UIIL65MNYO3XPSEPSH37LV5D5Q6RWZE34ZWUPXEJA\m\target\it\script-global-vars\build.log, f:\jenkins\jenkins-slave\workspace\invoker-plugin_MINVOKER-244-NG7YUAFH574UIIL65MNYO3XPSEPSH37LV5D5Q6RWZE34ZWUPXEJA\m\target\it\script-global-vars\src\it\beanshell\build.log, f:\jenkins\jenkins-slave\workspace\invoker-plugin_MINVOKER-244-NG7YUAFH574UIIL65MNYO3XPSEPSH37LV5D5Q6RWZE34ZWUPXEJA\m\target\it\script-global-vars\src\it\groovy\build.log, f:\jenkins\jenkins-slave\workspace\invoker-plugin_MINVOKER-244-NG7YUAFH574UIIL65MNYO3XPSEPSH37LV5D5Q6RWZE34ZWUPXEJA\m\target\it\script-interpreter-detection\build.log, f:\jenkins\jenkins-slave\workspace\invoker-plugin_MINVOKER-244-NG7YUAFH574UIIL65MNYO3XPSEPSH37LV5D5Q6RWZE34ZWUPXEJA\m\target\it\script-interpreter-detection\target\its\beanshell\build.log, f:\jenkins\jenkins-slave\workspace\invoker-plugin_MINVOKER-244-NG7YUAFH574UIIL65MNYO3XPSEPSH37LV5D5Q6RWZE34ZWUPXEJA\m\target\it\script-interpreter-detection\target\its\groovy\build.log, f:\jenkins\jenkins-slave\workspace\invoker-plugin_MINVOKER-244-NG7YUAFH574UIIL65MNYO3XPSEPSH37LV5D5Q6RWZE34ZWUPXEJA\m\target\it\script-verify-xml\build.log, f:\jenkins\jenkins-slave\workspace\invoker-plugin_MINVOKER-244-NG7YUAFH574UIIL65MNYO3XPSEPSH37LV5D5Q6RWZE34ZWUPXEJA\m\target\it\selector-conditions\build.log, f:\jenkins\jenkins-slave\workspace\invoker-plugin_MINVOKER-244-NG7YUAFH574UIIL65MNYO3XPSEPSH37LV5D5Q6RWZE34ZWUPXEJA\m\target\it\selector-conditions\target\its\jre-version-match\build.log, f:\jenkins\jenkins-slave\workspace\invoker-plugin_MINVOKER-244-NG7YUAFH574UIIL65MNYO3XPSEPSH37LV5D5Q6RWZE34ZWUPXEJA\m\target\it\selector-conditions\target\its\maven-version-match\build.log, f:\jenkins\jenkins-slave\workspace\invoker-plugin_MINVOKER-244-NG7YUAFH574UIIL65MNYO3XPSEPSH37LV5D5Q6RWZE34ZWUPXEJA\m\target\it\selector-conditions\target\its\os-family-match\build.log, f:\jenkins\jenkins-slave\workspace\invoker-plugin_MINVOKER-244-NG7YUAFH574UIIL65MNYO3XPSEPSH37LV5D5Q6RWZE34ZWUPXEJA\m\target\it\selector-scripts\build.log, f:\jenkins\jenkins-slave\workspace\invoker-plugin_MINVOKER-244-NG7YUAFH574UIIL65MNYO3XPSEPSH37LV5D5Q6RWZE34ZWUPXEJA\m\target\it\selector-scripts\target\its\script-ret-false\build.log, f:\jenkins\jenkins-slave\workspace\invoker-plugin_MINVOKER-244-NG7YUAFH574UIIL65MNYO3XPSEPSH37LV5D5Q6RWZE34ZWUPXEJA\m\target\it\selector-scripts\target\its\script-ret-other\build.log, f:\jenkins\jenkins-slave\workspace\invoker-plugin_MINVOKER-244-NG7YUAFH574UIIL65MNYO3XPSEPSH37LV5D5Q6RWZE34ZWUPXEJA\m\target\it\selector-scripts\target\its\script-ret-quiet\build.log, f:\jenkins\jenkins-slave\workspace\invoker-plugin_MINVOKER-244-NG7YUAFH574UIIL65MNYO3XPSEPSH37LV5D5Q6RWZE34ZWUPXEJA\m\target\it\selector-scripts\target\its\script-ret-true\build.log, f:\jenkins\jenkins-slave\workspace\invoker-plugin_MINVOKER-244-NG7YUAFH574UIIL65MNYO3XPSEPSH37LV5D5Q6RWZE34ZWUPXEJA\m\target\it\selector-scripts\target\its\script-throw\build.log, f:\jenkins\jenkins-slave\workspace\invoker-plugin_MINVOKER-244-NG7YUAFH574UIIL65MNYO3XPSEPSH37LV5D5Q6RWZE34ZWUPXEJA\m\target\it\settings-auto-exclude\build.log, f:\jenkins\jenkins-slave\workspace\invoker-plugin_MINVOKER-244-NG7YUAFH574UIIL65MNYO3XPSEPSH37LV5D5Q6RWZE34ZWUPXEJA\m\target\it\settings-auto-exclude\src\it\project\build.log, f:\jenkins\jenkins-slave\workspace\invoker-plugin_MINVOKER-244-NG7YUAFH574UIIL65MNYO3XPSEPSH37LV5D5Q6RWZE34ZWUPXEJA\m\target\it\settings-inherit\build.log, f:\jenkins\jenkins-slave\workspace\invoker-plugin_MINVOKER-244-NG7YUAFH574UIIL65MNYO3XPSEPSH37LV5D5Q6RWZE34ZWUPXEJA\m\target\it\settings-inherit\target\it\project\build.log, f:\jenkins\jenkins-slave\workspace\invoker-plugin_MINVOKER-244-NG7YUAFH574UIIL65MNYO3XPSEPSH37LV5D5Q6RWZE34ZWUPXEJA\m\target\it\settings-merge-multiexecutions\build.log, f:\jenkins\jenkins-slave\workspace\invoker-plugin_MINVOKER-244-NG7YUAFH574UIIL65MNYO3XPSEPSH37LV5D5Q6RWZE34ZWUPXEJA\m\target\it\settings-merge-multiexecutions\target\it\minvoker-133\build.log, f:\jenkins\jenkins-slave\workspace\invoker-plugin_MINVOKER-244-NG7YUAFH574UIIL65MNYO3XPSEPSH37LV5D5Q6RWZE34ZWUPXEJA\m\target\it\settings-merge\build.log, f:\jenkins\jenkins-slave\workspace\invoker-plugin_MINVOKER-244-NG7YUAFH574UIIL65MNYO3XPSEPSH37LV5D5Q6RWZE34ZWUPXEJA\m\target\it\settings-merge\target\it\project\build.log, f:\jenkins\jenkins-slave\workspace\invoker-plugin_MINVOKER-244-NG7YUAFH574UIIL65MNYO3XPSEPSH37LV5D5Q6RWZE34ZWUPXEJA\m\target\it\settings-merge_jdk9+\build.log, f:\jenkins\jenkins-slave\workspace\invoker-plugin_MINVOKER-244-NG7YUAFH574UIIL65MNYO3XPSEPSH37LV5D5Q6RWZE34ZWUPXEJA\m\target\it\settings-merge_jdk9+\target\it\project\build.log, f:\jenkins\jenkins-slave\workspace\invoker-plugin_MINVOKER-244-NG7YUAFH574UIIL65MNYO3XPSEPSH37LV5D5Q6RWZE34ZWUPXEJA\m\target\it\settings-override\build.log, f:\jenkins\jenkins-slave\workspace\invoker-plugin_MINVOKER-244-NG7YUAFH574UIIL65MNYO3XPSEPSH37LV5D5Q6RWZE34ZWUPXEJA\m\target\it\settings-override\src\it\project\build.log, f:\jenkins\jenkins-slave\workspace\invoker-plugin_MINVOKER-244-NG7YUAFH574UIIL65MNYO3XPSEPSH37LV5D5Q6RWZE34ZWUPXEJA\m\target\it\skip-install\build.log, f:\jenkins\jenkins-slave\workspace\invoker-plugin_MINVOKER-244-NG7YUAFH574UIIL65MNYO3XPSEPSH37LV5D5Q6RWZE34ZWUPXEJA\m\target\it\skip-run\build.log, f:\jenkins\jenkins-slave\workspace\invoker-plugin_MINVOKER-244-NG7YUAFH574UIIL65MNYO3XPSEPSH37LV5D5Q6RWZE34ZWUPXEJA\m\target\it\spaces-should-work_windows\build.log, f:\jenkins\jenkins-slave\workspace\invoker-plugin_MINVOKER-244-NG7YUAFH574UIIL65MNYO3XPSEPSH37LV5D5Q6RWZE34ZWUPXEJA\m\target\it\spaces-should-work_windows\src\it\test-Ééê- & -Ééê-test\build.log, f:\jenkins\jenkins-slave\workspace\invoker-plugin_MINVOKER-244-NG7YUAFH574UIIL65MNYO3XPSEPSH37LV5D5Q6RWZE34ZWUPXEJA\m\target\it\special-characters-should-work\build.log, f:\jenkins\jenkins-slave\workspace\invoker-plugin_MINVOKER-244-NG7YUAFH574UIIL65MNYO3XPSEPSH37LV5D5Q6RWZE34ZWUPXEJA\m\target\it\special-characters-should-work\src\it\test-Ééê-more-Ééê-test\build.log, f:\jenkins\jenkins-slave\workspace\invoker-plugin_MINVOKER-244-NG7YUAFH574UIIL65MNYO3XPSEPSH37LV5D5Q6RWZE34ZWUPXEJA\m\target\it\staging-dependencies\build.log, f:\jenkins\jenkins-slave\workspace\invoker-plugin_MINVOKER-244-NG7YUAFH574UIIL65MNYO3XPSEPSH37LV5D5Q6RWZE34ZWUPXEJA\m\target\it\staging-pom\build.log, f:\jenkins\jenkins-slave\workspace\invoker-plugin_MINVOKER-244-NG7YUAFH574UIIL65MNYO3XPSEPSH37LV5D5Q6RWZE34ZWUPXEJA\m\target\it\staging-reactor\build.log, f:\jenkins\jenkins-slave\workspace\invoker-plugin_MINVOKER-244-NG7YUAFH574UIIL65MNYO3XPSEPSH37LV5D5Q6RWZE34ZWUPXEJA\m\target\it\wrongPropertyInterpolation\build.log, f:\jenkins\jenkins-slave\workspace\invoker-plugin_MINVOKER-244-NG7YUAFH574UIIL65MNYO3XPSEPSH37LV5D5Q6RWZE34ZWUPXEJA\m\target\it\wrongPropertyInterpolation\target\it\project\build.log]
[windows-jdk7] Finished parsing Maven Invoker results (found 68)
[windows-jdk7] [withMaven] junitPublisher - Archive test results for Maven artifact org.apache.maven.plugins:maven-invoker-plugin:3.1.1-SNAPSHOT generated by maven-surefire-plugin:test (default-test): m\target\surefire-reports\*.xml
[windows-jdk7] Recording test results
[Pipeline] [windows-jdk7] // withMaven
[Pipeline] [windows-jdk9] }
[Pipeline] [windows-jdk7] cleanWs
[Pipeline] [windows-jdk9] // dir
[windows-jdk7] [WS-CLEANUP] Deleting project workspace...[WS-CLEANUP] done
[Pipeline] [windows-jdk9] }
[windows-jdk9] [withMaven] invokerPublisher - Archive invoker results for Maven artifact MavenArtifact{org.apache.maven.plugins:maven-invoker-plugin::3.1.1-SNAPSHOT(version: 3.1.1-SNAPSHOT, snapshot:false) } generated by PluginInvocation{org.apache.maven.plugins:maven-invoker-plugin:3.0.1@integration-test  integration-test}: m\target\invoker-reports\*.xml
[windows-jdk9] performing MavenInvokerRecorder, reportsFilenamePattern:'**/m\target\invoker-reports/BUILD*.xml', invokerBuildDir:'**/m\target\it'
[windows-jdk9] Found reports:[f:\jenkins\jenkins-slave\workspace\invoker-plugin_MINVOKER-244-NG7YUAFH574UIIL65MNYO3XPSEPSH37LV5D5Q6RWZE34ZWUPXEJA\m\target\invoker-reports\BUILD-MINVOKER-191.xml, f:\jenkins\jenkins-slave\workspace\invoker-plugin_MINVOKER-244-NG7YUAFH574UIIL65MNYO3XPSEPSH37LV5D5Q6RWZE34ZWUPXEJA\m\target\invoker-reports\BUILD-clone-clean.xml, f:\jenkins\jenkins-slave\workspace\invoker-plugin_MINVOKER-244-NG7YUAFH574UIIL65MNYO3XPSEPSH37LV5D5Q6RWZE34ZWUPXEJA\m\target\invoker-reports\BUILD-clone-maven-plugin-packaging.xml, f:\jenkins\jenkins-slave\workspace\invoker-plugin_MINVOKER-244-NG7YUAFH574UIIL65MNYO3XPSEPSH37LV5D5Q6RWZE34ZWUPXEJA\m\target\invoker-reports\BUILD-exec-timeout-invoker-level.xml, f:\jenkins\jenkins-slave\workspace\invoker-plugin_MINVOKER-244-NG7YUAFH574UIIL65MNYO3XPSEPSH37LV5D5Q6RWZE34ZWUPXEJA\m\target\invoker-reports\BUILD-exec-timeout-mojo-level.xml, f:\jenkins\jenkins-slave\workspace\invoker-plugin_MINVOKER-244-NG7YUAFH574UIIL65MNYO3XPSEPSH37LV5D5Q6RWZE34ZWUPXEJA\m\target\invoker-reports\BUILD-fail-build-with-verify.xml, f:\jenkins\jenkins-slave\workspace\invoker-plugin_MINVOKER-244-NG7YUAFH574UIIL65MNYO3XPSEPSH37LV5D5Q6RWZE34ZWUPXEJA\m\target\invoker-reports\BUILD-fail-build.xml, f:\jenkins\jenkins-slave\workspace\invoker-plugin_MINVOKER-244-NG7YUAFH574UIIL65MNYO3XPSEPSH37LV5D5Q6RWZE34ZWUPXEJA\m\target\invoker-reports\BUILD-fail-ignore-with-verify.xml, f:\jenkins\jenkins-slave\workspace\invoker-plugin_MINVOKER-244-NG7YUAFH574UIIL65MNYO3XPSEPSH37LV5D5Q6RWZE34ZWUPXEJA\m\target\invoker-reports\BUILD-fail-ignore.xml, f:\jenkins\jenkins-slave\workspace\invoker-plugin_MINVOKER-244-NG7YUAFH574UIIL65MNYO3XPSEPSH37LV5D5Q6RWZE34ZWUPXEJA\m\target\invoker-reports\BUILD-fail-noprojects_integration-test.xml, f:\jenkins\jenkins-slave\workspace\invoker-plugin_MINVOKER-244-NG7YUAFH574UIIL65MNYO3XPSEPSH37LV5D5Q6RWZE34ZWUPXEJA\m\target\invoker-reports\BUILD-fail-noprojects_run.xml, f:\jenkins\jenkins-slave\workspace\invoker-plugin_MINVOKER-244-NG7YUAFH574UIIL65MNYO3XPSEPSH37LV5D5Q6RWZE34ZWUPXEJA\m\target\invoker-reports\BUILD-fail-noprojects_verify.xml, f:\jenkins\jenkins-slave\workspace\invoker-plugin_MINVOKER-244-NG7YUAFH574UIIL65MNYO3XPSEPSH37LV5D5Q6RWZE34ZWUPXEJA\m\target\invoker-reports\BUILD-fail-postbuild.xml, f:\jenkins\jenkins-slave\workspace\invoker-plugin_MINVOKER-244-NG7YUAFH574UIIL65MNYO3XPSEPSH37LV5D5Q6RWZE34ZWUPXEJA\m\target\invoker-reports\BUILD-fail-prebuild.xml, f:\jenkins\jenkins-slave\workspace\invoker-plugin_MINVOKER-244-NG7YUAFH574UIIL65MNYO3XPSEPSH37LV5D5Q6RWZE34ZWUPXEJA\m\target\invoker-reports\BUILD-fail-run-postbuild.xml, f:\jenkins\jenkins-slave\workspace\invoker-plugin_MINVOKER-244-NG7YUAFH574UIIL65MNYO3XPSEPSH37LV5D5Q6RWZE34ZWUPXEJA\m\target\invoker-reports\BUILD-filtering-extensions.xml, f:\jenkins\jenkins-slave\workspace\invoker-plugin_MINVOKER-244-NG7YUAFH574UIIL65MNYO3XPSEPSH37LV5D5Q6RWZE34ZWUPXEJA\m\target\invoker-reports\BUILD-install-extra-artifacts.xml, f:\jenkins\jenkins-slave\workspace\invoker-plugin_MINVOKER-244-NG7YUAFH574UIIL65MNYO3XPSEPSH37LV5D5Q6RWZE34ZWUPXEJA\m\target\invoker-reports\BUILD-integration-test-never-fails.xml, f:\jenkins\jenkins-slave\workspace\invoker-plugin_MINVOKER-244-NG7YUAFH574UIIL65MNYO3XPSEPSH37LV5D5Q6RWZE34ZWUPXEJA\m\target\invoker-reports\BUILD-invocation-cmdline-exclude.xml, f:\jenkins\jenkins-slave\workspace\invoker-plugin_MINVOKER-244-NG7YUAFH574UIIL65MNYO3XPSEPSH37LV5D5Q6RWZE34ZWUPXEJA\m\target\invoker-reports\BUILD-invocation-debug.xml, f:\jenkins\jenkins-slave\workspace\invoker-plugin_MINVOKER-244-NG7YUAFH574UIIL65MNYO3XPSEPSH37LV5D5Q6RWZE34ZWUPXEJA\m\target\invoker-reports\BUILD-invocation-emptyproperty.xml, f:\jenkins\jenkins-slave\workspace\invoker-plugin_MINVOKER-244-NG7YUAFH574UIIL65MNYO3XPSEPSH37LV5D5Q6RWZE34ZWUPXEJA\m\target\invoker-reports\BUILD-invocation-environmentvariable.xml, f:\jenkins\jenkins-slave\workspace\invoker-plugin_MINVOKER-244-NG7YUAFH574UIIL65MNYO3XPSEPSH37LV5D5Q6RWZE34ZWUPXEJA\m\target\invoker-reports\BUILD-invocation-multiple.xml, f:\jenkins\jenkins-slave\workspace\invoker-plugin_MINVOKER-244-NG7YUAFH574UIIL65MNYO3XPSEPSH37LV5D5Q6RWZE34ZWUPXEJA\m\target\invoker-reports\BUILD-invocation-offline.xml, f:\jenkins\jenkins-slave\workspace\invoker-plugin_MINVOKER-244-NG7YUAFH574UIIL65MNYO3XPSEPSH37LV5D5Q6RWZE34ZWUPXEJA\m\target\invoker-reports\BUILD-invocation-project.xml, f:\jenkins\jenkins-slave\workspace\invoker-plugin_MINVOKER-244-NG7YUAFH574UIIL65MNYO3XPSEPSH37LV5D5Q6RWZE34ZWUPXEJA\m\target\invoker-reports\BUILD-invocation-reactor-indirect.xml, f:\jenkins\jenkins-slave\workspace\invoker-plugin_MINVOKER-244-NG7YUAFH574UIIL65MNYO3XPSEPSH37LV5D5Q6RWZE34ZWUPXEJA\m\target\invoker-reports\BUILD-invocation-spaces.xml, f:\jenkins\jenkins-slave\workspace\invoker-plugin_MINVOKER-244-NG7YUAFH574UIIL65MNYO3XPSEPSH37LV5D5Q6RWZE34ZWUPXEJA\m\target\invoker-reports\BUILD-invoker-report.xml, f:\jenkins\jenkins-slave\workspace\invoker-plugin_MINVOKER-244-NG7YUAFH574UIIL65MNYO3XPSEPSH37LV5D5Q6RWZE34ZWUPXEJA\m\target\invoker-reports\BUILD-local-repo-default.xml, f:\jenkins\jenkins-slave\workspace\invoker-plugin_MINVOKER-244-NG7YUAFH574UIIL65MNYO3XPSEPSH37LV5D5Q6RWZE34ZWUPXEJA\m\target\invoker-reports\BUILD-local-repo-isolated.xml, f:\jenkins\jenkins-slave\workspace\invoker-plugin_MINVOKER-244-NG7YUAFH574UIIL65MNYO3XPSEPSH37LV5D5Q6RWZE34ZWUPXEJA\m\target\invoker-reports\BUILD-local-repo-path.xml, f:\jenkins\jenkins-slave\workspace\invoker-plugin_MINVOKER-244-NG7YUAFH574UIIL65MNYO3XPSEPSH37LV5D5Q6RWZE34ZWUPXEJA\m\target\invoker-reports\BUILD-local-repo-url.xml, f:\jenkins\jenkins-slave\workspace\invoker-plugin_MINVOKER-244-NG7YUAFH574UIIL65MNYO3XPSEPSH37LV5D5Q6RWZE34ZWUPXEJA\m\target\invoker-reports\BUILD-multiEnvVar.xml, f:\jenkins\jenkins-slave\workspace\invoker-plugin_MINVOKER-244-NG7YUAFH574UIIL65MNYO3XPSEPSH37LV5D5Q6RWZE34ZWUPXEJA\m\target\invoker-reports\BUILD-not-clone-not-plugin.xml, f:\jenkins\jenkins-slave\workspace\invoker-plugin_MINVOKER-244-NG7YUAFH574UIIL65MNYO3XPSEPSH37LV5D5Q6RWZE34ZWUPXEJA\m\target\invoker-reports\BUILD-pom-filtering-encoding.xml, f:\jenkins\jenkins-slave\workspace\invoker-plugin_MINVOKER-244-NG7YUAFH574UIIL65MNYO3XPSEPSH37LV5D5Q6RWZE34ZWUPXEJA\m\target\invoker-reports\BUILD-pom-filtering-reactor.xml, f:\jenkins\jenkins-slave\workspace\invoker-plugin_MINVOKER-244-NG7YUAFH574UIIL65MNYO3XPSEPSH37LV5D5Q6RWZE34ZWUPXEJA\m\target\invoker-reports\BUILD-pom-filtering.xml, f:\jenkins\jenkins-slave\workspace\invoker-plugin_MINVOKER-244-NG7YUAFH574UIIL65MNYO3XPSEPSH37LV5D5Q6RWZE34ZWUPXEJA\m\target\invoker-reports\BUILD-pom-less-invocation.xml, f:\jenkins\jenkins-slave\workspace\invoker-plugin_MINVOKER-244-NG7YUAFH574UIIL65MNYO3XPSEPSH37LV5D5Q6RWZE34ZWUPXEJA\m\target\invoker-reports\BUILD-postbuild-executed-only-once.xml, f:\jenkins\jenkins-slave\workspace\invoker-plugin_MINVOKER-244-NG7YUAFH574UIIL65MNYO3XPSEPSH37LV5D5Q6RWZE34ZWUPXEJA\m\target\invoker-reports\BUILD-project-cloning-reactor.xml, f:\jenkins\jenkins-slave\workspace\invoker-plugin_MINVOKER-244-NG7YUAFH574UIIL65MNYO3XPSEPSH37LV5D5Q6RWZE34ZWUPXEJA\m\target\invoker-reports\BUILD-project-cloning.xml, f:\jenkins\jenkins-slave\workspace\invoker-plugin_MINVOKER-244-NG7YUAFH574UIIL65MNYO3XPSEPSH37LV5D5Q6RWZE34ZWUPXEJA\m\target\invoker-reports\BUILD-project-setup.xml, f:\jenkins\jenkins-slave\workspace\invoker-plugin_MINVOKER-244-NG7YUAFH574UIIL65MNYO3XPSEPSH37LV5D5Q6RWZE34ZWUPXEJA\m\target\invoker-reports\BUILD-script-accessibility.xml, f:\jenkins\jenkins-slave\workspace\invoker-plugin_MINVOKER-244-NG7YUAFH574UIIL65MNYO3XPSEPSH37LV5D5Q6RWZE34ZWUPXEJA\m\target\invoker-reports\BUILD-script-additional-vars.xml, f:\jenkins\jenkins-slave\workspace\invoker-plugin_MINVOKER-244-NG7YUAFH574UIIL65MNYO3XPSEPSH37LV5D5Q6RWZE34ZWUPXEJA\m\target\invoker-reports\BUILD-script-class-loading.xml, f:\jenkins\jenkins-slave\workspace\invoker-plugin_MINVOKER-244-NG7YUAFH574UIIL65MNYO3XPSEPSH37LV5D5Q6RWZE34ZWUPXEJA\m\target\invoker-reports\BUILD-script-classpath-duplicates.xml, f:\jenkins\jenkins-slave\workspace\invoker-plugin_MINVOKER-244-NG7YUAFH574UIIL65MNYO3XPSEPSH37LV5D5Q6RWZE34ZWUPXEJA\m\target\invoker-reports\BUILD-script-context.xml, f:\jenkins\jenkins-slave\workspace\invoker-plugin_MINVOKER-244-NG7YUAFH574UIIL65MNYO3XPSEPSH37LV5D5Q6RWZE34ZWUPXEJA\m\target\invoker-reports\BUILD-script-errors.xml, f:\jenkins\jenkins-slave\workspace\invoker-plugin_MINVOKER-244-NG7YUAFH574UIIL65MNYO3XPSEPSH37LV5D5Q6RWZE34ZWUPXEJA\m\target\invoker-reports\BUILD-script-global-vars.xml, f:\jenkins\jenkins-slave\workspace\invoker-plugin_MINVOKER-244-NG7YUAFH574UIIL65MNYO3XPSEPSH37LV5D5Q6RWZE34ZWUPXEJA\m\target\invoker-reports\BUILD-script-interpreter-detection.xml, f:\jenkins\jenkins-slave\workspace\invoker-plugin_MINVOKER-244-NG7YUAFH574UIIL65MNYO3XPSEPSH37LV5D5Q6RWZE34ZWUPXEJA\m\target\invoker-reports\BUILD-script-verify-xml.xml, f:\jenkins\jenkins-slave\workspace\invoker-plugin_MINVOKER-244-NG7YUAFH574UIIL65MNYO3XPSEPSH37LV5D5Q6RWZE34ZWUPXEJA\m\target\invoker-reports\BUILD-selector-conditions.xml, f:\jenkins\jenkins-slave\workspace\invoker-plugin_MINVOKER-244-NG7YUAFH574UIIL65MNYO3XPSEPSH37LV5D5Q6RWZE34ZWUPXEJA\m\target\invoker-reports\BUILD-selector-scripts.xml, f:\jenkins\jenkins-slave\workspace\invoker-plugin_MINVOKER-244-NG7YUAFH574UIIL65MNYO3XPSEPSH37LV5D5Q6RWZE34ZWUPXEJA\m\target\invoker-reports\BUILD-settings-auto-exclude.xml, f:\jenkins\jenkins-slave\workspace\invoker-plugin_MINVOKER-244-NG7YUAFH574UIIL65MNYO3XPSEPSH37LV5D5Q6RWZE34ZWUPXEJA\m\target\invoker-reports\BUILD-settings-inherit.xml, f:\jenkins\jenkins-slave\workspace\invoker-plugin_MINVOKER-244-NG7YUAFH574UIIL65MNYO3XPSEPSH37LV5D5Q6RWZE34ZWUPXEJA\m\target\invoker-reports\BUILD-settings-merge-multiexecutions.xml, f:\jenkins\jenkins-slave\workspace\invoker-plugin_MINVOKER-244-NG7YUAFH574UIIL65MNYO3XPSEPSH37LV5D5Q6RWZE34ZWUPXEJA\m\target\invoker-reports\BUILD-settings-merge.xml, f:\jenkins\jenkins-slave\workspace\invoker-plugin_MINVOKER-244-NG7YUAFH574UIIL65MNYO3XPSEPSH37LV5D5Q6RWZE34ZWUPXEJA\m\target\invoker-reports\BUILD-settings-merge_jdk9+.xml, f:\jenkins\jenkins-slave\workspace\invoker-plugin_MINVOKER-244-NG7YUAFH574UIIL65MNYO3XPSEPSH37LV5D5Q6RWZE34ZWUPXEJA\m\target\invoker-reports\BUILD-settings-override.xml, f:\jenkins\jenkins-slave\workspace\invoker-plugin_MINVOKER-244-NG7YUAFH574UIIL65MNYO3XPSEPSH37LV5D5Q6RWZE34ZWUPXEJA\m\target\invoker-reports\BUILD-skip-install.xml, f:\jenkins\jenkins-slave\workspace\invoker-plugin_MINVOKER-244-NG7YUAFH574UIIL65MNYO3XPSEPSH37LV5D5Q6RWZE34ZWUPXEJA\m\target\invoker-reports\BUILD-skip-run.xml, f:\jenkins\jenkins-slave\workspace\invoker-plugin_MINVOKER-244-NG7YUAFH574UIIL65MNYO3XPSEPSH37LV5D5Q6RWZE34ZWUPXEJA\m\target\invoker-reports\BUILD-spaces-should-work_non-windows.xml, f:\jenkins\jenkins-slave\workspace\invoker-plugin_MINVOKER-244-NG7YUAFH574UIIL65MNYO3XPSEPSH37LV5D5Q6RWZE34ZWUPXEJA\m\target\invoker-reports\BUILD-spaces-should-work_windows.xml, f:\jenkins\jenkins-slave\workspace\invoker-plugin_MINVOKER-244-NG7YUAFH574UIIL65MNYO3XPSEPSH37LV5D5Q6RWZE34ZWUPXEJA\m\target\invoker-reports\BUILD-special-characters-should-work.xml, f:\jenkins\jenkins-slave\workspace\invoker-plugin_MINVOKER-244-NG7YUAFH574UIIL65MNYO3XPSEPSH37LV5D5Q6RWZE34ZWUPXEJA\m\target\invoker-reports\BUILD-staging-dependencies.xml, f:\jenkins\jenkins-slave\workspace\invoker-plugin_MINVOKER-244-NG7YUAFH574UIIL65MNYO3XPSEPSH37LV5D5Q6RWZE34ZWUPXEJA\m\target\invoker-reports\BUILD-staging-pom.xml, f:\jenkins\jenkins-slave\workspace\invoker-plugin_MINVOKER-244-NG7YUAFH574UIIL65MNYO3XPSEPSH37LV5D5Q6RWZE34ZWUPXEJA\m\target\invoker-reports\BUILD-staging-reactor.xml, f:\jenkins\jenkins-slave\workspace\invoker-plugin_MINVOKER-244-NG7YUAFH574UIIL65MNYO3XPSEPSH37LV5D5Q6RWZE34ZWUPXEJA\m\target\invoker-reports\BUILD-wrongPropertyInterpolation.xml]
[windows-jdk9] Found logs:[f:\jenkins\jenkins-slave\workspace\invoker-plugin_MINVOKER-244-NG7YUAFH574UIIL65MNYO3XPSEPSH37LV5D5Q6RWZE34ZWUPXEJA\m\target\it\MINVOKER-191\build.log, f:\jenkins\jenkins-slave\workspace\invoker-plugin_MINVOKER-244-NG7YUAFH574UIIL65MNYO3XPSEPSH37LV5D5Q6RWZE34ZWUPXEJA\m\target\it\MINVOKER-191\plugin\target\it\basic\build.log, f:\jenkins\jenkins-slave\workspace\invoker-plugin_MINVOKER-244-NG7YUAFH574UIIL65MNYO3XPSEPSH37LV5D5Q6RWZE34ZWUPXEJA\m\target\it\clone-clean\build.log, f:\jenkins\jenkins-slave\workspace\invoker-plugin_MINVOKER-244-NG7YUAFH574UIIL65MNYO3XPSEPSH37LV5D5Q6RWZE34ZWUPXEJA\m\target\it\clone-clean\target\it\clone-clean\build.log, f:\jenkins\jenkins-slave\workspace\invoker-plugin_MINVOKER-244-NG7YUAFH574UIIL65MNYO3XPSEPSH37LV5D5Q6RWZE34ZWUPXEJA\m\target\it\clone-maven-plugin-packaging\build.log, f:\jenkins\jenkins-slave\workspace\invoker-plugin_MINVOKER-244-NG7YUAFH574UIIL65MNYO3XPSEPSH37LV5D5Q6RWZE34ZWUPXEJA\m\target\it\clone-maven-plugin-packaging\target\it\clone-clean\build.log, f:\jenkins\jenkins-slave\workspace\invoker-plugin_MINVOKER-244-NG7YUAFH574UIIL65MNYO3XPSEPSH37LV5D5Q6RWZE34ZWUPXEJA\m\target\it\exec-timeout-invoker-level\build.log, f:\jenkins\jenkins-slave\workspace\invoker-plugin_MINVOKER-244-NG7YUAFH574UIIL65MNYO3XPSEPSH37LV5D5Q6RWZE34ZWUPXEJA\m\target\it\exec-timeout-invoker-level\target\it\basic\build.log, f:\jenkins\jenkins-slave\workspace\invoker-plugin_MINVOKER-244-NG7YUAFH574UIIL65MNYO3XPSEPSH37LV5D5Q6RWZE34ZWUPXEJA\m\target\it\exec-timeout-mojo-level\build.log, f:\jenkins\jenkins-slave\workspace\invoker-plugin_MINVOKER-244-NG7YUAFH574UIIL65MNYO3XPSEPSH37LV5D5Q6RWZE34ZWUPXEJA\m\target\it\exec-timeout-mojo-level\target\it\basic\build.log, f:\jenkins\jenkins-slave\workspace\invoker-plugin_MINVOKER-244-NG7YUAFH574UIIL65MNYO3XPSEPSH37LV5D5Q6RWZE34ZWUPXEJA\m\target\it\fail-build-with-verify\build.log, f:\jenkins\jenkins-slave\workspace\invoker-plugin_MINVOKER-244-NG7YUAFH574UIIL65MNYO3XPSEPSH37LV5D5Q6RWZE34ZWUPXEJA\m\target\it\fail-build-with-verify\target\it\project\build.log, f:\jenkins\jenkins-slave\workspace\invoker-plugin_MINVOKER-244-NG7YUAFH574UIIL65MNYO3XPSEPSH37LV5D5Q6RWZE34ZWUPXEJA\m\target\it\fail-build\build.log, f:\jenkins\jenkins-slave\workspace\invoker-plugin_MINVOKER-244-NG7YUAFH574UIIL65MNYO3XPSEPSH37LV5D5Q6RWZE34ZWUPXEJA\m\target\it\fail-build\target\it\project\build.log, f:\jenkins\jenkins-slave\workspace\invoker-plugin_MINVOKER-244-NG7YUAFH574UIIL65MNYO3XPSEPSH37LV5D5Q6RWZE34ZWUPXEJA\m\target\it\fail-ignore-with-verify\build.log, f:\jenkins\jenkins-slave\workspace\invoker-plugin_MINVOKER-244-NG7YUAFH574UIIL65MNYO3XPSEPSH37LV5D5Q6RWZE34ZWUPXEJA\m\target\it\fail-ignore-with-verify\target\it\project\build.log, f:\jenkins\jenkins-slave\workspace\invoker-plugin_MINVOKER-244-NG7YUAFH574UIIL65MNYO3XPSEPSH37LV5D5Q6RWZE34ZWUPXEJA\m\target\it\fail-ignore\build.log, f:\jenkins\jenkins-slave\workspace\invoker-plugin_MINVOKER-244-NG7YUAFH574UIIL65MNYO3XPSEPSH37LV5D5Q6RWZE34ZWUPXEJA\m\target\it\fail-ignore\target\it\project\build.log, f:\jenkins\jenkins-slave\workspace\invoker-plugin_MINVOKER-244-NG7YUAFH574UIIL65MNYO3XPSEPSH37LV5D5Q6RWZE34ZWUPXEJA\m\target\it\fail-noprojects_integration-test\build.log, f:\jenkins\jenkins-slave\workspace\invoker-plugin_MINVOKER-244-NG7YUAFH574UIIL65MNYO3XPSEPSH37LV5D5Q6RWZE34ZWUPXEJA\m\target\it\fail-noprojects_run\build.log, f:\jenkins\jenkins-slave\workspace\invoker-plugin_MINVOKER-244-NG7YUAFH574UIIL65MNYO3XPSEPSH37LV5D5Q6RWZE34ZWUPXEJA\m\target\it\fail-noprojects_verify\build.log, f:\jenkins\jenkins-slave\workspace\invoker-plugin_MINVOKER-244-NG7YUAFH574UIIL65MNYO3XPSEPSH37LV5D5Q6RWZE34ZWUPXEJA\m\target\it\fail-postbuild\build.log, f:\jenkins\jenkins-slave\workspace\invoker-plugin_MINVOKER-244-NG7YUAFH574UIIL65MNYO3XPSEPSH37LV5D5Q6RWZE34ZWUPXEJA\m\target\it\fail-postbuild\target\it\project\build.log, f:\jenkins\jenkins-slave\workspace\invoker-plugin_MINVOKER-244-NG7YUAFH574UIIL65MNYO3XPSEPSH37LV5D5Q6RWZE34ZWUPXEJA\m\target\it\fail-prebuild\build.log, f:\jenkins\jenkins-slave\workspace\invoker-plugin_MINVOKER-244-NG7YUAFH574UIIL65MNYO3XPSEPSH37LV5D5Q6RWZE34ZWUPXEJA\m\target\it\fail-prebuild\target\it\project\build.log, f:\jenkins\jenkins-slave\workspace\invoker-plugin_MINVOKER-244-NG7YUAFH574UIIL65MNYO3XPSEPSH37LV5D5Q6RWZE34ZWUPXEJA\m\target\it\fail-run-postbuild\build.log, f:\jenkins\jenkins-slave\workspace\invoker-plugin_MINVOKER-244-NG7YUAFH574UIIL65MNYO3XPSEPSH37LV5D5Q6RWZE34ZWUPXEJA\m\target\it\fail-run-postbuild\target\it\project\build.log, f:\jenkins\jenkins-slave\workspace\invoker-plugin_MINVOKER-244-NG7YUAFH574UIIL65MNYO3XPSEPSH37LV5D5Q6RWZE34ZWUPXEJA\m\target\it\filtering-extensions\build.log, f:\jenkins\jenkins-slave\workspace\invoker-plugin_MINVOKER-244-NG7YUAFH574UIIL65MNYO3XPSEPSH37LV5D5Q6RWZE34ZWUPXEJA\m\target\it\filtering-extensions\target\it\project\build.log, f:\jenkins\jenkins-slave\workspace\invoker-plugin_MINVOKER-244-NG7YUAFH574UIIL65MNYO3XPSEPSH37LV5D5Q6RWZE34ZWUPXEJA\m\target\it\install-extra-artifacts\build.log, f:\jenkins\jenkins-slave\workspace\invoker-plugin_MINVOKER-244-NG7YUAFH574UIIL65MNYO3XPSEPSH37LV5D5Q6RWZE34ZWUPXEJA\m\target\it\integration-test-never-fails\build.log, f:\jenkins\jenkins-slave\workspace\invoker-plugin_MINVOKER-244-NG7YUAFH574UIIL65MNYO3XPSEPSH37LV5D5Q6RWZE34ZWUPXEJA\m\target\it\integration-test-never-fails\target\it\project\build.log, f:\jenkins\jenkins-slave\workspace\invoker-plugin_MINVOKER-244-NG7YUAFH574UIIL65MNYO3XPSEPSH37LV5D5Q6RWZE34ZWUPXEJA\m\target\it\invocation-cmdline-exclude\build.log, f:\jenkins\jenkins-slave\workspace\invoker-plugin_MINVOKER-244-NG7YUAFH574UIIL65MNYO3XPSEPSH37LV5D5Q6RWZE34ZWUPXEJA\m\target\it\invocation-debug\build.log, f:\jenkins\jenkins-slave\workspace\invoker-plugin_MINVOKER-244-NG7YUAFH574UIIL65MNYO3XPSEPSH37LV5D5Q6RWZE34ZWUPXEJA\m\target\it\invocation-debug\src\it\minvoker-142\build.log, f:\jenkins\jenkins-slave\workspace\invoker-plugin_MINVOKER-244-NG7YUAFH574UIIL65MNYO3XPSEPSH37LV5D5Q6RWZE34ZWUPXEJA\m\target\it\invocation-emptyproperty\build.log, f:\jenkins\jenkins-slave\workspace\invoker-plugin_MINVOKER-244-NG7YUAFH574UIIL65MNYO3XPSEPSH37LV5D5Q6RWZE34ZWUPXEJA\m\target\it\invocation-emptyproperty\src\it\minvoker-118\build.log, f:\jenkins\jenkins-slave\workspace\invoker-plugin_MINVOKER-244-NG7YUAFH574UIIL65MNYO3XPSEPSH37LV5D5Q6RWZE34ZWUPXEJA\m\target\it\invocation-environmentvariable\build.log, f:\jenkins\jenkins-slave\workspace\invoker-plugin_MINVOKER-244-NG7YUAFH574UIIL65MNYO3XPSEPSH37LV5D5Q6RWZE34ZWUPXEJA\m\target\it\invocation-environmentvariable\src\it\minvoker-145\build.log, f:\jenkins\jenkins-slave\workspace\invoker-plugin_MINVOKER-244-NG7YUAFH574UIIL65MNYO3XPSEPSH37LV5D5Q6RWZE34ZWUPXEJA\m\target\it\invocation-multiple\build.log, f:\jenkins\jenkins-slave\workspace\invoker-plugin_MINVOKER-244-NG7YUAFH574UIIL65MNYO3XPSEPSH37LV5D5Q6RWZE34ZWUPXEJA\m\target\it\invocation-multiple\target\it\project\build.log, f:\jenkins\jenkins-slave\workspace\invoker-plugin_MINVOKER-244-NG7YUAFH574UIIL65MNYO3XPSEPSH37LV5D5Q6RWZE34ZWUPXEJA\m\target\it\invocation-offline\build.log, f:\jenkins\jenkins-slave\workspace\invoker-plugin_MINVOKER-244-NG7YUAFH574UIIL65MNYO3XPSEPSH37LV5D5Q6RWZE34ZWUPXEJA\m\target\it\invocation-offline\src\it\project\build.log, f:\jenkins\jenkins-slave\workspace\invoker-plugin_MINVOKER-244-NG7YUAFH574UIIL65MNYO3XPSEPSH37LV5D5Q6RWZE34ZWUPXEJA\m\target\it\invocation-project\build.log, f:\jenkins\jenkins-slave\workspace\invoker-plugin_MINVOKER-244-NG7YUAFH574UIIL65MNYO3XPSEPSH37LV5D5Q6RWZE34ZWUPXEJA\m\target\it\invocation-project\target\it\project\build.log, f:\jenkins\jenkins-slave\workspace\invoker-plugin_MINVOKER-244-NG7YUAFH574UIIL65MNYO3XPSEPSH37LV5D5Q6RWZE34ZWUPXEJA\m\target\it\invocation-reactor-indirect\build.log, f:\jenkins\jenkins-slave\workspace\invoker-plugin_MINVOKER-244-NG7YUAFH574UIIL65MNYO3XPSEPSH37LV5D5Q6RWZE34ZWUPXEJA\m\target\it\invocation-reactor-indirect\itests\target\it\basic\build.log, f:\jenkins\jenkins-slave\workspace\invoker-plugin_MINVOKER-244-NG7YUAFH574UIIL65MNYO3XPSEPSH37LV5D5Q6RWZE34ZWUPXEJA\m\target\it\invocation-spaces\build.log, f:\jenkins\jenkins-slave\workspace\invoker-plugin_MINVOKER-244-NG7YUAFH574UIIL65MNYO3XPSEPSH37LV5D5Q6RWZE34ZWUPXEJA\m\target\it\invocation-spaces\target\it projects\project\build.log, f:\jenkins\jenkins-slave\workspace\invoker-plugin_MINVOKER-244-NG7YUAFH574UIIL65MNYO3XPSEPSH37LV5D5Q6RWZE34ZWUPXEJA\m\target\it\invoker-report\build.log, f:\jenkins\jenkins-slave\workspace\invoker-plugin_MINVOKER-244-NG7YUAFH574UIIL65MNYO3XPSEPSH37LV5D5Q6RWZE34ZWUPXEJA\m\target\it\invoker-report\src\it\failure-build\build.log, f:\jenkins\jenkins-slave\workspace\invoker-plugin_MINVOKER-244-NG7YUAFH574UIIL65MNYO3XPSEPSH37LV5D5Q6RWZE34ZWUPXEJA\m\target\it\invoker-report\src\it\failure-post\build.log, f:\jenkins\jenkins-slave\workspace\invoker-plugin_MINVOKER-244-NG7YUAFH574UIIL65MNYO3XPSEPSH37LV5D5Q6RWZE34ZWUPXEJA\m\target\it\invoker-report\src\it\failure-pre\build.log, f:\jenkins\jenkins-slave\workspace\invoker-plugin_MINVOKER-244-NG7YUAFH574UIIL65MNYO3XPSEPSH37LV5D5Q6RWZE34ZWUPXEJA\m\target\it\invoker-report\src\it\success\build.log, f:\jenkins\jenkins-slave\workspace\invoker-plugin_MINVOKER-244-NG7YUAFH574UIIL65MNYO3XPSEPSH37LV5D5Q6RWZE34ZWUPXEJA\m\target\it\local-repo-default\build.log, f:\jenkins\jenkins-slave\workspace\invoker-plugin_MINVOKER-244-NG7YUAFH574UIIL65MNYO3XPSEPSH37LV5D5Q6RWZE34ZWUPXEJA\m\target\it\local-repo-default\target\its\project\build.log, f:\jenkins\jenkins-slave\workspace\invoker-plugin_MINVOKER-244-NG7YUAFH574UIIL65MNYO3XPSEPSH37LV5D5Q6RWZE34ZWUPXEJA\m\target\it\local-repo-isolated\build.log, f:\jenkins\jenkins-slave\workspace\invoker-plugin_MINVOKER-244-NG7YUAFH574UIIL65MNYO3XPSEPSH37LV5D5Q6RWZE34ZWUPXEJA\m\target\it\local-repo-isolated\src\it\project\build.log, f:\jenkins\jenkins-slave\workspace\invoker-plugin_MINVOKER-244-NG7YUAFH574UIIL65MNYO3XPSEPSH37LV5D5Q6RWZE34ZWUPXEJA\m\target\it\local-repo-path\build.log, f:\jenkins\jenkins-slave\workspace\invoker-plugin_MINVOKER-244-NG7YUAFH574UIIL65MNYO3XPSEPSH37LV5D5Q6RWZE34ZWUPXEJA\m\target\it\local-repo-path\src\it\project\build.log, f:\jenkins\jenkins-slave\workspace\invoker-plugin_MINVOKER-244-NG7YUAFH574UIIL65MNYO3XPSEPSH37LV5D5Q6RWZE34ZWUPXEJA\m\target\it\local-repo-url\build.log, f:\jenkins\jenkins-slave\workspace\invoker-plugin_MINVOKER-244-NG7YUAFH574UIIL65MNYO3XPSEPSH37LV5D5Q6RWZE34ZWUPXEJA\m\target\it\local-repo-url\src\it\project\build.log, f:\jenkins\jenkins-slave\workspace\invoker-plugin_MINVOKER-244-NG7YUAFH574UIIL65MNYO3XPSEPSH37LV5D5Q6RWZE34ZWUPXEJA\m\target\it\multiEnvVar\build.log, f:\jenkins\jenkins-slave\workspace\invoker-plugin_MINVOKER-244-NG7YUAFH574UIIL65MNYO3XPSEPSH37LV5D5Q6RWZE34ZWUPXEJA\m\target\it\multiEnvVar\target\it\project\build.log, f:\jenkins\jenkins-slave\workspace\invoker-plugin_MINVOKER-244-NG7YUAFH574UIIL65MNYO3XPSEPSH37LV5D5Q6RWZE34ZWUPXEJA\m\target\it\not-clone-not-plugin\build.log, f:\jenkins\jenkins-slave\workspace\invoker-plugin_MINVOKER-244-NG7YUAFH574UIIL65MNYO3XPSEPSH37LV5D5Q6RWZE34ZWUPXEJA\m\target\it\not-clone-not-plugin\src\it\clone-clean\build.log, f:\jenkins\jenkins-slave\workspace\invoker-plugin_MINVOKER-244-NG7YUAFH574UIIL65MNYO3XPSEPSH37LV5D5Q6RWZE34ZWUPXEJA\m\target\it\pom-filtering-encoding\build.log, f:\jenkins\jenkins-slave\workspace\invoker-plugin_MINVOKER-244-NG7YUAFH574UIIL65MNYO3XPSEPSH37LV5D5Q6RWZE34ZWUPXEJA\m\target\it\pom-filtering-encoding\target\it\latin-1\build.log, f:\jenkins\jenkins-slave\workspace\invoker-plugin_MINVOKER-244-NG7YUAFH574UIIL65MNYO3XPSEPSH37LV5D5Q6RWZE34ZWUPXEJA\m\target\it\pom-filtering-encoding\target\it\utf-8\build.log, f:\jenkins\jenkins-slave\workspace\invoker-plugin_MINVOKER-244-NG7YUAFH574UIIL65MNYO3XPSEPSH37LV5D5Q6RWZE34ZWUPXEJA\m\target\it\pom-filtering-reactor\build.log, f:\jenkins\jenkins-slave\workspace\invoker-plugin_MINVOKER-244-NG7YUAFH574UIIL65MNYO3XPSEPSH37LV5D5Q6RWZE34ZWUPXEJA\m\target\it\pom-filtering-reactor\target\it\mod2-parent\build.log, f:\jenkins\jenkins-slave\workspace\invoker-plugin_MINVOKER-244-NG7YUAFH574UIIL65MNYO3XPSEPSH37LV5D5Q6RWZE34ZWUPXEJA\m\target\it\pom-filtering\build.log, f:\jenkins\jenkins-slave\workspace\invoker-plugin_MINVOKER-244-NG7YUAFH574UIIL65MNYO3XPSEPSH37LV5D5Q6RWZE34ZWUPXEJA\m\target\it\pom-filtering\target\it\project\build.log, f:\jenkins\jenkins-slave\workspace\invoker-plugin_MINVOKER-244-NG7YUAFH574UIIL65MNYO3XPSEPSH37LV5D5Q6RWZE34ZWUPXEJA\m\target\it\pom-less-invocation\build.log, f:\jenkins\jenkins-slave\workspace\invoker-plugin_MINVOKER-244-NG7YUAFH574UIIL65MNYO3XPSEPSH37LV5D5Q6RWZE34ZWUPXEJA\m\target\it\pom-less-invocation\target\it\no-pom\build.log, f:\jenkins\jenkins-slave\workspace\invoker-plugin_MINVOKER-244-NG7YUAFH574UIIL65MNYO3XPSEPSH37LV5D5Q6RWZE34ZWUPXEJA\m\target\it\postbuild-executed-only-once\build.log, f:\jenkins\jenkins-slave\workspace\invoker-plugin_MINVOKER-244-NG7YUAFH574UIIL65MNYO3XPSEPSH37LV5D5Q6RWZE34ZWUPXEJA\m\target\it\postbuild-executed-only-once\target\it\project\build.log, f:\jenkins\jenkins-slave\workspace\invoker-plugin_MINVOKER-244-NG7YUAFH574UIIL65MNYO3XPSEPSH37LV5D5Q6RWZE34ZWUPXEJA\m\target\it\project-cloning-reactor\build.log, f:\jenkins\jenkins-slave\workspace\invoker-plugin_MINVOKER-244-NG7YUAFH574UIIL65MNYO3XPSEPSH37LV5D5Q6RWZE34ZWUPXEJA\m\target\it\project-cloning-reactor\target\it\aggregator\build.log, f:\jenkins\jenkins-slave\workspace\invoker-plugin_MINVOKER-244-NG7YUAFH574UIIL65MNYO3XPSEPSH37LV5D5Q6RWZE34ZWUPXEJA\m\target\it\project-cloning\build.log, f:\jenkins\jenkins-slave\workspace\invoker-plugin_MINVOKER-244-NG7YUAFH574UIIL65MNYO3XPSEPSH37LV5D5Q6RWZE34ZWUPXEJA\m\target\it\project-cloning\target\it\module-1\build.log, f:\jenkins\jenkins-slave\workspace\invoker-plugin_MINVOKER-244-NG7YUAFH574UIIL65MNYO3XPSEPSH37LV5D5Q6RWZE34ZWUPXEJA\m\target\it\project-cloning\target\it\module-1\sub-module\build.log, f:\jenkins\jenkins-slave\workspace\invoker-plugin_MINVOKER-244-NG7YUAFH574UIIL65MNYO3XPSEPSH37LV5D5Q6RWZE34ZWUPXEJA\m\target\it\project-cloning\target\it\module\build.log, f:\jenkins\jenkins-slave\workspace\invoker-plugin_MINVOKER-244-NG7YUAFH574UIIL65MNYO3XPSEPSH37LV5D5Q6RWZE34ZWUPXEJA\m\target\it\project-setup\build.log, f:\jenkins\jenkins-slave\workspace\invoker-plugin_MINVOKER-244-NG7YUAFH574UIIL65MNYO3XPSEPSH37LV5D5Q6RWZE34ZWUPXEJA\m\target\it\project-setup\target\it\project1\build.log, f:\jenkins\jenkins-slave\workspace\invoker-plugin_MINVOKER-244-NG7YUAFH574UIIL65MNYO3XPSEPSH37LV5D5Q6RWZE34ZWUPXEJA\m\target\it\project-setup\target\it\project2\build.log, f:\jenkins\jenkins-slave\workspace\invoker-plugin_MINVOKER-244-NG7YUAFH574UIIL65MNYO3XPSEPSH37LV5D5Q6RWZE34ZWUPXEJA\m\target\it\project-setup\target\it\project3\build.log, f:\jenkins\jenkins-slave\workspace\invoker-plugin_MINVOKER-244-NG7YUAFH574UIIL65MNYO3XPSEPSH37LV5D5Q6RWZE34ZWUPXEJA\m\target\it\project-setup\target\it\project4\build.log, f:\jenkins\jenkins-slave\workspace\invoker-plugin_MINVOKER-244-NG7YUAFH574UIIL65MNYO3XPSEPSH37LV5D5Q6RWZE34ZWUPXEJA\m\target\it\project-setup\target\it\project5\build.log, f:\jenkins\jenkins-slave\workspace\invoker-plugin_MINVOKER-244-NG7YUAFH574UIIL65MNYO3XPSEPSH37LV5D5Q6RWZE34ZWUPXEJA\m\target\it\script-accessibility\build.log, f:\jenkins\jenkins-slave\workspace\invoker-plugin_MINVOKER-244-NG7YUAFH574UIIL65MNYO3XPSEPSH37LV5D5Q6RWZE34ZWUPXEJA\m\target\it\script-accessibility\src\it\beanshell\build.log, f:\jenkins\jenkins-slave\workspace\invoker-plugin_MINVOKER-244-NG7YUAFH574UIIL65MNYO3XPSEPSH37LV5D5Q6RWZE34ZWUPXEJA\m\target\it\script-accessibility\src\it\groovy\build.log, f:\jenkins\jenkins-slave\workspace\invoker-plugin_MINVOKER-244-NG7YUAFH574UIIL65MNYO3XPSEPSH37LV5D5Q6RWZE34ZWUPXEJA\m\target\it\script-additional-vars\build.log, f:\jenkins\jenkins-slave\workspace\invoker-plugin_MINVOKER-244-NG7YUAFH574UIIL65MNYO3XPSEPSH37LV5D5Q6RWZE34ZWUPXEJA\m\target\it\script-additional-vars\src\it\beanshell\build.log, f:\jenkins\jenkins-slave\workspace\invoker-plugin_MINVOKER-244-NG7YUAFH574UIIL65MNYO3XPSEPSH37LV5D5Q6RWZE34ZWUPXEJA\m\target\it\script-additional-vars\src\it\groovy\build.log, f:\jenkins\jenkins-slave\workspace\invoker-plugin_MINVOKER-244-NG7YUAFH574UIIL65MNYO3XPSEPSH37LV5D5Q6RWZE34ZWUPXEJA\m\target\it\script-class-loading\build.log, f:\jenkins\jenkins-slave\workspace\invoker-plugin_MINVOKER-244-NG7YUAFH574UIIL65MNYO3XPSEPSH37LV5D5Q6RWZE34ZWUPXEJA\m\target\it\script-class-loading\src\it\beanshell\build.log, f:\jenkins\jenkins-slave\workspace\invoker-plugin_MINVOKER-244-NG7YUAFH574UIIL65MNYO3XPSEPSH37LV5D5Q6RWZE34ZWUPXEJA\m\target\it\script-class-loading\src\it\groovy\build.log, f:\jenkins\jenkins-slave\workspace\invoker-plugin_MINVOKER-244-NG7YUAFH574UIIL65MNYO3XPSEPSH37LV5D5Q6RWZE34ZWUPXEJA\m\target\it\script-classpath-duplicates\build.log, f:\jenkins\jenkins-slave\workspace\invoker-plugin_MINVOKER-244-NG7YUAFH574UIIL65MNYO3XPSEPSH37LV5D5Q6RWZE34ZWUPXEJA\m\target\it\script-classpath-duplicates\target\it\beanshell\build.log, f:\jenkins\jenkins-slave\workspace\invoker-plugin_MINVOKER-244-NG7YUAFH574UIIL65MNYO3XPSEPSH37LV5D5Q6RWZE34ZWUPXEJA\m\target\it\script-classpath-duplicates\target\it\groovy\build.log, f:\jenkins\jenkins-slave\workspace\invoker-plugin_MINVOKER-244-NG7YUAFH574UIIL65MNYO3XPSEPSH37LV5D5Q6RWZE34ZWUPXEJA\m\target\it\script-context\build.log, f:\jenkins\jenkins-slave\workspace\invoker-plugin_MINVOKER-244-NG7YUAFH574UIIL65MNYO3XPSEPSH37LV5D5Q6RWZE34ZWUPXEJA\m\target\it\script-context\target\its\beanshell\build.log, f:\jenkins\jenkins-slave\workspace\invoker-plugin_MINVOKER-244-NG7YUAFH574UIIL65MNYO3XPSEPSH37LV5D5Q6RWZE34ZWUPXEJA\m\target\it\script-context\target\its\groovy\build.log, f:\jenkins\jenkins-slave\workspace\invoker-plugin_MINVOKER-244-NG7YUAFH574UIIL65MNYO3XPSEPSH37LV5D5Q6RWZE34ZWUPXEJA\m\target\it\script-errors\build.log, f:\jenkins\jenkins-slave\workspace\invoker-plugin_MINVOKER-244-NG7YUAFH574UIIL65MNYO3XPSEPSH37LV5D5Q6RWZE34ZWUPXEJA\m\target\it\script-errors\target\its\beanshell\build.log, f:\jenkins\jenkins-slave\workspace\invoker-plugin_MINVOKER-244-NG7YUAFH574UIIL65MNYO3XPSEPSH37LV5D5Q6RWZE34ZWUPXEJA\m\target\it\script-errors\target\its\groovy\build.log, f:\jenkins\jenkins-slave\workspace\invoker-plugin_MINVOKER-244-NG7YUAFH574UIIL65MNYO3XPSEPSH37LV5D5Q6RWZE34ZWUPXEJA\m\target\it\script-global-vars\build.log, f:\jenkins\jenkins-slave\workspace\invoker-plugin_MINVOKER-244-NG7YUAFH574UIIL65MNYO3XPSEPSH37LV5D5Q6RWZE34ZWUPXEJA\m\target\it\script-global-vars\src\it\beanshell\build.log, f:\jenkins\jenkins-slave\workspace\invoker-plugin_MINVOKER-244-NG7YUAFH574UIIL65MNYO3XPSEPSH37LV5D5Q6RWZE34ZWUPXEJA\m\target\it\script-global-vars\src\it\groovy\build.log, f:\jenkins\jenkins-slave\workspace\invoker-plugin_MINVOKER-244-NG7YUAFH574UIIL65MNYO3XPSEPSH37LV5D5Q6RWZE34ZWUPXEJA\m\target\it\script-interpreter-detection\build.log, f:\jenkins\jenkins-slave\workspace\invoker-plugin_MINVOKER-244-NG7YUAFH574UIIL65MNYO3XPSEPSH37LV5D5Q6RWZE34ZWUPXEJA\m\target\it\script-interpreter-detection\target\its\beanshell\build.log, f:\jenkins\jenkins-slave\workspace\invoker-plugin_MINVOKER-244-NG7YUAFH574UIIL65MNYO3XPSEPSH37LV5D5Q6RWZE34ZWUPXEJA\m\target\it\script-interpreter-detection\target\its\groovy\build.log, f:\jenkins\jenkins-slave\workspace\invoker-plugin_MINVOKER-244-NG7YUAFH574UIIL65MNYO3XPSEPSH37LV5D5Q6RWZE34ZWUPXEJA\m\target\it\script-verify-xml\build.log, f:\jenkins\jenkins-slave\workspace\invoker-plugin_MINVOKER-244-NG7YUAFH574UIIL65MNYO3XPSEPSH37LV5D5Q6RWZE34ZWUPXEJA\m\target\it\selector-conditions\build.log, f:\jenkins\jenkins-slave\workspace\invoker-plugin_MINVOKER-244-NG7YUAFH574UIIL65MNYO3XPSEPSH37LV5D5Q6RWZE34ZWUPXEJA\m\target\it\selector-conditions\target\its\jre-version-match\build.log, f:\jenkins\jenkins-slave\workspace\invoker-plugin_MINVOKER-244-NG7YUAFH574UIIL65MNYO3XPSEPSH37LV5D5Q6RWZE34ZWUPXEJA\m\target\it\selector-conditions\target\its\maven-version-match\build.log, f:\jenkins\jenkins-slave\workspace\invoker-plugin_MINVOKER-244-NG7YUAFH574UIIL65MNYO3XPSEPSH37LV5D5Q6RWZE34ZWUPXEJA\m\target\it\selector-conditions\target\its\os-family-match\build.log, f:\jenkins\jenkins-slave\workspace\invoker-plugin_MINVOKER-244-NG7YUAFH574UIIL65MNYO3XPSEPSH37LV5D5Q6RWZE34ZWUPXEJA\m\target\it\selector-scripts\build.log, f:\jenkins\jenkins-slave\workspace\invoker-plugin_MINVOKER-244-NG7YUAFH574UIIL65MNYO3XPSEPSH37LV5D5Q6RWZE34ZWUPXEJA\m\target\it\selector-scripts\target\its\script-ret-false\build.log, f:\jenkins\jenkins-slave\workspace\invoker-plugin_MINVOKER-244-NG7YUAFH574UIIL65MNYO3XPSEPSH37LV5D5Q6RWZE34ZWUPXEJA\m\target\it\selector-scripts\target\its\script-ret-other\build.log, f:\jenkins\jenkins-slave\workspace\invoker-plugin_MINVOKER-244-NG7YUAFH574UIIL65MNYO3XPSEPSH37LV5D5Q6RWZE34ZWUPXEJA\m\target\it\selector-scripts\target\its\script-ret-quiet\build.log, f:\jenkins\jenkins-slave\workspace\invoker-plugin_MINVOKER-244-NG7YUAFH574UIIL65MNYO3XPSEPSH37LV5D5Q6RWZE34ZWUPXEJA\m\target\it\selector-scripts\target\its\script-ret-true\build.log, f:\jenkins\jenkins-slave\workspace\invoker-plugin_MINVOKER-244-NG7YUAFH574UIIL65MNYO3XPSEPSH37LV5D5Q6RWZE34ZWUPXEJA\m\target\it\selector-scripts\target\its\script-throw\build.log, f:\jenkins\jenkins-slave\workspace\invoker-plugin_MINVOKER-244-NG7YUAFH574UIIL65MNYO3XPSEPSH37LV5D5Q6RWZE34ZWUPXEJA\m\target\it\settings-auto-exclude\build.log, f:\jenkins\jenkins-slave\workspace\invoker-plugin_MINVOKER-244-NG7YUAFH574UIIL65MNYO3XPSEPSH37LV5D5Q6RWZE34ZWUPXEJA\m\target\it\settings-auto-exclude\src\it\project\build.log, f:\jenkins\jenkins-slave\workspace\invoker-plugin_MINVOKER-244-NG7YUAFH574UIIL65MNYO3XPSEPSH37LV5D5Q6RWZE34ZWUPXEJA\m\target\it\settings-inherit\build.log, f:\jenkins\jenkins-slave\workspace\invoker-plugin_MINVOKER-244-NG7YUAFH574UIIL65MNYO3XPSEPSH37LV5D5Q6RWZE34ZWUPXEJA\m\target\it\settings-inherit\target\it\project\build.log, f:\jenkins\jenkins-slave\workspace\invoker-plugin_MINVOKER-244-NG7YUAFH574UIIL65MNYO3XPSEPSH37LV5D5Q6RWZE34ZWUPXEJA\m\target\it\settings-merge-multiexecutions\build.log, f:\jenkins\jenkins-slave\workspace\invoker-plugin_MINVOKER-244-NG7YUAFH574UIIL65MNYO3XPSEPSH37LV5D5Q6RWZE34ZWUPXEJA\m\target\it\settings-merge-multiexecutions\target\it\minvoker-133\build.log, f:\jenkins\jenkins-slave\workspace\invoker-plugin_MINVOKER-244-NG7YUAFH574UIIL65MNYO3XPSEPSH37LV5D5Q6RWZE34ZWUPXEJA\m\target\it\settings-merge_jdk9+\build.log, f:\jenkins\jenkins-slave\workspace\invoker-plugin_MINVOKER-244-NG7YUAFH574UIIL65MNYO3XPSEPSH37LV5D5Q6RWZE34ZWUPXEJA\m\target\it\settings-merge_jdk9+\target\it\project\build.log, f:\jenkins\jenkins-slave\workspace\invoker-plugin_MINVOKER-244-NG7YUAFH574UIIL65MNYO3XPSEPSH37LV5D5Q6RWZE34ZWUPXEJA\m\target\it\settings-override\build.log, f:\jenkins\jenkins-slave\workspace\invoker-plugin_MINVOKER-244-NG7YUAFH574UIIL65MNYO3XPSEPSH37LV5D5Q6RWZE34ZWUPXEJA\m\target\it\settings-override\src\it\project\build.log, f:\jenkins\jenkins-slave\workspace\invoker-plugin_MINVOKER-244-NG7YUAFH574UIIL65MNYO3XPSEPSH37LV5D5Q6RWZE34ZWUPXEJA\m\target\it\skip-install\build.log, f:\jenkins\jenkins-slave\workspace\invoker-plugin_MINVOKER-244-NG7YUAFH574UIIL65MNYO3XPSEPSH37LV5D5Q6RWZE34ZWUPXEJA\m\target\it\skip-run\build.log, f:\jenkins\jenkins-slave\workspace\invoker-plugin_MINVOKER-244-NG7YUAFH574UIIL65MNYO3XPSEPSH37LV5D5Q6RWZE34ZWUPXEJA\m\target\it\spaces-should-work_windows\build.log, f:\jenkins\jenkins-slave\workspace\invoker-plugin_MINVOKER-244-NG7YUAFH574UIIL65MNYO3XPSEPSH37LV5D5Q6RWZE34ZWUPXEJA\m\target\it\spaces-should-work_windows\src\it\test-Ééê- & -Ééê-test\build.log, f:\jenkins\jenkins-slave\workspace\invoker-plugin_MINVOKER-244-NG7YUAFH574UIIL65MNYO3XPSEPSH37LV5D5Q6RWZE34ZWUPXEJA\m\target\it\special-characters-should-work\build.log, f:\jenkins\jenkins-slave\workspace\invoker-plugin_MINVOKER-244-NG7YUAFH574UIIL65MNYO3XPSEPSH37LV5D5Q6RWZE34ZWUPXEJA\m\target\it\special-characters-should-work\src\it\test-Ééê-more-Ééê-test\build.log, f:\jenkins\jenkins-slave\workspace\invoker-plugin_MINVOKER-244-NG7YUAFH574UIIL65MNYO3XPSEPSH37LV5D5Q6RWZE34ZWUPXEJA\m\target\it\staging-dependencies\build.log, f:\jenkins\jenkins-slave\workspace\invoker-plugin_MINVOKER-244-NG7YUAFH574UIIL65MNYO3XPSEPSH37LV5D5Q6RWZE34ZWUPXEJA\m\target\it\staging-pom\build.log, f:\jenkins\jenkins-slave\workspace\invoker-plugin_MINVOKER-244-NG7YUAFH574UIIL65MNYO3XPSEPSH37LV5D5Q6RWZE34ZWUPXEJA\m\target\it\staging-reactor\build.log, f:\jenkins\jenkins-slave\workspace\invoker-plugin_MINVOKER-244-NG7YUAFH574UIIL65MNYO3XPSEPSH37LV5D5Q6RWZE34ZWUPXEJA\m\target\it\wrongPropertyInterpolation\build.log, f:\jenkins\jenkins-slave\workspace\invoker-plugin_MINVOKER-244-NG7YUAFH574UIIL65MNYO3XPSEPSH37LV5D5Q6RWZE34ZWUPXEJA\m\target\it\wrongPropertyInterpolation\target\it\project\build.log]
[windows-jdk9] Finished parsing Maven Invoker results (found 68)
[windows-jdk9] [withMaven] junitPublisher - Archive test results for Maven artifact org.apache.maven.plugins:maven-invoker-plugin:3.1.1-SNAPSHOT generated by maven-surefire-plugin:test (default-test): m\target\surefire-reports\*.xml
[windows-jdk9] Recording test results
[Pipeline] [windows-jdk9] // withMaven
[Pipeline] [windows-jdk9] cleanWs
[Pipeline] [windows-jdk7] cleanWs
[windows-jdk7] [WS-CLEANUP] Deleting project workspace...[WS-CLEANUP] done
[Pipeline] [windows-jdk7] }
[windows-jdk9] [WS-CLEANUP] Deleting project workspace...[WS-CLEANUP] done
[Pipeline] [windows-jdk7] // stage
[Pipeline] [windows-jdk7] }
[Pipeline] [windows-jdk9] cleanWs
[Pipeline] [windows-jdk7] // node
[Pipeline] [windows-jdk7] }
[windows-jdk9] [WS-CLEANUP] Deleting project workspace...[WS-CLEANUP] done
[windows-jdk7] Failed in branch windows-jdk7
[Pipeline] [windows-jdk9] }
[Pipeline] [windows-jdk9] // stage
[Pipeline] [windows-jdk9] }
[Pipeline] [windows-jdk9] // node
[Pipeline] [windows-jdk9] }
[windows-jdk9] Failed in branch windows-jdk9
[Pipeline] // parallel
[Pipeline] stage
[Pipeline] { (Notifications)
[Pipeline] echo
Build result: FAILURE
[Pipeline] jiraIssueSelector
[Pipeline] emailext
Reply | Threaded
Open this post in threaded view
|

Build failed in Jenkins: Maven TLP » maven-invoker-plugin » MINVOKER-244 #3

Apache Jenkins Server-2
See https://builds.apache.org/job/maven-box/job/maven-invoker-plugin/job/MINVOKER-244/3/

No changes.

All tests passed

Build log:
[...truncated 2.81 MB...]
[windows-jdk10] [INFO]
[windows-jdk10] [INFO] --- maven-invoker-plugin:3.0.1:verify (integration-test) @ maven-invoker-plugin ---
[windows-jdk10] [INFO] -------------------------------------------------
[windows-jdk10] [INFO] Build Summary:
[windows-jdk10] [INFO]   Passed: 65, Failed: 1, Errors: 0, Skipped: 2
[windows-jdk10] [INFO] -------------------------------------------------
[windows-jdk10] [ERROR] The following builds failed:
[windows-jdk10] [ERROR] *  install-extra-artifacts\pom.xml
[windows-jdk10] [INFO] -------------------------------------------------
[windows-jdk10] [INFO] ------------------------------------------------------------------------
[windows-jdk10] [INFO] BUILD FAILURE
[windows-jdk10] [INFO] ------------------------------------------------------------------------
[windows-jdk10] [INFO] Total time: 25:15 min
[windows-jdk10] [INFO] Finished at: 2018-11-03T10:47:54Z
[windows-jdk10] [INFO] Final Memory: 49M/174M
[windows-jdk10] [INFO] ------------------------------------------------------------------------
[windows-jdk10] [INFO] [jenkins-event-spy] Generated F:\jenkins\jenkins-slave\workspace\invoker-plugin_MINVOKER-244-NG7YUAFH574UIIL65MNYO3XPSEPSH37LV5D5Q6RWZE34ZWUPXEJA@tmp\withMaven5d2469b5\maven-spy-20181103-102239-569834973997207106281.log
[windows-jdk10] [ERROR] Failed to execute goal org.apache.maven.plugins:maven-invoker-plugin:3.0.1:verify (integration-test) on project maven-invoker-plugin: 1 build failed. See console output above for details. -> [Help 1]
[windows-jdk10] [ERROR]
[windows-jdk10] [ERROR] To see the full stack trace of the errors, re-run Maven with the -e switch.
[windows-jdk10] [ERROR] Re-run Maven using the -X switch to enable full debug logging.
[windows-jdk10] [ERROR]
[windows-jdk10] [ERROR] For more information about the errors and possible solutions, please read the following articles:
[windows-jdk10] [ERROR] [Help 1] http://cwiki.apache.org/confluence/display/MAVEN/MojoFailureException
[Pipeline] [windows-jdk10] }
[Pipeline] [windows-jdk10] // dir
[Pipeline] [windows-jdk10] }
[windows-jdk10] [withMaven] invokerPublisher - Archive invoker results for Maven artifact MavenArtifact{org.apache.maven.plugins:maven-invoker-plugin::3.1.1-SNAPSHOT(version: 3.1.1-SNAPSHOT, snapshot:false) } generated by PluginInvocation{org.apache.maven.plugins:maven-invoker-plugin:3.0.1@integration-test  integration-test}: m\target\invoker-reports\*.xml
[windows-jdk10] performing MavenInvokerRecorder, reportsFilenamePattern:'**/m\target\invoker-reports/BUILD*.xml', invokerBuildDir:'**/m\target\it'
[windows-jdk10] Found reports:[f:\jenkins\jenkins-slave\workspace\invoker-plugin_MINVOKER-244-NG7YUAFH574UIIL65MNYO3XPSEPSH37LV5D5Q6RWZE34ZWUPXEJA\m\target\invoker-reports\BUILD-MINVOKER-191.xml, f:\jenkins\jenkins-slave\workspace\invoker-plugin_MINVOKER-244-NG7YUAFH574UIIL65MNYO3XPSEPSH37LV5D5Q6RWZE34ZWUPXEJA\m\target\invoker-reports\BUILD-clone-clean.xml, f:\jenkins\jenkins-slave\workspace\invoker-plugin_MINVOKER-244-NG7YUAFH574UIIL65MNYO3XPSEPSH37LV5D5Q6RWZE34ZWUPXEJA\m\target\invoker-reports\BUILD-clone-maven-plugin-packaging.xml, f:\jenkins\jenkins-slave\workspace\invoker-plugin_MINVOKER-244-NG7YUAFH574UIIL65MNYO3XPSEPSH37LV5D5Q6RWZE34ZWUPXEJA\m\target\invoker-reports\BUILD-exec-timeout-invoker-level.xml, f:\jenkins\jenkins-slave\workspace\invoker-plugin_MINVOKER-244-NG7YUAFH574UIIL65MNYO3XPSEPSH37LV5D5Q6RWZE34ZWUPXEJA\m\target\invoker-reports\BUILD-exec-timeout-mojo-level.xml, f:\jenkins\jenkins-slave\workspace\invoker-plugin_MINVOKER-244-NG7YUAFH574UIIL65MNYO3XPSEPSH37LV5D5Q6RWZE34ZWUPXEJA\m\target\invoker-reports\BUILD-fail-build-with-verify.xml, f:\jenkins\jenkins-slave\workspace\invoker-plugin_MINVOKER-244-NG7YUAFH574UIIL65MNYO3XPSEPSH37LV5D5Q6RWZE34ZWUPXEJA\m\target\invoker-reports\BUILD-fail-build.xml, f:\jenkins\jenkins-slave\workspace\invoker-plugin_MINVOKER-244-NG7YUAFH574UIIL65MNYO3XPSEPSH37LV5D5Q6RWZE34ZWUPXEJA\m\target\invoker-reports\BUILD-fail-ignore-with-verify.xml, f:\jenkins\jenkins-slave\workspace\invoker-plugin_MINVOKER-244-NG7YUAFH574UIIL65MNYO3XPSEPSH37LV5D5Q6RWZE34ZWUPXEJA\m\target\invoker-reports\BUILD-fail-ignore.xml, f:\jenkins\jenkins-slave\workspace\invoker-plugin_MINVOKER-244-NG7YUAFH574UIIL65MNYO3XPSEPSH37LV5D5Q6RWZE34ZWUPXEJA\m\target\invoker-reports\BUILD-fail-noprojects_integration-test.xml, f:\jenkins\jenkins-slave\workspace\invoker-plugin_MINVOKER-244-NG7YUAFH574UIIL65MNYO3XPSEPSH37LV5D5Q6RWZE34ZWUPXEJA\m\target\invoker-reports\BUILD-fail-noprojects_run.xml, f:\jenkins\jenkins-slave\workspace\invoker-plugin_MINVOKER-244-NG7YUAFH574UIIL65MNYO3XPSEPSH37LV5D5Q6RWZE34ZWUPXEJA\m\target\invoker-reports\BUILD-fail-noprojects_verify.xml, f:\jenkins\jenkins-slave\workspace\invoker-plugin_MINVOKER-244-NG7YUAFH574UIIL65MNYO3XPSEPSH37LV5D5Q6RWZE34ZWUPXEJA\m\target\invoker-reports\BUILD-fail-postbuild.xml, f:\jenkins\jenkins-slave\workspace\invoker-plugin_MINVOKER-244-NG7YUAFH574UIIL65MNYO3XPSEPSH37LV5D5Q6RWZE34ZWUPXEJA\m\target\invoker-reports\BUILD-fail-prebuild.xml, f:\jenkins\jenkins-slave\workspace\invoker-plugin_MINVOKER-244-NG7YUAFH574UIIL65MNYO3XPSEPSH37LV5D5Q6RWZE34ZWUPXEJA\m\target\invoker-reports\BUILD-fail-run-postbuild.xml, f:\jenkins\jenkins-slave\workspace\invoker-plugin_MINVOKER-244-NG7YUAFH574UIIL65MNYO3XPSEPSH37LV5D5Q6RWZE34ZWUPXEJA\m\target\invoker-reports\BUILD-filtering-extensions.xml, f:\jenkins\jenkins-slave\workspace\invoker-plugin_MINVOKER-244-NG7YUAFH574UIIL65MNYO3XPSEPSH37LV5D5Q6RWZE34ZWUPXEJA\m\target\invoker-reports\BUILD-install-extra-artifacts.xml, f:\jenkins\jenkins-slave\workspace\invoker-plugin_MINVOKER-244-NG7YUAFH574UIIL65MNYO3XPSEPSH37LV5D5Q6RWZE34ZWUPXEJA\m\target\invoker-reports\BUILD-integration-test-never-fails.xml, f:\jenkins\jenkins-slave\workspace\invoker-plugin_MINVOKER-244-NG7YUAFH574UIIL65MNYO3XPSEPSH37LV5D5Q6RWZE34ZWUPXEJA\m\target\invoker-reports\BUILD-invocation-cmdline-exclude.xml, f:\jenkins\jenkins-slave\workspace\invoker-plugin_MINVOKER-244-NG7YUAFH574UIIL65MNYO3XPSEPSH37LV5D5Q6RWZE34ZWUPXEJA\m\target\invoker-reports\BUILD-invocation-debug.xml, f:\jenkins\jenkins-slave\workspace\invoker-plugin_MINVOKER-244-NG7YUAFH574UIIL65MNYO3XPSEPSH37LV5D5Q6RWZE34ZWUPXEJA\m\target\invoker-reports\BUILD-invocation-emptyproperty.xml, f:\jenkins\jenkins-slave\workspace\invoker-plugin_MINVOKER-244-NG7YUAFH574UIIL65MNYO3XPSEPSH37LV5D5Q6RWZE34ZWUPXEJA\m\target\invoker-reports\BUILD-invocation-environmentvariable.xml, f:\jenkins\jenkins-slave\workspace\invoker-plugin_MINVOKER-244-NG7YUAFH574UIIL65MNYO3XPSEPSH37LV5D5Q6RWZE34ZWUPXEJA\m\target\invoker-reports\BUILD-invocation-multiple.xml, f:\jenkins\jenkins-slave\workspace\invoker-plugin_MINVOKER-244-NG7YUAFH574UIIL65MNYO3XPSEPSH37LV5D5Q6RWZE34ZWUPXEJA\m\target\invoker-reports\BUILD-invocation-offline.xml, f:\jenkins\jenkins-slave\workspace\invoker-plugin_MINVOKER-244-NG7YUAFH574UIIL65MNYO3XPSEPSH37LV5D5Q6RWZE34ZWUPXEJA\m\target\invoker-reports\BUILD-invocation-project.xml, f:\jenkins\jenkins-slave\workspace\invoker-plugin_MINVOKER-244-NG7YUAFH574UIIL65MNYO3XPSEPSH37LV5D5Q6RWZE34ZWUPXEJA\m\target\invoker-reports\BUILD-invocation-reactor-indirect.xml, f:\jenkins\jenkins-slave\workspace\invoker-plugin_MINVOKER-244-NG7YUAFH574UIIL65MNYO3XPSEPSH37LV5D5Q6RWZE34ZWUPXEJA\m\target\invoker-reports\BUILD-invocation-spaces.xml, f:\jenkins\jenkins-slave\workspace\invoker-plugin_MINVOKER-244-NG7YUAFH574UIIL65MNYO3XPSEPSH37LV5D5Q6RWZE34ZWUPXEJA\m\target\invoker-reports\BUILD-invoker-report.xml, f:\jenkins\jenkins-slave\workspace\invoker-plugin_MINVOKER-244-NG7YUAFH574UIIL65MNYO3XPSEPSH37LV5D5Q6RWZE34ZWUPXEJA\m\target\invoker-reports\BUILD-local-repo-default.xml, f:\jenkins\jenkins-slave\workspace\invoker-plugin_MINVOKER-244-NG7YUAFH574UIIL65MNYO3XPSEPSH37LV5D5Q6RWZE34ZWUPXEJA\m\target\invoker-reports\BUILD-local-repo-isolated.xml, f:\jenkins\jenkins-slave\workspace\invoker-plugin_MINVOKER-244-NG7YUAFH574UIIL65MNYO3XPSEPSH37LV5D5Q6RWZE34ZWUPXEJA\m\target\invoker-reports\BUILD-local-repo-path.xml, f:\jenkins\jenkins-slave\workspace\invoker-plugin_MINVOKER-244-NG7YUAFH574UIIL65MNYO3XPSEPSH37LV5D5Q6RWZE34ZWUPXEJA\m\target\invoker-reports\BUILD-local-repo-url.xml, f:\jenkins\jenkins-slave\workspace\invoker-plugin_MINVOKER-244-NG7YUAFH574UIIL65MNYO3XPSEPSH37LV5D5Q6RWZE34ZWUPXEJA\m\target\invoker-reports\BUILD-multiEnvVar.xml, f:\jenkins\jenkins-slave\workspace\invoker-plugin_MINVOKER-244-NG7YUAFH574UIIL65MNYO3XPSEPSH37LV5D5Q6RWZE34ZWUPXEJA\m\target\invoker-reports\BUILD-not-clone-not-plugin.xml, f:\jenkins\jenkins-slave\workspace\invoker-plugin_MINVOKER-244-NG7YUAFH574UIIL65MNYO3XPSEPSH37LV5D5Q6RWZE34ZWUPXEJA\m\target\invoker-reports\BUILD-pom-filtering-encoding.xml, f:\jenkins\jenkins-slave\workspace\invoker-plugin_MINVOKER-244-NG7YUAFH574UIIL65MNYO3XPSEPSH37LV5D5Q6RWZE34ZWUPXEJA\m\target\invoker-reports\BUILD-pom-filtering-reactor.xml, f:\jenkins\jenkins-slave\workspace\invoker-plugin_MINVOKER-244-NG7YUAFH574UIIL65MNYO3XPSEPSH37LV5D5Q6RWZE34ZWUPXEJA\m\target\invoker-reports\BUILD-pom-filtering.xml, f:\jenkins\jenkins-slave\workspace\invoker-plugin_MINVOKER-244-NG7YUAFH574UIIL65MNYO3XPSEPSH37LV5D5Q6RWZE34ZWUPXEJA\m\target\invoker-reports\BUILD-pom-less-invocation.xml, f:\jenkins\jenkins-slave\workspace\invoker-plugin_MINVOKER-244-NG7YUAFH574UIIL65MNYO3XPSEPSH37LV5D5Q6RWZE34ZWUPXEJA\m\target\invoker-reports\BUILD-postbuild-executed-only-once.xml, f:\jenkins\jenkins-slave\workspace\invoker-plugin_MINVOKER-244-NG7YUAFH574UIIL65MNYO3XPSEPSH37LV5D5Q6RWZE34ZWUPXEJA\m\target\invoker-reports\BUILD-project-cloning-reactor.xml, f:\jenkins\jenkins-slave\workspace\invoker-plugin_MINVOKER-244-NG7YUAFH574UIIL65MNYO3XPSEPSH37LV5D5Q6RWZE34ZWUPXEJA\m\target\invoker-reports\BUILD-project-cloning.xml, f:\jenkins\jenkins-slave\workspace\invoker-plugin_MINVOKER-244-NG7YUAFH574UIIL65MNYO3XPSEPSH37LV5D5Q6RWZE34ZWUPXEJA\m\target\invoker-reports\BUILD-project-setup.xml, f:\jenkins\jenkins-slave\workspace\invoker-plugin_MINVOKER-244-NG7YUAFH574UIIL65MNYO3XPSEPSH37LV5D5Q6RWZE34ZWUPXEJA\m\target\invoker-reports\BUILD-script-accessibility.xml, f:\jenkins\jenkins-slave\workspace\invoker-plugin_MINVOKER-244-NG7YUAFH574UIIL65MNYO3XPSEPSH37LV5D5Q6RWZE34ZWUPXEJA\m\target\invoker-reports\BUILD-script-additional-vars.xml, f:\jenkins\jenkins-slave\workspace\invoker-plugin_MINVOKER-244-NG7YUAFH574UIIL65MNYO3XPSEPSH37LV5D5Q6RWZE34ZWUPXEJA\m\target\invoker-reports\BUILD-script-class-loading.xml, f:\jenkins\jenkins-slave\workspace\invoker-plugin_MINVOKER-244-NG7YUAFH574UIIL65MNYO3XPSEPSH37LV5D5Q6RWZE34ZWUPXEJA\m\target\invoker-reports\BUILD-script-classpath-duplicates.xml, f:\jenkins\jenkins-slave\workspace\invoker-plugin_MINVOKER-244-NG7YUAFH574UIIL65MNYO3XPSEPSH37LV5D5Q6RWZE34ZWUPXEJA\m\target\invoker-reports\BUILD-script-context.xml, f:\jenkins\jenkins-slave\workspace\invoker-plugin_MINVOKER-244-NG7YUAFH574UIIL65MNYO3XPSEPSH37LV5D5Q6RWZE34ZWUPXEJA\m\target\invoker-reports\BUILD-script-errors.xml, f:\jenkins\jenkins-slave\workspace\invoker-plugin_MINVOKER-244-NG7YUAFH574UIIL65MNYO3XPSEPSH37LV5D5Q6RWZE34ZWUPXEJA\m\target\invoker-reports\BUILD-script-global-vars.xml, f:\jenkins\jenkins-slave\workspace\invoker-plugin_MINVOKER-244-NG7YUAFH574UIIL65MNYO3XPSEPSH37LV5D5Q6RWZE34ZWUPXEJA\m\target\invoker-reports\BUILD-script-interpreter-detection.xml, f:\jenkins\jenkins-slave\workspace\invoker-plugin_MINVOKER-244-NG7YUAFH574UIIL65MNYO3XPSEPSH37LV5D5Q6RWZE34ZWUPXEJA\m\target\invoker-reports\BUILD-script-verify-xml.xml, f:\jenkins\jenkins-slave\workspace\invoker-plugin_MINVOKER-244-NG7YUAFH574UIIL65MNYO3XPSEPSH37LV5D5Q6RWZE34ZWUPXEJA\m\target\invoker-reports\BUILD-selector-conditions.xml, f:\jenkins\jenkins-slave\workspace\invoker-plugin_MINVOKER-244-NG7YUAFH574UIIL65MNYO3XPSEPSH37LV5D5Q6RWZE34ZWUPXEJA\m\target\invoker-reports\BUILD-selector-scripts.xml, f:\jenkins\jenkins-slave\workspace\invoker-plugin_MINVOKER-244-NG7YUAFH574UIIL65MNYO3XPSEPSH37LV5D5Q6RWZE34ZWUPXEJA\m\target\invoker-reports\BUILD-settings-auto-exclude.xml, f:\jenkins\jenkins-slave\workspace\invoker-plugin_MINVOKER-244-NG7YUAFH574UIIL65MNYO3XPSEPSH37LV5D5Q6RWZE34ZWUPXEJA\m\target\invoker-reports\BUILD-settings-inherit.xml, f:\jenkins\jenkins-slave\workspace\invoker-plugin_MINVOKER-244-NG7YUAFH574UIIL65MNYO3XPSEPSH37LV5D5Q6RWZE34ZWUPXEJA\m\target\invoker-reports\BUILD-settings-merge-multiexecutions.xml, f:\jenkins\jenkins-slave\workspace\invoker-plugin_MINVOKER-244-NG7YUAFH574UIIL65MNYO3XPSEPSH37LV5D5Q6RWZE34ZWUPXEJA\m\target\invoker-reports\BUILD-settings-merge.xml, f:\jenkins\jenkins-slave\workspace\invoker-plugin_MINVOKER-244-NG7YUAFH574UIIL65MNYO3XPSEPSH37LV5D5Q6RWZE34ZWUPXEJA\m\target\invoker-reports\BUILD-settings-merge_jdk9+.xml, f:\jenkins\jenkins-slave\workspace\invoker-plugin_MINVOKER-244-NG7YUAFH574UIIL65MNYO3XPSEPSH37LV5D5Q6RWZE34ZWUPXEJA\m\target\invoker-reports\BUILD-settings-override.xml, f:\jenkins\jenkins-slave\workspace\invoker-plugin_MINVOKER-244-NG7YUAFH574UIIL65MNYO3XPSEPSH37LV5D5Q6RWZE34ZWUPXEJA\m\target\invoker-reports\BUILD-skip-install.xml, f:\jenkins\jenkins-slave\workspace\invoker-plugin_MINVOKER-244-NG7YUAFH574UIIL65MNYO3XPSEPSH37LV5D5Q6RWZE34ZWUPXEJA\m\target\invoker-reports\BUILD-skip-run.xml, f:\jenkins\jenkins-slave\workspace\invoker-plugin_MINVOKER-244-NG7YUAFH574UIIL65MNYO3XPSEPSH37LV5D5Q6RWZE34ZWUPXEJA\m\target\invoker-reports\BUILD-spaces-should-work_non-windows.xml, f:\jenkins\jenkins-slave\workspace\invoker-plugin_MINVOKER-244-NG7YUAFH574UIIL65MNYO3XPSEPSH37LV5D5Q6RWZE34ZWUPXEJA\m\target\invoker-reports\BUILD-spaces-should-work_windows.xml, f:\jenkins\jenkins-slave\workspace\invoker-plugin_MINVOKER-244-NG7YUAFH574UIIL65MNYO3XPSEPSH37LV5D5Q6RWZE34ZWUPXEJA\m\target\invoker-reports\BUILD-special-characters-should-work.xml, f:\jenkins\jenkins-slave\workspace\invoker-plugin_MINVOKER-244-NG7YUAFH574UIIL65MNYO3XPSEPSH37LV5D5Q6RWZE34ZWUPXEJA\m\target\invoker-reports\BUILD-staging-dependencies.xml, f:\jenkins\jenkins-slave\workspace\invoker-plugin_MINVOKER-244-NG7YUAFH574UIIL65MNYO3XPSEPSH37LV5D5Q6RWZE34ZWUPXEJA\m\target\invoker-reports\BUILD-staging-pom.xml, f:\jenkins\jenkins-slave\workspace\invoker-plugin_MINVOKER-244-NG7YUAFH574UIIL65MNYO3XPSEPSH37LV5D5Q6RWZE34ZWUPXEJA\m\target\invoker-reports\BUILD-staging-reactor.xml, f:\jenkins\jenkins-slave\workspace\invoker-plugin_MINVOKER-244-NG7YUAFH574UIIL65MNYO3XPSEPSH37LV5D5Q6RWZE34ZWUPXEJA\m\target\invoker-reports\BUILD-wrongPropertyInterpolation.xml]
[windows-jdk10] Found logs:[f:\jenkins\jenkins-slave\workspace\invoker-plugin_MINVOKER-244-NG7YUAFH574UIIL65MNYO3XPSEPSH37LV5D5Q6RWZE34ZWUPXEJA\m\target\it\MINVOKER-191\build.log, f:\jenkins\jenkins-slave\workspace\invoker-plugin_MINVOKER-244-NG7YUAFH574UIIL65MNYO3XPSEPSH37LV5D5Q6RWZE34ZWUPXEJA\m\target\it\MINVOKER-191\plugin\target\it\basic\build.log, f:\jenkins\jenkins-slave\workspace\invoker-plugin_MINVOKER-244-NG7YUAFH574UIIL65MNYO3XPSEPSH37LV5D5Q6RWZE34ZWUPXEJA\m\target\it\clone-clean\build.log, f:\jenkins\jenkins-slave\workspace\invoker-plugin_MINVOKER-244-NG7YUAFH574UIIL65MNYO3XPSEPSH37LV5D5Q6RWZE34ZWUPXEJA\m\target\it\clone-clean\target\it\clone-clean\build.log, f:\jenkins\jenkins-slave\workspace\invoker-plugin_MINVOKER-244-NG7YUAFH574UIIL65MNYO3XPSEPSH37LV5D5Q6RWZE34ZWUPXEJA\m\target\it\clone-maven-plugin-packaging\build.log, f:\jenkins\jenkins-slave\workspace\invoker-plugin_MINVOKER-244-NG7YUAFH574UIIL65MNYO3XPSEPSH37LV5D5Q6RWZE34ZWUPXEJA\m\target\it\clone-maven-plugin-packaging\target\it\clone-clean\build.log, f:\jenkins\jenkins-slave\workspace\invoker-plugin_MINVOKER-244-NG7YUAFH574UIIL65MNYO3XPSEPSH37LV5D5Q6RWZE34ZWUPXEJA\m\target\it\exec-timeout-invoker-level\build.log, f:\jenkins\jenkins-slave\workspace\invoker-plugin_MINVOKER-244-NG7YUAFH574UIIL65MNYO3XPSEPSH37LV5D5Q6RWZE34ZWUPXEJA\m\target\it\exec-timeout-invoker-level\target\it\basic\build.log, f:\jenkins\jenkins-slave\workspace\invoker-plugin_MINVOKER-244-NG7YUAFH574UIIL65MNYO3XPSEPSH37LV5D5Q6RWZE34ZWUPXEJA\m\target\it\exec-timeout-mojo-level\build.log, f:\jenkins\jenkins-slave\workspace\invoker-plugin_MINVOKER-244-NG7YUAFH574UIIL65MNYO3XPSEPSH37LV5D5Q6RWZE34ZWUPXEJA\m\target\it\exec-timeout-mojo-level\target\it\basic\build.log, f:\jenkins\jenkins-slave\workspace\invoker-plugin_MINVOKER-244-NG7YUAFH574UIIL65MNYO3XPSEPSH37LV5D5Q6RWZE34ZWUPXEJA\m\target\it\fail-build-with-verify\build.log, f:\jenkins\jenkins-slave\workspace\invoker-plugin_MINVOKER-244-NG7YUAFH574UIIL65MNYO3XPSEPSH37LV5D5Q6RWZE34ZWUPXEJA\m\target\it\fail-build-with-verify\target\it\project\build.log, f:\jenkins\jenkins-slave\workspace\invoker-plugin_MINVOKER-244-NG7YUAFH574UIIL65MNYO3XPSEPSH37LV5D5Q6RWZE34ZWUPXEJA\m\target\it\fail-build\build.log, f:\jenkins\jenkins-slave\workspace\invoker-plugin_MINVOKER-244-NG7YUAFH574UIIL65MNYO3XPSEPSH37LV5D5Q6RWZE34ZWUPXEJA\m\target\it\fail-build\target\it\project\build.log, f:\jenkins\jenkins-slave\workspace\invoker-plugin_MINVOKER-244-NG7YUAFH574UIIL65MNYO3XPSEPSH37LV5D5Q6RWZE34ZWUPXEJA\m\target\it\fail-ignore-with-verify\build.log, f:\jenkins\jenkins-slave\workspace\invoker-plugin_MINVOKER-244-NG7YUAFH574UIIL65MNYO3XPSEPSH37LV5D5Q6RWZE34ZWUPXEJA\m\target\it\fail-ignore-with-verify\target\it\project\build.log, f:\jenkins\jenkins-slave\workspace\invoker-plugin_MINVOKER-244-NG7YUAFH574UIIL65MNYO3XPSEPSH37LV5D5Q6RWZE34ZWUPXEJA\m\target\it\fail-ignore\build.log, f:\jenkins\jenkins-slave\workspace\invoker-plugin_MINVOKER-244-NG7YUAFH574UIIL65MNYO3XPSEPSH37LV5D5Q6RWZE34ZWUPXEJA\m\target\it\fail-ignore\target\it\project\build.log, f:\jenkins\jenkins-slave\workspace\invoker-plugin_MINVOKER-244-NG7YUAFH574UIIL65MNYO3XPSEPSH37LV5D5Q6RWZE34ZWUPXEJA\m\target\it\fail-noprojects_integration-test\build.log, f:\jenkins\jenkins-slave\workspace\invoker-plugin_MINVOKER-244-NG7YUAFH574UIIL65MNYO3XPSEPSH37LV5D5Q6RWZE34ZWUPXEJA\m\target\it\fail-noprojects_run\build.log, f:\jenkins\jenkins-slave\workspace\invoker-plugin_MINVOKER-244-NG7YUAFH574UIIL65MNYO3XPSEPSH37LV5D5Q6RWZE34ZWUPXEJA\m\target\it\fail-noprojects_verify\build.log, f:\jenkins\jenkins-slave\workspace\invoker-plugin_MINVOKER-244-NG7YUAFH574UIIL65MNYO3XPSEPSH37LV5D5Q6RWZE34ZWUPXEJA\m\target\it\fail-postbuild\build.log, f:\jenkins\jenkins-slave\workspace\invoker-plugin_MINVOKER-244-NG7YUAFH574UIIL65MNYO3XPSEPSH37LV5D5Q6RWZE34ZWUPXEJA\m\target\it\fail-postbuild\target\it\project\build.log, f:\jenkins\jenkins-slave\workspace\invoker-plugin_MINVOKER-244-NG7YUAFH574UIIL65MNYO3XPSEPSH37LV5D5Q6RWZE34ZWUPXEJA\m\target\it\fail-prebuild\build.log, f:\jenkins\jenkins-slave\workspace\invoker-plugin_MINVOKER-244-NG7YUAFH574UIIL65MNYO3XPSEPSH37LV5D5Q6RWZE34ZWUPXEJA\m\target\it\fail-prebuild\target\it\project\build.log, f:\jenkins\jenkins-slave\workspace\invoker-plugin_MINVOKER-244-NG7YUAFH574UIIL65MNYO3XPSEPSH37LV5D5Q6RWZE34ZWUPXEJA\m\target\it\fail-run-postbuild\build.log, f:\jenkins\jenkins-slave\workspace\invoker-plugin_MINVOKER-244-NG7YUAFH574UIIL65MNYO3XPSEPSH37LV5D5Q6RWZE34ZWUPXEJA\m\target\it\fail-run-postbuild\target\it\project\build.log, f:\jenkins\jenkins-slave\workspace\invoker-plugin_MINVOKER-244-NG7YUAFH574UIIL65MNYO3XPSEPSH37LV5D5Q6RWZE34ZWUPXEJA\m\target\it\filtering-extensions\build.log, f:\jenkins\jenkins-slave\workspace\invoker-plugin_MINVOKER-244-NG7YUAFH574UIIL65MNYO3XPSEPSH37LV5D5Q6RWZE34ZWUPXEJA\m\target\it\filtering-extensions\target\it\project\build.log, f:\jenkins\jenkins-slave\workspace\invoker-plugin_MINVOKER-244-NG7YUAFH574UIIL65MNYO3XPSEPSH37LV5D5Q6RWZE34ZWUPXEJA\m\target\it\install-extra-artifacts\build.log, f:\jenkins\jenkins-slave\workspace\invoker-plugin_MINVOKER-244-NG7YUAFH574UIIL65MNYO3XPSEPSH37LV5D5Q6RWZE34ZWUPXEJA\m\target\it\integration-test-never-fails\build.log, f:\jenkins\jenkins-slave\workspace\invoker-plugin_MINVOKER-244-NG7YUAFH574UIIL65MNYO3XPSEPSH37LV5D5Q6RWZE34ZWUPXEJA\m\target\it\integration-test-never-fails\target\it\project\build.log, f:\jenkins\jenkins-slave\workspace\invoker-plugin_MINVOKER-244-NG7YUAFH574UIIL65MNYO3XPSEPSH37LV5D5Q6RWZE34ZWUPXEJA\m\target\it\invocation-cmdline-exclude\build.log, f:\jenkins\jenkins-slave\workspace\invoker-plugin_MINVOKER-244-NG7YUAFH574UIIL65MNYO3XPSEPSH37LV5D5Q6RWZE34ZWUPXEJA\m\target\it\invocation-debug\build.log, f:\jenkins\jenkins-slave\workspace\invoker-plugin_MINVOKER-244-NG7YUAFH574UIIL65MNYO3XPSEPSH37LV5D5Q6RWZE34ZWUPXEJA\m\target\it\invocation-debug\src\it\minvoker-142\build.log, f:\jenkins\jenkins-slave\workspace\invoker-plugin_MINVOKER-244-NG7YUAFH574UIIL65MNYO3XPSEPSH37LV5D5Q6RWZE34ZWUPXEJA\m\target\it\invocation-emptyproperty\build.log, f:\jenkins\jenkins-slave\workspace\invoker-plugin_MINVOKER-244-NG7YUAFH574UIIL65MNYO3XPSEPSH37LV5D5Q6RWZE34ZWUPXEJA\m\target\it\invocation-emptyproperty\src\it\minvoker-118\build.log, f:\jenkins\jenkins-slave\workspace\invoker-plugin_MINVOKER-244-NG7YUAFH574UIIL65MNYO3XPSEPSH37LV5D5Q6RWZE34ZWUPXEJA\m\target\it\invocation-environmentvariable\build.log, f:\jenkins\jenkins-slave\workspace\invoker-plugin_MINVOKER-244-NG7YUAFH574UIIL65MNYO3XPSEPSH37LV5D5Q6RWZE34ZWUPXEJA\m\target\it\invocation-environmentvariable\src\it\minvoker-145\build.log, f:\jenkins\jenkins-slave\workspace\invoker-plugin_MINVOKER-244-NG7YUAFH574UIIL65MNYO3XPSEPSH37LV5D5Q6RWZE34ZWUPXEJA\m\target\it\invocation-multiple\build.log, f:\jenkins\jenkins-slave\workspace\invoker-plugin_MINVOKER-244-NG7YUAFH574UIIL65MNYO3XPSEPSH37LV5D5Q6RWZE34ZWUPXEJA\m\target\it\invocation-multiple\target\it\project\build.log, f:\jenkins\jenkins-slave\workspace\invoker-plugin_MINVOKER-244-NG7YUAFH574UIIL65MNYO3XPSEPSH37LV5D5Q6RWZE34ZWUPXEJA\m\target\it\invocation-offline\build.log, f:\jenkins\jenkins-slave\workspace\invoker-plugin_MINVOKER-244-NG7YUAFH574UIIL65MNYO3XPSEPSH37LV5D5Q6RWZE34ZWUPXEJA\m\target\it\invocation-offline\src\it\project\build.log, f:\jenkins\jenkins-slave\workspace\invoker-plugin_MINVOKER-244-NG7YUAFH574UIIL65MNYO3XPSEPSH37LV5D5Q6RWZE34ZWUPXEJA\m\target\it\invocation-project\build.log, f:\jenkins\jenkins-slave\workspace\invoker-plugin_MINVOKER-244-NG7YUAFH574UIIL65MNYO3XPSEPSH37LV5D5Q6RWZE34ZWUPXEJA\m\target\it\invocation-project\target\it\project\build.log, f:\jenkins\jenkins-slave\workspace\invoker-plugin_MINVOKER-244-NG7YUAFH574UIIL65MNYO3XPSEPSH37LV5D5Q6RWZE34ZWUPXEJA\m\target\it\invocation-reactor-indirect\build.log, f:\jenkins\jenkins-slave\workspace\invoker-plugin_MINVOKER-244-NG7YUAFH574UIIL65MNYO3XPSEPSH37LV5D5Q6RWZE34ZWUPXEJA\m\target\it\invocation-reactor-indirect\itests\target\it\basic\build.log, f:\jenkins\jenkins-slave\workspace\invoker-plugin_MINVOKER-244-NG7YUAFH574UIIL65MNYO3XPSEPSH37LV5D5Q6RWZE34ZWUPXEJA\m\target\it\invocation-spaces\build.log, f:\jenkins\jenkins-slave\workspace\invoker-plugin_MINVOKER-244-NG7YUAFH574UIIL65MNYO3XPSEPSH37LV5D5Q6RWZE34ZWUPXEJA\m\target\it\invocation-spaces\target\it projects\project\build.log, f:\jenkins\jenkins-slave\workspace\invoker-plugin_MINVOKER-244-NG7YUAFH574UIIL65MNYO3XPSEPSH37LV5D5Q6RWZE34ZWUPXEJA\m\target\it\invoker-report\build.log, f:\jenkins\jenkins-slave\workspace\invoker-plugin_MINVOKER-244-NG7YUAFH574UIIL65MNYO3XPSEPSH37LV5D5Q6RWZE34ZWUPXEJA\m\target\it\invoker-report\src\it\failure-build\build.log, f:\jenkins\jenkins-slave\workspace\invoker-plugin_MINVOKER-244-NG7YUAFH574UIIL65MNYO3XPSEPSH37LV5D5Q6RWZE34ZWUPXEJA\m\target\it\invoker-report\src\it\failure-post\build.log, f:\jenkins\jenkins-slave\workspace\invoker-plugin_MINVOKER-244-NG7YUAFH574UIIL65MNYO3XPSEPSH37LV5D5Q6RWZE34ZWUPXEJA\m\target\it\invoker-report\src\it\failure-pre\build.log, f:\jenkins\jenkins-slave\workspace\invoker-plugin_MINVOKER-244-NG7YUAFH574UIIL65MNYO3XPSEPSH37LV5D5Q6RWZE34ZWUPXEJA\m\target\it\invoker-report\src\it\success\build.log, f:\jenkins\jenkins-slave\workspace\invoker-plugin_MINVOKER-244-NG7YUAFH574UIIL65MNYO3XPSEPSH37LV5D5Q6RWZE34ZWUPXEJA\m\target\it\local-repo-default\build.log, f:\jenkins\jenkins-slave\workspace\invoker-plugin_MINVOKER-244-NG7YUAFH574UIIL65MNYO3XPSEPSH37LV5D5Q6RWZE34ZWUPXEJA\m\target\it\local-repo-default\target\its\project\build.log, f:\jenkins\jenkins-slave\workspace\invoker-plugin_MINVOKER-244-NG7YUAFH574UIIL65MNYO3XPSEPSH37LV5D5Q6RWZE34ZWUPXEJA\m\target\it\local-repo-isolated\build.log, f:\jenkins\jenkins-slave\workspace\invoker-plugin_MINVOKER-244-NG7YUAFH574UIIL65MNYO3XPSEPSH37LV5D5Q6RWZE34ZWUPXEJA\m\target\it\local-repo-isolated\src\it\project\build.log, f:\jenkins\jenkins-slave\workspace\invoker-plugin_MINVOKER-244-NG7YUAFH574UIIL65MNYO3XPSEPSH37LV5D5Q6RWZE34ZWUPXEJA\m\target\it\local-repo-path\build.log, f:\jenkins\jenkins-slave\workspace\invoker-plugin_MINVOKER-244-NG7YUAFH574UIIL65MNYO3XPSEPSH37LV5D5Q6RWZE34ZWUPXEJA\m\target\it\local-repo-path\src\it\project\build.log, f:\jenkins\jenkins-slave\workspace\invoker-plugin_MINVOKER-244-NG7YUAFH574UIIL65MNYO3XPSEPSH37LV5D5Q6RWZE34ZWUPXEJA\m\target\it\local-repo-url\build.log, f:\jenkins\jenkins-slave\workspace\invoker-plugin_MINVOKER-244-NG7YUAFH574UIIL65MNYO3XPSEPSH37LV5D5Q6RWZE34ZWUPXEJA\m\target\it\local-repo-url\src\it\project\build.log, f:\jenkins\jenkins-slave\workspace\invoker-plugin_MINVOKER-244-NG7YUAFH574UIIL65MNYO3XPSEPSH37LV5D5Q6RWZE34ZWUPXEJA\m\target\it\multiEnvVar\build.log, f:\jenkins\jenkins-slave\workspace\invoker-plugin_MINVOKER-244-NG7YUAFH574UIIL65MNYO3XPSEPSH37LV5D5Q6RWZE34ZWUPXEJA\m\target\it\multiEnvVar\target\it\project\build.log, f:\jenkins\jenkins-slave\workspace\invoker-plugin_MINVOKER-244-NG7YUAFH574UIIL65MNYO3XPSEPSH37LV5D5Q6RWZE34ZWUPXEJA\m\target\it\not-clone-not-plugin\build.log, f:\jenkins\jenkins-slave\workspace\invoker-plugin_MINVOKER-244-NG7YUAFH574UIIL65MNYO3XPSEPSH37LV5D5Q6RWZE34ZWUPXEJA\m\target\it\not-clone-not-plugin\src\it\clone-clean\build.log, f:\jenkins\jenkins-slave\workspace\invoker-plugin_MINVOKER-244-NG7YUAFH574UIIL65MNYO3XPSEPSH37LV5D5Q6RWZE34ZWUPXEJA\m\target\it\pom-filtering-encoding\build.log, f:\jenkins\jenkins-slave\workspace\invoker-plugin_MINVOKER-244-NG7YUAFH574UIIL65MNYO3XPSEPSH37LV5D5Q6RWZE34ZWUPXEJA\m\target\it\pom-filtering-encoding\target\it\latin-1\build.log, f:\jenkins\jenkins-slave\workspace\invoker-plugin_MINVOKER-244-NG7YUAFH574UIIL65MNYO3XPSEPSH37LV5D5Q6RWZE34ZWUPXEJA\m\target\it\pom-filtering-encoding\target\it\utf-8\build.log, f:\jenkins\jenkins-slave\workspace\invoker-plugin_MINVOKER-244-NG7YUAFH574UIIL65MNYO3XPSEPSH37LV5D5Q6RWZE34ZWUPXEJA\m\target\it\pom-filtering-reactor\build.log, f:\jenkins\jenkins-slave\workspace\invoker-plugin_MINVOKER-244-NG7YUAFH574UIIL65MNYO3XPSEPSH37LV5D5Q6RWZE34ZWUPXEJA\m\target\it\pom-filtering-reactor\target\it\mod2-parent\build.log, f:\jenkins\jenkins-slave\workspace\invoker-plugin_MINVOKER-244-NG7YUAFH574UIIL65MNYO3XPSEPSH37LV5D5Q6RWZE34ZWUPXEJA\m\target\it\pom-filtering\build.log, f:\jenkins\jenkins-slave\workspace\invoker-plugin_MINVOKER-244-NG7YUAFH574UIIL65MNYO3XPSEPSH37LV5D5Q6RWZE34ZWUPXEJA\m\target\it\pom-filtering\target\it\project\build.log, f:\jenkins\jenkins-slave\workspace\invoker-plugin_MINVOKER-244-NG7YUAFH574UIIL65MNYO3XPSEPSH37LV5D5Q6RWZE34ZWUPXEJA\m\target\it\pom-less-invocation\build.log, f:\jenkins\jenkins-slave\workspace\invoker-plugin_MINVOKER-244-NG7YUAFH574UIIL65MNYO3XPSEPSH37LV5D5Q6RWZE34ZWUPXEJA\m\target\it\pom-less-invocation\target\it\no-pom\build.log, f:\jenkins\jenkins-slave\workspace\invoker-plugin_MINVOKER-244-NG7YUAFH574UIIL65MNYO3XPSEPSH37LV5D5Q6RWZE34ZWUPXEJA\m\target\it\postbuild-executed-only-once\build.log, f:\jenkins\jenkins-slave\workspace\invoker-plugin_MINVOKER-244-NG7YUAFH574UIIL65MNYO3XPSEPSH37LV5D5Q6RWZE34ZWUPXEJA\m\target\it\postbuild-executed-only-once\target\it\project\build.log, f:\jenkins\jenkins-slave\workspace\invoker-plugin_MINVOKER-244-NG7YUAFH574UIIL65MNYO3XPSEPSH37LV5D5Q6RWZE34ZWUPXEJA\m\target\it\project-cloning-reactor\build.log, f:\jenkins\jenkins-slave\workspace\invoker-plugin_MINVOKER-244-NG7YUAFH574UIIL65MNYO3XPSEPSH37LV5D5Q6RWZE34ZWUPXEJA\m\target\it\project-cloning-reactor\target\it\aggregator\build.log, f:\jenkins\jenkins-slave\workspace\invoker-plugin_MINVOKER-244-NG7YUAFH574UIIL65MNYO3XPSEPSH37LV5D5Q6RWZE34ZWUPXEJA\m\target\it\project-cloning\build.log, f:\jenkins\jenkins-slave\workspace\invoker-plugin_MINVOKER-244-NG7YUAFH574UIIL65MNYO3XPSEPSH37LV5D5Q6RWZE34ZWUPXEJA\m\target\it\project-cloning\target\it\module-1\build.log, f:\jenkins\jenkins-slave\workspace\invoker-plugin_MINVOKER-244-NG7YUAFH574UIIL65MNYO3XPSEPSH37LV5D5Q6RWZE34ZWUPXEJA\m\target\it\project-cloning\target\it\module-1\sub-module\build.log, f:\jenkins\jenkins-slave\workspace\invoker-plugin_MINVOKER-244-NG7YUAFH574UIIL65MNYO3XPSEPSH37LV5D5Q6RWZE34ZWUPXEJA\m\target\it\project-cloning\target\it\module\build.log, f:\jenkins\jenkins-slave\workspace\invoker-plugin_MINVOKER-244-NG7YUAFH574UIIL65MNYO3XPSEPSH37LV5D5Q6RWZE34ZWUPXEJA\m\target\it\project-setup\build.log, f:\jenkins\jenkins-slave\workspace\invoker-plugin_MINVOKER-244-NG7YUAFH574UIIL65MNYO3XPSEPSH37LV5D5Q6RWZE34ZWUPXEJA\m\target\it\project-setup\target\it\project1\build.log, f:\jenkins\jenkins-slave\workspace\invoker-plugin_MINVOKER-244-NG7YUAFH574UIIL65MNYO3XPSEPSH37LV5D5Q6RWZE34ZWUPXEJA\m\target\it\project-setup\target\it\project2\build.log, f:\jenkins\jenkins-slave\workspace\invoker-plugin_MINVOKER-244-NG7YUAFH574UIIL65MNYO3XPSEPSH37LV5D5Q6RWZE34ZWUPXEJA\m\target\it\project-setup\target\it\project3\build.log, f:\jenkins\jenkins-slave\workspace\invoker-plugin_MINVOKER-244-NG7YUAFH574UIIL65MNYO3XPSEPSH37LV5D5Q6RWZE34ZWUPXEJA\m\target\it\project-setup\target\it\project4\build.log, f:\jenkins\jenkins-slave\workspace\invoker-plugin_MINVOKER-244-NG7YUAFH574UIIL65MNYO3XPSEPSH37LV5D5Q6RWZE34ZWUPXEJA\m\target\it\project-setup\target\it\project5\build.log, f:\jenkins\jenkins-slave\workspace\invoker-plugin_MINVOKER-244-NG7YUAFH574UIIL65MNYO3XPSEPSH37LV5D5Q6RWZE34ZWUPXEJA\m\target\it\script-accessibility\build.log, f:\jenkins\jenkins-slave\workspace\invoker-plugin_MINVOKER-244-NG7YUAFH574UIIL65MNYO3XPSEPSH37LV5D5Q6RWZE34ZWUPXEJA\m\target\it\script-accessibility\src\it\beanshell\build.log, f:\jenkins\jenkins-slave\workspace\invoker-plugin_MINVOKER-244-NG7YUAFH574UIIL65MNYO3XPSEPSH37LV5D5Q6RWZE34ZWUPXEJA\m\target\it\script-accessibility\src\it\groovy\build.log, f:\jenkins\jenkins-slave\workspace\invoker-plugin_MINVOKER-244-NG7YUAFH574UIIL65MNYO3XPSEPSH37LV5D5Q6RWZE34ZWUPXEJA\m\target\it\script-additional-vars\build.log, f:\jenkins\jenkins-slave\workspace\invoker-plugin_MINVOKER-244-NG7YUAFH574UIIL65MNYO3XPSEPSH37LV5D5Q6RWZE34ZWUPXEJA\m\target\it\script-additional-vars\src\it\beanshell\build.log, f:\jenkins\jenkins-slave\workspace\invoker-plugin_MINVOKER-244-NG7YUAFH574UIIL65MNYO3XPSEPSH37LV5D5Q6RWZE34ZWUPXEJA\m\target\it\script-additional-vars\src\it\groovy\build.log, f:\jenkins\jenkins-slave\workspace\invoker-plugin_MINVOKER-244-NG7YUAFH574UIIL65MNYO3XPSEPSH37LV5D5Q6RWZE34ZWUPXEJA\m\target\it\script-class-loading\build.log, f:\jenkins\jenkins-slave\workspace\invoker-plugin_MINVOKER-244-NG7YUAFH574UIIL65MNYO3XPSEPSH37LV5D5Q6RWZE34ZWUPXEJA\m\target\it\script-class-loading\src\it\beanshell\build.log, f:\jenkins\jenkins-slave\workspace\invoker-plugin_MINVOKER-244-NG7YUAFH574UIIL65MNYO3XPSEPSH37LV5D5Q6RWZE34ZWUPXEJA\m\target\it\script-class-loading\src\it\groovy\build.log, f:\jenkins\jenkins-slave\workspace\invoker-plugin_MINVOKER-244-NG7YUAFH574UIIL65MNYO3XPSEPSH37LV5D5Q6RWZE34ZWUPXEJA\m\target\it\script-classpath-duplicates\build.log, f:\jenkins\jenkins-slave\workspace\invoker-plugin_MINVOKER-244-NG7YUAFH574UIIL65MNYO3XPSEPSH37LV5D5Q6RWZE34ZWUPXEJA\m\target\it\script-classpath-duplicates\target\it\beanshell\build.log, f:\jenkins\jenkins-slave\workspace\invoker-plugin_MINVOKER-244-NG7YUAFH574UIIL65MNYO3XPSEPSH37LV5D5Q6RWZE34ZWUPXEJA\m\target\it\script-classpath-duplicates\target\it\groovy\build.log, f:\jenkins\jenkins-slave\workspace\invoker-plugin_MINVOKER-244-NG7YUAFH574UIIL65MNYO3XPSEPSH37LV5D5Q6RWZE34ZWUPXEJA\m\target\it\script-context\build.log, f:\jenkins\jenkins-slave\workspace\invoker-plugin_MINVOKER-244-NG7YUAFH574UIIL65MNYO3XPSEPSH37LV5D5Q6RWZE34ZWUPXEJA\m\target\it\script-context\target\its\beanshell\build.log, f:\jenkins\jenkins-slave\workspace\invoker-plugin_MINVOKER-244-NG7YUAFH574UIIL65MNYO3XPSEPSH37LV5D5Q6RWZE34ZWUPXEJA\m\target\it\script-context\target\its\groovy\build.log, f:\jenkins\jenkins-slave\workspace\invoker-plugin_MINVOKER-244-NG7YUAFH574UIIL65MNYO3XPSEPSH37LV5D5Q6RWZE34ZWUPXEJA\m\target\it\script-errors\build.log, f:\jenkins\jenkins-slave\workspace\invoker-plugin_MINVOKER-244-NG7YUAFH574UIIL65MNYO3XPSEPSH37LV5D5Q6RWZE34ZWUPXEJA\m\target\it\script-errors\target\its\beanshell\build.log, f:\jenkins\jenkins-slave\workspace\invoker-plugin_MINVOKER-244-NG7YUAFH574UIIL65MNYO3XPSEPSH37LV5D5Q6RWZE34ZWUPXEJA\m\target\it\script-errors\target\its\groovy\build.log, f:\jenkins\jenkins-slave\workspace\invoker-plugin_MINVOKER-244-NG7YUAFH574UIIL65MNYO3XPSEPSH37LV5D5Q6RWZE34ZWUPXEJA\m\target\it\script-global-vars\build.log, f:\jenkins\jenkins-slave\workspace\invoker-plugin_MINVOKER-244-NG7YUAFH574UIIL65MNYO3XPSEPSH37LV5D5Q6RWZE34ZWUPXEJA\m\target\it\script-global-vars\src\it\beanshell\build.log, f:\jenkins\jenkins-slave\workspace\invoker-plugin_MINVOKER-244-NG7YUAFH574UIIL65MNYO3XPSEPSH37LV5D5Q6RWZE34ZWUPXEJA\m\target\it\script-global-vars\src\it\groovy\build.log, f:\jenkins\jenkins-slave\workspace\invoker-plugin_MINVOKER-244-NG7YUAFH574UIIL65MNYO3XPSEPSH37LV5D5Q6RWZE34ZWUPXEJA\m\target\it\script-interpreter-detection\build.log, f:\jenkins\jenkins-slave\workspace\invoker-plugin_MINVOKER-244-NG7YUAFH574UIIL65MNYO3XPSEPSH37LV5D5Q6RWZE34ZWUPXEJA\m\target\it\script-interpreter-detection\target\its\beanshell\build.log, f:\jenkins\jenkins-slave\workspace\invoker-plugin_MINVOKER-244-NG7YUAFH574UIIL65MNYO3XPSEPSH37LV5D5Q6RWZE34ZWUPXEJA\m\target\it\script-interpreter-detection\target\its\groovy\build.log, f:\jenkins\jenkins-slave\workspace\invoker-plugin_MINVOKER-244-NG7YUAFH574UIIL65MNYO3XPSEPSH37LV5D5Q6RWZE34ZWUPXEJA\m\target\it\script-verify-xml\build.log, f:\jenkins\jenkins-slave\workspace\invoker-plugin_MINVOKER-244-NG7YUAFH574UIIL65MNYO3XPSEPSH37LV5D5Q6RWZE34ZWUPXEJA\m\target\it\selector-conditions\build.log, f:\jenkins\jenkins-slave\workspace\invoker-plugin_MINVOKER-244-NG7YUAFH574UIIL65MNYO3XPSEPSH37LV5D5Q6RWZE34ZWUPXEJA\m\target\it\selector-conditions\target\its\jre-version-match\build.log, f:\jenkins\jenkins-slave\workspace\invoker-plugin_MINVOKER-244-NG7YUAFH574UIIL65MNYO3XPSEPSH37LV5D5Q6RWZE34ZWUPXEJA\m\target\it\selector-conditions\target\its\maven-version-match\build.log, f:\jenkins\jenkins-slave\workspace\invoker-plugin_MINVOKER-244-NG7YUAFH574UIIL65MNYO3XPSEPSH37LV5D5Q6RWZE34ZWUPXEJA\m\target\it\selector-conditions\target\its\os-family-match\build.log, f:\jenkins\jenkins-slave\workspace\invoker-plugin_MINVOKER-244-NG7YUAFH574UIIL65MNYO3XPSEPSH37LV5D5Q6RWZE34ZWUPXEJA\m\target\it\selector-scripts\build.log, f:\jenkins\jenkins-slave\workspace\invoker-plugin_MINVOKER-244-NG7YUAFH574UIIL65MNYO3XPSEPSH37LV5D5Q6RWZE34ZWUPXEJA\m\target\it\selector-scripts\target\its\script-ret-false\build.log, f:\jenkins\jenkins-slave\workspace\invoker-plugin_MINVOKER-244-NG7YUAFH574UIIL65MNYO3XPSEPSH37LV5D5Q6RWZE34ZWUPXEJA\m\target\it\selector-scripts\target\its\script-ret-other\build.log, f:\jenkins\jenkins-slave\workspace\invoker-plugin_MINVOKER-244-NG7YUAFH574UIIL65MNYO3XPSEPSH37LV5D5Q6RWZE34ZWUPXEJA\m\target\it\selector-scripts\target\its\script-ret-quiet\build.log, f:\jenkins\jenkins-slave\workspace\invoker-plugin_MINVOKER-244-NG7YUAFH574UIIL65MNYO3XPSEPSH37LV5D5Q6RWZE34ZWUPXEJA\m\target\it\selector-scripts\target\its\script-ret-true\build.log, f:\jenkins\jenkins-slave\workspace\invoker-plugin_MINVOKER-244-NG7YUAFH574UIIL65MNYO3XPSEPSH37LV5D5Q6RWZE34ZWUPXEJA\m\target\it\selector-scripts\target\its\script-throw\build.log, f:\jenkins\jenkins-slave\workspace\invoker-plugin_MINVOKER-244-NG7YUAFH574UIIL65MNYO3XPSEPSH37LV5D5Q6RWZE34ZWUPXEJA\m\target\it\settings-auto-exclude\build.log, f:\jenkins\jenkins-slave\workspace\invoker-plugin_MINVOKER-244-NG7YUAFH574UIIL65MNYO3XPSEPSH37LV5D5Q6RWZE34ZWUPXEJA\m\target\it\settings-auto-exclude\src\it\project\build.log, f:\jenkins\jenkins-slave\workspace\invoker-plugin_MINVOKER-244-NG7YUAFH574UIIL65MNYO3XPSEPSH37LV5D5Q6RWZE34ZWUPXEJA\m\target\it\settings-inherit\build.log, f:\jenkins\jenkins-slave\workspace\invoker-plugin_MINVOKER-244-NG7YUAFH574UIIL65MNYO3XPSEPSH37LV5D5Q6RWZE34ZWUPXEJA\m\target\it\settings-inherit\target\it\project\build.log, f:\jenkins\jenkins-slave\workspace\invoker-plugin_MINVOKER-244-NG7YUAFH574UIIL65MNYO3XPSEPSH37LV5D5Q6RWZE34ZWUPXEJA\m\target\it\settings-merge-multiexecutions\build.log, f:\jenkins\jenkins-slave\workspace\invoker-plugin_MINVOKER-244-NG7YUAFH574UIIL65MNYO3XPSEPSH37LV5D5Q6RWZE34ZWUPXEJA\m\target\it\settings-merge-multiexecutions\target\it\minvoker-133\build.log, f:\jenkins\jenkins-slave\workspace\invoker-plugin_MINVOKER-244-NG7YUAFH574UIIL65MNYO3XPSEPSH37LV5D5Q6RWZE34ZWUPXEJA\m\target\it\settings-merge_jdk9+\build.log, f:\jenkins\jenkins-slave\workspace\invoker-plugin_MINVOKER-244-NG7YUAFH574UIIL65MNYO3XPSEPSH37LV5D5Q6RWZE34ZWUPXEJA\m\target\it\settings-merge_jdk9+\target\it\project\build.log, f:\jenkins\jenkins-slave\workspace\invoker-plugin_MINVOKER-244-NG7YUAFH574UIIL65MNYO3XPSEPSH37LV5D5Q6RWZE34ZWUPXEJA\m\target\it\settings-override\build.log, f:\jenkins\jenkins-slave\workspace\invoker-plugin_MINVOKER-244-NG7YUAFH574UIIL65MNYO3XPSEPSH37LV5D5Q6RWZE34ZWUPXEJA\m\target\it\settings-override\src\it\project\build.log, f:\jenkins\jenkins-slave\workspace\invoker-plugin_MINVOKER-244-NG7YUAFH574UIIL65MNYO3XPSEPSH37LV5D5Q6RWZE34ZWUPXEJA\m\target\it\skip-install\build.log, f:\jenkins\jenkins-slave\workspace\invoker-plugin_MINVOKER-244-NG7YUAFH574UIIL65MNYO3XPSEPSH37LV5D5Q6RWZE34ZWUPXEJA\m\target\it\skip-run\build.log, f:\jenkins\jenkins-slave\workspace\invoker-plugin_MINVOKER-244-NG7YUAFH574UIIL65MNYO3XPSEPSH37LV5D5Q6RWZE34ZWUPXEJA\m\target\it\spaces-should-work_windows\build.log, f:\jenkins\jenkins-slave\workspace\invoker-plugin_MINVOKER-244-NG7YUAFH574UIIL65MNYO3XPSEPSH37LV5D5Q6RWZE34ZWUPXEJA\m\target\it\spaces-should-work_windows\src\it\test-Ééê- & -Ééê-test\build.log, f:\jenkins\jenkins-slave\workspace\invoker-plugin_MINVOKER-244-NG7YUAFH574UIIL65MNYO3XPSEPSH37LV5D5Q6RWZE34ZWUPXEJA\m\target\it\special-characters-should-work\build.log, f:\jenkins\jenkins-slave\workspace\invoker-plugin_MINVOKER-244-NG7YUAFH574UIIL65MNYO3XPSEPSH37LV5D5Q6RWZE34ZWUPXEJA\m\target\it\special-characters-should-work\src\it\test-Ééê-more-Ééê-test\build.log, f:\jenkins\jenkins-slave\workspace\invoker-plugin_MINVOKER-244-NG7YUAFH574UIIL65MNYO3XPSEPSH37LV5D5Q6RWZE34ZWUPXEJA\m\target\it\staging-dependencies\build.log, f:\jenkins\jenkins-slave\workspace\invoker-plugin_MINVOKER-244-NG7YUAFH574UIIL65MNYO3XPSEPSH37LV5D5Q6RWZE34ZWUPXEJA\m\target\it\staging-pom\build.log, f:\jenkins\jenkins-slave\workspace\invoker-plugin_MINVOKER-244-NG7YUAFH574UIIL65MNYO3XPSEPSH37LV5D5Q6RWZE34ZWUPXEJA\m\target\it\staging-reactor\build.log, f:\jenkins\jenkins-slave\workspace\invoker-plugin_MINVOKER-244-NG7YUAFH574UIIL65MNYO3XPSEPSH37LV5D5Q6RWZE34ZWUPXEJA\m\target\it\wrongPropertyInterpolation\build.log, f:\jenkins\jenkins-slave\workspace\invoker-plugin_MINVOKER-244-NG7YUAFH574UIIL65MNYO3XPSEPSH37LV5D5Q6RWZE34ZWUPXEJA\m\target\it\wrongPropertyInterpolation\target\it\project\build.log]
[windows-jdk10] Finished parsing Maven Invoker results (found 68)
[windows-jdk10] [withMaven] junitPublisher - Archive test results for Maven artifact org.apache.maven.plugins:maven-invoker-plugin:3.1.1-SNAPSHOT generated by maven-surefire-plugin:test (default-test): m\target\surefire-reports\*.xml
[windows-jdk10] Recording test results
[Pipeline] [windows-jdk10] // withMaven
[Pipeline] [windows-jdk10] cleanWs
[windows-jdk10] [WS-CLEANUP] Deleting project workspace...[WS-CLEANUP] done
[Pipeline] [windows-jdk10] cleanWs
[windows-jdk10] [WS-CLEANUP] Deleting project workspace...[WS-CLEANUP] done
[Pipeline] [windows-jdk10] }
[Pipeline] [windows-jdk10] // stage
[Pipeline] [windows-jdk10] }
[Pipeline] [windows-jdk10] // node
[Pipeline] [windows-jdk10] }
[windows-jdk10] Failed in branch windows-jdk10
[windows-jdk9] [INFO] run post-build script verify.bsh
[windows-jdk9] [INFO]           postbuild-executed-only-once\pom.xml ............. SUCCESS (32.0 s)
[windows-jdk9] [INFO] Building: project-cloning\pom.xml
[windows-jdk9] [INFO] run pre-build script setup.bsh
[windows-jdk9] [INFO] run post-build script verify.bsh
[windows-jdk9] [INFO]           project-cloning\pom.xml .......................... SUCCESS (19.9 s)
[windows-jdk9] [INFO] Building: project-cloning-reactor\pom.xml
[windows-jdk9] [INFO] run post-build script verify.bsh
[windows-jdk9] [INFO]           project-cloning-reactor\pom.xml .................. SUCCESS (11.2 s)
[windows-jdk9] [INFO] Building: project-setup\pom.xml
[windows-jdk9] [INFO] run post-build script verify.bsh
[windows-jdk9] [INFO]           project-setup\pom.xml ............................ SUCCESS (28.1 s)
[windows-jdk9] [INFO] Building: script-accessibility\pom.xml
[windows-jdk9] [INFO]           script-accessibility\pom.xml ..................... SUCCESS (18.8 s)
[windows-jdk9] [INFO] Building: script-additional-vars\pom.xml
[windows-jdk9] [INFO]           script-additional-vars\pom.xml ................... SUCCESS (16.7 s)
[windows-jdk9] [INFO] Building: script-class-loading\pom.xml
[windows-jdk9] [INFO]           script-class-loading\pom.xml ..................... SUCCESS (19.8 s)
[windows-jdk9] [INFO] Building: script-classpath-duplicates\pom.xml
[windows-jdk9] [INFO] run post-build script verify.bsh
[windows-jdk9] [INFO]           script-classpath-duplicates\pom.xml .............. SUCCESS (18.1 s)
[windows-jdk9] [INFO] Building: script-context\pom.xml
[windows-jdk9] [INFO] run post-build script verify.bsh
[windows-jdk9] [INFO]           script-context\pom.xml ........................... SUCCESS (16.8 s)
[windows-jdk9] [INFO] Building: script-errors\pom.xml
[windows-jdk9] [INFO] run post-build script verify.bsh
[windows-jdk9] [INFO]           script-errors\pom.xml ............................ SUCCESS (8.7 s)
[windows-jdk9] [INFO] Building: script-global-vars\pom.xml
[windows-jdk9] [INFO]           script-global-vars\pom.xml ....................... SUCCESS (17.3 s)
[windows-jdk9] [INFO] Building: script-interpreter-detection\pom.xml
[windows-jdk9] [INFO] run post-build script verify.bsh
[windows-jdk9] [INFO]           script-interpreter-detection\pom.xml ............. SUCCESS (17.3 s)
[windows-jdk9] [INFO] Building: script-verify-xml\pom.xml
[windows-jdk9] [INFO] run post-build script verify.groovy
[windows-jdk9] [INFO]           script-verify-xml\pom.xml ........................ SUCCESS (7.0 s)
[windows-jdk9] [INFO] Building: selector-conditions\pom.xml
[windows-jdk9] [INFO] run pre-build script setup.groovy
[windows-jdk9] [INFO] run post-build script verify.bsh
[windows-jdk9] [INFO]           selector-conditions\pom.xml ...................... SUCCESS (20.2 s)
[windows-jdk9] [INFO] Building: selector-scripts\pom.xml
[windows-jdk9] [INFO] run pre-build script setup.groovy
[windows-jdk9] [INFO] run post-build script verify.bsh
[windows-jdk9] [INFO]           selector-scripts\pom.xml ......................... SUCCESS (16.5 s)
[windows-jdk9] [INFO] Building: settings-auto-exclude\pom.xml
[windows-jdk9] [INFO]           settings-auto-exclude\pom.xml .................... SUCCESS (11.5 s)
[windows-jdk9] [INFO] Building: settings-inherit\pom.xml
[windows-jdk9] [INFO]           settings-inherit\pom.xml ......................... SUCCESS (12.8 s)
[windows-jdk9] [INFO] Building: settings-merge\pom.xml
[windows-jdk9] [INFO]           settings-merge\pom.xml ........................... SKIPPED due to JRE version
[windows-jdk9] [INFO] Building: settings-merge-multiexecutions\pom.xml
[windows-jdk9] [INFO]           settings-merge-multiexecutions\pom.xml ........... SUCCESS (18.7 s)
[windows-jdk9] [INFO] Building: settings-merge_jdk9+\pom.xml
[windows-jdk9] [INFO]           settings-merge_jdk9+\pom.xml ..................... SUCCESS (17.6 s)
[windows-jdk9] [INFO] Building: settings-override\pom.xml
[windows-jdk9] [INFO]           settings-override\pom.xml ........................ SUCCESS (12.6 s)
[windows-jdk9] [INFO] Building: skip-install\pom.xml
[windows-jdk9] [INFO] run post-build script verify.bsh
[windows-jdk9] [INFO]           skip-install\pom.xml ............................. SUCCESS (5.7 s)
[windows-jdk9] [INFO] Building: skip-run\pom.xml
[windows-jdk9] [INFO] run post-build script verify.bsh
[windows-jdk9] [INFO]           skip-run\pom.xml ................................. SUCCESS (6.5 s)
[windows-jdk9] [INFO] Building: spaces-should-work_non-windows\pom.xml
[windows-jdk9] [INFO]           spaces-should-work_non-windows\pom.xml ........... SKIPPED due to OS
[windows-jdk9] [INFO] Building: spaces-should-work_windows\pom.xml
[windows-jdk9] [INFO] run pre-build script setup.groovy
[windows-jdk9] [INFO]           spaces-should-work_windows\pom.xml ............... SUCCESS (16.2 s)
[windows-jdk9] [INFO] Building: special-characters-should-work\pom.xml
[windows-jdk9] [INFO] run pre-build script setup.groovy
[windows-jdk9] [INFO]           special-characters-should-work\pom.xml ........... SUCCESS (15.4 s)
[windows-jdk9] [INFO] Building: staging-dependencies\pom.xml
[windows-jdk9] [INFO] run post-build script verify.bsh
[windows-jdk9] [INFO]           staging-dependencies\pom.xml ..................... SUCCESS (12.6 s)
[windows-jdk9] [INFO] Building: staging-pom\pom.xml
[windows-jdk9] [INFO] run post-build script verify.bsh
[windows-jdk9] [INFO]           staging-pom\pom.xml .............................. SUCCESS (6.8 s)
[windows-jdk9] [INFO] Building: staging-reactor\pom.xml
[windows-jdk9] [INFO] run post-build script verify.bsh
[windows-jdk9] [INFO]           staging-reactor\pom.xml .......................... SUCCESS (10.8 s)
[windows-jdk9] [INFO] Building: wrongPropertyInterpolation\pom.xml
[windows-jdk9] [INFO]           wrongPropertyInterpolation\pom.xml ............... SUCCESS (34.7 s)
[windows-jdk9] [INFO]
[windows-jdk9] [INFO] --- maven-checkstyle-plugin:3.0.0:check (checkstyle-check) @ maven-invoker-plugin ---
[windows-jdk9] [INFO] Downloading from central: https://repo.maven.apache.org/maven2/org/apache/maven/shared/maven-shared-resources/2/maven-shared-resources-2.pom
[windows-jdk9] [INFO] Downloaded from central: https://repo.maven.apache.org/maven2/org/apache/maven/shared/maven-shared-resources/2/maven-shared-resources-2.pom (3.0 kB at 40 kB/s)
[windows-jdk9] [INFO] Downloading from central: https://repo.maven.apache.org/maven2/org/codehaus/plexus/plexus-utils/3.0.10/plexus-utils-3.0.10.pom
[windows-jdk9] [INFO] Downloaded from central: https://repo.maven.apache.org/maven2/org/codehaus/plexus/plexus-utils/3.0.10/plexus-utils-3.0.10.pom (3.1 kB at 83 kB/s)
[windows-jdk9] [INFO] Downloading from central: https://repo.maven.apache.org/maven2/org/codehaus/plexus/plexus/3.3/plexus-3.3.pom
[windows-jdk9] [INFO] Downloaded from central: https://repo.maven.apache.org/maven2/org/codehaus/plexus/plexus/3.3/plexus-3.3.pom (20 kB at 538 kB/s)
[windows-jdk9] [INFO] Downloading from central: https://repo.maven.apache.org/maven2/org/apache/maven/doxia/doxia-integration-tools/1.6/doxia-integration-tools-1.6.pom
[windows-jdk9] [INFO] Downloaded from central: https://repo.maven.apache.org/maven2/org/apache/maven/doxia/doxia-integration-tools/1.6/doxia-integration-tools-1.6.pom (7.0 kB at 258 kB/s)
[windows-jdk9] [INFO] Downloading from central: https://repo.maven.apache.org/maven2/org/apache/maven/doxia/doxia-tools/3/doxia-tools-3.pom
[windows-jdk9] [INFO] Downloaded from central: https://repo.maven.apache.org/maven2/org/apache/maven/doxia/doxia-tools/3/doxia-tools-3.pom (9.9 kB at 432 kB/s)
[windows-jdk9] [INFO] Downloading from central: https://repo.maven.apache.org/maven2/org/codehaus/plexus/plexus-resources/1.1.0/plexus-resources-1.1.0.pom
[windows-jdk9] [INFO] Downloaded from central: https://repo.maven.apache.org/maven2/org/codehaus/plexus/plexus-resources/1.1.0/plexus-resources-1.1.0.pom (3.2 kB at 144 kB/s)
[windows-jdk9] [INFO] Downloading from central: https://repo.maven.apache.org/maven2/com/puppycrawl/tools/checkstyle/6.18/checkstyle-6.18.pom
[windows-jdk9] [INFO] Downloaded from central: https://repo.maven.apache.org/maven2/com/puppycrawl/tools/checkstyle/6.18/checkstyle-6.18.pom (71 kB at 1.8 MB/s)
[windows-jdk9] [INFO] Downloading from central: https://repo.maven.apache.org/maven2/antlr/antlr/2.7.7/antlr-2.7.7.pom
[windows-jdk9] [INFO] Downloaded from central: https://repo.maven.apache.org/maven2/antlr/antlr/2.7.7/antlr-2.7.7.pom (632 B at 27 kB/s)
[windows-jdk9] [INFO] Downloading from central: https://repo.maven.apache.org/maven2/org/antlr/antlr4-runtime/4.5.3/antlr4-runtime-4.5.3.pom
[windows-jdk9] [INFO] Downloaded from central: https://repo.maven.apache.org/maven2/org/antlr/antlr4-runtime/4.5.3/antlr4-runtime-4.5.3.pom (2.3 kB at 86 kB/s)
[windows-jdk9] [INFO] Downloading from central: https://repo.maven.apache.org/maven2/org/antlr/antlr4-master/4.5.3/antlr4-master-4.5.3.pom
[windows-jdk9] [INFO] Downloaded from central: https://repo.maven.apache.org/maven2/org/antlr/antlr4-master/4.5.3/antlr4-master-4.5.3.pom (3.7 kB at 48 kB/s)
[windows-jdk9] [INFO] Downloading from central: https://repo.maven.apache.org/maven2/commons-beanutils/commons-beanutils/1.9.2/commons-beanutils-1.9.2.pom
[windows-jdk9] [INFO] Downloaded from central: https://repo.maven.apache.org/maven2/commons-beanutils/commons-beanutils/1.9.2/commons-beanutils-1.9.2.pom (14 kB at 461 kB/s)
[windows-jdk9] [INFO] Downloading from central: https://repo.maven.apache.org/maven2/org/apache/commons/commons-parent/33/commons-parent-33.pom
[windows-jdk9] [INFO] Downloaded from central: https://repo.maven.apache.org/maven2/org/apache/commons/commons-parent/33/commons-parent-33.pom (53 kB at 1.1 MB/s)
[windows-jdk9] [INFO] Downloading from central: https://repo.maven.apache.org/maven2/commons-cli/commons-cli/1.3.1/commons-cli-1.3.1.pom
[windows-jdk9] [INFO] Downloaded from central: https://repo.maven.apache.org/maven2/commons-cli/commons-cli/1.3.1/commons-cli-1.3.1.pom (10 kB at 385 kB/s)
[windows-jdk9] [INFO] Downloading from central: https://repo.maven.apache.org/maven2/com/google/guava/guava/19.0/guava-19.0.pom
[windows-jdk9] [INFO] Downloaded from central: https://repo.maven.apache.org/maven2/com/google/guava/guava/19.0/guava-19.0.pom (6.8 kB at 219 kB/s)
[windows-jdk9] [INFO] Downloading from central: https://repo.maven.apache.org/maven2/com/google/guava/guava-parent/19.0/guava-parent-19.0.pom
[windows-jdk9] [INFO] Downloaded from central: https://repo.maven.apache.org/maven2/com/google/guava/guava-parent/19.0/guava-parent-19.0.pom (9.9 kB at 412 kB/s)
[windows-jdk9] [INFO] Downloading from central: https://repo.maven.apache.org/maven2/org/sonatype/oss/oss-parent/7/oss-parent-7.pom
[windows-jdk9] [INFO] Downloaded from central: https://repo.maven.apache.org/maven2/org/sonatype/oss/oss-parent/7/oss-parent-7.pom (4.8 kB at 210 kB/s)
[windows-jdk9] [INFO] Downloading from central: https://repo.maven.apache.org/maven2/javax/xml/bind/jaxb-api/2.3.0/jaxb-api-2.3.0.pom
[windows-jdk9] [INFO] Downloaded from central: https://repo.maven.apache.org/maven2/javax/xml/bind/jaxb-api/2.3.0/jaxb-api-2.3.0.pom (23 kB at 766 kB/s)
[windows-jdk9] [INFO] Downloading from central: https://repo.maven.apache.org/maven2/javax/xml/bind/jaxb-api-parent/2.3.0/jaxb-api-parent-2.3.0.pom
[windows-jdk9] [INFO] Downloaded from central: https://repo.maven.apache.org/maven2/javax/xml/bind/jaxb-api-parent/2.3.0/jaxb-api-parent-2.3.0.pom (5.6 kB at 209 kB/s)
[windows-jdk9] [INFO] Downloading from central: https://repo.maven.apache.org/maven2/net/java/jvnet-parent/5/jvnet-parent-5.pom
[windows-jdk9] [INFO] Downloaded from central: https://repo.maven.apache.org/maven2/net/java/jvnet-parent/5/jvnet-parent-5.pom (8.9 kB at 295 kB/s)
[windows-jdk9] [INFO] Downloading from central: https://repo.maven.apache.org/maven2/org/apache/maven/shared/maven-shared-resources/2/maven-shared-resources-2.jar
[windows-jdk9] [INFO] Downloading from central: https://repo.maven.apache.org/maven2/org/apache/maven/doxia/doxia-integration-tools/1.6/doxia-integration-tools-1.6.jar
[windows-jdk9] [INFO] Downloading from central: https://repo.maven.apache.org/maven2/org/apache/maven/doxia/doxia-core/1.2/doxia-core-1.2.jar
[windows-jdk9] [INFO] Downloading from central: https://repo.maven.apache.org/maven2/commons-digester/commons-digester/1.6/commons-digester-1.6.jar
[windows-jdk9] [INFO] Downloading from central: https://repo.maven.apache.org/maven2/commons-logging/commons-logging/1.0.4/commons-logging-1.0.4.jar
[windows-jdk9] [INFO] Downloaded from central: https://repo.maven.apache.org/maven2/org/apache/maven/doxia/doxia-core/1.2/doxia-core-1.2.jar (154 kB at 2.0 MB/s)
[windows-jdk9] [INFO] Downloading from central: https://repo.maven.apache.org/maven2/commons-io/commons-io/1.4/commons-io-1.4.jar
[windows-jdk9] [INFO] Downloaded from central: https://repo.maven.apache.org/maven2/commons-logging/commons-logging/1.0.4/commons-logging-1.0.4.jar (38 kB at 413 kB/s)
[windows-jdk9] [INFO] Downloading from central: https://repo.maven.apache.org/maven2/org/codehaus/plexus/plexus-resources/1.1.0/plexus-resources-1.1.0.jar
[windows-jdk9] [INFO] Downloaded from central: https://repo.maven.apache.org/maven2/org/apache/maven/shared/maven-shared-resources/2/maven-shared-resources-2.jar (13 kB at 119 kB/s)
[windows-jdk9] [INFO] Downloading from central: https://repo.maven.apache.org/maven2/com/puppycrawl/tools/checkstyle/6.18/checkstyle-6.18.jar
[windows-jdk9] [INFO] Downloaded from central: https://repo.maven.apache.org/maven2/commons-digester/commons-digester/1.6/commons-digester-1.6.jar (168 kB at 1.0 MB/s)
[windows-jdk9] [INFO] Downloading from central: https://repo.maven.apache.org/maven2/antlr/antlr/2.7.7/antlr-2.7.7.jar
[windows-jdk9] [INFO] Downloaded from central: https://repo.maven.apache.org/maven2/commons-io/commons-io/1.4/commons-io-1.4.jar (109 kB at 645 kB/s)
[windows-jdk9] [INFO] Downloading from central: https://repo.maven.apache.org/maven2/org/antlr/antlr4-runtime/4.5.3/antlr4-runtime-4.5.3.jar
[windows-jdk9] [INFO] Downloaded from central: https://repo.maven.apache.org/maven2/antlr/antlr/2.7.7/antlr-2.7.7.jar (445 kB at 2.0 MB/s)
[windows-jdk9] [INFO] Downloading from central: https://repo.maven.apache.org/maven2/commons-beanutils/commons-beanutils/1.9.2/commons-beanutils-1.9.2.jar
[windows-jdk9] [INFO] Downloaded from central: https://repo.maven.apache.org/maven2/com/puppycrawl/tools/checkstyle/6.18/checkstyle-6.18.jar (1.2 MB at 5.0 MB/s)
[windows-jdk9] [INFO] Downloading from central: https://repo.maven.apache.org/maven2/commons-cli/commons-cli/1.3.1/commons-cli-1.3.1.jar
[windows-jdk9] [INFO] Downloaded from central: https://repo.maven.apache.org/maven2/org/antlr/antlr4-runtime/4.5.3/antlr4-runtime-4.5.3.jar (302 kB at 1.2 MB/s)
[windows-jdk9] [INFO] Downloading from central: https://repo.maven.apache.org/maven2/com/google/guava/guava/19.0/guava-19.0.jar
[windows-jdk9] [INFO] Downloaded from central: https://repo.maven.apache.org/maven2/commons-cli/commons-cli/1.3.1/commons-cli-1.3.1.jar (53 kB at 201 kB/s)
[windows-jdk9] [INFO] Downloading from central: https://repo.maven.apache.org/maven2/commons-lang/commons-lang/2.1/commons-lang-2.1.jar
[windows-jdk9] [INFO] Downloaded from central: https://repo.maven.apache.org/maven2/commons-beanutils/commons-beanutils/1.9.2/commons-beanutils-1.9.2.jar (234 kB at 882 kB/s)
[windows-jdk9] [INFO] Downloading from central: https://repo.maven.apache.org/maven2/javax/xml/bind/jaxb-api/2.3.0/jaxb-api-2.3.0.jar
[windows-jdk9] [INFO] Downloaded from central: https://repo.maven.apache.org/maven2/commons-lang/commons-lang/2.1/commons-lang-2.1.jar (208 kB at 618 kB/s)
[windows-jdk9] [INFO] Downloaded from central: https://repo.maven.apache.org/maven2/org/codehaus/plexus/plexus-resources/1.1.0/plexus-resources-1.1.0.jar (23 kB at 67 kB/s)
[windows-jdk9] [INFO] Downloaded from central: https://repo.maven.apache.org/maven2/javax/xml/bind/jaxb-api/2.3.0/jaxb-api-2.3.0.jar (126 kB at 349 kB/s)
[windows-jdk9] [INFO] Downloaded from central: https://repo.maven.apache.org/maven2/com/google/guava/guava/19.0/guava-19.0.jar (2.3 MB at 6.2 MB/s)
[windows-jdk9] [INFO] Downloaded from central: https://repo.maven.apache.org/maven2/org/apache/maven/doxia/doxia-integration-tools/1.6/doxia-integration-tools-1.6.jar (45 kB at 108 kB/s)
[windows-jdk9] [INFO] There are 2 errors reported by Checkstyle 6.18 with config/maven_checks.xml ruleset.
[windows-jdk9] [INFO] Ignored 2 errors, 0 violation remaining.
[windows-jdk9] [INFO]
[windows-jdk9] [INFO] --- maven-invoker-plugin:3.0.1:verify (integration-test) @ maven-invoker-plugin ---
[windows-jdk9] [INFO] -------------------------------------------------
[windows-jdk9] [INFO] Build Summary:
[windows-jdk9] [INFO]   Passed: 65, Failed: 1, Errors: 0, Skipped: 2
[windows-jdk9] [INFO] -------------------------------------------------
[windows-jdk9] [ERROR] The following builds failed:
[windows-jdk9] [ERROR] *  install-extra-artifacts\pom.xml
[windows-jdk9] [INFO] -------------------------------------------------
[windows-jdk9] [INFO] ------------------------------------------------------------------------
[windows-jdk9] [INFO] BUILD FAILURE
[windows-jdk9] [INFO] ------------------------------------------------------------------------
[windows-jdk9] [INFO] Total time: 32:43 min
[windows-jdk9] [INFO] Finished at: 2018-11-03T03:55:06-07:00
[windows-jdk9] [INFO] Final Memory: 50M/168M
[windows-jdk9] [INFO] ------------------------------------------------------------------------
[windows-jdk9] [INFO] [jenkins-event-spy] Generated F:\jenkins\jenkins-slave\workspace\invoker-plugin_MINVOKER-244-NG7YUAFH574UIIL65MNYO3XPSEPSH37LV5D5Q6RWZE34ZWUPXEJA@tmp\withMaven1e772cec\maven-spy-20181103-032222-5161272701700017650413.log
[windows-jdk9] [ERROR] Failed to execute goal org.apache.maven.plugins:maven-invoker-plugin:3.0.1:verify (integration-test) on project maven-invoker-plugin: 1 build failed. See console output above for details. -> [Help 1]
[windows-jdk9] [ERROR]
[windows-jdk9] [ERROR] To see the full stack trace of the errors, re-run Maven with the -e switch.
[windows-jdk9] [ERROR] Re-run Maven using the -X switch to enable full debug logging.
[windows-jdk9] [ERROR]
[windows-jdk9] [ERROR] For more information about the errors and possible solutions, please read the following articles:
[windows-jdk9] [ERROR] [Help 1] http://cwiki.apache.org/confluence/display/MAVEN/MojoFailureException
[Pipeline] [windows-jdk9] }
[Pipeline] [windows-jdk9] // dir
[Pipeline] [windows-jdk9] }
[windows-jdk9] [withMaven] invokerPublisher - Archive invoker results for Maven artifact MavenArtifact{org.apache.maven.plugins:maven-invoker-plugin::3.1.1-SNAPSHOT(version: 3.1.1-SNAPSHOT, snapshot:false) } generated by PluginInvocation{org.apache.maven.plugins:maven-invoker-plugin:3.0.1@integration-test  integration-test}: m\target\invoker-reports\*.xml
[windows-jdk9] performing MavenInvokerRecorder, reportsFilenamePattern:'**/m\target\invoker-reports/BUILD*.xml', invokerBuildDir:'**/m\target\it'
[windows-jdk9] Found reports:[f:\jenkins\jenkins-slave\workspace\invoker-plugin_MINVOKER-244-NG7YUAFH574UIIL65MNYO3XPSEPSH37LV5D5Q6RWZE34ZWUPXEJA\m\target\invoker-reports\BUILD-MINVOKER-191.xml, f:\jenkins\jenkins-slave\workspace\invoker-plugin_MINVOKER-244-NG7YUAFH574UIIL65MNYO3XPSEPSH37LV5D5Q6RWZE34ZWUPXEJA\m\target\invoker-reports\BUILD-clone-clean.xml, f:\jenkins\jenkins-slave\workspace\invoker-plugin_MINVOKER-244-NG7YUAFH574UIIL65MNYO3XPSEPSH37LV5D5Q6RWZE34ZWUPXEJA\m\target\invoker-reports\BUILD-clone-maven-plugin-packaging.xml, f:\jenkins\jenkins-slave\workspace\invoker-plugin_MINVOKER-244-NG7YUAFH574UIIL65MNYO3XPSEPSH37LV5D5Q6RWZE34ZWUPXEJA\m\target\invoker-reports\BUILD-exec-timeout-invoker-level.xml, f:\jenkins\jenkins-slave\workspace\invoker-plugin_MINVOKER-244-NG7YUAFH574UIIL65MNYO3XPSEPSH37LV5D5Q6RWZE34ZWUPXEJA\m\target\invoker-reports\BUILD-exec-timeout-mojo-level.xml, f:\jenkins\jenkins-slave\workspace\invoker-plugin_MINVOKER-244-NG7YUAFH574UIIL65MNYO3XPSEPSH37LV5D5Q6RWZE34ZWUPXEJA\m\target\invoker-reports\BUILD-fail-build-with-verify.xml, f:\jenkins\jenkins-slave\workspace\invoker-plugin_MINVOKER-244-NG7YUAFH574UIIL65MNYO3XPSEPSH37LV5D5Q6RWZE34ZWUPXEJA\m\target\invoker-reports\BUILD-fail-build.xml, f:\jenkins\jenkins-slave\workspace\invoker-plugin_MINVOKER-244-NG7YUAFH574UIIL65MNYO3XPSEPSH37LV5D5Q6RWZE34ZWUPXEJA\m\target\invoker-reports\BUILD-fail-ignore-with-verify.xml, f:\jenkins\jenkins-slave\workspace\invoker-plugin_MINVOKER-244-NG7YUAFH574UIIL65MNYO3XPSEPSH37LV5D5Q6RWZE34ZWUPXEJA\m\target\invoker-reports\BUILD-fail-ignore.xml, f:\jenkins\jenkins-slave\workspace\invoker-plugin_MINVOKER-244-NG7YUAFH574UIIL65MNYO3XPSEPSH37LV5D5Q6RWZE34ZWUPXEJA\m\target\invoker-reports\BUILD-fail-noprojects_integration-test.xml, f:\jenkins\jenkins-slave\workspace\invoker-plugin_MINVOKER-244-NG7YUAFH574UIIL65MNYO3XPSEPSH37LV5D5Q6RWZE34ZWUPXEJA\m\target\invoker-reports\BUILD-fail-noprojects_run.xml, f:\jenkins\jenkins-slave\workspace\invoker-plugin_MINVOKER-244-NG7YUAFH574UIIL65MNYO3XPSEPSH37LV5D5Q6RWZE34ZWUPXEJA\m\target\invoker-reports\BUILD-fail-noprojects_verify.xml, f:\jenkins\jenkins-slave\workspace\invoker-plugin_MINVOKER-244-NG7YUAFH574UIIL65MNYO3XPSEPSH37LV5D5Q6RWZE34ZWUPXEJA\m\target\invoker-reports\BUILD-fail-postbuild.xml, f:\jenkins\jenkins-slave\workspace\invoker-plugin_MINVOKER-244-NG7YUAFH574UIIL65MNYO3XPSEPSH37LV5D5Q6RWZE34ZWUPXEJA\m\target\invoker-reports\BUILD-fail-prebuild.xml, f:\jenkins\jenkins-slave\workspace\invoker-plugin_MINVOKER-244-NG7YUAFH574UIIL65MNYO3XPSEPSH37LV5D5Q6RWZE34ZWUPXEJA\m\target\invoker-reports\BUILD-fail-run-postbuild.xml, f:\jenkins\jenkins-slave\workspace\invoker-plugin_MINVOKER-244-NG7YUAFH574UIIL65MNYO3XPSEPSH37LV5D5Q6RWZE34ZWUPXEJA\m\target\invoker-reports\BUILD-filtering-extensions.xml, f:\jenkins\jenkins-slave\workspace\invoker-plugin_MINVOKER-244-NG7YUAFH574UIIL65MNYO3XPSEPSH37LV5D5Q6RWZE34ZWUPXEJA\m\target\invoker-reports\BUILD-install-extra-artifacts.xml, f:\jenkins\jenkins-slave\workspace\invoker-plugin_MINVOKER-244-NG7YUAFH574UIIL65MNYO3XPSEPSH37LV5D5Q6RWZE34ZWUPXEJA\m\target\invoker-reports\BUILD-integration-test-never-fails.xml, f:\jenkins\jenkins-slave\workspace\invoker-plugin_MINVOKER-244-NG7YUAFH574UIIL65MNYO3XPSEPSH37LV5D5Q6RWZE34ZWUPXEJA\m\target\invoker-reports\BUILD-invocation-cmdline-exclude.xml, f:\jenkins\jenkins-slave\workspace\invoker-plugin_MINVOKER-244-NG7YUAFH574UIIL65MNYO3XPSEPSH37LV5D5Q6RWZE34ZWUPXEJA\m\target\invoker-reports\BUILD-invocation-debug.xml, f:\jenkins\jenkins-slave\workspace\invoker-plugin_MINVOKER-244-NG7YUAFH574UIIL65MNYO3XPSEPSH37LV5D5Q6RWZE34ZWUPXEJA\m\target\invoker-reports\BUILD-invocation-emptyproperty.xml, f:\jenkins\jenkins-slave\workspace\invoker-plugin_MINVOKER-244-NG7YUAFH574UIIL65MNYO3XPSEPSH37LV5D5Q6RWZE34ZWUPXEJA\m\target\invoker-reports\BUILD-invocation-environmentvariable.xml, f:\jenkins\jenkins-slave\workspace\invoker-plugin_MINVOKER-244-NG7YUAFH574UIIL65MNYO3XPSEPSH37LV5D5Q6RWZE34ZWUPXEJA\m\target\invoker-reports\BUILD-invocation-multiple.xml, f:\jenkins\jenkins-slave\workspace\invoker-plugin_MINVOKER-244-NG7YUAFH574UIIL65MNYO3XPSEPSH37LV5D5Q6RWZE34ZWUPXEJA\m\target\invoker-reports\BUILD-invocation-offline.xml, f:\jenkins\jenkins-slave\workspace\invoker-plugin_MINVOKER-244-NG7YUAFH574UIIL65MNYO3XPSEPSH37LV5D5Q6RWZE34ZWUPXEJA\m\target\invoker-reports\BUILD-invocation-project.xml, f:\jenkins\jenkins-slave\workspace\invoker-plugin_MINVOKER-244-NG7YUAFH574UIIL65MNYO3XPSEPSH37LV5D5Q6RWZE34ZWUPXEJA\m\target\invoker-reports\BUILD-invocation-reactor-indirect.xml, f:\jenkins\jenkins-slave\workspace\invoker-plugin_MINVOKER-244-NG7YUAFH574UIIL65MNYO3XPSEPSH37LV5D5Q6RWZE34ZWUPXEJA\m\target\invoker-reports\BUILD-invocation-spaces.xml, f:\jenkins\jenkins-slave\workspace\invoker-plugin_MINVOKER-244-NG7YUAFH574UIIL65MNYO3XPSEPSH37LV5D5Q6RWZE34ZWUPXEJA\m\target\invoker-reports\BUILD-invoker-report.xml, f:\jenkins\jenkins-slave\workspace\invoker-plugin_MINVOKER-244-NG7YUAFH574UIIL65MNYO3XPSEPSH37LV5D5Q6RWZE34ZWUPXEJA\m\target\invoker-reports\BUILD-local-repo-default.xml, f:\jenkins\jenkins-slave\workspace\invoker-plugin_MINVOKER-244-NG7YUAFH574UIIL65MNYO3XPSEPSH37LV5D5Q6RWZE34ZWUPXEJA\m\target\invoker-reports\BUILD-local-repo-isolated.xml, f:\jenkins\jenkins-slave\workspace\invoker-plugin_MINVOKER-244-NG7YUAFH574UIIL65MNYO3XPSEPSH37LV5D5Q6RWZE34ZWUPXEJA\m\target\invoker-reports\BUILD-local-repo-path.xml, f:\jenkins\jenkins-slave\workspace\invoker-plugin_MINVOKER-244-NG7YUAFH574UIIL65MNYO3XPSEPSH37LV5D5Q6RWZE34ZWUPXEJA\m\target\invoker-reports\BUILD-local-repo-url.xml, f:\jenkins\jenkins-slave\workspace\invoker-plugin_MINVOKER-244-NG7YUAFH574UIIL65MNYO3XPSEPSH37LV5D5Q6RWZE34ZWUPXEJA\m\target\invoker-reports\BUILD-multiEnvVar.xml, f:\jenkins\jenkins-slave\workspace\invoker-plugin_MINVOKER-244-NG7YUAFH574UIIL65MNYO3XPSEPSH37LV5D5Q6RWZE34ZWUPXEJA\m\target\invoker-reports\BUILD-not-clone-not-plugin.xml, f:\jenkins\jenkins-slave\workspace\invoker-plugin_MINVOKER-244-NG7YUAFH574UIIL65MNYO3XPSEPSH37LV5D5Q6RWZE34ZWUPXEJA\m\target\invoker-reports\BUILD-pom-filtering-encoding.xml, f:\jenkins\jenkins-slave\workspace\invoker-plugin_MINVOKER-244-NG7YUAFH574UIIL65MNYO3XPSEPSH37LV5D5Q6RWZE34ZWUPXEJA\m\target\invoker-reports\BUILD-pom-filtering-reactor.xml, f:\jenkins\jenkins-slave\workspace\invoker-plugin_MINVOKER-244-NG7YUAFH574UIIL65MNYO3XPSEPSH37LV5D5Q6RWZE34ZWUPXEJA\m\target\invoker-reports\BUILD-pom-filtering.xml, f:\jenkins\jenkins-slave\workspace\invoker-plugin_MINVOKER-244-NG7YUAFH574UIIL65MNYO3XPSEPSH37LV5D5Q6RWZE34ZWUPXEJA\m\target\invoker-reports\BUILD-pom-less-invocation.xml, f:\jenkins\jenkins-slave\workspace\invoker-plugin_MINVOKER-244-NG7YUAFH574UIIL65MNYO3XPSEPSH37LV5D5Q6RWZE34ZWUPXEJA\m\target\invoker-reports\BUILD-postbuild-executed-only-once.xml, f:\jenkins\jenkins-slave\workspace\invoker-plugin_MINVOKER-244-NG7YUAFH574UIIL65MNYO3XPSEPSH37LV5D5Q6RWZE34ZWUPXEJA\m\target\invoker-reports\BUILD-project-cloning-reactor.xml, f:\jenkins\jenkins-slave\workspace\invoker-plugin_MINVOKER-244-NG7YUAFH574UIIL65MNYO3XPSEPSH37LV5D5Q6RWZE34ZWUPXEJA\m\target\invoker-reports\BUILD-project-cloning.xml, f:\jenkins\jenkins-slave\workspace\invoker-plugin_MINVOKER-244-NG7YUAFH574UIIL65MNYO3XPSEPSH37LV5D5Q6RWZE34ZWUPXEJA\m\target\invoker-reports\BUILD-project-setup.xml, f:\jenkins\jenkins-slave\workspace\invoker-plugin_MINVOKER-244-NG7YUAFH574UIIL65MNYO3XPSEPSH37LV5D5Q6RWZE34ZWUPXEJA\m\target\invoker-reports\BUILD-script-accessibility.xml, f:\jenkins\jenkins-slave\workspace\invoker-plugin_MINVOKER-244-NG7YUAFH574UIIL65MNYO3XPSEPSH37LV5D5Q6RWZE34ZWUPXEJA\m\target\invoker-reports\BUILD-script-additional-vars.xml, f:\jenkins\jenkins-slave\workspace\invoker-plugin_MINVOKER-244-NG7YUAFH574UIIL65MNYO3XPSEPSH37LV5D5Q6RWZE34ZWUPXEJA\m\target\invoker-reports\BUILD-script-class-loading.xml, f:\jenkins\jenkins-slave\workspace\invoker-plugin_MINVOKER-244-NG7YUAFH574UIIL65MNYO3XPSEPSH37LV5D5Q6RWZE34ZWUPXEJA\m\target\invoker-reports\BUILD-script-classpath-duplicates.xml, f:\jenkins\jenkins-slave\workspace\invoker-plugin_MINVOKER-244-NG7YUAFH574UIIL65MNYO3XPSEPSH37LV5D5Q6RWZE34ZWUPXEJA\m\target\invoker-reports\BUILD-script-context.xml, f:\jenkins\jenkins-slave\workspace\invoker-plugin_MINVOKER-244-NG7YUAFH574UIIL65MNYO3XPSEPSH37LV5D5Q6RWZE34ZWUPXEJA\m\target\invoker-reports\BUILD-script-errors.xml, f:\jenkins\jenkins-slave\workspace\invoker-plugin_MINVOKER-244-NG7YUAFH574UIIL65MNYO3XPSEPSH37LV5D5Q6RWZE34ZWUPXEJA\m\target\invoker-reports\BUILD-script-global-vars.xml, f:\jenkins\jenkins-slave\workspace\invoker-plugin_MINVOKER-244-NG7YUAFH574UIIL65MNYO3XPSEPSH37LV5D5Q6RWZE34ZWUPXEJA\m\target\invoker-reports\BUILD-script-interpreter-detection.xml, f:\jenkins\jenkins-slave\workspace\invoker-plugin_MINVOKER-244-NG7YUAFH574UIIL65MNYO3XPSEPSH37LV5D5Q6RWZE34ZWUPXEJA\m\target\invoker-reports\BUILD-script-verify-xml.xml, f:\jenkins\jenkins-slave\workspace\invoker-plugin_MINVOKER-244-NG7YUAFH574UIIL65MNYO3XPSEPSH37LV5D5Q6RWZE34ZWUPXEJA\m\target\invoker-reports\BUILD-selector-conditions.xml, f:\jenkins\jenkins-slave\workspace\invoker-plugin_MINVOKER-244-NG7YUAFH574UIIL65MNYO3XPSEPSH37LV5D5Q6RWZE34ZWUPXEJA\m\target\invoker-reports\BUILD-selector-scripts.xml, f:\jenkins\jenkins-slave\workspace\invoker-plugin_MINVOKER-244-NG7YUAFH574UIIL65MNYO3XPSEPSH37LV5D5Q6RWZE34ZWUPXEJA\m\target\invoker-reports\BUILD-settings-auto-exclude.xml, f:\jenkins\jenkins-slave\workspace\invoker-plugin_MINVOKER-244-NG7YUAFH574UIIL65MNYO3XPSEPSH37LV5D5Q6RWZE34ZWUPXEJA\m\target\invoker-reports\BUILD-settings-inherit.xml, f:\jenkins\jenkins-slave\workspace\invoker-plugin_MINVOKER-244-NG7YUAFH574UIIL65MNYO3XPSEPSH37LV5D5Q6RWZE34ZWUPXEJA\m\target\invoker-reports\BUILD-settings-merge-multiexecutions.xml, f:\jenkins\jenkins-slave\workspace\invoker-plugin_MINVOKER-244-NG7YUAFH574UIIL65MNYO3XPSEPSH37LV5D5Q6RWZE34ZWUPXEJA\m\target\invoker-reports\BUILD-settings-merge.xml, f:\jenkins\jenkins-slave\workspace\invoker-plugin_MINVOKER-244-NG7YUAFH574UIIL65MNYO3XPSEPSH37LV5D5Q6RWZE34ZWUPXEJA\m\target\invoker-reports\BUILD-settings-merge_jdk9+.xml, f:\jenkins\jenkins-slave\workspace\invoker-plugin_MINVOKER-244-NG7YUAFH574UIIL65MNYO3XPSEPSH37LV5D5Q6RWZE34ZWUPXEJA\m\target\invoker-reports\BUILD-settings-override.xml, f:\jenkins\jenkins-slave\workspace\invoker-plugin_MINVOKER-244-NG7YUAFH574UIIL65MNYO3XPSEPSH37LV5D5Q6RWZE34ZWUPXEJA\m\target\invoker-reports\BUILD-skip-install.xml, f:\jenkins\jenkins-slave\workspace\invoker-plugin_MINVOKER-244-NG7YUAFH574UIIL65MNYO3XPSEPSH37LV5D5Q6RWZE34ZWUPXEJA\m\target\invoker-reports\BUILD-skip-run.xml, f:\jenkins\jenkins-slave\workspace\invoker-plugin_MINVOKER-244-NG7YUAFH574UIIL65MNYO3XPSEPSH37LV5D5Q6RWZE34ZWUPXEJA\m\target\invoker-reports\BUILD-spaces-should-work_non-windows.xml, f:\jenkins\jenkins-slave\workspace\invoker-plugin_MINVOKER-244-NG7YUAFH574UIIL65MNYO3XPSEPSH37LV5D5Q6RWZE34ZWUPXEJA\m\target\invoker-reports\BUILD-spaces-should-work_windows.xml, f:\jenkins\jenkins-slave\workspace\invoker-plugin_MINVOKER-244-NG7YUAFH574UIIL65MNYO3XPSEPSH37LV5D5Q6RWZE34ZWUPXEJA\m\target\invoker-reports\BUILD-special-characters-should-work.xml, f:\jenkins\jenkins-slave\workspace\invoker-plugin_MINVOKER-244-NG7YUAFH574UIIL65MNYO3XPSEPSH37LV5D5Q6RWZE34ZWUPXEJA\m\target\invoker-reports\BUILD-staging-dependencies.xml, f:\jenkins\jenkins-slave\workspace\invoker-plugin_MINVOKER-244-NG7YUAFH574UIIL65MNYO3XPSEPSH37LV5D5Q6RWZE34ZWUPXEJA\m\target\invoker-reports\BUILD-staging-pom.xml, f:\jenkins\jenkins-slave\workspace\invoker-plugin_MINVOKER-244-NG7YUAFH574UIIL65MNYO3XPSEPSH37LV5D5Q6RWZE34ZWUPXEJA\m\target\invoker-reports\BUILD-staging-reactor.xml, f:\jenkins\jenkins-slave\workspace\invoker-plugin_MINVOKER-244-NG7YUAFH574UIIL65MNYO3XPSEPSH37LV5D5Q6RWZE34ZWUPXEJA\m\target\invoker-reports\BUILD-wrongPropertyInterpolation.xml]
[windows-jdk9] Found logs:[f:\jenkins\jenkins-slave\workspace\invoker-plugin_MINVOKER-244-NG7YUAFH574UIIL65MNYO3XPSEPSH37LV5D5Q6RWZE34ZWUPXEJA\m\target\it\MINVOKER-191\build.log, f:\jenkins\jenkins-slave\workspace\invoker-plugin_MINVOKER-244-NG7YUAFH574UIIL65MNYO3XPSEPSH37LV5D5Q6RWZE34ZWUPXEJA\m\target\it\MINVOKER-191\plugin\target\it\basic\build.log, f:\jenkins\jenkins-slave\workspace\invoker-plugin_MINVOKER-244-NG7YUAFH574UIIL65MNYO3XPSEPSH37LV5D5Q6RWZE34ZWUPXEJA\m\target\it\clone-clean\build.log, f:\jenkins\jenkins-slave\workspace\invoker-plugin_MINVOKER-244-NG7YUAFH574UIIL65MNYO3XPSEPSH37LV5D5Q6RWZE34ZWUPXEJA\m\target\it\clone-clean\target\it\clone-clean\build.log, f:\jenkins\jenkins-slave\workspace\invoker-plugin_MINVOKER-244-NG7YUAFH574UIIL65MNYO3XPSEPSH37LV5D5Q6RWZE34ZWUPXEJA\m\target\it\clone-maven-plugin-packaging\build.log, f:\jenkins\jenkins-slave\workspace\invoker-plugin_MINVOKER-244-NG7YUAFH574UIIL65MNYO3XPSEPSH37LV5D5Q6RWZE34ZWUPXEJA\m\target\it\clone-maven-plugin-packaging\target\it\clone-clean\build.log, f:\jenkins\jenkins-slave\workspace\invoker-plugin_MINVOKER-244-NG7YUAFH574UIIL65MNYO3XPSEPSH37LV5D5Q6RWZE34ZWUPXEJA\m\target\it\exec-timeout-invoker-level\build.log, f:\jenkins\jenkins-slave\workspace\invoker-plugin_MINVOKER-244-NG7YUAFH574UIIL65MNYO3XPSEPSH37LV5D5Q6RWZE34ZWUPXEJA\m\target\it\exec-timeout-invoker-level\target\it\basic\build.log, f:\jenkins\jenkins-slave\workspace\invoker-plugin_MINVOKER-244-NG7YUAFH574UIIL65MNYO3XPSEPSH37LV5D5Q6RWZE34ZWUPXEJA\m\target\it\exec-timeout-mojo-level\build.log, f:\jenkins\jenkins-slave\workspace\invoker-plugin_MINVOKER-244-NG7YUAFH574UIIL65MNYO3XPSEPSH37LV5D5Q6RWZE34ZWUPXEJA\m\target\it\exec-timeout-mojo-level\target\it\basic\build.log, f:\jenkins\jenkins-slave\workspace\invoker-plugin_MINVOKER-244-NG7YUAFH574UIIL65MNYO3XPSEPSH37LV5D5Q6RWZE34ZWUPXEJA\m\target\it\fail-build-with-verify\build.log, f:\jenkins\jenkins-slave\workspace\invoker-plugin_MINVOKER-244-NG7YUAFH574UIIL65MNYO3XPSEPSH37LV5D5Q6RWZE34ZWUPXEJA\m\target\it\fail-build-with-verify\target\it\project\build.log, f:\jenkins\jenkins-slave\workspace\invoker-plugin_MINVOKER-244-NG7YUAFH574UIIL65MNYO3XPSEPSH37LV5D5Q6RWZE34ZWUPXEJA\m\target\it\fail-build\build.log, f:\jenkins\jenkins-slave\workspace\invoker-plugin_MINVOKER-244-NG7YUAFH574UIIL65MNYO3XPSEPSH37LV5D5Q6RWZE34ZWUPXEJA\m\target\it\fail-build\target\it\project\build.log, f:\jenkins\jenkins-slave\workspace\invoker-plugin_MINVOKER-244-NG7YUAFH574UIIL65MNYO3XPSEPSH37LV5D5Q6RWZE34ZWUPXEJA\m\target\it\fail-ignore-with-verify\build.log, f:\jenkins\jenkins-slave\workspace\invoker-plugin_MINVOKER-244-NG7YUAFH574UIIL65MNYO3XPSEPSH37LV5D5Q6RWZE34ZWUPXEJA\m\target\it\fail-ignore-with-verify\target\it\project\build.log, f:\jenkins\jenkins-slave\workspace\invoker-plugin_MINVOKER-244-NG7YUAFH574UIIL65MNYO3XPSEPSH37LV5D5Q6RWZE34ZWUPXEJA\m\target\it\fail-ignore\build.log, f:\jenkins\jenkins-slave\workspace\invoker-plugin_MINVOKER-244-NG7YUAFH574UIIL65MNYO3XPSEPSH37LV5D5Q6RWZE34ZWUPXEJA\m\target\it\fail-ignore\target\it\project\build.log, f:\jenkins\jenkins-slave\workspace\invoker-plugin_MINVOKER-244-NG7YUAFH574UIIL65MNYO3XPSEPSH37LV5D5Q6RWZE34ZWUPXEJA\m\target\it\fail-noprojects_integration-test\build.log, f:\jenkins\jenkins-slave\workspace\invoker-plugin_MINVOKER-244-NG7YUAFH574UIIL65MNYO3XPSEPSH37LV5D5Q6RWZE34ZWUPXEJA\m\target\it\fail-noprojects_run\build.log, f:\jenkins\jenkins-slave\workspace\invoker-plugin_MINVOKER-244-NG7YUAFH574UIIL65MNYO3XPSEPSH37LV5D5Q6RWZE34ZWUPXEJA\m\target\it\fail-noprojects_verify\build.log, f:\jenkins\jenkins-slave\workspace\invoker-plugin_MINVOKER-244-NG7YUAFH574UIIL65MNYO3XPSEPSH37LV5D5Q6RWZE34ZWUPXEJA\m\target\it\fail-postbuild\build.log, f:\jenkins\jenkins-slave\workspace\invoker-plugin_MINVOKER-244-NG7YUAFH574UIIL65MNYO3XPSEPSH37LV5D5Q6RWZE34ZWUPXEJA\m\target\it\fail-postbuild\target\it\project\build.log, f:\jenkins\jenkins-slave\workspace\invoker-plugin_MINVOKER-244-NG7YUAFH574UIIL65MNYO3XPSEPSH37LV5D5Q6RWZE34ZWUPXEJA\m\target\it\fail-prebuild\build.log, f:\jenkins\jenkins-slave\workspace\invoker-plugin_MINVOKER-244-NG7YUAFH574UIIL65MNYO3XPSEPSH37LV5D5Q6RWZE34ZWUPXEJA\m\target\it\fail-prebuild\target\it\project\build.log, f:\jenkins\jenkins-slave\workspace\invoker-plugin_MINVOKER-244-NG7YUAFH574UIIL65MNYO3XPSEPSH37LV5D5Q6RWZE34ZWUPXEJA\m\target\it\fail-run-postbuild\build.log, f:\jenkins\jenkins-slave\workspace\invoker-plugin_MINVOKER-244-NG7YUAFH574UIIL65MNYO3XPSEPSH37LV5D5Q6RWZE34ZWUPXEJA\m\target\it\fail-run-postbuild\target\it\project\build.log, f:\jenkins\jenkins-slave\workspace\invoker-plugin_MINVOKER-244-NG7YUAFH574UIIL65MNYO3XPSEPSH37LV5D5Q6RWZE34ZWUPXEJA\m\target\it\filtering-extensions\build.log, f:\jenkins\jenkins-slave\workspace\invoker-plugin_MINVOKER-244-NG7YUAFH574UIIL65MNYO3XPSEPSH37LV5D5Q6RWZE34ZWUPXEJA\m\target\it\filtering-extensions\target\it\project\build.log, f:\jenkins\jenkins-slave\workspace\invoker-plugin_MINVOKER-244-NG7YUAFH574UIIL65MNYO3XPSEPSH37LV5D5Q6RWZE34ZWUPXEJA\m\target\it\install-extra-artifacts\build.log, f:\jenkins\jenkins-slave\workspace\invoker-plugin_MINVOKER-244-NG7YUAFH574UIIL65MNYO3XPSEPSH37LV5D5Q6RWZE34ZWUPXEJA\m\target\it\integration-test-never-fails\build.log, f:\jenkins\jenkins-slave\workspace\invoker-plugin_MINVOKER-244-NG7YUAFH574UIIL65MNYO3XPSEPSH37LV5D5Q6RWZE34ZWUPXEJA\m\target\it\integration-test-never-fails\target\it\project\build.log, f:\jenkins\jenkins-slave\workspace\invoker-plugin_MINVOKER-244-NG7YUAFH574UIIL65MNYO3XPSEPSH37LV5D5Q6RWZE34ZWUPXEJA\m\target\it\invocation-cmdline-exclude\build.log, f:\jenkins\jenkins-slave\workspace\invoker-plugin_MINVOKER-244-NG7YUAFH574UIIL65MNYO3XPSEPSH37LV5D5Q6RWZE34ZWUPXEJA\m\target\it\invocation-debug\build.log, f:\jenkins\jenkins-slave\workspace\invoker-plugin_MINVOKER-244-NG7YUAFH574UIIL65MNYO3XPSEPSH37LV5D5Q6RWZE34ZWUPXEJA\m\target\it\invocation-debug\src\it\minvoker-142\build.log, f:\jenkins\jenkins-slave\workspace\invoker-plugin_MINVOKER-244-NG7YUAFH574UIIL65MNYO3XPSEPSH37LV5D5Q6RWZE34ZWUPXEJA\m\target\it\invocation-emptyproperty\build.log, f:\jenkins\jenkins-slave\workspace\invoker-plugin_MINVOKER-244-NG7YUAFH574UIIL65MNYO3XPSEPSH37LV5D5Q6RWZE34ZWUPXEJA\m\target\it\invocation-emptyproperty\src\it\minvoker-118\build.log, f:\jenkins\jenkins-slave\workspace\invoker-plugin_MINVOKER-244-NG7YUAFH574UIIL65MNYO3XPSEPSH37LV5D5Q6RWZE34ZWUPXEJA\m\target\it\invocation-environmentvariable\build.log, f:\jenkins\jenkins-slave\workspace\invoker-plugin_MINVOKER-244-NG7YUAFH574UIIL65MNYO3XPSEPSH37LV5D5Q6RWZE34ZWUPXEJA\m\target\it\invocation-environmentvariable\src\it\minvoker-145\build.log, f:\jenkins\jenkins-slave\workspace\invoker-plugin_MINVOKER-244-NG7YUAFH574UIIL65MNYO3XPSEPSH37LV5D5Q6RWZE34ZWUPXEJA\m\target\it\invocation-multiple\build.log, f:\jenkins\jenkins-slave\workspace\invoker-plugin_MINVOKER-244-NG7YUAFH574UIIL65MNYO3XPSEPSH37LV5D5Q6RWZE34ZWUPXEJA\m\target\it\invocation-multiple\target\it\project\build.log, f:\jenkins\jenkins-slave\workspace\invoker-plugin_MINVOKER-244-NG7YUAFH574UIIL65MNYO3XPSEPSH37LV5D5Q6RWZE34ZWUPXEJA\m\target\it\invocation-offline\build.log, f:\jenkins\jenkins-slave\workspace\invoker-plugin_MINVOKER-244-NG7YUAFH574UIIL65MNYO3XPSEPSH37LV5D5Q6RWZE34ZWUPXEJA\m\target\it\invocation-offline\src\it\project\build.log, f:\jenkins\jenkins-slave\workspace\invoker-plugin_MINVOKER-244-NG7YUAFH574UIIL65MNYO3XPSEPSH37LV5D5Q6RWZE34ZWUPXEJA\m\target\it\invocation-project\build.log, f:\jenkins\jenkins-slave\workspace\invoker-plugin_MINVOKER-244-NG7YUAFH574UIIL65MNYO3XPSEPSH37LV5D5Q6RWZE34ZWUPXEJA\m\target\it\invocation-project\target\it\project\build.log, f:\jenkins\jenkins-slave\workspace\invoker-plugin_MINVOKER-244-NG7YUAFH574UIIL65MNYO3XPSEPSH37LV5D5Q6RWZE34ZWUPXEJA\m\target\it\invocation-reactor-indirect\build.log, f:\jenkins\jenkins-slave\workspace\invoker-plugin_MINVOKER-244-NG7YUAFH574UIIL65MNYO3XPSEPSH37LV5D5Q6RWZE34ZWUPXEJA\m\target\it\invocation-reactor-indirect\itests\target\it\basic\build.log, f:\jenkins\jenkins-slave\workspace\invoker-plugin_MINVOKER-244-NG7YUAFH574UIIL65MNYO3XPSEPSH37LV5D5Q6RWZE34ZWUPXEJA\m\target\it\invocation-spaces\build.log, f:\jenkins\jenkins-slave\workspace\invoker-plugin_MINVOKER-244-NG7YUAFH574UIIL65MNYO3XPSEPSH37LV5D5Q6RWZE34ZWUPXEJA\m\target\it\invocation-spaces\target\it projects\project\build.log, f:\jenkins\jenkins-slave\workspace\invoker-plugin_MINVOKER-244-NG7YUAFH574UIIL65MNYO3XPSEPSH37LV5D5Q6RWZE34ZWUPXEJA\m\target\it\invoker-report\build.log, f:\jenkins\jenkins-slave\workspace\invoker-plugin_MINVOKER-244-NG7YUAFH574UIIL65MNYO3XPSEPSH37LV5D5Q6RWZE34ZWUPXEJA\m\target\it\invoker-report\src\it\failure-build\build.log, f:\jenkins\jenkins-slave\workspace\invoker-plugin_MINVOKER-244-NG7YUAFH574UIIL65MNYO3XPSEPSH37LV5D5Q6RWZE34ZWUPXEJA\m\target\it\invoker-report\src\it\failure-post\build.log, f:\jenkins\jenkins-slave\workspace\invoker-plugin_MINVOKER-244-NG7YUAFH574UIIL65MNYO3XPSEPSH37LV5D5Q6RWZE34ZWUPXEJA\m\target\it\invoker-report\src\it\failure-pre\build.log, f:\jenkins\jenkins-slave\workspace\invoker-plugin_MINVOKER-244-NG7YUAFH574UIIL65MNYO3XPSEPSH37LV5D5Q6RWZE34ZWUPXEJA\m\target\it\invoker-report\src\it\success\build.log, f:\jenkins\jenkins-slave\workspace\invoker-plugin_MINVOKER-244-NG7YUAFH574UIIL65MNYO3XPSEPSH37LV5D5Q6RWZE34ZWUPXEJA\m\target\it\local-repo-default\build.log, f:\jenkins\jenkins-slave\workspace\invoker-plugin_MINVOKER-244-NG7YUAFH574UIIL65MNYO3XPSEPSH37LV5D5Q6RWZE34ZWUPXEJA\m\target\it\local-repo-default\target\its\project\build.log, f:\jenkins\jenkins-slave\workspace\invoker-plugin_MINVOKER-244-NG7YUAFH574UIIL65MNYO3XPSEPSH37LV5D5Q6RWZE34ZWUPXEJA\m\target\it\local-repo-isolated\build.log, f:\jenkins\jenkins-slave\workspace\invoker-plugin_MINVOKER-244-NG7YUAFH574UIIL65MNYO3XPSEPSH37LV5D5Q6RWZE34ZWUPXEJA\m\target\it\local-repo-isolated\src\it\project\build.log, f:\jenkins\jenkins-slave\workspace\invoker-plugin_MINVOKER-244-NG7YUAFH574UIIL65MNYO3XPSEPSH37LV5D5Q6RWZE34ZWUPXEJA\m\target\it\local-repo-path\build.log, f:\jenkins\jenkins-slave\workspace\invoker-plugin_MINVOKER-244-NG7YUAFH574UIIL65MNYO3XPSEPSH37LV5D5Q6RWZE34ZWUPXEJA\m\target\it\local-repo-path\src\it\project\build.log, f:\jenkins\jenkins-slave\workspace\invoker-plugin_MINVOKER-244-NG7YUAFH574UIIL65MNYO3XPSEPSH37LV5D5Q6RWZE34ZWUPXEJA\m\target\it\local-repo-url\build.log, f:\jenkins\jenkins-slave\workspace\invoker-plugin_MINVOKER-244-NG7YUAFH574UIIL65MNYO3XPSEPSH37LV5D5Q6RWZE34ZWUPXEJA\m\target\it\local-repo-url\src\it\project\build.log, f:\jenkins\jenkins-slave\workspace\invoker-plugin_MINVOKER-244-NG7YUAFH574UIIL65MNYO3XPSEPSH37LV5D5Q6RWZE34ZWUPXEJA\m\target\it\multiEnvVar\build.log, f:\jenkins\jenkins-slave\workspace\invoker-plugin_MINVOKER-244-NG7YUAFH574UIIL65MNYO3XPSEPSH37LV5D5Q6RWZE34ZWUPXEJA\m\target\it\multiEnvVar\target\it\project\build.log, f:\jenkins\jenkins-slave\workspace\invoker-plugin_MINVOKER-244-NG7YUAFH574UIIL65MNYO3XPSEPSH37LV5D5Q6RWZE34ZWUPXEJA\m\target\it\not-clone-not-plugin\build.log, f:\jenkins\jenkins-slave\workspace\invoker-plugin_MINVOKER-244-NG7YUAFH574UIIL65MNYO3XPSEPSH37LV5D5Q6RWZE34ZWUPXEJA\m\target\it\not-clone-not-plugin\src\it\clone-clean\build.log, f:\jenkins\jenkins-slave\workspace\invoker-plugin_MINVOKER-244-NG7YUAFH574UIIL65MNYO3XPSEPSH37LV5D5Q6RWZE34ZWUPXEJA\m\target\it\pom-filtering-encoding\build.log, f:\jenkins\jenkins-slave\workspace\invoker-plugin_MINVOKER-244-NG7YUAFH574UIIL65MNYO3XPSEPSH37LV5D5Q6RWZE34ZWUPXEJA\m\target\it\pom-filtering-encoding\target\it\latin-1\build.log, f:\jenkins\jenkins-slave\workspace\invoker-plugin_MINVOKER-244-NG7YUAFH574UIIL65MNYO3XPSEPSH37LV5D5Q6RWZE34ZWUPXEJA\m\target\it\pom-filtering-encoding\target\it\utf-8\build.log, f:\jenkins\jenkins-slave\workspace\invoker-plugin_MINVOKER-244-NG7YUAFH574UIIL65MNYO3XPSEPSH37LV5D5Q6RWZE34ZWUPXEJA\m\target\it\pom-filtering-reactor\build.log, f:\jenkins\jenkins-slave\workspace\invoker-plugin_MINVOKER-244-NG7YUAFH574UIIL65MNYO3XPSEPSH37LV5D5Q6RWZE34ZWUPXEJA\m\target\it\pom-filtering-reactor\target\it\mod2-parent\build.log, f:\jenkins\jenkins-slave\workspace\invoker-plugin_MINVOKER-244-NG7YUAFH574UIIL65MNYO3XPSEPSH37LV5D5Q6RWZE34ZWUPXEJA\m\target\it\pom-filtering\build.log, f:\jenkins\jenkins-slave\workspace\invoker-plugin_MINVOKER-244-NG7YUAFH574UIIL65MNYO3XPSEPSH37LV5D5Q6RWZE34ZWUPXEJA\m\target\it\pom-filtering\target\it\project\build.log, f:\jenkins\jenkins-slave\workspace\invoker-plugin_MINVOKER-244-NG7YUAFH574UIIL65MNYO3XPSEPSH37LV5D5Q6RWZE34ZWUPXEJA\m\target\it\pom-less-invocation\build.log, f:\jenkins\jenkins-slave\workspace\invoker-plugin_MINVOKER-244-NG7YUAFH574UIIL65MNYO3XPSEPSH37LV5D5Q6RWZE34ZWUPXEJA\m\target\it\pom-less-invocation\target\it\no-pom\build.log, f:\jenkins\jenkins-slave\workspace\invoker-plugin_MINVOKER-244-NG7YUAFH574UIIL65MNYO3XPSEPSH37LV5D5Q6RWZE34ZWUPXEJA\m\target\it\postbuild-executed-only-once\build.log, f:\jenkins\jenkins-slave\workspace\invoker-plugin_MINVOKER-244-NG7YUAFH574UIIL65MNYO3XPSEPSH37LV5D5Q6RWZE34ZWUPXEJA\m\target\it\postbuild-executed-only-once\target\it\project\build.log, f:\jenkins\jenkins-slave\workspace\invoker-plugin_MINVOKER-244-NG7YUAFH574UIIL65MNYO3XPSEPSH37LV5D5Q6RWZE34ZWUPXEJA\m\target\it\project-cloning-reactor\build.log, f:\jenkins\jenkins-slave\workspace\invoker-plugin_MINVOKER-244-NG7YUAFH574UIIL65MNYO3XPSEPSH37LV5D5Q6RWZE34ZWUPXEJA\m\target\it\project-cloning-reactor\target\it\aggregator\build.log, f:\jenkins\jenkins-slave\workspace\invoker-plugin_MINVOKER-244-NG7YUAFH574UIIL65MNYO3XPSEPSH37LV5D5Q6RWZE34ZWUPXEJA\m\target\it\project-cloning\build.log, f:\jenkins\jenkins-slave\workspace\invoker-plugin_MINVOKER-244-NG7YUAFH574UIIL65MNYO3XPSEPSH37LV5D5Q6RWZE34ZWUPXEJA\m\target\it\project-cloning\target\it\module-1\build.log, f:\jenkins\jenkins-slave\workspace\invoker-plugin_MINVOKER-244-NG7YUAFH574UIIL65MNYO3XPSEPSH37LV5D5Q6RWZE34ZWUPXEJA\m\target\it\project-cloning\target\it\module-1\sub-module\build.log, f:\jenkins\jenkins-slave\workspace\invoker-plugin_MINVOKER-244-NG7YUAFH574UIIL65MNYO3XPSEPSH37LV5D5Q6RWZE34ZWUPXEJA\m\target\it\project-cloning\target\it\module\build.log, f:\jenkins\jenkins-slave\workspace\invoker-plugin_MINVOKER-244-NG7YUAFH574UIIL65MNYO3XPSEPSH37LV5D5Q6RWZE34ZWUPXEJA\m\target\it\project-setup\build.log, f:\jenkins\jenkins-slave\workspace\invoker-plugin_MINVOKER-244-NG7YUAFH574UIIL65MNYO3XPSEPSH37LV5D5Q6RWZE34ZWUPXEJA\m\target\it\project-setup\target\it\project1\build.log, f:\jenkins\jenkins-slave\workspace\invoker-plugin_MINVOKER-244-NG7YUAFH574UIIL65MNYO3XPSEPSH37LV5D5Q6RWZE34ZWUPXEJA\m\target\it\project-setup\target\it\project2\build.log, f:\jenkins\jenkins-slave\workspace\invoker-plugin_MINVOKER-244-NG7YUAFH574UIIL65MNYO3XPSEPSH37LV5D5Q6RWZE34ZWUPXEJA\m\target\it\project-setup\target\it\project3\build.log, f:\jenkins\jenkins-slave\workspace\invoker-plugin_MINVOKER-244-NG7YUAFH574UIIL65MNYO3XPSEPSH37LV5D5Q6RWZE34ZWUPXEJA\m\target\it\project-setup\target\it\project4\build.log, f:\jenkins\jenkins-slave\workspace\invoker-plugin_MINVOKER-244-NG7YUAFH574UIIL65MNYO3XPSEPSH37LV5D5Q6RWZE34ZWUPXEJA\m\target\it\project-setup\target\it\project5\build.log, f:\jenkins\jenkins-slave\workspace\invoker-plugin_MINVOKER-244-NG7YUAFH574UIIL65MNYO3XPSEPSH37LV5D5Q6RWZE34ZWUPXEJA\m\target\it\script-accessibility\build.log, f:\jenkins\jenkins-slave\workspace\invoker-plugin_MINVOKER-244-NG7YUAFH574UIIL65MNYO3XPSEPSH37LV5D5Q6RWZE34ZWUPXEJA\m\target\it\script-accessibility\src\it\beanshell\build.log, f:\jenkins\jenkins-slave\workspace\invoker-plugin_MINVOKER-244-NG7YUAFH574UIIL65MNYO3XPSEPSH37LV5D5Q6RWZE34ZWUPXEJA\m\target\it\script-accessibility\src\it\groovy\build.log, f:\jenkins\jenkins-slave\workspace\invoker-plugin_MINVOKER-244-NG7YUAFH574UIIL65MNYO3XPSEPSH37LV5D5Q6RWZE34ZWUPXEJA\m\target\it\script-additional-vars\build.log, f:\jenkins\jenkins-slave\workspace\invoker-plugin_MINVOKER-244-NG7YUAFH574UIIL65MNYO3XPSEPSH37LV5D5Q6RWZE34ZWUPXEJA\m\target\it\script-additional-vars\src\it\beanshell\build.log, f:\jenkins\jenkins-slave\workspace\invoker-plugin_MINVOKER-244-NG7YUAFH574UIIL65MNYO3XPSEPSH37LV5D5Q6RWZE34ZWUPXEJA\m\target\it\script-additional-vars\src\it\groovy\build.log, f:\jenkins\jenkins-slave\workspace\invoker-plugin_MINVOKER-244-NG7YUAFH574UIIL65MNYO3XPSEPSH37LV5D5Q6RWZE34ZWUPXEJA\m\target\it\script-class-loading\build.log, f:\jenkins\jenkins-slave\workspace\invoker-plugin_MINVOKER-244-NG7YUAFH574UIIL65MNYO3XPSEPSH37LV5D5Q6RWZE34ZWUPXEJA\m\target\it\script-class-loading\src\it\beanshell\build.log, f:\jenkins\jenkins-slave\workspace\invoker-plugin_MINVOKER-244-NG7YUAFH574UIIL65MNYO3XPSEPSH37LV5D5Q6RWZE34ZWUPXEJA\m\target\it\script-class-loading\src\it\groovy\build.log, f:\jenkins\jenkins-slave\workspace\invoker-plugin_MINVOKER-244-NG7YUAFH574UIIL65MNYO3XPSEPSH37LV5D5Q6RWZE34ZWUPXEJA\m\target\it\script-classpath-duplicates\build.log, f:\jenkins\jenkins-slave\workspace\invoker-plugin_MINVOKER-244-NG7YUAFH574UIIL65MNYO3XPSEPSH37LV5D5Q6RWZE34ZWUPXEJA\m\target\it\script-classpath-duplicates\target\it\beanshell\build.log, f:\jenkins\jenkins-slave\workspace\invoker-plugin_MINVOKER-244-NG7YUAFH574UIIL65MNYO3XPSEPSH37LV5D5Q6RWZE34ZWUPXEJA\m\target\it\script-classpath-duplicates\target\it\groovy\build.log, f:\jenkins\jenkins-slave\workspace\invoker-plugin_MINVOKER-244-NG7YUAFH574UIIL65MNYO3XPSEPSH37LV5D5Q6RWZE34ZWUPXEJA\m\target\it\script-context\build.log, f:\jenkins\jenkins-slave\workspace\invoker-plugin_MINVOKER-244-NG7YUAFH574UIIL65MNYO3XPSEPSH37LV5D5Q6RWZE34ZWUPXEJA\m\target\it\script-context\target\its\beanshell\build.log, f:\jenkins\jenkins-slave\workspace\invoker-plugin_MINVOKER-244-NG7YUAFH574UIIL65MNYO3XPSEPSH37LV5D5Q6RWZE34ZWUPXEJA\m\target\it\script-context\target\its\groovy\build.log, f:\jenkins\jenkins-slave\workspace\invoker-plugin_MINVOKER-244-NG7YUAFH574UIIL65MNYO3XPSEPSH37LV5D5Q6RWZE34ZWUPXEJA\m\target\it\script-errors\build.log, f:\jenkins\jenkins-slave\workspace\invoker-plugin_MINVOKER-244-NG7YUAFH574UIIL65MNYO3XPSEPSH37LV5D5Q6RWZE34ZWUPXEJA\m\target\it\script-errors\target\its\beanshell\build.log, f:\jenkins\jenkins-slave\workspace\invoker-plugin_MINVOKER-244-NG7YUAFH574UIIL65MNYO3XPSEPSH37LV5D5Q6RWZE34ZWUPXEJA\m\target\it\script-errors\target\its\groovy\build.log, f:\jenkins\jenkins-slave\workspace\invoker-plugin_MINVOKER-244-NG7YUAFH574UIIL65MNYO3XPSEPSH37LV5D5Q6RWZE34ZWUPXEJA\m\target\it\script-global-vars\build.log, f:\jenkins\jenkins-slave\workspace\invoker-plugin_MINVOKER-244-NG7YUAFH574UIIL65MNYO3XPSEPSH37LV5D5Q6RWZE34ZWUPXEJA\m\target\it\script-global-vars\src\it\beanshell\build.log, f:\jenkins\jenkins-slave\workspace\invoker-plugin_MINVOKER-244-NG7YUAFH574UIIL65MNYO3XPSEPSH37LV5D5Q6RWZE34ZWUPXEJA\m\target\it\script-global-vars\src\it\groovy\build.log, f:\jenkins\jenkins-slave\workspace\invoker-plugin_MINVOKER-244-NG7YUAFH574UIIL65MNYO3XPSEPSH37LV5D5Q6RWZE34ZWUPXEJA\m\target\it\script-interpreter-detection\build.log, f:\jenkins\jenkins-slave\workspace\invoker-plugin_MINVOKER-244-NG7YUAFH574UIIL65MNYO3XPSEPSH37LV5D5Q6RWZE34ZWUPXEJA\m\target\it\script-interpreter-detection\target\its\beanshell\build.log, f:\jenkins\jenkins-slave\workspace\invoker-plugin_MINVOKER-244-NG7YUAFH574UIIL65MNYO3XPSEPSH37LV5D5Q6RWZE34ZWUPXEJA\m\target\it\script-interpreter-detection\target\its\groovy\build.log, f:\jenkins\jenkins-slave\workspace\invoker-plugin_MINVOKER-244-NG7YUAFH574UIIL65MNYO3XPSEPSH37LV5D5Q6RWZE34ZWUPXEJA\m\target\it\script-verify-xml\build.log, f:\jenkins\jenkins-slave\workspace\invoker-plugin_MINVOKER-244-NG7YUAFH574UIIL65MNYO3XPSEPSH37LV5D5Q6RWZE34ZWUPXEJA\m\target\it\selector-conditions\build.log, f:\jenkins\jenkins-slave\workspace\invoker-plugin_MINVOKER-244-NG7YUAFH574UIIL65MNYO3XPSEPSH37LV5D5Q6RWZE34ZWUPXEJA\m\target\it\selector-conditions\target\its\jre-version-match\build.log, f:\jenkins\jenkins-slave\workspace\invoker-plugin_MINVOKER-244-NG7YUAFH574UIIL65MNYO3XPSEPSH37LV5D5Q6RWZE34ZWUPXEJA\m\target\it\selector-conditions\target\its\maven-version-match\build.log, f:\jenkins\jenkins-slave\workspace\invoker-plugin_MINVOKER-244-NG7YUAFH574UIIL65MNYO3XPSEPSH37LV5D5Q6RWZE34ZWUPXEJA\m\target\it\selector-conditions\target\its\os-family-match\build.log, f:\jenkins\jenkins-slave\workspace\invoker-plugin_MINVOKER-244-NG7YUAFH574UIIL65MNYO3XPSEPSH37LV5D5Q6RWZE34ZWUPXEJA\m\target\it\selector-scripts\build.log, f:\jenkins\jenkins-slave\workspace\invoker-plugin_MINVOKER-244-NG7YUAFH574UIIL65MNYO3XPSEPSH37LV5D5Q6RWZE34ZWUPXEJA\m\target\it\selector-scripts\target\its\script-ret-false\build.log, f:\jenkins\jenkins-slave\workspace\invoker-plugin_MINVOKER-244-NG7YUAFH574UIIL65MNYO3XPSEPSH37LV5D5Q6RWZE34ZWUPXEJA\m\target\it\selector-scripts\target\its\script-ret-other\build.log, f:\jenkins\jenkins-slave\workspace\invoker-plugin_MINVOKER-244-NG7YUAFH574UIIL65MNYO3XPSEPSH37LV5D5Q6RWZE34ZWUPXEJA\m\target\it\selector-scripts\target\its\script-ret-quiet\build.log, f:\jenkins\jenkins-slave\workspace\invoker-plugin_MINVOKER-244-NG7YUAFH574UIIL65MNYO3XPSEPSH37LV5D5Q6RWZE34ZWUPXEJA\m\target\it\selector-scripts\target\its\script-ret-true\build.log, f:\jenkins\jenkins-slave\workspace\invoker-plugin_MINVOKER-244-NG7YUAFH574UIIL65MNYO3XPSEPSH37LV5D5Q6RWZE34ZWUPXEJA\m\target\it\selector-scripts\target\its\script-throw\build.log, f:\jenkins\jenkins-slave\workspace\invoker-plugin_MINVOKER-244-NG7YUAFH574UIIL65MNYO3XPSEPSH37LV5D5Q6RWZE34ZWUPXEJA\m\target\it\settings-auto-exclude\build.log, f:\jenkins\jenkins-slave\workspace\invoker-plugin_MINVOKER-244-NG7YUAFH574UIIL65MNYO3XPSEPSH37LV5D5Q6RWZE34ZWUPXEJA\m\target\it\settings-auto-exclude\src\it\project\build.log, f:\jenkins\jenkins-slave\workspace\invoker-plugin_MINVOKER-244-NG7YUAFH574UIIL65MNYO3XPSEPSH37LV5D5Q6RWZE34ZWUPXEJA\m\target\it\settings-inherit\build.log, f:\jenkins\jenkins-slave\workspace\invoker-plugin_MINVOKER-244-NG7YUAFH574UIIL65MNYO3XPSEPSH37LV5D5Q6RWZE34ZWUPXEJA\m\target\it\settings-inherit\target\it\project\build.log, f:\jenkins\jenkins-slave\workspace\invoker-plugin_MINVOKER-244-NG7YUAFH574UIIL65MNYO3XPSEPSH37LV5D5Q6RWZE34ZWUPXEJA\m\target\it\settings-merge-multiexecutions\build.log, f:\jenkins\jenkins-slave\workspace\invoker-plugin_MINVOKER-244-NG7YUAFH574UIIL65MNYO3XPSEPSH37LV5D5Q6RWZE34ZWUPXEJA\m\target\it\settings-merge-multiexecutions\target\it\minvoker-133\build.log, f:\jenkins\jenkins-slave\workspace\invoker-plugin_MINVOKER-244-NG7YUAFH574UIIL65MNYO3XPSEPSH37LV5D5Q6RWZE34ZWUPXEJA\m\target\it\settings-merge_jdk9+\build.log, f:\jenkins\jenkins-slave\workspace\invoker-plugin_MINVOKER-244-NG7YUAFH574UIIL65MNYO3XPSEPSH37LV5D5Q6RWZE34ZWUPXEJA\m\target\it\settings-merge_jdk9+\target\it\project\build.log, f:\jenkins\jenkins-slave\workspace\invoker-plugin_MINVOKER-244-NG7YUAFH574UIIL65MNYO3XPSEPSH37LV5D5Q6RWZE34ZWUPXEJA\m\target\it\settings-override\build.log, f:\jenkins\jenkins-slave\workspace\invoker-plugin_MINVOKER-244-NG7YUAFH574UIIL65MNYO3XPSEPSH37LV5D5Q6RWZE34ZWUPXEJA\m\target\it\settings-override\src\it\project\build.log, f:\jenkins\jenkins-slave\workspace\invoker-plugin_MINVOKER-244-NG7YUAFH574UIIL65MNYO3XPSEPSH37LV5D5Q6RWZE34ZWUPXEJA\m\target\it\skip-install\build.log, f:\jenkins\jenkins-slave\workspace\invoker-plugin_MINVOKER-244-NG7YUAFH574UIIL65MNYO3XPSEPSH37LV5D5Q6RWZE34ZWUPXEJA\m\target\it\skip-run\build.log, f:\jenkins\jenkins-slave\workspace\invoker-plugin_MINVOKER-244-NG7YUAFH574UIIL65MNYO3XPSEPSH37LV5D5Q6RWZE34ZWUPXEJA\m\target\it\spaces-should-work_windows\build.log, f:\jenkins\jenkins-slave\workspace\invoker-plugin_MINVOKER-244-NG7YUAFH574UIIL65MNYO3XPSEPSH37LV5D5Q6RWZE34ZWUPXEJA\m\target\it\spaces-should-work_windows\src\it\test-Ééê- & -Ééê-test\build.log, f:\jenkins\jenkins-slave\workspace\invoker-plugin_MINVOKER-244-NG7YUAFH574UIIL65MNYO3XPSEPSH37LV5D5Q6RWZE34ZWUPXEJA\m\target\it\special-characters-should-work\build.log, f:\jenkins\jenkins-slave\workspace\invoker-plugin_MINVOKER-244-NG7YUAFH574UIIL65MNYO3XPSEPSH37LV5D5Q6RWZE34ZWUPXEJA\m\target\it\special-characters-should-work\src\it\test-Ééê-more-Ééê-test\build.log, f:\jenkins\jenkins-slave\workspace\invoker-plugin_MINVOKER-244-NG7YUAFH574UIIL65MNYO3XPSEPSH37LV5D5Q6RWZE34ZWUPXEJA\m\target\it\staging-dependencies\build.log, f:\jenkins\jenkins-slave\workspace\invoker-plugin_MINVOKER-244-NG7YUAFH574UIIL65MNYO3XPSEPSH37LV5D5Q6RWZE34ZWUPXEJA\m\target\it\staging-pom\build.log, f:\jenkins\jenkins-slave\workspace\invoker-plugin_MINVOKER-244-NG7YUAFH574UIIL65MNYO3XPSEPSH37LV5D5Q6RWZE34ZWUPXEJA\m\target\it\staging-reactor\build.log, f:\jenkins\jenkins-slave\workspace\invoker-plugin_MINVOKER-244-NG7YUAFH574UIIL65MNYO3XPSEPSH37LV5D5Q6RWZE34ZWUPXEJA\m\target\it\wrongPropertyInterpolation\build.log, f:\jenkins\jenkins-slave\workspace\invoker-plugin_MINVOKER-244-NG7YUAFH574UIIL65MNYO3XPSEPSH37LV5D5Q6RWZE34ZWUPXEJA\m\target\it\wrongPropertyInterpolation\target\it\project\build.log]
[windows-jdk9] Finished parsing Maven Invoker results (found 68)
[windows-jdk9] [withMaven] junitPublisher - Archive test results for Maven artifact org.apache.maven.plugins:maven-invoker-plugin:3.1.1-SNAPSHOT generated by maven-surefire-plugin:test (default-test): m\target\surefire-reports\*.xml
[windows-jdk9] Recording test results
[Pipeline] [windows-jdk9] // withMaven
[Pipeline] [windows-jdk9] cleanWs
[windows-jdk9] [WS-CLEANUP] Deleting project workspace...[WS-CLEANUP] done
[Pipeline] [windows-jdk9] cleanWs
[windows-jdk9] [WS-CLEANUP] Deleting project workspace...[WS-CLEANUP] done
[Pipeline] [windows-jdk9] }
[Pipeline] [windows-jdk9] // stage
[Pipeline] [windows-jdk9] }
[Pipeline] [windows-jdk9] // node
[Pipeline] [windows-jdk9] }
[windows-jdk9] Failed in branch windows-jdk9
[Pipeline] // parallel
[Pipeline] stage
[Pipeline] { (Notifications)
[Pipeline] echo
Build result: FAILURE
[Pipeline] jiraIssueSelector
[Pipeline] emailext