Build failed in Jenkins: Maven TLP » maven-indexer » master #26

classic Classic list List threaded Threaded
3 messages Options
Reply | Threaded
Open this post in threaded view
|

Build failed in Jenkins: Maven TLP » maven-indexer » master #26

Apache Jenkins Server-2
See https://builds.apache.org/job/maven-box/job/maven-indexer/job/master/26/

Changes:

* [INFRA-19273] Maven 3.6.0 dropped, update to 3.6.2

All tests passed

Build log:
[...truncated 28823 lines...]
[INFO] --- maven-enforcer-plugin:1.4.1:enforce (enforce-bytecode-version) @ indexer-examples-basic ---
[INFO]
[INFO] --- maven-enforcer-plugin:1.4.1:enforce (ban-known-bad-maven-versions) @ indexer-examples-basic ---
[INFO]
[INFO] --- apache-rat-plugin:0.12:check (rat-check) @ indexer-examples-basic ---
[INFO] Enabled default license matchers.
[INFO] Will parse SCM ignores for exclusions...
[INFO] Finished adding exclusions from SCM ignore files.
[INFO] 61 implicit excludes (use -debug for more details).
[INFO] Exclude: .repository/**
[INFO] Exclude: .maven/spy.log
[INFO] Exclude: dependency-reduced-pom.xml
[INFO] Exclude: .java-version
[INFO] Exclude: README.md
[INFO] Exclude: .gitignore
[INFO] Exclude: NOTICE
[INFO] Exclude: **/packageinfo
[INFO] Exclude: .git/**
[INFO] Exclude: .idea/**
[INFO] Exclude: **/*.iml
[INFO] Exclude: src/test/**/*.sha1
[INFO] Exclude: src/test/**/*.md5
[INFO] Exclude: src/test/**/*.xml
[INFO] Exclude: src/test/**/*.pom
[INFO] Exclude: src/test/**/*.asc
[INFO] Exclude: src/test/**/*.properties
[INFO] Exclude: src/test/**/*.swc
[INFO] Exclude: src/test/**/*.txt
[INFO] Exclude: src/test/**/*.filename
[INFO] Exclude: src/test/**/.placeholder
[INFO] 4 resources included (use -debug for more details)
[INFO] Rat check: Summary over all files. Unapproved: 0, unknown: 0, generated: 0, approved: 4 licenses.
[INFO]
[INFO] --- maven-remote-resources-plugin:1.5:process (process-resource-bundles) @ indexer-examples-basic ---
[INFO]
[INFO] --- maven-resources-plugin:3.1.0:resources (default-resources) @ indexer-examples-basic ---
[INFO] Using 'UTF-8' encoding to copy filtered resources.
[INFO] skip non existing resourceDirectory F:\jenkins\jenkins-slave\workspace\maven-box_maven-indexer_master\m\indexer-examples\indexer-examples-basic\src\main\resources
[INFO] Copying 3 resources
[INFO]
[INFO] --- maven-compiler-plugin:3.7.0:compile (default-compile) @ indexer-examples-basic ---
[INFO] Changes detected - recompiling the module!
[INFO] Compiling 1 source file to F:\jenkins\jenkins-slave\workspace\maven-box_maven-indexer_master\m\indexer-examples\indexer-examples-basic\target\classes
[INFO]
[INFO] --- animal-sniffer-maven-plugin:1.16:check (check-java-compat) @ indexer-examples-basic ---
[INFO] Checking unresolved references to org.codehaus.mojo.signature:java17:1.0
[INFO]
[INFO] --- maven-resources-plugin:3.1.0:testResources (default-testResources) @ indexer-examples-basic ---
[INFO] Using 'UTF-8' encoding to copy filtered resources.
[INFO] skip non existing resourceDirectory F:\jenkins\jenkins-slave\workspace\maven-box_maven-indexer_master\m\indexer-examples\indexer-examples-basic\src\test\resources
[INFO] Copying 3 resources
[INFO]
[INFO] --- maven-compiler-plugin:3.7.0:testCompile (default-testCompile) @ indexer-examples-basic ---
[INFO] Changes detected - recompiling the module!
[INFO] Compiling 1 source file to F:\jenkins\jenkins-slave\workspace\maven-box_maven-indexer_master\m\indexer-examples\indexer-examples-basic\target\test-classes
[INFO]
[INFO] --- maven-surefire-plugin:2.22.0:test (default-test) @ indexer-examples-basic ---
[INFO] Tests are skipped.
[INFO]
[INFO] --- maven-jar-plugin:3.1.0:jar (default-jar) @ indexer-examples-basic ---
[INFO] Building jar: F:\jenkins\jenkins-slave\workspace\maven-box_maven-indexer_master\m\indexer-examples\indexer-examples-basic\target\indexer-examples-basic-6.1.0-SNAPSHOT.jar
[INFO]
[INFO] --- maven-site-plugin:3.7.1:attach-descriptor (attach-descriptor) @ indexer-examples-basic ---
[INFO] Skipping because packaging 'jar' is not pom.
[INFO]
[INFO] --- maven-checkstyle-plugin:2.17:check (checkstyle-check) @ indexer-examples-basic ---
[INFO] There is 1 error reported by Checkstyle 6.11.2 with config/maven_checks.xml ruleset.
[INFO] Ignored 1 error, 0 violation remaining.
[INFO]
[INFO] ----------< org.apache.maven.indexer:indexer-examples-spring >----------
[INFO] Building Maven :: Indexer Examples [Spring] 6.1.0-SNAPSHOT         [7/7]
[INFO] --------------------------------[ jar ]---------------------------------
[INFO] Downloading from central: https://repo.maven.apache.org/maven2/ch/qos/logback/logback-classic/1.2.3/logback-classic-1.2.3.pom
[INFO] Downloaded from central: https://repo.maven.apache.org/maven2/ch/qos/logback/logback-classic/1.2.3/logback-classic-1.2.3.pom (13 kB at 422 kB/s)
[INFO] Downloading from central: https://repo.maven.apache.org/maven2/ch/qos/logback/logback-parent/1.2.3/logback-parent-1.2.3.pom
[INFO] Downloaded from central: https://repo.maven.apache.org/maven2/ch/qos/logback/logback-parent/1.2.3/logback-parent-1.2.3.pom (18 kB at 635 kB/s)
[INFO] Downloading from central: https://repo.maven.apache.org/maven2/ch/qos/logback/logback-core/1.2.3/logback-core-1.2.3.pom
[INFO] Downloaded from central: https://repo.maven.apache.org/maven2/ch/qos/logback/logback-core/1.2.3/logback-core-1.2.3.pom (4.2 kB at 155 kB/s)
[INFO] Downloading from central: https://repo.maven.apache.org/maven2/org/apache/maven/maven-model-builder/3.5.2/maven-model-builder-3.5.2.pom
[INFO] Downloaded from central: https://repo.maven.apache.org/maven2/org/apache/maven/maven-model-builder/3.5.2/maven-model-builder-3.5.2.pom (3.1 kB at 126 kB/s)
[INFO] Downloading from central: https://repo.maven.apache.org/maven2/org/apache/maven/maven-artifact/3.5.2/maven-artifact-3.5.2.pom
[INFO] Downloaded from central: https://repo.maven.apache.org/maven2/org/apache/maven/maven-artifact/3.5.2/maven-artifact-3.5.2.pom (2.1 kB at 68 kB/s)
[INFO] Downloading from central: https://repo.maven.apache.org/maven2/org/apache/maven/maven-builder-support/3.5.2/maven-builder-support-3.5.2.pom
[INFO] Downloaded from central: https://repo.maven.apache.org/maven2/org/apache/maven/maven-builder-support/3.5.2/maven-builder-support-3.5.2.pom (1.5 kB at 48 kB/s)
[INFO] Downloading from central: https://repo.maven.apache.org/maven2/org/springframework/spring-beans/4.0.6.RELEASE/spring-beans-4.0.6.RELEASE.pom
[INFO] Downloaded from central: https://repo.maven.apache.org/maven2/org/springframework/spring-beans/4.0.6.RELEASE/spring-beans-4.0.6.RELEASE.pom (2.3 kB at 68 kB/s)
[INFO] Downloading from central: https://repo.maven.apache.org/maven2/org/springframework/spring-core/4.0.6.RELEASE/spring-core-4.0.6.RELEASE.pom
[INFO] Downloaded from central: https://repo.maven.apache.org/maven2/org/springframework/spring-core/4.0.6.RELEASE/spring-core-4.0.6.RELEASE.pom (2.3 kB at 69 kB/s)
[INFO] Downloading from central: https://repo.maven.apache.org/maven2/commons-logging/commons-logging/1.1.3/commons-logging-1.1.3.pom
[INFO] Downloaded from central: https://repo.maven.apache.org/maven2/commons-logging/commons-logging/1.1.3/commons-logging-1.1.3.pom (18 kB at 556 kB/s)
[INFO] Downloading from central: https://repo.maven.apache.org/maven2/org/apache/commons/commons-parent/28/commons-parent-28.pom
[INFO] Downloaded from central: https://repo.maven.apache.org/maven2/org/apache/commons/commons-parent/28/commons-parent-28.pom (50 kB at 1.1 MB/s)
[INFO] Downloading from central: https://repo.maven.apache.org/maven2/org/springframework/spring-context/4.0.6.RELEASE/spring-context-4.0.6.RELEASE.pom
[INFO] Downloaded from central: https://repo.maven.apache.org/maven2/org/springframework/spring-context/4.0.6.RELEASE/spring-context-4.0.6.RELEASE.pom (4.8 kB at 142 kB/s)
[INFO] Downloading from central: https://repo.maven.apache.org/maven2/org/springframework/spring-aop/4.0.6.RELEASE/spring-aop-4.0.6.RELEASE.pom
[INFO] Downloaded from central: https://repo.maven.apache.org/maven2/org/springframework/spring-aop/4.0.6.RELEASE/spring-aop-4.0.6.RELEASE.pom (2.7 kB at 80 kB/s)
[INFO] Downloading from central: https://repo.maven.apache.org/maven2/org/springframework/spring-expression/4.0.6.RELEASE/spring-expression-4.0.6.RELEASE.pom
[INFO] Downloaded from central: https://repo.maven.apache.org/maven2/org/springframework/spring-expression/4.0.6.RELEASE/spring-expression-4.0.6.RELEASE.pom (1.7 kB at 54 kB/s)
[INFO] Downloading from central: https://repo.maven.apache.org/maven2/org/springframework/spring-test/4.0.6.RELEASE/spring-test-4.0.6.RELEASE.pom
[INFO] Downloaded from central: https://repo.maven.apache.org/maven2/org/springframework/spring-test/4.0.6.RELEASE/spring-test-4.0.6.RELEASE.pom (6.7 kB at 202 kB/s)
[INFO] Downloading from central: https://repo.maven.apache.org/maven2/ch/qos/logback/logback-classic/1.2.3/logback-classic-1.2.3.jar
[INFO] Downloading from central: https://repo.maven.apache.org/maven2/org/apache/maven/maven-builder-support/3.5.2/maven-builder-support-3.5.2.jar
[INFO] Downloading from central: https://repo.maven.apache.org/maven2/org/apache/maven/maven-artifact/3.5.2/maven-artifact-3.5.2.jar
[INFO] Downloading from central: https://repo.maven.apache.org/maven2/org/apache/maven/maven-model-builder/3.5.2/maven-model-builder-3.5.2.jar
[INFO] Downloading from central: https://repo.maven.apache.org/maven2/ch/qos/logback/logback-core/1.2.3/logback-core-1.2.3.jar
[INFO] Downloaded from central: https://repo.maven.apache.org/maven2/org/apache/maven/maven-artifact/3.5.2/maven-artifact-3.5.2.jar (55 kB at 1.3 MB/s)
[INFO] Downloading from central: https://repo.maven.apache.org/maven2/org/springframework/spring-beans/4.0.6.RELEASE/spring-beans-4.0.6.RELEASE.jar
[INFO] Downloaded from central: https://repo.maven.apache.org/maven2/ch/qos/logback/logback-classic/1.2.3/logback-classic-1.2.3.jar (290 kB at 5.5 MB/s)
[INFO] Downloading from central: https://repo.maven.apache.org/maven2/org/springframework/spring-context/4.0.6.RELEASE/spring-context-4.0.6.RELEASE.jar
[INFO] Downloaded from central: https://repo.maven.apache.org/maven2/org/apache/maven/maven-model-builder/3.5.2/maven-model-builder-3.5.2.jar (180 kB at 2.9 MB/s)
[INFO] Downloading from central: https://repo.maven.apache.org/maven2/org/springframework/spring-aop/4.0.6.RELEASE/spring-aop-4.0.6.RELEASE.jar
[INFO] Downloaded from central: https://repo.maven.apache.org/maven2/ch/qos/logback/logback-core/1.2.3/logback-core-1.2.3.jar (472 kB at 5.1 MB/s)
[INFO] Downloading from central: https://repo.maven.apache.org/maven2/org/springframework/spring-expression/4.0.6.RELEASE/spring-expression-4.0.6.RELEASE.jar
[INFO] Downloaded from central: https://repo.maven.apache.org/maven2/org/springframework/spring-beans/4.0.6.RELEASE/spring-beans-4.0.6.RELEASE.jar (670 kB at 6.5 MB/s)
[INFO] Downloading from central: https://repo.maven.apache.org/maven2/org/springframework/spring-core/4.0.6.RELEASE/spring-core-4.0.6.RELEASE.jar
[INFO] Downloaded from central: https://repo.maven.apache.org/maven2/org/springframework/spring-aop/4.0.6.RELEASE/spring-aop-4.0.6.RELEASE.jar (353 kB at 2.8 MB/s)
[INFO] Downloading from central: https://repo.maven.apache.org/maven2/commons-logging/commons-logging/1.1.3/commons-logging-1.1.3.jar
[INFO] Downloaded from central: https://repo.maven.apache.org/maven2/org/apache/maven/maven-builder-support/3.5.2/maven-builder-support-3.5.2.jar (15 kB at 92 kB/s)
[INFO] Downloading from central: https://repo.maven.apache.org/maven2/org/springframework/spring-test/4.0.6.RELEASE/spring-test-4.0.6.RELEASE.jar
[INFO] Downloaded from central: https://repo.maven.apache.org/maven2/org/springframework/spring-expression/4.0.6.RELEASE/spring-expression-4.0.6.RELEASE.jar (205 kB at 1.2 MB/s)
[INFO] Downloaded from central: https://repo.maven.apache.org/maven2/commons-logging/commons-logging/1.1.3/commons-logging-1.1.3.jar (62 kB at 355 kB/s)
[INFO] Downloaded from central: https://repo.maven.apache.org/maven2/org/springframework/spring-context/4.0.6.RELEASE/spring-context-4.0.6.RELEASE.jar (978 kB at 5.6 MB/s)
[INFO] Downloaded from central: https://repo.maven.apache.org/maven2/org/springframework/spring-core/4.0.6.RELEASE/spring-core-4.0.6.RELEASE.jar (977 kB at 4.5 MB/s)
[INFO] Downloaded from central: https://repo.maven.apache.org/maven2/org/springframework/spring-test/4.0.6.RELEASE/spring-test-4.0.6.RELEASE.jar (449 kB at 1.9 MB/s)
[INFO]
[INFO] --- maven-clean-plugin:3.1.0:clean (default-clean) @ indexer-examples-spring ---
[INFO]
[INFO] --- maven-enforcer-plugin:1.4.1:enforce (enforce-maven-version) @ indexer-examples-spring ---
[INFO]
[INFO] --- maven-enforcer-plugin:1.4.1:enforce (enforce-bytecode-version) @ indexer-examples-spring ---
[INFO]
[INFO] --- maven-enforcer-plugin:1.4.1:enforce (ban-known-bad-maven-versions) @ indexer-examples-spring ---
[INFO]
[INFO] --- apache-rat-plugin:0.12:check (rat-check) @ indexer-examples-spring ---
[INFO] Enabled default license matchers.
[INFO] Will parse SCM ignores for exclusions...
[INFO] Finished adding exclusions from SCM ignore files.
[INFO] 61 implicit excludes (use -debug for more details).
[INFO] Exclude: .repository/**
[INFO] Exclude: .maven/spy.log
[INFO] Exclude: dependency-reduced-pom.xml
[INFO] Exclude: .java-version
[INFO] Exclude: README.md
[INFO] Exclude: .gitignore
[INFO] Exclude: NOTICE
[INFO] Exclude: **/packageinfo
[INFO] Exclude: .git/**
[INFO] Exclude: .idea/**
[INFO] Exclude: **/*.iml
[INFO] Exclude: src/test/**/*.sha1
[INFO] Exclude: src/test/**/*.md5
[INFO] Exclude: src/test/**/*.xml
[INFO] Exclude: src/test/**/*.pom
[INFO] Exclude: src/test/**/*.asc
[INFO] Exclude: src/test/**/*.properties
[INFO] Exclude: src/test/**/*.swc
[INFO] Exclude: src/test/**/*.txt
[INFO] Exclude: src/test/**/*.filename
[INFO] Exclude: src/test/**/.placeholder
[INFO] 14 resources included (use -debug for more details)
[INFO] Rat check: Summary over all files. Unapproved: 0, unknown: 0, generated: 0, approved: 14 licenses.
[INFO]
[INFO] --- maven-remote-resources-plugin:1.5:process (process-resource-bundles) @ indexer-examples-spring ---
[INFO]
[INFO] --- maven-resources-plugin:3.1.0:resources (default-resources) @ indexer-examples-spring ---
[INFO] Using 'UTF-8' encoding to copy filtered resources.
[INFO] Copying 1 resource
[INFO] Copying 3 resources
[INFO]
[INFO] --- maven-compiler-plugin:3.7.0:compile (default-compile) @ indexer-examples-spring ---
[INFO] Changes detected - recompiling the module!
[INFO] Compiling 8 source files to F:\jenkins\jenkins-slave\workspace\maven-box_maven-indexer_master\m\indexer-examples\indexer-examples-spring\target\classes
[INFO]
[INFO] --- animal-sniffer-maven-plugin:1.16:check (check-java-compat) @ indexer-examples-spring ---
[INFO] Checking unresolved references to org.codehaus.mojo.signature:java17:1.0
[INFO]
[INFO] --- maven-resources-plugin:3.1.0:testResources (default-testResources) @ indexer-examples-spring ---
[INFO] Using 'UTF-8' encoding to copy filtered resources.
[INFO] Copying 2 resources
[INFO] Copying 3 resources
[INFO]
[INFO] --- maven-compiler-plugin:3.7.0:testCompile (default-testCompile) @ indexer-examples-spring ---
[INFO] Changes detected - recompiling the module!
[INFO] Compiling 3 source files to F:\jenkins\jenkins-slave\workspace\maven-box_maven-indexer_master\m\indexer-examples\indexer-examples-spring\target\test-classes
[INFO]
[INFO] --- maven-surefire-plugin:2.22.0:test (default-test) @ indexer-examples-spring ---
[INFO] Tests are skipped.
[INFO]
[INFO] --- maven-jar-plugin:3.1.0:jar (default-jar) @ indexer-examples-spring ---
[INFO] Building jar: F:\jenkins\jenkins-slave\workspace\maven-box_maven-indexer_master\m\indexer-examples\indexer-examples-spring\target\indexer-examples-spring-6.1.0-SNAPSHOT.jar
[INFO]
[INFO] --- maven-site-plugin:3.7.1:attach-descriptor (attach-descriptor) @ indexer-examples-spring ---
[INFO] Skipping because packaging 'jar' is not pom.
[INFO]
[INFO] --- maven-checkstyle-plugin:2.17:check (checkstyle-check) @ indexer-examples-spring ---
[INFO] ------------------------------------------------------------------------
[INFO] Reactor Summary for Maven-Indexer 6.1.0-SNAPSHOT:
[INFO]
[INFO] Maven-Indexer ...................................... SUCCESS [ 31.045 s]
[INFO] Maven :: Indexer Core .............................. SUCCESS [05:28 min]
[INFO] Maven :: Indexer CLI ............................... SUCCESS [ 55.032 s]
[INFO] Maven :: Indexer Reader ............................ SUCCESS [  6.606 s]
[INFO] Maven :: Indexer Examples .......................... SUCCESS [  0.687 s]
[INFO] Maven :: Indexer Examples [Basic] .................. SUCCESS [  2.789 s]
[INFO] Maven :: Indexer Examples [Spring] ................. SUCCESS [  4.372 s]
[INFO] ------------------------------------------------------------------------
[INFO] BUILD SUCCESS
[INFO] ------------------------------------------------------------------------
[INFO] Total time:  07:21 min
[INFO] Finished at: 2019-10-25T21:55:22-07:00
[INFO] ------------------------------------------------------------------------
[WARNING] The requested profile "run-its" could not be activated because it does not exist.
[INFO] [jenkins-event-spy] Generated F:\jenkins\jenkins-slave\workspace\maven-box_maven-indexer_master@tmp\withMaven56a55acc\maven-spy-20191025-214800-955120635623782907530.log
[Pipeline] }
[Pipeline] // dir
[Pipeline] }
[withMaven] junitPublisher - Archive test results for Maven artifact org.apache.maven.indexer:indexer-core:jar:6.1.0-SNAPSHOT generated by maven-surefire-plugin:test (default-test): m\indexer-core\target\surefire-reports\*.xml
[withMaven] junitPublisher - Archive test results for Maven artifact org.apache.maven.indexer:indexer-cli:jar:6.1.0-SNAPSHOT generated by maven-surefire-plugin:test (default-test): m\indexer-cli\target\surefire-reports\*.xml
[withMaven] junitPublisher - Archive test results for Maven artifact org.apache.maven.indexer:indexer-reader:bundle:6.1.0-SNAPSHOT generated by maven-surefire-plugin:test (default-test): m\indexer-reader\target\surefire-reports\*.xml
[withMaven] junitPublisher - Archive test results for Maven artifact org.apache.maven.indexer:indexer-examples-basic:jar:6.1.0-SNAPSHOT generated by maven-surefire-plugin:test (default-test): m\indexer-examples\indexer-examples-basic\target\surefire-reports\*.xml
[withMaven] junitPublisher - Archive test results for Maven artifact org.apache.maven.indexer:indexer-examples-spring:jar:6.1.0-SNAPSHOT generated by maven-surefire-plugin:test (default-test): m\indexer-examples\indexer-examples-spring\target\surefire-reports\*.xml
Recording test results
[withMaven] junitPublisher - Archive test results for Maven artifact org.apache.maven.indexer:indexer-core:jar:6.1.0-SNAPSHOT generated by maven-failsafe-plugin:integration-test (default): m\indexer-core\target\failsafe-reports\*.xml
[withMaven] junitPublisher - Archive test results for Maven artifact org.apache.maven.indexer:indexer-cli:jar:6.1.0-SNAPSHOT generated by maven-failsafe-plugin:integration-test (default): m\indexer-cli\target\failsafe-reports\*.xml
Recording test results
[withMaven] Publishers: Pipeline Graph Publisher: 3 ms, Junit Publisher: 1236 ms, Dependencies Fingerprint Publisher: 45 ms
[Pipeline] // withMaven
[Pipeline] cleanWs
[WS-CLEANUP] Deleting project workspace...
[WS-CLEANUP] Deferred wipeout is used...
[WS-CLEANUP] done
[Pipeline] }
[Pipeline] // stage
[Pipeline] }
[Pipeline] // node
[Pipeline] }
[Pipeline] // parallel
[Pipeline] echo
[FAILURE-003] AbortException hudson.AbortException: script returned exit code 1
[Pipeline] stage
[Pipeline] { (Notifications)
[Pipeline] echo
Build result: FAILURE
[Pipeline] jiraIssueSelector
[Pipeline] echo
The authors of changes [rfscholte].
[Pipeline] echo
Sending email ...
[Pipeline] emailext
Reply | Threaded
Open this post in threaded view
|

Build failed in Jenkins: Maven TLP » maven-indexer » master #27

Apache Jenkins Server-2
See https://builds.apache.org/job/maven-box/job/maven-indexer/job/master/27/

No changes.

All tests passed

Build log:
[...truncated 23783 lines...]
[INFO] --- maven-enforcer-plugin:1.4.1:enforce (enforce-bytecode-version) @ indexer-examples-basic ---
[INFO]
[INFO] --- maven-enforcer-plugin:1.4.1:enforce (ban-known-bad-maven-versions) @ indexer-examples-basic ---
[INFO]
[INFO] --- apache-rat-plugin:0.12:check (rat-check) @ indexer-examples-basic ---
[INFO] Enabled default license matchers.
[INFO] Will parse SCM ignores for exclusions...
[INFO] Finished adding exclusions from SCM ignore files.
[INFO] 61 implicit excludes (use -debug for more details).
[INFO] Exclude: .repository/**
[INFO] Exclude: .maven/spy.log
[INFO] Exclude: dependency-reduced-pom.xml
[INFO] Exclude: .java-version
[INFO] Exclude: README.md
[INFO] Exclude: .gitignore
[INFO] Exclude: NOTICE
[INFO] Exclude: **/packageinfo
[INFO] Exclude: .git/**
[INFO] Exclude: .idea/**
[INFO] Exclude: **/*.iml
[INFO] Exclude: src/test/**/*.sha1
[INFO] Exclude: src/test/**/*.md5
[INFO] Exclude: src/test/**/*.xml
[INFO] Exclude: src/test/**/*.pom
[INFO] Exclude: src/test/**/*.asc
[INFO] Exclude: src/test/**/*.properties
[INFO] Exclude: src/test/**/*.swc
[INFO] Exclude: src/test/**/*.txt
[INFO] Exclude: src/test/**/*.filename
[INFO] Exclude: src/test/**/.placeholder
[INFO] 4 resources included (use -debug for more details)
[INFO] Rat check: Summary over all files. Unapproved: 0, unknown: 0, generated: 0, approved: 4 licenses.
[INFO]
[INFO] --- maven-remote-resources-plugin:1.5:process (process-resource-bundles) @ indexer-examples-basic ---
[INFO]
[INFO] --- maven-resources-plugin:3.1.0:resources (default-resources) @ indexer-examples-basic ---
[INFO] Using 'UTF-8' encoding to copy filtered resources.
[INFO] skip non existing resourceDirectory F:\jenkins\jenkins-slave\workspace\maven-box_maven-indexer_master@2\m\indexer-examples\indexer-examples-basic\src\main\resources
[INFO] Copying 3 resources
[INFO]
[INFO] --- maven-compiler-plugin:3.7.0:compile (default-compile) @ indexer-examples-basic ---
[INFO] Changes detected - recompiling the module!
[INFO] Compiling 1 source file to F:\jenkins\jenkins-slave\workspace\maven-box_maven-indexer_master@2\m\indexer-examples\indexer-examples-basic\target\classes
[INFO]
[INFO] --- animal-sniffer-maven-plugin:1.16:check (check-java-compat) @ indexer-examples-basic ---
[INFO] Checking unresolved references to org.codehaus.mojo.signature:java17:1.0
[INFO]
[INFO] --- maven-resources-plugin:3.1.0:testResources (default-testResources) @ indexer-examples-basic ---
[INFO] Using 'UTF-8' encoding to copy filtered resources.
[INFO] skip non existing resourceDirectory F:\jenkins\jenkins-slave\workspace\maven-box_maven-indexer_master@2\m\indexer-examples\indexer-examples-basic\src\test\resources
[INFO] Copying 3 resources
[INFO]
[INFO] --- maven-compiler-plugin:3.7.0:testCompile (default-testCompile) @ indexer-examples-basic ---
[INFO] Changes detected - recompiling the module!
[INFO] Compiling 1 source file to F:\jenkins\jenkins-slave\workspace\maven-box_maven-indexer_master@2\m\indexer-examples\indexer-examples-basic\target\test-classes
[INFO]
[INFO] --- maven-surefire-plugin:2.22.0:test (default-test) @ indexer-examples-basic ---
[INFO] Tests are skipped.
[INFO]
[INFO] --- maven-jar-plugin:3.1.0:jar (default-jar) @ indexer-examples-basic ---
[INFO] Building jar: F:\jenkins\jenkins-slave\workspace\maven-box_maven-indexer_master@2\m\indexer-examples\indexer-examples-basic\target\indexer-examples-basic-6.1.0-SNAPSHOT.jar
[INFO]
[INFO] --- maven-site-plugin:3.7.1:attach-descriptor (attach-descriptor) @ indexer-examples-basic ---
[INFO] Skipping because packaging 'jar' is not pom.
[INFO]
[INFO] --- maven-checkstyle-plugin:2.17:check (checkstyle-check) @ indexer-examples-basic ---
[INFO] There is 1 error reported by Checkstyle 6.11.2 with config/maven_checks.xml ruleset.
[INFO] Ignored 1 error, 0 violation remaining.
[INFO]
[INFO] ----------< org.apache.maven.indexer:indexer-examples-spring >----------
[INFO] Building Maven :: Indexer Examples [Spring] 6.1.0-SNAPSHOT         [7/7]
[INFO] --------------------------------[ jar ]---------------------------------
[INFO] Downloading from central: https://repo.maven.apache.org/maven2/ch/qos/logback/logback-classic/1.2.3/logback-classic-1.2.3.pom
[INFO] Downloaded from central: https://repo.maven.apache.org/maven2/ch/qos/logback/logback-classic/1.2.3/logback-classic-1.2.3.pom (13 kB at 354 kB/s)
[INFO] Downloading from central: https://repo.maven.apache.org/maven2/ch/qos/logback/logback-parent/1.2.3/logback-parent-1.2.3.pom
[INFO] Downloaded from central: https://repo.maven.apache.org/maven2/ch/qos/logback/logback-parent/1.2.3/logback-parent-1.2.3.pom (18 kB at 593 kB/s)
[INFO] Downloading from central: https://repo.maven.apache.org/maven2/ch/qos/logback/logback-core/1.2.3/logback-core-1.2.3.pom
[INFO] Downloaded from central: https://repo.maven.apache.org/maven2/ch/qos/logback/logback-core/1.2.3/logback-core-1.2.3.pom (4.2 kB at 155 kB/s)
[INFO] Downloading from central: https://repo.maven.apache.org/maven2/org/apache/maven/maven-model-builder/3.5.2/maven-model-builder-3.5.2.pom
[INFO] Downloaded from central: https://repo.maven.apache.org/maven2/org/apache/maven/maven-model-builder/3.5.2/maven-model-builder-3.5.2.pom (3.1 kB at 116 kB/s)
[INFO] Downloading from central: https://repo.maven.apache.org/maven2/org/apache/maven/maven-artifact/3.5.2/maven-artifact-3.5.2.pom
[INFO] Downloaded from central: https://repo.maven.apache.org/maven2/org/apache/maven/maven-artifact/3.5.2/maven-artifact-3.5.2.pom (2.1 kB at 101 kB/s)
[INFO] Downloading from central: https://repo.maven.apache.org/maven2/org/apache/maven/maven-builder-support/3.5.2/maven-builder-support-3.5.2.pom
[INFO] Downloaded from central: https://repo.maven.apache.org/maven2/org/apache/maven/maven-builder-support/3.5.2/maven-builder-support-3.5.2.pom (1.5 kB at 44 kB/s)
[INFO] Downloading from central: https://repo.maven.apache.org/maven2/org/springframework/spring-beans/4.0.6.RELEASE/spring-beans-4.0.6.RELEASE.pom
[INFO] Downloaded from central: https://repo.maven.apache.org/maven2/org/springframework/spring-beans/4.0.6.RELEASE/spring-beans-4.0.6.RELEASE.pom (2.3 kB at 79 kB/s)
[INFO] Downloading from central: https://repo.maven.apache.org/maven2/org/springframework/spring-core/4.0.6.RELEASE/spring-core-4.0.6.RELEASE.pom
[INFO] Downloaded from central: https://repo.maven.apache.org/maven2/org/springframework/spring-core/4.0.6.RELEASE/spring-core-4.0.6.RELEASE.pom (2.3 kB at 91 kB/s)
[INFO] Downloading from central: https://repo.maven.apache.org/maven2/commons-logging/commons-logging/1.1.3/commons-logging-1.1.3.pom
[INFO] Downloaded from central: https://repo.maven.apache.org/maven2/commons-logging/commons-logging/1.1.3/commons-logging-1.1.3.pom (18 kB at 574 kB/s)
[INFO] Downloading from central: https://repo.maven.apache.org/maven2/org/apache/commons/commons-parent/28/commons-parent-28.pom
[INFO] Downloaded from central: https://repo.maven.apache.org/maven2/org/apache/commons/commons-parent/28/commons-parent-28.pom (50 kB at 1.2 MB/s)
[INFO] Downloading from central: https://repo.maven.apache.org/maven2/org/springframework/spring-context/4.0.6.RELEASE/spring-context-4.0.6.RELEASE.pom
[INFO] Downloaded from central: https://repo.maven.apache.org/maven2/org/springframework/spring-context/4.0.6.RELEASE/spring-context-4.0.6.RELEASE.pom (4.8 kB at 210 kB/s)
[INFO] Downloading from central: https://repo.maven.apache.org/maven2/org/springframework/spring-aop/4.0.6.RELEASE/spring-aop-4.0.6.RELEASE.pom
[INFO] Downloaded from central: https://repo.maven.apache.org/maven2/org/springframework/spring-aop/4.0.6.RELEASE/spring-aop-4.0.6.RELEASE.pom (2.7 kB at 92 kB/s)
[INFO] Downloading from central: https://repo.maven.apache.org/maven2/org/springframework/spring-expression/4.0.6.RELEASE/spring-expression-4.0.6.RELEASE.pom
[INFO] Downloaded from central: https://repo.maven.apache.org/maven2/org/springframework/spring-expression/4.0.6.RELEASE/spring-expression-4.0.6.RELEASE.pom (1.7 kB at 58 kB/s)
[INFO] Downloading from central: https://repo.maven.apache.org/maven2/org/springframework/spring-test/4.0.6.RELEASE/spring-test-4.0.6.RELEASE.pom
[INFO] Downloaded from central: https://repo.maven.apache.org/maven2/org/springframework/spring-test/4.0.6.RELEASE/spring-test-4.0.6.RELEASE.pom (6.7 kB at 12 kB/s)
[INFO] Downloading from central: https://repo.maven.apache.org/maven2/ch/qos/logback/logback-classic/1.2.3/logback-classic-1.2.3.jar
[INFO] Downloading from central: https://repo.maven.apache.org/maven2/org/apache/maven/maven-builder-support/3.5.2/maven-builder-support-3.5.2.jar
[INFO] Downloading from central: https://repo.maven.apache.org/maven2/org/apache/maven/maven-artifact/3.5.2/maven-artifact-3.5.2.jar
[INFO] Downloading from central: https://repo.maven.apache.org/maven2/org/apache/maven/maven-model-builder/3.5.2/maven-model-builder-3.5.2.jar
[INFO] Downloading from central: https://repo.maven.apache.org/maven2/ch/qos/logback/logback-core/1.2.3/logback-core-1.2.3.jar
[INFO] Downloaded from central: https://repo.maven.apache.org/maven2/org/apache/maven/maven-artifact/3.5.2/maven-artifact-3.5.2.jar (55 kB at 1.2 MB/s)
[INFO] Downloading from central: https://repo.maven.apache.org/maven2/org/springframework/spring-beans/4.0.6.RELEASE/spring-beans-4.0.6.RELEASE.jar
[INFO] Downloaded from central: https://repo.maven.apache.org/maven2/ch/qos/logback/logback-classic/1.2.3/logback-classic-1.2.3.jar (290 kB at 5.8 MB/s)
[INFO] Downloading from central: https://repo.maven.apache.org/maven2/org/springframework/spring-context/4.0.6.RELEASE/spring-context-4.0.6.RELEASE.jar
[INFO] Downloaded from central: https://repo.maven.apache.org/maven2/org/apache/maven/maven-model-builder/3.5.2/maven-model-builder-3.5.2.jar (180 kB at 3.3 MB/s)
[INFO] Downloading from central: https://repo.maven.apache.org/maven2/org/springframework/spring-aop/4.0.6.RELEASE/spring-aop-4.0.6.RELEASE.jar
[INFO] Downloaded from central: https://repo.maven.apache.org/maven2/ch/qos/logback/logback-core/1.2.3/logback-core-1.2.3.jar (472 kB at 5.0 MB/s)
[INFO] Downloading from central: https://repo.maven.apache.org/maven2/org/springframework/spring-expression/4.0.6.RELEASE/spring-expression-4.0.6.RELEASE.jar
[INFO] Downloaded from central: https://repo.maven.apache.org/maven2/org/springframework/spring-aop/4.0.6.RELEASE/spring-aop-4.0.6.RELEASE.jar (353 kB at 2.9 MB/s)
[INFO] Downloading from central: https://repo.maven.apache.org/maven2/org/springframework/spring-core/4.0.6.RELEASE/spring-core-4.0.6.RELEASE.jar
[INFO] Downloaded from central: https://repo.maven.apache.org/maven2/org/springframework/spring-context/4.0.6.RELEASE/spring-context-4.0.6.RELEASE.jar (978 kB at 7.3 MB/s)
[INFO] Downloading from central: https://repo.maven.apache.org/maven2/commons-logging/commons-logging/1.1.3/commons-logging-1.1.3.jar
[INFO] Downloaded from central: https://repo.maven.apache.org/maven2/org/springframework/spring-beans/4.0.6.RELEASE/spring-beans-4.0.6.RELEASE.jar (670 kB at 4.9 MB/s)
[INFO] Downloading from central: https://repo.maven.apache.org/maven2/org/springframework/spring-test/4.0.6.RELEASE/spring-test-4.0.6.RELEASE.jar
[INFO] Downloaded from central: https://repo.maven.apache.org/maven2/org/springframework/spring-expression/4.0.6.RELEASE/spring-expression-4.0.6.RELEASE.jar (205 kB at 1.4 MB/s)
[INFO] Downloaded from central: https://repo.maven.apache.org/maven2/commons-logging/commons-logging/1.1.3/commons-logging-1.1.3.jar (62 kB at 355 kB/s)
[INFO] Downloaded from central: https://repo.maven.apache.org/maven2/org/springframework/spring-test/4.0.6.RELEASE/spring-test-4.0.6.RELEASE.jar (449 kB at 2.4 MB/s)
[INFO] Downloaded from central: https://repo.maven.apache.org/maven2/org/apache/maven/maven-builder-support/3.5.2/maven-builder-support-3.5.2.jar (15 kB at 75 kB/s)
[INFO] Downloaded from central: https://repo.maven.apache.org/maven2/org/springframework/spring-core/4.0.6.RELEASE/spring-core-4.0.6.RELEASE.jar (977 kB at 4.6 MB/s)
[INFO]
[INFO] --- maven-clean-plugin:3.1.0:clean (default-clean) @ indexer-examples-spring ---
[INFO]
[INFO] --- maven-enforcer-plugin:1.4.1:enforce (enforce-maven-version) @ indexer-examples-spring ---
[INFO]
[INFO] --- maven-enforcer-plugin:1.4.1:enforce (enforce-bytecode-version) @ indexer-examples-spring ---
[INFO]
[INFO] --- maven-enforcer-plugin:1.4.1:enforce (ban-known-bad-maven-versions) @ indexer-examples-spring ---
[INFO]
[INFO] --- apache-rat-plugin:0.12:check (rat-check) @ indexer-examples-spring ---
[INFO] Enabled default license matchers.
[INFO] Will parse SCM ignores for exclusions...
[INFO] Finished adding exclusions from SCM ignore files.
[INFO] 61 implicit excludes (use -debug for more details).
[INFO] Exclude: .repository/**
[INFO] Exclude: .maven/spy.log
[INFO] Exclude: dependency-reduced-pom.xml
[INFO] Exclude: .java-version
[INFO] Exclude: README.md
[INFO] Exclude: .gitignore
[INFO] Exclude: NOTICE
[INFO] Exclude: **/packageinfo
[INFO] Exclude: .git/**
[INFO] Exclude: .idea/**
[INFO] Exclude: **/*.iml
[INFO] Exclude: src/test/**/*.sha1
[INFO] Exclude: src/test/**/*.md5
[INFO] Exclude: src/test/**/*.xml
[INFO] Exclude: src/test/**/*.pom
[INFO] Exclude: src/test/**/*.asc
[INFO] Exclude: src/test/**/*.properties
[INFO] Exclude: src/test/**/*.swc
[INFO] Exclude: src/test/**/*.txt
[INFO] Exclude: src/test/**/*.filename
[INFO] Exclude: src/test/**/.placeholder
[INFO] 14 resources included (use -debug for more details)
[INFO] Rat check: Summary over all files. Unapproved: 0, unknown: 0, generated: 0, approved: 14 licenses.
[INFO]
[INFO] --- maven-remote-resources-plugin:1.5:process (process-resource-bundles) @ indexer-examples-spring ---
[INFO]
[INFO] --- maven-resources-plugin:3.1.0:resources (default-resources) @ indexer-examples-spring ---
[INFO] Using 'UTF-8' encoding to copy filtered resources.
[INFO] Copying 1 resource
[INFO] Copying 3 resources
[INFO]
[INFO] --- maven-compiler-plugin:3.7.0:compile (default-compile) @ indexer-examples-spring ---
[INFO] Changes detected - recompiling the module!
[INFO] Compiling 8 source files to F:\jenkins\jenkins-slave\workspace\maven-box_maven-indexer_master@2\m\indexer-examples\indexer-examples-spring\target\classes
[INFO]
[INFO] --- animal-sniffer-maven-plugin:1.16:check (check-java-compat) @ indexer-examples-spring ---
[INFO] Checking unresolved references to org.codehaus.mojo.signature:java17:1.0
[INFO]
[INFO] --- maven-resources-plugin:3.1.0:testResources (default-testResources) @ indexer-examples-spring ---
[INFO] Using 'UTF-8' encoding to copy filtered resources.
[INFO] Copying 2 resources
[INFO] Copying 3 resources
[INFO]
[INFO] --- maven-compiler-plugin:3.7.0:testCompile (default-testCompile) @ indexer-examples-spring ---
[INFO] Changes detected - recompiling the module!
[INFO] Compiling 3 source files to F:\jenkins\jenkins-slave\workspace\maven-box_maven-indexer_master@2\m\indexer-examples\indexer-examples-spring\target\test-classes
[INFO]
[INFO] --- maven-surefire-plugin:2.22.0:test (default-test) @ indexer-examples-spring ---
[INFO] Tests are skipped.
[INFO]
[INFO] --- maven-jar-plugin:3.1.0:jar (default-jar) @ indexer-examples-spring ---
[INFO] Building jar: F:\jenkins\jenkins-slave\workspace\maven-box_maven-indexer_master@2\m\indexer-examples\indexer-examples-spring\target\indexer-examples-spring-6.1.0-SNAPSHOT.jar
[INFO]
[INFO] --- maven-site-plugin:3.7.1:attach-descriptor (attach-descriptor) @ indexer-examples-spring ---
[INFO] Skipping because packaging 'jar' is not pom.
[INFO]
[INFO] --- maven-checkstyle-plugin:2.17:check (checkstyle-check) @ indexer-examples-spring ---
[INFO] ------------------------------------------------------------------------
[INFO] Reactor Summary for Maven-Indexer 6.1.0-SNAPSHOT:
[INFO]
[INFO] Maven-Indexer ...................................... SUCCESS [ 40.056 s]
[INFO] Maven :: Indexer Core .............................. SUCCESS [09:16 min]
[INFO] Maven :: Indexer CLI ............................... SUCCESS [01:09 min]
[INFO] Maven :: Indexer Reader ............................ SUCCESS [  7.739 s]
[INFO] Maven :: Indexer Examples .......................... SUCCESS [  0.530 s]
[INFO] Maven :: Indexer Examples [Basic] .................. SUCCESS [  2.665 s]
[INFO] Maven :: Indexer Examples [Spring] ................. SUCCESS [  6.305 s]
[INFO] ------------------------------------------------------------------------
[INFO] BUILD SUCCESS
[INFO] ------------------------------------------------------------------------
[INFO] Total time:  11:39 min
[INFO] Finished at: 2019-10-27T01:40:26-07:00
[INFO] ------------------------------------------------------------------------
[WARNING] The requested profile "run-its" could not be activated because it does not exist.
[INFO] [jenkins-event-spy] Generated F:\jenkins\jenkins-slave\workspace\maven-box_maven-indexer_master@2@tmp\withMaven29796447\maven-spy-20191027-012846-9396860922591842624764.log
[Pipeline] }
[Pipeline] // dir
[Pipeline] }
[withMaven] junitPublisher - Archive test results for Maven artifact org.apache.maven.indexer:indexer-core:jar:6.1.0-SNAPSHOT generated by maven-surefire-plugin:test (default-test): m\indexer-core\target\surefire-reports\*.xml
[withMaven] junitPublisher - Archive test results for Maven artifact org.apache.maven.indexer:indexer-cli:jar:6.1.0-SNAPSHOT generated by maven-surefire-plugin:test (default-test): m\indexer-cli\target\surefire-reports\*.xml
[withMaven] junitPublisher - Archive test results for Maven artifact org.apache.maven.indexer:indexer-reader:bundle:6.1.0-SNAPSHOT generated by maven-surefire-plugin:test (default-test): m\indexer-reader\target\surefire-reports\*.xml
[withMaven] junitPublisher - Archive test results for Maven artifact org.apache.maven.indexer:indexer-examples-basic:jar:6.1.0-SNAPSHOT generated by maven-surefire-plugin:test (default-test): m\indexer-examples\indexer-examples-basic\target\surefire-reports\*.xml
[withMaven] junitPublisher - Archive test results for Maven artifact org.apache.maven.indexer:indexer-examples-spring:jar:6.1.0-SNAPSHOT generated by maven-surefire-plugin:test (default-test): m\indexer-examples\indexer-examples-spring\target\surefire-reports\*.xml
Recording test results
[withMaven] junitPublisher - Archive test results for Maven artifact org.apache.maven.indexer:indexer-core:jar:6.1.0-SNAPSHOT generated by maven-failsafe-plugin:integration-test (default): m\indexer-core\target\failsafe-reports\*.xml
[withMaven] junitPublisher - Archive test results for Maven artifact org.apache.maven.indexer:indexer-cli:jar:6.1.0-SNAPSHOT generated by maven-failsafe-plugin:integration-test (default): m\indexer-cli\target\failsafe-reports\*.xml
Recording test results
[withMaven] Publishers: Pipeline Graph Publisher: 5 ms, Junit Publisher: 1429 ms, Dependencies Fingerprint Publisher: 45 ms
[Pipeline] // withMaven
[Pipeline] cleanWs
[WS-CLEANUP] Deleting project workspace...
[WS-CLEANUP] Deferred wipeout is used...
[WS-CLEANUP] done
[Pipeline] }
[Pipeline] // stage
[Pipeline] }
[Pipeline] // node
[Pipeline] }
[Pipeline] // parallel
[Pipeline] echo
[FAILURE-003] AbortException hudson.AbortException: Error cloning remote repo 'origin'
[Pipeline] stage
[Pipeline] { (Notifications)
[Pipeline] echo
Build result: FAILURE
[Pipeline] jiraIssueSelector
[Pipeline] echo
The authors of changes [].
[Pipeline] echo
Sending email ...
[Pipeline] emailext
Reply | Threaded
Open this post in threaded view
|

Build succeeded in Jenkins: Maven TLP » maven-indexer » master #28

Apache Jenkins Server-2
See https://builds.apache.org/job/maven-box/job/maven-indexer/job/master/28/

Changes:

* echo NODE_NAME

All tests passed