Build failed in Jenkins: Maven TLP » maven-indexer » MINDEXER-120 #1

classic Classic list List threaded Threaded
2 messages Options
Reply | Threaded
Open this post in threaded view
|

Build failed in Jenkins: Maven TLP » maven-indexer » MINDEXER-120 #1

Apache Jenkins Server-2
See https://builds.apache.org/job/maven-box/job/maven-indexer/job/MINDEXER-120/1/

No changes.

All tests passed

Build log:
[...truncated 26127 lines...]
[withMaven] pipelineGraphPublisher - Skip recording release dependency: commons-logging:commons-logging:jar:1.1.3
[withMaven] pipelineGraphPublisher - Skip recording release dependency: org.springframework:spring-test:jar:4.0.6.RELEASE
[withMaven] pipelineGraphPublisher - Skip recording release dependency: junit:junit:jar:4.12
[withMaven] pipelineGraphPublisher - Skip recording release dependency: org.hamcrest:hamcrest-core:jar:1.3
[withMaven] pipelineGraphPublisher - recordGeneratedArtifacts...
[withMaven] pipelineGraphPublisher - Record generated artifact: org.apache.maven.indexer:maven-indexer:pom:6.1.0-SNAPSHOT, version: 6.1.0-SNAPSHOT, executedLifecyclePhases: [clean, validate, generate-resources, process-classes, package, verify, process-resources, compile, process-test-resources, test-compile, test, integration-test], skipDownstreamTriggers: false, lifecycleThreshold:deploy, file: /home/jenkins/jenkins-slave/workspace/n-box_maven-indexer_MINDEXER-120/m/pom.xml
[withMaven] pipelineGraphPublisher - Record generated artifact: org.apache.maven.indexer:maven-indexer:xml:site:6.1.0-SNAPSHOT, version: 6.1.0-SNAPSHOT, executedLifecyclePhases: [clean, validate, generate-resources, process-classes, package, verify, process-resources, compile, process-test-resources, test-compile, test, integration-test], skipDownstreamTriggers: false, lifecycleThreshold:deploy, file: /home/jenkins/jenkins-slave/workspace/n-box_maven-indexer_MINDEXER-120/m/target/maven-indexer-6.1.0-SNAPSHOT-site.xml
[withMaven] pipelineGraphPublisher - Record generated artifact: org.apache.maven.indexer:indexer-core:pom:6.1.0-SNAPSHOT, version: 6.1.0-SNAPSHOT, executedLifecyclePhases: [clean, validate, generate-resources, process-classes, package, verify, process-resources, compile, process-test-resources, test-compile, test, integration-test], skipDownstreamTriggers: false, lifecycleThreshold:deploy, file: /home/jenkins/jenkins-slave/workspace/n-box_maven-indexer_MINDEXER-120/m/indexer-core/pom.xml
[withMaven] pipelineGraphPublisher - Record generated artifact: org.apache.maven.indexer:indexer-core:jar:6.1.0-SNAPSHOT, version: 6.1.0-SNAPSHOT, executedLifecyclePhases: [clean, validate, generate-resources, process-classes, package, verify, process-resources, compile, process-test-resources, test-compile, test, integration-test], skipDownstreamTriggers: false, lifecycleThreshold:deploy, file: /home/jenkins/jenkins-slave/workspace/n-box_maven-indexer_MINDEXER-120/m/indexer-core/target/indexer-core-6.1.0-SNAPSHOT.jar
[withMaven] pipelineGraphPublisher - Record generated artifact: org.apache.maven.indexer:indexer-core:jar:shaded-lucene:6.1.0-SNAPSHOT, version: 6.1.0-SNAPSHOT, executedLifecyclePhases: [clean, validate, generate-resources, process-classes, package, verify, process-resources, compile, process-test-resources, test-compile, test, integration-test], skipDownstreamTriggers: false, lifecycleThreshold:deploy, file: /home/jenkins/jenkins-slave/workspace/n-box_maven-indexer_MINDEXER-120/m/indexer-core/target/indexer-core-6.1.0-SNAPSHOT-shaded-lucene.jar
[withMaven] pipelineGraphPublisher - Record generated artifact: org.apache.maven.indexer:indexer-cli:pom:6.1.0-SNAPSHOT, version: 6.1.0-SNAPSHOT, executedLifecyclePhases: [clean, validate, generate-resources, process-classes, package, verify, process-resources, compile, process-test-resources, test-compile, test, integration-test], skipDownstreamTriggers: false, lifecycleThreshold:deploy, file: /home/jenkins/jenkins-slave/workspace/n-box_maven-indexer_MINDEXER-120/m/indexer-cli/pom.xml
[withMaven] pipelineGraphPublisher - Record generated artifact: org.apache.maven.indexer:indexer-cli:jar:6.1.0-SNAPSHOT, version: 6.1.0-SNAPSHOT, executedLifecyclePhases: [clean, validate, generate-resources, process-classes, package, verify, process-resources, compile, process-test-resources, test-compile, test, integration-test], skipDownstreamTriggers: false, lifecycleThreshold:deploy, file: /home/jenkins/jenkins-slave/workspace/n-box_maven-indexer_MINDEXER-120/m/indexer-cli/target/indexer-cli-6.1.0-SNAPSHOT.jar
[withMaven] pipelineGraphPublisher - Record generated artifact: org.apache.maven.indexer:indexer-reader:pom:6.1.0-SNAPSHOT, version: 6.1.0-SNAPSHOT, executedLifecyclePhases: [clean, validate, generate-resources, process-classes, package, verify, process-resources, compile, process-test-resources, test-compile, test, integration-test], skipDownstreamTriggers: false, lifecycleThreshold:deploy, file: /home/jenkins/jenkins-slave/workspace/n-box_maven-indexer_MINDEXER-120/m/indexer-reader/pom.xml
[withMaven] pipelineGraphPublisher - Record generated artifact: org.apache.maven.indexer:indexer-reader:bundle:6.1.0-SNAPSHOT, version: 6.1.0-SNAPSHOT, executedLifecyclePhases: [clean, validate, generate-resources, process-classes, package, verify, process-resources, compile, process-test-resources, test-compile, test, integration-test], skipDownstreamTriggers: false, lifecycleThreshold:deploy, file: /home/jenkins/jenkins-slave/workspace/n-box_maven-indexer_MINDEXER-120/m/indexer-reader/target/indexer-reader-6.1.0-SNAPSHOT.jar
[withMaven] pipelineGraphPublisher - Record generated artifact: org.apache.maven.indexer:maven-indexer-examples:pom:6.1.0-SNAPSHOT, version: 6.1.0-SNAPSHOT, executedLifecyclePhases: [clean, validate, generate-resources, process-classes, package, verify, process-resources, compile, process-test-resources, test-compile, test, integration-test], skipDownstreamTriggers: false, lifecycleThreshold:deploy, file: /home/jenkins/jenkins-slave/workspace/n-box_maven-indexer_MINDEXER-120/m/indexer-examples/pom.xml
[withMaven] pipelineGraphPublisher - Record generated artifact: org.apache.maven.indexer:indexer-examples-basic:pom:6.1.0-SNAPSHOT, version: 6.1.0-SNAPSHOT, executedLifecyclePhases: [clean, validate, generate-resources, process-classes, package, verify, process-resources, compile, process-test-resources, test-compile, test, integration-test], skipDownstreamTriggers: false, lifecycleThreshold:deploy, file: /home/jenkins/jenkins-slave/workspace/n-box_maven-indexer_MINDEXER-120/m/indexer-examples/indexer-examples-basic/pom.xml
[withMaven] pipelineGraphPublisher - Record generated artifact: org.apache.maven.indexer:indexer-examples-basic:jar:6.1.0-SNAPSHOT, version: 6.1.0-SNAPSHOT, executedLifecyclePhases: [clean, validate, generate-resources, process-classes, package, verify, process-resources, compile, process-test-resources, test-compile, test, integration-test], skipDownstreamTriggers: false, lifecycleThreshold:deploy, file: /home/jenkins/jenkins-slave/workspace/n-box_maven-indexer_MINDEXER-120/m/indexer-examples/indexer-examples-basic/target/indexer-examples-basic-6.1.0-SNAPSHOT.jar
[withMaven] pipelineGraphPublisher - Record generated artifact: org.apache.maven.indexer:indexer-examples-spring:pom:6.1.0-SNAPSHOT, version: 6.1.0-SNAPSHOT, executedLifecyclePhases: [clean, validate, generate-resources, process-classes, package, verify, process-resources, compile, process-test-resources, test-compile, test, integration-test], skipDownstreamTriggers: false, lifecycleThreshold:deploy, file: /home/jenkins/jenkins-slave/workspace/n-box_maven-indexer_MINDEXER-120/m/indexer-examples/indexer-examples-spring/pom.xml
[withMaven] pipelineGraphPublisher - Record generated artifact: org.apache.maven.indexer:indexer-examples-spring:jar:6.1.0-SNAPSHOT, version: 6.1.0-SNAPSHOT, executedLifecyclePhases: [clean, validate, generate-resources, process-classes, package, verify, process-resources, compile, process-test-resources, test-compile, test, integration-test], skipDownstreamTriggers: false, lifecycleThreshold:deploy, file: /home/jenkins/jenkins-slave/workspace/n-box_maven-indexer_MINDEXER-120/m/indexer-examples/indexer-examples-spring/target/indexer-examples-spring-6.1.0-SNAPSHOT.jar
[withMaven] Skip 'Generated Artifacts Publisher' disabled by configuration
[withMaven] Run 'Invoker Publisher'...
[withMaven] invokerPublisher - No org.apache.maven.plugins:maven-invoker-plugin:run or org.apache.maven.plugins:maven-invoker-plugin:integration-test execution found
[withMaven] Run 'Junit Publisher'...
[withMaven] junitPublisher - Archive test results for Maven artifact org.apache.maven.indexer:indexer-core:jar:6.1.0-SNAPSHOT generated by maven-surefire-plugin:test (default-test): m/indexer-core/target/surefire-reports/*.xml
[withMaven] junitPublisher - Archive test results for Maven artifact org.apache.maven.indexer:indexer-cli:jar:6.1.0-SNAPSHOT generated by maven-surefire-plugin:test (default-test): m/indexer-cli/target/surefire-reports/*.xml
[withMaven] junitPublisher - Archive test results for Maven artifact org.apache.maven.indexer:indexer-reader:bundle:6.1.0-SNAPSHOT generated by maven-surefire-plugin:test (default-test): m/indexer-reader/target/surefire-reports/*.xml
[withMaven] junitPublisher - Archive test results for Maven artifact org.apache.maven.indexer:indexer-examples-basic:jar:6.1.0-SNAPSHOT generated by maven-surefire-plugin:test (default-test): m/indexer-examples/indexer-examples-basic/target/surefire-reports/*.xml
[withMaven] junitPublisher - Archive test results for Maven artifact org.apache.maven.indexer:indexer-examples-spring:jar:6.1.0-SNAPSHOT generated by maven-surefire-plugin:test (default-test): m/indexer-examples/indexer-examples-spring/target/surefire-reports/*.xml
[withMaven] junitPublisher - Publish junit test attachments...
[withMaven] junitPublisher - collect test reports: testResults=m/indexer-core/target/surefire-reports/*.xml,m/indexer-cli/target/surefire-reports/*.xml,m/indexer-reader/target/surefire-reports/*.xml,m/indexer-examples/indexer-examples-basic/target/surefire-reports/*.xml,m/indexer-examples/indexer-examples-spring/target/surefire-reports/*.xml, healthScaleFactor=1.0
Recording test results
[withMaven] junitPublisher - unit tests are all successful
[withMaven] junitPublisher - Archive test results for Maven artifact org.apache.maven.indexer:indexer-core:jar:6.1.0-SNAPSHOT generated by maven-failsafe-plugin:integration-test (default): m/indexer-core/target/failsafe-reports/*.xml
[withMaven] junitPublisher - Archive test results for Maven artifact org.apache.maven.indexer:indexer-cli:jar:6.1.0-SNAPSHOT generated by maven-failsafe-plugin:integration-test (default): m/indexer-cli/target/failsafe-reports/*.xml
[withMaven] junitPublisher - Publish junit test attachments...
[withMaven] junitPublisher - collect test reports: testResults=m/indexer-core/target/failsafe-reports/*.xml,m/indexer-cli/target/failsafe-reports/*.xml, healthScaleFactor=1.0
Recording test results
[withMaven] junitPublisher - unit tests are all successful
[withMaven] junitPublisher - No org.apache.maven.plugins:tycho-surefire-plugin:test execution found
[withMaven] Run 'Concordion Publisher'...
[withMaven] concordionPublisher - No concordion output dir pattern given, skip.
[withMaven] Run 'Dependencies Fingerprint Publisher'...
[withMaven] dependenciesFingerprintPublisher - filter: versions[snapshot: true, release: false], scopes:[compile, provided, runtime]
[withMaven] Skip fingerprinting release dependency: MavenDependency{org.slf4j:slf4j-api:jar:1.7.25, scope: compile,  optional: false version: 1.7.25 snapshot: false /home/jenkins/jenkins-slave/workspace/n-box_maven-indexer_MINDEXER-120/.repository/org/slf4j/slf4j-api/1.7.25/slf4j-api-1.7.25.jar}
[withMaven] Skip fingerprinting release dependency: MavenDependency{com.google.guava:guava:jar:20.0, scope: compile,  optional: false version: 20.0 snapshot: false /home/jenkins/jenkins-slave/workspace/n-box_maven-indexer_MINDEXER-120/.repository/com/google/guava/guava/20.0/guava-20.0.jar}
[withMaven] Skip fingerprinting release dependency: MavenDependency{javax.inject:javax.inject:jar:1, scope: compile,  optional: false version: 1 snapshot: false /home/jenkins/jenkins-slave/workspace/n-box_maven-indexer_MINDEXER-120/.repository/javax/inject/javax.inject/1/javax.inject-1.jar}
[withMaven] Skip fingerprinting release dependency: MavenDependency{javax.annotation:javax.annotation-api:jar:1.2, scope: compile,  optional: false version: 1.2 snapshot: false /home/jenkins/jenkins-slave/workspace/n-box_maven-indexer_MINDEXER-120/.repository/javax/annotation/javax.annotation-api/1.2/javax.annotation-api-1.2.jar}
[withMaven] Skip fingerprinting release dependency: MavenDependency{com.google.code.findbugs:jsr305:jar:3.0.2, scope: compile,  optional: false version: 3.0.2 snapshot: false /home/jenkins/jenkins-slave/workspace/n-box_maven-indexer_MINDEXER-120/.repository/com/google/code/findbugs/jsr305/3.0.2/jsr305-3.0.2.jar}
[withMaven] Skip fingerprinting release dependency: MavenDependency{org.eclipse.sisu:org.eclipse.sisu.inject:jar:0.3.3, scope: provided,  optional: false version: 0.3.3 snapshot: false /home/jenkins/jenkins-slave/workspace/n-box_maven-indexer_MINDEXER-120/.repository/org/eclipse/sisu/org.eclipse.sisu.inject/0.3.3/org.eclipse.sisu.inject-0.3.3.jar}
[withMaven] Skip fingerprinting release dependency: MavenDependency{com.google.inject:guice:jar:4.1.0, scope: compile,  optional: false version: 4.1.0 snapshot: false /home/jenkins/jenkins-slave/workspace/n-box_maven-indexer_MINDEXER-120/.repository/com/google/inject/guice/4.1.0/guice-4.1.0.jar}
[withMaven] Skip fingerprinting release dependency: MavenDependency{aopalliance:aopalliance:jar:1.0, scope: compile,  optional: false version: 1.0 snapshot: false /home/jenkins/jenkins-slave/workspace/n-box_maven-indexer_MINDEXER-120/.repository/aopalliance/aopalliance/1.0/aopalliance-1.0.jar}
[withMaven] Skip fingerprinting release dependency: MavenDependency{org.eclipse.sisu:org.eclipse.sisu.plexus:jar:0.3.3, scope: provided,  optional: false version: 0.3.3 snapshot: false /home/jenkins/jenkins-slave/workspace/n-box_maven-indexer_MINDEXER-120/.repository/org/eclipse/sisu/org.eclipse.sisu.plexus/0.3.3/org.eclipse.sisu.plexus-0.3.3.jar}
[withMaven] Skip fingerprinting release dependency: MavenDependency{javax.enterprise:cdi-api:jar:1.0, scope: provided,  optional: false version: 1.0 snapshot: false /home/jenkins/jenkins-slave/workspace/n-box_maven-indexer_MINDEXER-120/.repository/javax/enterprise/cdi-api/1.0/cdi-api-1.0.jar}
[withMaven] Skip fingerprinting release dependency: MavenDependency{org.codehaus.plexus:plexus-component-annotations:jar:1.7.1, scope: provided,  optional: false version: 1.7.1 snapshot: false /home/jenkins/jenkins-slave/workspace/n-box_maven-indexer_MINDEXER-120/.repository/org/codehaus/plexus/plexus-component-annotations/1.7.1/plexus-component-annotations-1.7.1.jar}
[withMaven] Skip fingerprinting release dependency: MavenDependency{org.codehaus.plexus:plexus-classworlds:jar:2.5.2, scope: provided,  optional: false version: 2.5.2 snapshot: false /home/jenkins/jenkins-slave/workspace/n-box_maven-indexer_MINDEXER-120/.repository/org/codehaus/plexus/plexus-classworlds/2.5.2/plexus-classworlds-2.5.2.jar}
[withMaven] Skip fingerprinting release dependency: MavenDependency{org.codehaus.plexus:plexus-utils:jar:3.0.17, scope: compile,  optional: false version: 3.0.17 snapshot: false /home/jenkins/jenkins-slave/workspace/n-box_maven-indexer_MINDEXER-120/.repository/org/codehaus/plexus/plexus-utils/3.0.17/plexus-utils-3.0.17.jar}
[withMaven] Skip fingerprinting release dependency: MavenDependency{org.apache.lucene:lucene-core:jar:5.5.5, scope: compile,  optional: false version: 5.5.5 snapshot: false /home/jenkins/jenkins-slave/workspace/n-box_maven-indexer_MINDEXER-120/.repository/org/apache/lucene/lucene-core/5.5.5/lucene-core-5.5.5.jar}
[withMaven] Skip fingerprinting release dependency: MavenDependency{org.apache.lucene:lucene-queryparser:jar:5.5.5, scope: compile,  optional: false version: 5.5.5 snapshot: false /home/jenkins/jenkins-slave/workspace/n-box_maven-indexer_MINDEXER-120/.repository/org/apache/lucene/lucene-queryparser/5.5.5/lucene-queryparser-5.5.5.jar}
[withMaven] Skip fingerprinting release dependency: MavenDependency{org.apache.lucene:lucene-queries:jar:5.5.5, scope: compile,  optional: false version: 5.5.5 snapshot: false /home/jenkins/jenkins-slave/workspace/n-box_maven-indexer_MINDEXER-120/.repository/org/apache/lucene/lucene-queries/5.5.5/lucene-queries-5.5.5.jar}
[withMaven] Skip fingerprinting release dependency: MavenDependency{org.apache.lucene:lucene-sandbox:jar:5.5.5, scope: compile,  optional: false version: 5.5.5 snapshot: false /home/jenkins/jenkins-slave/workspace/n-box_maven-indexer_MINDEXER-120/.repository/org/apache/lucene/lucene-sandbox/5.5.5/lucene-sandbox-5.5.5.jar}
[withMaven] Skip fingerprinting release dependency: MavenDependency{org.apache.lucene:lucene-analyzers-common:jar:5.5.5, scope: compile,  optional: false version: 5.5.5 snapshot: false /home/jenkins/jenkins-slave/workspace/n-box_maven-indexer_MINDEXER-120/.repository/org/apache/lucene/lucene-analyzers-common/5.5.5/lucene-analyzers-common-5.5.5.jar}
[withMaven] Skip fingerprinting release dependency: MavenDependency{org.apache.lucene:lucene-backward-codecs:jar:5.5.5, scope: compile,  optional: false version: 5.5.5 snapshot: false /home/jenkins/jenkins-slave/workspace/n-box_maven-indexer_MINDEXER-120/.repository/org/apache/lucene/lucene-backward-codecs/5.5.5/lucene-backward-codecs-5.5.5.jar}
[withMaven] Skip fingerprinting release dependency: MavenDependency{org.apache.lucene:lucene-highlighter:jar:5.5.5, scope: compile,  optional: false version: 5.5.5 snapshot: false /home/jenkins/jenkins-slave/workspace/n-box_maven-indexer_MINDEXER-120/.repository/org/apache/lucene/lucene-highlighter/5.5.5/lucene-highlighter-5.5.5.jar}
[withMaven] Skip fingerprinting release dependency: MavenDependency{org.apache.lucene:lucene-join:jar:5.5.5, scope: compile,  optional: false version: 5.5.5 snapshot: false /home/jenkins/jenkins-slave/workspace/n-box_maven-indexer_MINDEXER-120/.repository/org/apache/lucene/lucene-join/5.5.5/lucene-join-5.5.5.jar}
[withMaven] Skip fingerprinting release dependency: MavenDependency{org.apache.lucene:lucene-memory:jar:5.5.5, scope: compile,  optional: false version: 5.5.5 snapshot: false /home/jenkins/jenkins-slave/workspace/n-box_maven-indexer_MINDEXER-120/.repository/org/apache/lucene/lucene-memory/5.5.5/lucene-memory-5.5.5.jar}
[withMaven] Skip fingerprinting release dependency: MavenDependency{org.apache.maven.resolver:maven-resolver-api:jar:1.1.0, scope: compile,  optional: false version: 1.1.0 snapshot: false /home/jenkins/jenkins-slave/workspace/n-box_maven-indexer_MINDEXER-120/.repository/org/apache/maven/resolver/maven-resolver-api/1.1.0/maven-resolver-api-1.1.0.jar}
[withMaven] Skip fingerprinting release dependency: MavenDependency{org.apache.maven.resolver:maven-resolver-util:jar:1.1.0, scope: compile,  optional: false version: 1.1.0 snapshot: false /home/jenkins/jenkins-slave/workspace/n-box_maven-indexer_MINDEXER-120/.repository/org/apache/maven/resolver/maven-resolver-util/1.1.0/maven-resolver-util-1.1.0.jar}
[withMaven] Skip fingerprinting release dependency: MavenDependency{org.apache.maven:maven-model:jar:3.5.2, scope: compile,  optional: false version: 3.5.2 snapshot: false /home/jenkins/jenkins-slave/workspace/n-box_maven-indexer_MINDEXER-120/.repository/org/apache/maven/maven-model/3.5.2/maven-model-3.5.2.jar}
[withMaven] Skip fingerprinting release dependency: MavenDependency{org.apache.commons:commons-lang3:jar:3.5, scope: compile,  optional: false version: 3.5 snapshot: false /home/jenkins/jenkins-slave/workspace/n-box_maven-indexer_MINDEXER-120/.repository/org/apache/commons/commons-lang3/3.5/commons-lang3-3.5.jar}
[withMaven] Skip fingerprinting release dependency: MavenDependency{org.apache.maven.wagon:wagon-provider-api:jar:2.12, scope: compile,  optional: true version: 2.12 snapshot: false /home/jenkins/jenkins-slave/workspace/n-box_maven-indexer_MINDEXER-120/.repository/org/apache/maven/wagon/wagon-provider-api/2.12/wagon-provider-api-2.12.jar}
[withMaven] Skip fingerprinting release dependency: MavenDependency{org.apache.maven.archetype:archetype-catalog:jar:2.4, scope: compile,  optional: true version: 2.4 snapshot: false /home/jenkins/jenkins-slave/workspace/n-box_maven-indexer_MINDEXER-120/.repository/org/apache/maven/archetype/archetype-catalog/2.4/archetype-catalog-2.4.jar}
[withMaven] Skip fingerprinting release dependency: MavenDependency{junit:junit:jar:4.12, scope: test,  optional: false version: 4.12 snapshot: false /home/jenkins/jenkins-slave/workspace/n-box_maven-indexer_MINDEXER-120/.repository/junit/junit/4.12/junit-4.12.jar}
[withMaven] Skip fingerprinting release dependency: MavenDependency{org.hamcrest:hamcrest-core:jar:1.3, scope: test,  optional: false version: 1.3 snapshot: false /home/jenkins/jenkins-slave/workspace/n-box_maven-indexer_MINDEXER-120/.repository/org/hamcrest/hamcrest-core/1.3/hamcrest-core-1.3.jar}
[withMaven] Skip fingerprinting release dependency: MavenDependency{org.slf4j:slf4j-simple:jar:1.7.5, scope: test,  optional: false version: 1.7.5 snapshot: false /home/jenkins/jenkins-slave/workspace/n-box_maven-indexer_MINDEXER-120/.repository/org/slf4j/slf4j-simple/1.7.5/slf4j-simple-1.7.5.jar}
[withMaven] Skip fingerprinting release dependency: MavenDependency{org.jmock:jmock:jar:2.5.1, scope: test,  optional: false version: 2.5.1 snapshot: false /home/jenkins/jenkins-slave/workspace/n-box_maven-indexer_MINDEXER-120/.repository/org/jmock/jmock/2.5.1/jmock-2.5.1.jar}
[withMaven] Skip fingerprinting release dependency: MavenDependency{org.hamcrest:hamcrest-library:jar:1.1, scope: test,  optional: false version: 1.1 snapshot: false /home/jenkins/jenkins-slave/workspace/n-box_maven-indexer_MINDEXER-120/.repository/org/hamcrest/hamcrest-library/1.1/hamcrest-library-1.1.jar}
[withMaven] Skip fingerprinting release dependency: MavenDependency{org.mortbay.jetty:jetty:jar:6.1.19, scope: test,  optional: false version: 6.1.19 snapshot: false /home/jenkins/jenkins-slave/workspace/n-box_maven-indexer_MINDEXER-120/.repository/org/mortbay/jetty/jetty/6.1.19/jetty-6.1.19.jar}
[withMaven] Skip fingerprinting release dependency: MavenDependency{org.mortbay.jetty:jetty-util:jar:6.1.19, scope: test,  optional: false version: 6.1.19 snapshot: false /home/jenkins/jenkins-slave/workspace/n-box_maven-indexer_MINDEXER-120/.repository/org/mortbay/jetty/jetty-util/6.1.19/jetty-util-6.1.19.jar}
[withMaven] Skip fingerprinting release dependency: MavenDependency{org.mortbay.jetty:servlet-api:jar:2.5-20081211, scope: test,  optional: false version: 2.5-20081211 snapshot: false /home/jenkins/jenkins-slave/workspace/n-box_maven-indexer_MINDEXER-120/.repository/org/mortbay/jetty/servlet-api/2.5-20081211/servlet-api-2.5-20081211.jar}
[withMaven] Skip fingerprinting release dependency: MavenDependency{org.apache.maven.wagon:wagon-http:jar:2.12, scope: test,  optional: false version: 2.12 snapshot: false /home/jenkins/jenkins-slave/workspace/n-box_maven-indexer_MINDEXER-120/.repository/org/apache/maven/wagon/wagon-http/2.12/wagon-http-2.12.jar}
[withMaven] Skip fingerprinting release dependency: MavenDependency{org.apache.maven.wagon:wagon-http-shared:jar:2.12, scope: test,  optional: false version: 2.12 snapshot: false /home/jenkins/jenkins-slave/workspace/n-box_maven-indexer_MINDEXER-120/.repository/org/apache/maven/wagon/wagon-http-shared/2.12/wagon-http-shared-2.12.jar}
[withMaven] Skip fingerprinting release dependency: MavenDependency{org.jsoup:jsoup:jar:1.7.2, scope: test,  optional: false version: 1.7.2 snapshot: false /home/jenkins/jenkins-slave/workspace/n-box_maven-indexer_MINDEXER-120/.repository/org/jsoup/jsoup/1.7.2/jsoup-1.7.2.jar}
[withMaven] Skip fingerprinting release dependency: MavenDependency{commons-io:commons-io:jar:2.5, scope: test,  optional: false version: 2.5 snapshot: false /home/jenkins/jenkins-slave/workspace/n-box_maven-indexer_MINDEXER-120/.repository/commons-io/commons-io/2.5/commons-io-2.5.jar}
[withMaven] Skip fingerprinting release dependency: MavenDependency{org.apache.httpcomponents:httpclient:jar:4.5.2, scope: test,  optional: false version: 4.5.2 snapshot: false /home/jenkins/jenkins-slave/workspace/n-box_maven-indexer_MINDEXER-120/.repository/org/apache/httpcomponents/httpclient/4.5.2/httpclient-4.5.2.jar}
[withMaven] Skip fingerprinting release dependency: MavenDependency{commons-codec:commons-codec:jar:1.9, scope: test,  optional: false version: 1.9 snapshot: false /home/jenkins/jenkins-slave/workspace/n-box_maven-indexer_MINDEXER-120/.repository/commons-codec/commons-codec/1.9/commons-codec-1.9.jar}
[withMaven] Skip fingerprinting release dependency: MavenDependency{org.slf4j:jcl-over-slf4j:jar:1.7.25, scope: test,  optional: true version: 1.7.25 snapshot: false /home/jenkins/jenkins-slave/workspace/n-box_maven-indexer_MINDEXER-120/.repository/org/slf4j/jcl-over-slf4j/1.7.25/jcl-over-slf4j-1.7.25.jar}
[withMaven] Skip fingerprinting release dependency: MavenDependency{org.apache.httpcomponents:httpcore:jar:4.4.4, scope: test,  optional: false version: 4.4.4 snapshot: false /home/jenkins/jenkins-slave/workspace/n-box_maven-indexer_MINDEXER-120/.repository/org/apache/httpcomponents/httpcore/4.4.4/httpcore-4.4.4.jar}
[withMaven] Fingerprint dependency org/apache/maven/indexer/indexer-core/6.1.0-SNAPSHOT/indexer-core-6.1.0-SNAPSHOT.jar
[withMaven] Skip fingerprinting release dependency: MavenDependency{org.slf4j:slf4j-api:jar:1.7.25, scope: compile,  optional: false version: 1.7.25 snapshot: false /home/jenkins/jenkins-slave/workspace/n-box_maven-indexer_MINDEXER-120/.repository/org/slf4j/slf4j-api/1.7.25/slf4j-api-1.7.25.jar}
[withMaven] Skip fingerprinting release dependency: MavenDependency{com.google.guava:guava:jar:20.0, scope: compile,  optional: false version: 20.0 snapshot: false /home/jenkins/jenkins-slave/workspace/n-box_maven-indexer_MINDEXER-120/.repository/com/google/guava/guava/20.0/guava-20.0.jar}
[withMaven] Skip fingerprinting release dependency: MavenDependency{javax.inject:javax.inject:jar:1, scope: compile,  optional: false version: 1 snapshot: false /home/jenkins/jenkins-slave/workspace/n-box_maven-indexer_MINDEXER-120/.repository/javax/inject/javax.inject/1/javax.inject-1.jar}
[withMaven] Skip fingerprinting release dependency: MavenDependency{javax.annotation:javax.annotation-api:jar:1.2, scope: compile,  optional: false version: 1.2 snapshot: false /home/jenkins/jenkins-slave/workspace/n-box_maven-indexer_MINDEXER-120/.repository/javax/annotation/javax.annotation-api/1.2/javax.annotation-api-1.2.jar}
[withMaven] Skip fingerprinting release dependency: MavenDependency{com.google.code.findbugs:jsr305:jar:3.0.2, scope: compile,  optional: false version: 3.0.2 snapshot: false /home/jenkins/jenkins-slave/workspace/n-box_maven-indexer_MINDEXER-120/.repository/com/google/code/findbugs/jsr305/3.0.2/jsr305-3.0.2.jar}
[withMaven] Skip fingerprinting release dependency: MavenDependency{org.apache.lucene:lucene-core:jar:5.5.5, scope: compile,  optional: false version: 5.5.5 snapshot: false /home/jenkins/jenkins-slave/workspace/n-box_maven-indexer_MINDEXER-120/.repository/org/apache/lucene/lucene-core/5.5.5/lucene-core-5.5.5.jar}
[withMaven] Skip fingerprinting release dependency: MavenDependency{org.apache.lucene:lucene-queryparser:jar:5.5.5, scope: compile,  optional: false version: 5.5.5 snapshot: false /home/jenkins/jenkins-slave/workspace/n-box_maven-indexer_MINDEXER-120/.repository/org/apache/lucene/lucene-queryparser/5.5.5/lucene-queryparser-5.5.5.jar}
[withMaven] Skip fingerprinting release dependency: MavenDependency{org.apache.lucene:lucene-queries:jar:5.5.5, scope: compile,  optional: false version: 5.5.5 snapshot: false /home/jenkins/jenkins-slave/workspace/n-box_maven-indexer_MINDEXER-120/.repository/org/apache/lucene/lucene-queries/5.5.5/lucene-queries-5.5.5.jar}
[withMaven] Skip fingerprinting release dependency: MavenDependency{org.apache.lucene:lucene-sandbox:jar:5.5.5, scope: compile,  optional: false version: 5.5.5 snapshot: false /home/jenkins/jenkins-slave/workspace/n-box_maven-indexer_MINDEXER-120/.repository/org/apache/lucene/lucene-sandbox/5.5.5/lucene-sandbox-5.5.5.jar}
[withMaven] Skip fingerprinting release dependency: MavenDependency{org.apache.lucene:lucene-analyzers-common:jar:5.5.5, scope: compile,  optional: false version: 5.5.5 snapshot: false /home/jenkins/jenkins-slave/workspace/n-box_maven-indexer_MINDEXER-120/.repository/org/apache/lucene/lucene-analyzers-common/5.5.5/lucene-analyzers-common-5.5.5.jar}
[withMaven] Skip fingerprinting release dependency: MavenDependency{org.apache.lucene:lucene-backward-codecs:jar:5.5.5, scope: compile,  optional: false version: 5.5.5 snapshot: false /home/jenkins/jenkins-slave/workspace/n-box_maven-indexer_MINDEXER-120/.repository/org/apache/lucene/lucene-backward-codecs/5.5.5/lucene-backward-codecs-5.5.5.jar}
[withMaven] Skip fingerprinting release dependency: MavenDependency{org.apache.lucene:lucene-highlighter:jar:5.5.5, scope: compile,  optional: false version: 5.5.5 snapshot: false /home/jenkins/jenkins-slave/workspace/n-box_maven-indexer_MINDEXER-120/.repository/org/apache/lucene/lucene-highlighter/5.5.5/lucene-highlighter-5.5.5.jar}
[withMaven] Skip fingerprinting release dependency: MavenDependency{org.apache.lucene:lucene-join:jar:5.5.5, scope: compile,  optional: false version: 5.5.5 snapshot: false /home/jenkins/jenkins-slave/workspace/n-box_maven-indexer_MINDEXER-120/.repository/org/apache/lucene/lucene-join/5.5.5/lucene-join-5.5.5.jar}
[withMaven] Skip fingerprinting release dependency: MavenDependency{org.apache.lucene:lucene-memory:jar:5.5.5, scope: compile,  optional: false version: 5.5.5 snapshot: false /home/jenkins/jenkins-slave/workspace/n-box_maven-indexer_MINDEXER-120/.repository/org/apache/lucene/lucene-memory/5.5.5/lucene-memory-5.5.5.jar}
[withMaven] Skip fingerprinting release dependency: MavenDependency{org.apache.maven.resolver:maven-resolver-api:jar:1.1.0, scope: compile,  optional: false version: 1.1.0 snapshot: false /home/jenkins/jenkins-slave/workspace/n-box_maven-indexer_MINDEXER-120/.repository/org/apache/maven/resolver/maven-resolver-api/1.1.0/maven-resolver-api-1.1.0.jar}
[withMaven] Skip fingerprinting release dependency: MavenDependency{org.apache.maven.resolver:maven-resolver-util:jar:1.1.0, scope: compile,  optional: false version: 1.1.0 snapshot: false /home/jenkins/jenkins-slave/workspace/n-box_maven-indexer_MINDEXER-120/.repository/org/apache/maven/resolver/maven-resolver-util/1.1.0/maven-resolver-util-1.1.0.jar}
[withMaven] Skip fingerprinting release dependency: MavenDependency{org.apache.maven:maven-model:jar:3.5.2, scope: compile,  optional: false version: 3.5.2 snapshot: false /home/jenkins/jenkins-slave/workspace/n-box_maven-indexer_MINDEXER-120/.repository/org/apache/maven/maven-model/3.5.2/maven-model-3.5.2.jar}
[withMaven] Skip fingerprinting release dependency: MavenDependency{org.apache.commons:commons-lang3:jar:3.5, scope: compile,  optional: false version: 3.5 snapshot: false /home/jenkins/jenkins-slave/workspace/n-box_maven-indexer_MINDEXER-120/.repository/org/apache/commons/commons-lang3/3.5/commons-lang3-3.5.jar}
[withMaven] Skip fingerprinting release dependency: MavenDependency{org.eclipse.sisu:org.eclipse.sisu.inject:jar:0.3.3, scope: compile,  optional: false version: 0.3.3 snapshot: false /home/jenkins/jenkins-slave/workspace/n-box_maven-indexer_MINDEXER-120/.repository/org/eclipse/sisu/org.eclipse.sisu.inject/0.3.3/org.eclipse.sisu.inject-0.3.3.jar}
[withMaven] Skip fingerprinting release dependency: MavenDependency{com.google.inject:guice:jar:4.1.0, scope: compile,  optional: false version: 4.1.0 snapshot: false /home/jenkins/jenkins-slave/workspace/n-box_maven-indexer_MINDEXER-120/.repository/com/google/inject/guice/4.1.0/guice-4.1.0.jar}
[withMaven] Skip fingerprinting release dependency: MavenDependency{aopalliance:aopalliance:jar:1.0, scope: compile,  optional: false version: 1.0 snapshot: false /home/jenkins/jenkins-slave/workspace/n-box_maven-indexer_MINDEXER-120/.repository/aopalliance/aopalliance/1.0/aopalliance-1.0.jar}
[withMaven] Skip fingerprinting release dependency: MavenDependency{org.eclipse.sisu:org.eclipse.sisu.plexus:jar:0.3.3, scope: compile,  optional: false version: 0.3.3 snapshot: false /home/jenkins/jenkins-slave/workspace/n-box_maven-indexer_MINDEXER-120/.repository/org/eclipse/sisu/org.eclipse.sisu.plexus/0.3.3/org.eclipse.sisu.plexus-0.3.3.jar}
[withMaven] Skip fingerprinting release dependency: MavenDependency{javax.enterprise:cdi-api:jar:1.0, scope: compile,  optional: false version: 1.0 snapshot: false /home/jenkins/jenkins-slave/workspace/n-box_maven-indexer_MINDEXER-120/.repository/javax/enterprise/cdi-api/1.0/cdi-api-1.0.jar}
[withMaven] Skip fingerprinting release dependency: MavenDependency{org.codehaus.plexus:plexus-component-annotations:jar:1.7.1, scope: compile,  optional: false version: 1.7.1 snapshot: false /home/jenkins/jenkins-slave/workspace/n-box_maven-indexer_MINDEXER-120/.repository/org/codehaus/plexus/plexus-component-annotations/1.7.1/plexus-component-annotations-1.7.1.jar}
[withMaven] Skip fingerprinting release dependency: MavenDependency{org.codehaus.plexus:plexus-classworlds:jar:2.5.2, scope: compile,  optional: false version: 2.5.2 snapshot: false /home/jenkins/jenkins-slave/workspace/n-box_maven-indexer_MINDEXER-120/.repository/org/codehaus/plexus/plexus-classworlds/2.5.2/plexus-classworlds-2.5.2.jar}
[withMaven] Skip fingerprinting release dependency: MavenDependency{org.codehaus.plexus:plexus-utils:jar:3.0.17, scope: compile,  optional: false version: 3.0.17 snapshot: false /home/jenkins/jenkins-slave/workspace/n-box_maven-indexer_MINDEXER-120/.repository/org/codehaus/plexus/plexus-utils/3.0.17/plexus-utils-3.0.17.jar}
[withMaven] Skip fingerprinting release dependency: MavenDependency{org.codehaus.plexus:plexus-cli:jar:1.6, scope: compile,  optional: false version: 1.6 snapshot: false /home/jenkins/jenkins-slave/workspace/n-box_maven-indexer_MINDEXER-120/.repository/org/codehaus/plexus/plexus-cli/1.6/plexus-cli-1.6.jar}
[withMaven] Skip fingerprinting release dependency: MavenDependency{commons-cli:commons-cli:jar:1.2, scope: compile,  optional: false version: 1.2 snapshot: false /home/jenkins/jenkins-slave/workspace/n-box_maven-indexer_MINDEXER-120/.repository/commons-cli/commons-cli/1.2/commons-cli-1.2.jar}
[withMaven] Skip fingerprinting release dependency: MavenDependency{junit:junit:jar:4.12, scope: test,  optional: false version: 4.12 snapshot: false /home/jenkins/jenkins-slave/workspace/n-box_maven-indexer_MINDEXER-120/.repository/junit/junit/4.12/junit-4.12.jar}
[withMaven] Skip fingerprinting release dependency: MavenDependency{org.hamcrest:hamcrest-core:jar:1.3, scope: test,  optional: false version: 1.3 snapshot: false /home/jenkins/jenkins-slave/workspace/n-box_maven-indexer_MINDEXER-120/.repository/org/hamcrest/hamcrest-core/1.3/hamcrest-core-1.3.jar}
[withMaven] Skip fingerprinting release dependency: MavenDependency{org.jmock:jmock:jar:2.5.1, scope: test,  optional: false version: 2.5.1 snapshot: false /home/jenkins/jenkins-slave/workspace/n-box_maven-indexer_MINDEXER-120/.repository/org/jmock/jmock/2.5.1/jmock-2.5.1.jar}
[withMaven] Skip fingerprinting release dependency: MavenDependency{org.hamcrest:hamcrest-library:jar:1.1, scope: test,  optional: false version: 1.1 snapshot: false /home/jenkins/jenkins-slave/workspace/n-box_maven-indexer_MINDEXER-120/.repository/org/hamcrest/hamcrest-library/1.1/hamcrest-library-1.1.jar}
[withMaven] Skip fingerprinting release dependency: MavenDependency{org.mortbay.jetty:jetty:jar:6.1.19, scope: test,  optional: false version: 6.1.19 snapshot: false /home/jenkins/jenkins-slave/workspace/n-box_maven-indexer_MINDEXER-120/.repository/org/mortbay/jetty/jetty/6.1.19/jetty-6.1.19.jar}
[withMaven] Skip fingerprinting release dependency: MavenDependency{org.mortbay.jetty:jetty-util:jar:6.1.19, scope: test,  optional: false version: 6.1.19 snapshot: false /home/jenkins/jenkins-slave/workspace/n-box_maven-indexer_MINDEXER-120/.repository/org/mortbay/jetty/jetty-util/6.1.19/jetty-util-6.1.19.jar}
[withMaven] Skip fingerprinting release dependency: MavenDependency{org.mortbay.jetty:servlet-api:jar:2.5-20081211, scope: test,  optional: false version: 2.5-20081211 snapshot: false /home/jenkins/jenkins-slave/workspace/n-box_maven-indexer_MINDEXER-120/.repository/org/mortbay/jetty/servlet-api/2.5-20081211/servlet-api-2.5-20081211.jar}
[withMaven] Skip fingerprinting release dependency: MavenDependency{org.apache.maven.wagon:wagon-http:jar:2.12, scope: test,  optional: false version: 2.12 snapshot: false /home/jenkins/jenkins-slave/workspace/n-box_maven-indexer_MINDEXER-120/.repository/org/apache/maven/wagon/wagon-http/2.12/wagon-http-2.12.jar}
[withMaven] Skip fingerprinting release dependency: MavenDependency{org.apache.maven.wagon:wagon-http-shared:jar:2.12, scope: test,  optional: false version: 2.12 snapshot: false /home/jenkins/jenkins-slave/workspace/n-box_maven-indexer_MINDEXER-120/.repository/org/apache/maven/wagon/wagon-http-shared/2.12/wagon-http-shared-2.12.jar}
[withMaven] Skip fingerprinting release dependency: MavenDependency{org.jsoup:jsoup:jar:1.7.2, scope: test,  optional: false version: 1.7.2 snapshot: false /home/jenkins/jenkins-slave/workspace/n-box_maven-indexer_MINDEXER-120/.repository/org/jsoup/jsoup/1.7.2/jsoup-1.7.2.jar}
[withMaven] Skip fingerprinting release dependency: MavenDependency{commons-io:commons-io:jar:2.5, scope: test,  optional: false version: 2.5 snapshot: false /home/jenkins/jenkins-slave/workspace/n-box_maven-indexer_MINDEXER-120/.repository/commons-io/commons-io/2.5/commons-io-2.5.jar}
[withMaven] Skip fingerprinting release dependency: MavenDependency{org.apache.httpcomponents:httpclient:jar:4.5.2, scope: test,  optional: false version: 4.5.2 snapshot: false /home/jenkins/jenkins-slave/workspace/n-box_maven-indexer_MINDEXER-120/.repository/org/apache/httpcomponents/httpclient/4.5.2/httpclient-4.5.2.jar}
[withMaven] Skip fingerprinting release dependency: MavenDependency{commons-codec:commons-codec:jar:1.9, scope: test,  optional: false version: 1.9 snapshot: false /home/jenkins/jenkins-slave/workspace/n-box_maven-indexer_MINDEXER-120/.repository/commons-codec/commons-codec/1.9/commons-codec-1.9.jar}
[withMaven] Skip fingerprinting release dependency: MavenDependency{org.slf4j:jcl-over-slf4j:jar:1.7.25, scope: test,  optional: true version: 1.7.25 snapshot: false /home/jenkins/jenkins-slave/workspace/n-box_maven-indexer_MINDEXER-120/.repository/org/slf4j/jcl-over-slf4j/1.7.25/jcl-over-slf4j-1.7.25.jar}
[withMaven] Skip fingerprinting release dependency: MavenDependency{org.apache.httpcomponents:httpcore:jar:4.4.4, scope: test,  optional: false version: 4.4.4 snapshot: false /home/jenkins/jenkins-slave/workspace/n-box_maven-indexer_MINDEXER-120/.repository/org/apache/httpcomponents/httpcore/4.4.4/httpcore-4.4.4.jar}
[withMaven] Skip fingerprinting release dependency: MavenDependency{org.apache.maven.wagon:wagon-provider-api:jar:2.12, scope: test,  optional: false version: 2.12 snapshot: false /home/jenkins/jenkins-slave/workspace/n-box_maven-indexer_MINDEXER-120/.repository/org/apache/maven/wagon/wagon-provider-api/2.12/wagon-provider-api-2.12.jar}
[withMaven] Skip fingerprinting release dependency: MavenDependency{junit:junit:jar:4.12, scope: test,  optional: false version: 4.12 snapshot: false /home/jenkins/jenkins-slave/workspace/n-box_maven-indexer_MINDEXER-120/.repository/junit/junit/4.12/junit-4.12.jar}
[withMaven] Skip fingerprinting release dependency: MavenDependency{org.hamcrest:hamcrest-core:jar:1.3, scope: test,  optional: false version: 1.3 snapshot: false /home/jenkins/jenkins-slave/workspace/n-box_maven-indexer_MINDEXER-120/.repository/org/hamcrest/hamcrest-core/1.3/hamcrest-core-1.3.jar}
[withMaven] Skip fingerprinting release dependency: MavenDependency{com.google.guava:guava:jar:20.0, scope: test,  optional: false version: 20.0 snapshot: false /home/jenkins/jenkins-slave/workspace/n-box_maven-indexer_MINDEXER-120/.repository/com/google/guava/guava/20.0/guava-20.0.jar}
[withMaven] Skip fingerprinting release dependency: MavenDependency{org.slf4j:slf4j-api:jar:1.7.25, scope: compile,  optional: false version: 1.7.25 snapshot: false /home/jenkins/jenkins-slave/workspace/n-box_maven-indexer_MINDEXER-120/.repository/org/slf4j/slf4j-api/1.7.25/slf4j-api-1.7.25.jar}
[withMaven] Fingerprint dependency org/apache/maven/indexer/indexer-core/6.1.0-SNAPSHOT/indexer-core-6.1.0-SNAPSHOT.jar
[withMaven] Skip fingerprinting release dependency: MavenDependency{com.google.guava:guava:jar:20.0, scope: compile,  optional: false version: 20.0 snapshot: false /home/jenkins/jenkins-slave/workspace/n-box_maven-indexer_MINDEXER-120/.repository/com/google/guava/guava/20.0/guava-20.0.jar}
[withMaven] Skip fingerprinting release dependency: MavenDependency{javax.inject:javax.inject:jar:1, scope: compile,  optional: false version: 1 snapshot: false /home/jenkins/jenkins-slave/workspace/n-box_maven-indexer_MINDEXER-120/.repository/javax/inject/javax.inject/1/javax.inject-1.jar}
[withMaven] Skip fingerprinting release dependency: MavenDependency{javax.annotation:javax.annotation-api:jar:1.2, scope: compile,  optional: false version: 1.2 snapshot: false /home/jenkins/jenkins-slave/workspace/n-box_maven-indexer_MINDEXER-120/.repository/javax/annotation/javax.annotation-api/1.2/javax.annotation-api-1.2.jar}
[withMaven] Skip fingerprinting release dependency: MavenDependency{com.google.code.findbugs:jsr305:jar:3.0.2, scope: compile,  optional: false version: 3.0.2 snapshot: false /home/jenkins/jenkins-slave/workspace/n-box_maven-indexer_MINDEXER-120/.repository/com/google/code/findbugs/jsr305/3.0.2/jsr305-3.0.2.jar}
[withMaven] Skip fingerprinting release dependency: MavenDependency{org.apache.lucene:lucene-core:jar:5.5.5, scope: compile,  optional: false version: 5.5.5 snapshot: false /home/jenkins/jenkins-slave/workspace/n-box_maven-indexer_MINDEXER-120/.repository/org/apache/lucene/lucene-core/5.5.5/lucene-core-5.5.5.jar}
[withMaven] Skip fingerprinting release dependency: MavenDependency{org.apache.lucene:lucene-queryparser:jar:5.5.5, scope: compile,  optional: false version: 5.5.5 snapshot: false /home/jenkins/jenkins-slave/workspace/n-box_maven-indexer_MINDEXER-120/.repository/org/apache/lucene/lucene-queryparser/5.5.5/lucene-queryparser-5.5.5.jar}
[withMaven] Skip fingerprinting release dependency: MavenDependency{org.apache.lucene:lucene-queries:jar:5.5.5, scope: compile,  optional: false version: 5.5.5 snapshot: false /home/jenkins/jenkins-slave/workspace/n-box_maven-indexer_MINDEXER-120/.repository/org/apache/lucene/lucene-queries/5.5.5/lucene-queries-5.5.5.jar}
[withMaven] Skip fingerprinting release dependency: MavenDependency{org.apache.lucene:lucene-sandbox:jar:5.5.5, scope: compile,  optional: false version: 5.5.5 snapshot: false /home/jenkins/jenkins-slave/workspace/n-box_maven-indexer_MINDEXER-120/.repository/org/apache/lucene/lucene-sandbox/5.5.5/lucene-sandbox-5.5.5.jar}
[withMaven] Skip fingerprinting release dependency: MavenDependency{org.apache.lucene:lucene-analyzers-common:jar:5.5.5, scope: compile,  optional: false version: 5.5.5 snapshot: false /home/jenkins/jenkins-slave/workspace/n-box_maven-indexer_MINDEXER-120/.repository/org/apache/lucene/lucene-analyzers-common/5.5.5/lucene-analyzers-common-5.5.5.jar}
[withMaven] Skip fingerprinting release dependency: MavenDependency{org.apache.lucene:lucene-backward-codecs:jar:5.5.5, scope: compile,  optional: false version: 5.5.5 snapshot: false /home/jenkins/jenkins-slave/workspace/n-box_maven-indexer_MINDEXER-120/.repository/org/apache/lucene/lucene-backward-codecs/5.5.5/lucene-backward-codecs-5.5.5.jar}
[withMaven] Skip fingerprinting release dependency: MavenDependency{org.apache.lucene:lucene-highlighter:jar:5.5.5, scope: compile,  optional: false version: 5.5.5 snapshot: false /home/jenkins/jenkins-slave/workspace/n-box_maven-indexer_MINDEXER-120/.repository/org/apache/lucene/lucene-highlighter/5.5.5/lucene-highlighter-5.5.5.jar}
[withMaven] Skip fingerprinting release dependency: MavenDependency{org.apache.lucene:lucene-join:jar:5.5.5, scope: compile,  optional: false version: 5.5.5 snapshot: false /home/jenkins/jenkins-slave/workspace/n-box_maven-indexer_MINDEXER-120/.repository/org/apache/lucene/lucene-join/5.5.5/lucene-join-5.5.5.jar}
[withMaven] Skip fingerprinting release dependency: MavenDependency{org.apache.lucene:lucene-memory:jar:5.5.5, scope: compile,  optional: false version: 5.5.5 snapshot: false /home/jenkins/jenkins-slave/workspace/n-box_maven-indexer_MINDEXER-120/.repository/org/apache/lucene/lucene-memory/5.5.5/lucene-memory-5.5.5.jar}
[withMaven] Skip fingerprinting release dependency: MavenDependency{org.apache.maven.resolver:maven-resolver-api:jar:1.1.0, scope: compile,  optional: false version: 1.1.0 snapshot: false /home/jenkins/jenkins-slave/workspace/n-box_maven-indexer_MINDEXER-120/.repository/org/apache/maven/resolver/maven-resolver-api/1.1.0/maven-resolver-api-1.1.0.jar}
[withMaven] Skip fingerprinting release dependency: MavenDependency{org.apache.maven.resolver:maven-resolver-util:jar:1.1.0, scope: compile,  optional: false version: 1.1.0 snapshot: false /home/jenkins/jenkins-slave/workspace/n-box_maven-indexer_MINDEXER-120/.repository/org/apache/maven/resolver/maven-resolver-util/1.1.0/maven-resolver-util-1.1.0.jar}
[withMaven] Skip fingerprinting release dependency: MavenDependency{org.apache.maven:maven-model:jar:3.5.2, scope: compile,  optional: false version: 3.5.2 snapshot: false /home/jenkins/jenkins-slave/workspace/n-box_maven-indexer_MINDEXER-120/.repository/org/apache/maven/maven-model/3.5.2/maven-model-3.5.2.jar}
[withMaven] Skip fingerprinting release dependency: MavenDependency{org.apache.commons:commons-lang3:jar:3.5, scope: compile,  optional: false version: 3.5 snapshot: false /home/jenkins/jenkins-slave/workspace/n-box_maven-indexer_MINDEXER-120/.repository/org/apache/commons/commons-lang3/3.5/commons-lang3-3.5.jar}
[withMaven] Skip fingerprinting release dependency: MavenDependency{org.apache.maven.wagon:wagon-http-lightweight:jar:2.12, scope: compile,  optional: false version: 2.12 snapshot: false /home/jenkins/jenkins-slave/workspace/n-box_maven-indexer_MINDEXER-120/.repository/org/apache/maven/wagon/wagon-http-lightweight/2.12/wagon-http-lightweight-2.12.jar}
[withMaven] Skip fingerprinting release dependency: MavenDependency{org.apache.maven.wagon:wagon-http-shared:jar:2.12, scope: compile,  optional: false version: 2.12 snapshot: false /home/jenkins/jenkins-slave/workspace/n-box_maven-indexer_MINDEXER-120/.repository/org/apache/maven/wagon/wagon-http-shared/2.12/wagon-http-shared-2.12.jar}
[withMaven] Skip fingerprinting release dependency: MavenDependency{org.jsoup:jsoup:jar:1.7.2, scope: compile,  optional: false version: 1.7.2 snapshot: false /home/jenkins/jenkins-slave/workspace/n-box_maven-indexer_MINDEXER-120/.repository/org/jsoup/jsoup/1.7.2/jsoup-1.7.2.jar}
[withMaven] Skip fingerprinting release dependency: MavenDependency{org.codehaus.plexus:plexus-utils:jar:3.0.24, scope: compile,  optional: false version: 3.0.24 snapshot: false /home/jenkins/jenkins-slave/workspace/n-box_maven-indexer_MINDEXER-120/.repository/org/codehaus/plexus/plexus-utils/3.0.24/plexus-utils-3.0.24.jar}
[withMaven] Skip fingerprinting release dependency: MavenDependency{commons-io:commons-io:jar:2.5, scope: compile,  optional: false version: 2.5 snapshot: false /home/jenkins/jenkins-slave/workspace/n-box_maven-indexer_MINDEXER-120/.repository/commons-io/commons-io/2.5/commons-io-2.5.jar}
[withMaven] Skip fingerprinting release dependency: MavenDependency{org.apache.maven.wagon:wagon-provider-api:jar:2.12, scope: compile,  optional: false version: 2.12 snapshot: false /home/jenkins/jenkins-slave/workspace/n-box_maven-indexer_MINDEXER-120/.repository/org/apache/maven/wagon/wagon-provider-api/2.12/wagon-provider-api-2.12.jar}
[withMaven] Skip fingerprinting release dependency: MavenDependency{org.eclipse.sisu:org.eclipse.sisu.plexus:jar:0.3.3, scope: compile,  optional: false version: 0.3.3 snapshot: false /home/jenkins/jenkins-slave/workspace/n-box_maven-indexer_MINDEXER-120/.repository/org/eclipse/sisu/org.eclipse.sisu.plexus/0.3.3/org.eclipse.sisu.plexus-0.3.3.jar}
[withMaven] Skip fingerprinting release dependency: MavenDependency{javax.enterprise:cdi-api:jar:1.0, scope: compile,  optional: false version: 1.0 snapshot: false /home/jenkins/jenkins-slave/workspace/n-box_maven-indexer_MINDEXER-120/.repository/javax/enterprise/cdi-api/1.0/cdi-api-1.0.jar}
[withMaven] Skip fingerprinting release dependency: MavenDependency{org.eclipse.sisu:org.eclipse.sisu.inject:jar:0.3.3, scope: compile,  optional: false version: 0.3.3 snapshot: false /home/jenkins/jenkins-slave/workspace/n-box_maven-indexer_MINDEXER-120/.repository/org/eclipse/sisu/org.eclipse.sisu.inject/0.3.3/org.eclipse.sisu.inject-0.3.3.jar}
[withMaven] Skip fingerprinting release dependency: MavenDependency{org.codehaus.plexus:plexus-component-annotations:jar:1.7.1, scope: compile,  optional: false version: 1.7.1 snapshot: false /home/jenkins/jenkins-slave/workspace/n-box_maven-indexer_MINDEXER-120/.repository/org/codehaus/plexus/plexus-component-annotations/1.7.1/plexus-component-annotations-1.7.1.jar}
[withMaven] Skip fingerprinting release dependency: MavenDependency{org.codehaus.plexus:plexus-classworlds:jar:2.5.2, scope: compile,  optional: false version: 2.5.2 snapshot: false /home/jenkins/jenkins-slave/workspace/n-box_maven-indexer_MINDEXER-120/.repository/org/codehaus/plexus/plexus-classworlds/2.5.2/plexus-classworlds-2.5.2.jar}
[withMaven] Skip fingerprinting release dependency: MavenDependency{com.google.inject:guice:jar:4.1.0, scope: compile,  optional: false version: 4.1.0 snapshot: false /home/jenkins/jenkins-slave/workspace/n-box_maven-indexer_MINDEXER-120/.repository/com/google/inject/guice/4.1.0/guice-4.1.0.jar}
[withMaven] Skip fingerprinting release dependency: MavenDependency{aopalliance:aopalliance:jar:1.0, scope: compile,  optional: false version: 1.0 snapshot: false /home/jenkins/jenkins-slave/workspace/n-box_maven-indexer_MINDEXER-120/.repository/aopalliance/aopalliance/1.0/aopalliance-1.0.jar}
[withMaven] Skip fingerprinting release dependency: MavenDependency{junit:junit:jar:4.12, scope: test,  optional: false version: 4.12 snapshot: false /home/jenkins/jenkins-slave/workspace/n-box_maven-indexer_MINDEXER-120/.repository/junit/junit/4.12/junit-4.12.jar}
[withMaven] Skip fingerprinting release dependency: MavenDependency{org.hamcrest:hamcrest-core:jar:1.3, scope: test,  optional: false version: 1.3 snapshot: false /home/jenkins/jenkins-slave/workspace/n-box_maven-indexer_MINDEXER-120/.repository/org/hamcrest/hamcrest-core/1.3/hamcrest-core-1.3.jar}
[withMaven] Skip fingerprinting release dependency: MavenDependency{org.slf4j:slf4j-simple:jar:1.7.5, scope: test,  optional: false version: 1.7.5 snapshot: false /home/jenkins/jenkins-slave/workspace/n-box_maven-indexer_MINDEXER-120/.repository/org/slf4j/slf4j-simple/1.7.5/slf4j-simple-1.7.5.jar}
[withMaven] Skip fingerprinting release dependency: MavenDependency{org.slf4j:slf4j-api:jar:1.7.25, scope: compile,  optional: false version: 1.7.25 snapshot: false /home/jenkins/jenkins-slave/workspace/n-box_maven-indexer_MINDEXER-120/.repository/org/slf4j/slf4j-api/1.7.25/slf4j-api-1.7.25.jar}
[withMaven] Skip fingerprinting release dependency: MavenDependency{ch.qos.logback:logback-classic:jar:1.2.3, scope: test,  optional: false version: 1.2.3 snapshot: false /home/jenkins/jenkins-slave/workspace/n-box_maven-indexer_MINDEXER-120/.repository/ch/qos/logback/logback-classic/1.2.3/logback-classic-1.2.3.jar}
[withMaven] Skip fingerprinting release dependency: MavenDependency{ch.qos.logback:logback-core:jar:1.2.3, scope: test,  optional: false version: 1.2.3 snapshot: false /home/jenkins/jenkins-slave/workspace/n-box_maven-indexer_MINDEXER-120/.repository/ch/qos/logback/logback-core/1.2.3/logback-core-1.2.3.jar}
[withMaven] Skip fingerprinting release dependency: MavenDependency{org.slf4j:jcl-over-slf4j:jar:1.7.25, scope: test,  optional: false version: 1.7.25 snapshot: false /home/jenkins/jenkins-slave/workspace/n-box_maven-indexer_MINDEXER-120/.repository/org/slf4j/jcl-over-slf4j/1.7.25/jcl-over-slf4j-1.7.25.jar}
[withMaven] Fingerprint dependency org/apache/maven/indexer/indexer-core/6.1.0-SNAPSHOT/indexer-core-6.1.0-SNAPSHOT.jar
[withMaven] Skip fingerprinting release dependency: MavenDependency{com.google.guava:guava:jar:20.0, scope: compile,  optional: false version: 20.0 snapshot: false /home/jenkins/jenkins-slave/workspace/n-box_maven-indexer_MINDEXER-120/.repository/com/google/guava/guava/20.0/guava-20.0.jar}
[withMaven] Skip fingerprinting release dependency: MavenDependency{javax.inject:javax.inject:jar:1, scope: compile,  optional: false version: 1 snapshot: false /home/jenkins/jenkins-slave/workspace/n-box_maven-indexer_MINDEXER-120/.repository/javax/inject/javax.inject/1/javax.inject-1.jar}
[withMaven] Skip fingerprinting release dependency: MavenDependency{javax.annotation:javax.annotation-api:jar:1.2, scope: compile,  optional: false version: 1.2 snapshot: false /home/jenkins/jenkins-slave/workspace/n-box_maven-indexer_MINDEXER-120/.repository/javax/annotation/javax.annotation-api/1.2/javax.annotation-api-1.2.jar}
[withMaven] Skip fingerprinting release dependency: MavenDependency{com.google.code.findbugs:jsr305:jar:3.0.2, scope: compile,  optional: false version: 3.0.2 snapshot: false /home/jenkins/jenkins-slave/workspace/n-box_maven-indexer_MINDEXER-120/.repository/com/google/code/findbugs/jsr305/3.0.2/jsr305-3.0.2.jar}
[withMaven] Skip fingerprinting release dependency: MavenDependency{org.apache.lucene:lucene-core:jar:5.5.5, scope: compile,  optional: false version: 5.5.5 snapshot: false /home/jenkins/jenkins-slave/workspace/n-box_maven-indexer_MINDEXER-120/.repository/org/apache/lucene/lucene-core/5.5.5/lucene-core-5.5.5.jar}
[withMaven] Skip fingerprinting release dependency: MavenDependency{org.apache.lucene:lucene-queryparser:jar:5.5.5, scope: compile,  optional: false version: 5.5.5 snapshot: false /home/jenkins/jenkins-slave/workspace/n-box_maven-indexer_MINDEXER-120/.repository/org/apache/lucene/lucene-queryparser/5.5.5/lucene-queryparser-5.5.5.jar}
[withMaven] Skip fingerprinting release dependency: MavenDependency{org.apache.lucene:lucene-queries:jar:5.5.5, scope: compile,  optional: false version: 5.5.5 snapshot: false /home/jenkins/jenkins-slave/workspace/n-box_maven-indexer_MINDEXER-120/.repository/org/apache/lucene/lucene-queries/5.5.5/lucene-queries-5.5.5.jar}
[withMaven] Skip fingerprinting release dependency: MavenDependency{org.apache.lucene:lucene-sandbox:jar:5.5.5, scope: compile,  optional: false version: 5.5.5 snapshot: false /home/jenkins/jenkins-slave/workspace/n-box_maven-indexer_MINDEXER-120/.repository/org/apache/lucene/lucene-sandbox/5.5.5/lucene-sandbox-5.5.5.jar}
[withMaven] Skip fingerprinting release dependency: MavenDependency{org.apache.lucene:lucene-analyzers-common:jar:5.5.5, scope: compile,  optional: false version: 5.5.5 snapshot: false /home/jenkins/jenkins-slave/workspace/n-box_maven-indexer_MINDEXER-120/.repository/org/apache/lucene/lucene-analyzers-common/5.5.5/lucene-analyzers-common-5.5.5.jar}
[withMaven] Skip fingerprinting release dependency: MavenDependency{org.apache.lucene:lucene-backward-codecs:jar:5.5.5, scope: compile,  optional: false version: 5.5.5 snapshot: false /home/jenkins/jenkins-slave/workspace/n-box_maven-indexer_MINDEXER-120/.repository/org/apache/lucene/lucene-backward-codecs/5.5.5/lucene-backward-codecs-5.5.5.jar}
[withMaven] Skip fingerprinting release dependency: MavenDependency{org.apache.lucene:lucene-highlighter:jar:5.5.5, scope: compile,  optional: false version: 5.5.5 snapshot: false /home/jenkins/jenkins-slave/workspace/n-box_maven-indexer_MINDEXER-120/.repository/org/apache/lucene/lucene-highlighter/5.5.5/lucene-highlighter-5.5.5.jar}
[withMaven] Skip fingerprinting release dependency: MavenDependency{org.apache.lucene:lucene-join:jar:5.5.5, scope: compile,  optional: false version: 5.5.5 snapshot: false /home/jenkins/jenkins-slave/workspace/n-box_maven-indexer_MINDEXER-120/.repository/org/apache/lucene/lucene-join/5.5.5/lucene-join-5.5.5.jar}
[withMaven] Skip fingerprinting release dependency: MavenDependency{org.apache.lucene:lucene-memory:jar:5.5.5, scope: compile,  optional: false version: 5.5.5 snapshot: false /home/jenkins/jenkins-slave/workspace/n-box_maven-indexer_MINDEXER-120/.repository/org/apache/lucene/lucene-memory/5.5.5/lucene-memory-5.5.5.jar}
[withMaven] Skip fingerprinting release dependency: MavenDependency{org.apache.maven.resolver:maven-resolver-api:jar:1.1.0, scope: compile,  optional: false version: 1.1.0 snapshot: false /home/jenkins/jenkins-slave/workspace/n-box_maven-indexer_MINDEXER-120/.repository/org/apache/maven/resolver/maven-resolver-api/1.1.0/maven-resolver-api-1.1.0.jar}
[withMaven] Skip fingerprinting release dependency: MavenDependency{org.apache.maven.resolver:maven-resolver-util:jar:1.1.0, scope: compile,  optional: false version: 1.1.0 snapshot: false /home/jenkins/jenkins-slave/workspace/n-box_maven-indexer_MINDEXER-120/.repository/org/apache/maven/resolver/maven-resolver-util/1.1.0/maven-resolver-util-1.1.0.jar}
[withMaven] Skip fingerprinting release dependency: MavenDependency{org.apache.maven:maven-model:jar:3.5.2, scope: compile,  optional: false version: 3.5.2 snapshot: false /home/jenkins/jenkins-slave/workspace/n-box_maven-indexer_MINDEXER-120/.repository/org/apache/maven/maven-model/3.5.2/maven-model-3.5.2.jar}
[withMaven] Skip fingerprinting release dependency: MavenDependency{org.apache.maven:maven-model-builder:jar:3.5.2, scope: test,  optional: false version: 3.5.2 snapshot: false /home/jenkins/jenkins-slave/workspace/n-box_maven-indexer_MINDEXER-120/.repository/org/apache/maven/maven-model-builder/3.5.2/maven-model-builder-3.5.2.jar}
[withMaven] Skip fingerprinting release dependency: MavenDependency{org.codehaus.plexus:plexus-utils:jar:3.1.0, scope: compile,  optional: false version: 3.1.0 snapshot: false /home/jenkins/jenkins-slave/workspace/n-box_maven-indexer_MINDEXER-120/.repository/org/codehaus/plexus/plexus-utils/3.1.0/plexus-utils-3.1.0.jar}
[withMaven] Skip fingerprinting release dependency: MavenDependency{org.codehaus.plexus:plexus-interpolation:jar:1.24, scope: test,  optional: false version: 1.24 snapshot: false /home/jenkins/jenkins-slave/workspace/n-box_maven-indexer_MINDEXER-120/.repository/org/codehaus/plexus/plexus-interpolation/1.24/plexus-interpolation-1.24.jar}
[withMaven] Skip fingerprinting release dependency: MavenDependency{org.codehaus.plexus:plexus-component-annotations:jar:1.7.1, scope: compile,  optional: false version: 1.7.1 snapshot: false /home/jenkins/jenkins-slave/workspace/n-box_maven-indexer_MINDEXER-120/.repository/org/codehaus/plexus/plexus-component-annotations/1.7.1/plexus-component-annotations-1.7.1.jar}
[withMaven] Skip fingerprinting release dependency: MavenDependency{org.apache.maven:maven-artifact:jar:3.5.2, scope: test,  optional: false version: 3.5.2 snapshot: false /home/jenkins/jenkins-slave/workspace/n-box_maven-indexer_MINDEXER-120/.repository/org/apache/maven/maven-artifact/3.5.2/maven-artifact-3.5.2.jar}
[withMaven] Skip fingerprinting release dependency: MavenDependency{org.apache.maven:maven-builder-support:jar:3.5.2, scope: test,  optional: false version: 3.5.2 snapshot: false /home/jenkins/jenkins-slave/workspace/n-box_maven-indexer_MINDEXER-120/.repository/org/apache/maven/maven-builder-support/3.5.2/maven-builder-support-3.5.2.jar}
[withMaven] Skip fingerprinting release dependency: MavenDependency{org.apache.commons:commons-lang3:jar:3.5, scope: compile,  optional: false version: 3.5 snapshot: false /home/jenkins/jenkins-slave/workspace/n-box_maven-indexer_MINDEXER-120/.repository/org/apache/commons/commons-lang3/3.5/commons-lang3-3.5.jar}
[withMaven] Skip fingerprinting release dependency: MavenDependency{org.apache.maven.wagon:wagon-http-lightweight:jar:2.12, scope: compile,  optional: false version: 2.12 snapshot: false /home/jenkins/jenkins-slave/workspace/n-box_maven-indexer_MINDEXER-120/.repository/org/apache/maven/wagon/wagon-http-lightweight/2.12/wagon-http-lightweight-2.12.jar}
[withMaven] Skip fingerprinting release dependency: MavenDependency{org.apache.maven.wagon:wagon-http-shared:jar:2.12, scope: compile,  optional: false version: 2.12 snapshot: false /home/jenkins/jenkins-slave/workspace/n-box_maven-indexer_MINDEXER-120/.repository/org/apache/maven/wagon/wagon-http-shared/2.12/wagon-http-shared-2.12.jar}
[withMaven] Skip fingerprinting release dependency: MavenDependency{org.jsoup:jsoup:jar:1.7.2, scope: compile,  optional: false version: 1.7.2 snapshot: false /home/jenkins/jenkins-slave/workspace/n-box_maven-indexer_MINDEXER-120/.repository/org/jsoup/jsoup/1.7.2/jsoup-1.7.2.jar}
[withMaven] Skip fingerprinting release dependency: MavenDependency{commons-io:commons-io:jar:2.5, scope: compile,  optional: false version: 2.5 snapshot: false /home/jenkins/jenkins-slave/workspace/n-box_maven-indexer_MINDEXER-120/.repository/commons-io/commons-io/2.5/commons-io-2.5.jar}
[withMaven] Skip fingerprinting release dependency: MavenDependency{org.apache.maven.wagon:wagon-provider-api:jar:2.12, scope: compile,  optional: false version: 2.12 snapshot: false /home/jenkins/jenkins-slave/workspace/n-box_maven-indexer_MINDEXER-120/.repository/org/apache/maven/wagon/wagon-provider-api/2.12/wagon-provider-api-2.12.jar}
[withMaven] Skip fingerprinting release dependency: MavenDependency{org.eclipse.sisu:org.eclipse.sisu.plexus:jar:0.3.3, scope: compile,  optional: false version: 0.3.3 snapshot: false /home/jenkins/jenkins-slave/workspace/n-box_maven-indexer_MINDEXER-120/.repository/org/eclipse/sisu/org.eclipse.sisu.plexus/0.3.3/org.eclipse.sisu.plexus-0.3.3.jar}
[withMaven] Skip fingerprinting release dependency: MavenDependency{javax.enterprise:cdi-api:jar:1.0, scope: compile,  optional: false version: 1.0 snapshot: false /home/jenkins/jenkins-slave/workspace/n-box_maven-indexer_MINDEXER-120/.repository/javax/enterprise/cdi-api/1.0/cdi-api-1.0.jar}
[withMaven] Skip fingerprinting release dependency: MavenDependency{org.eclipse.sisu:org.eclipse.sisu.inject:jar:0.3.3, scope: compile,  optional: false version: 0.3.3 snapshot: false /home/jenkins/jenkins-slave/workspace/n-box_maven-indexer_MINDEXER-120/.repository/org/eclipse/sisu/org.eclipse.sisu.inject/0.3.3/org.eclipse.sisu.inject-0.3.3.jar}
[withMaven] Skip fingerprinting release dependency: MavenDependency{org.codehaus.plexus:plexus-classworlds:jar:2.5.2, scope: compile,  optional: false version: 2.5.2 snapshot: false /home/jenkins/jenkins-slave/workspace/n-box_maven-indexer_MINDEXER-120/.repository/org/codehaus/plexus/plexus-classworlds/2.5.2/plexus-classworlds-2.5.2.jar}
[withMaven] Skip fingerprinting release dependency: MavenDependency{com.google.inject:guice:jar:4.1.0, scope: compile,  optional: false version: 4.1.0 snapshot: false /home/jenkins/jenkins-slave/workspace/n-box_maven-indexer_MINDEXER-120/.repository/com/google/inject/guice/4.1.0/guice-4.1.0.jar}
[withMaven] Skip fingerprinting release dependency: MavenDependency{aopalliance:aopalliance:jar:1.0, scope: compile,  optional: false version: 1.0 snapshot: false /home/jenkins/jenkins-slave/workspace/n-box_maven-indexer_MINDEXER-120/.repository/aopalliance/aopalliance/1.0/aopalliance-1.0.jar}
[withMaven] Skip fingerprinting release dependency: MavenDependency{org.springframework:spring-beans:jar:4.0.6.RELEASE, scope: compile,  optional: false version: 4.0.6.RELEASE snapshot: false /home/jenkins/jenkins-slave/workspace/n-box_maven-indexer_MINDEXER-120/.repository/org/springframework/spring-beans/4.0.6.RELEASE/spring-beans-4.0.6.RELEASE.jar}
[withMaven] Skip fingerprinting release dependency: MavenDependency{org.springframework:spring-context:jar:4.0.6.RELEASE, scope: compile,  optional: false version: 4.0.6.RELEASE snapshot: false /home/jenkins/jenkins-slave/workspace/n-box_maven-indexer_MINDEXER-120/.repository/org/springframework/spring-context/4.0.6.RELEASE/spring-context-4.0.6.RELEASE.jar}
[withMaven] Skip fingerprinting release dependency: MavenDependency{org.springframework:spring-aop:jar:4.0.6.RELEASE, scope: compile,  optional: false version: 4.0.6.RELEASE snapshot: false /home/jenkins/jenkins-slave/workspace/n-box_maven-indexer_MINDEXER-120/.repository/org/springframework/spring-aop/4.0.6.RELEASE/spring-aop-4.0.6.RELEASE.jar}
[withMaven] Skip fingerprinting release dependency: MavenDependency{org.springframework:spring-expression:jar:4.0.6.RELEASE, scope: compile,  optional: false version: 4.0.6.RELEASE snapshot: false /home/jenkins/jenkins-slave/workspace/n-box_maven-indexer_MINDEXER-120/.repository/org/springframework/spring-expression/4.0.6.RELEASE/spring-expression-4.0.6.RELEASE.jar}
[withMaven] Skip fingerprinting release dependency: MavenDependency{org.springframework:spring-core:jar:4.0.6.RELEASE, scope: compile,  optional: false version: 4.0.6.RELEASE snapshot: false /home/jenkins/jenkins-slave/workspace/n-box_maven-indexer_MINDEXER-120/.repository/org/springframework/spring-core/4.0.6.RELEASE/spring-core-4.0.6.RELEASE.jar}
[withMaven] Skip fingerprinting release dependency: MavenDependency{commons-logging:commons-logging:jar:1.1.3, scope: compile,  optional: false version: 1.1.3 snapshot: false /home/jenkins/jenkins-slave/workspace/n-box_maven-indexer_MINDEXER-120/.repository/commons-logging/commons-logging/1.1.3/commons-logging-1.1.3.jar}
[withMaven] Skip fingerprinting release dependency: MavenDependency{org.springframework:spring-test:jar:4.0.6.RELEASE, scope: test,  optional: false version: 4.0.6.RELEASE snapshot: false /home/jenkins/jenkins-slave/workspace/n-box_maven-indexer_MINDEXER-120/.repository/org/springframework/spring-test/4.0.6.RELEASE/spring-test-4.0.6.RELEASE.jar}
[withMaven] Skip fingerprinting release dependency: MavenDependency{junit:junit:jar:4.12, scope: test,  optional: false version: 4.12 snapshot: false /home/jenkins/jenkins-slave/workspace/n-box_maven-indexer_MINDEXER-120/.repository/junit/junit/4.12/junit-4.12.jar}
[withMaven] Skip fingerprinting release dependency: MavenDependency{org.hamcrest:hamcrest-core:jar:1.3, scope: test,  optional: false version: 1.3 snapshot: false /home/jenkins/jenkins-slave/workspace/n-box_maven-indexer_MINDEXER-120/.repository/org/hamcrest/hamcrest-core/1.3/hamcrest-core-1.3.jar}
[withMaven] Skip 'Findbugs Publisher' disabled by configuration
[withMaven] Run 'JGiven Publisher'...
[withMaven] jgivenPublisher - JGiven not found within your project dependencies, aborting.
[withMaven] Run 'Jacoco Publisher'...
[withMaven] Run 'SpotBugs Publisher'...
[withMaven] Run 'Maven Linker Publisher'...
[withMaven] Skip 'Open Task Scanner Publisher' disabled by configuration
[withMaven] Publishers: Pipeline Graph Publisher: 33 ms, Invoker Publisher: 1 ms, Junit Publisher: 32805 ms, Concordion Publisher: 1 ms, Dependencies Fingerprint Publisher: 1038 ms, JGiven Publisher: 1 ms
[Pipeline] // withMaven
[Pipeline] cleanWs
[WS-CLEANUP] Deleting project workspace...
[WS-CLEANUP] Deferred wipeout is used...
[WS-CLEANUP] done
[Pipeline] }
[Pipeline] // stage
[Pipeline] }
[Pipeline] // node
[Pipeline] }
[Pipeline] // parallel
[Pipeline] echo
[FAILURE-003] AbortException hudson.AbortException: script returned exit code 1
[Pipeline] stage
[Pipeline] { (Notifications)
[Pipeline] echo
Build result: FAILURE
[Pipeline] jiraIssueSelector
[Pipeline] echo
The authors of changes [].
[Pipeline] echo
Sending email ...
[Pipeline] emailext
Reply | Threaded
Open this post in threaded view
|

Build succeeded in Jenkins: Maven TLP » maven-indexer » MINDEXER-120 #2

Apache Jenkins Server-2