Build failed in Jenkins: Maven TLP » maven-help-plugin » MPH-156 #1

classic Classic list List threaded Threaded
2 messages Options
Reply | Threaded
Open this post in threaded view
|

Build failed in Jenkins: Maven TLP » maven-help-plugin » MPH-156 #1

Apache Jenkins Server-2
See https://builds.apache.org/job/maven-box/job/maven-help-plugin/job/MPH-156/1/

No changes.

No tests ran.

Build log:
[...truncated 3.58 MB...]
[windows-jdk11-m3.5.x_build] [ERROR]   location: class org.apache.maven.plugins.help.EvaluateMojo
[windows-jdk11-m3.5.x_build] [ERROR] /f:/jenkins/jenkins-slave/workspace/x_maven-help-plugin_MPH-156-ZWRP5IEOERMDC63TRQGJIGZ5XE65KVMVPNL6SPUI3FYOBJ65HAPA@2@2/windows-jdk11-m3.5.x_build/src/main/java/org/apache/maven/plugins/help/EvaluateMojo.java:[635,13] cannot find symbol
[windows-jdk11-m3.5.x_build] [ERROR]   symbol:   class ArtifactCoordinate
[windows-jdk11-m3.5.x_build] [ERROR]   location: class org.apache.maven.plugins.help.EvaluateMojo
[windows-jdk11-m3.5.x_build] [ERROR] /f:/jenkins/jenkins-slave/workspace/x_maven-help-plugin_MPH-156-ZWRP5IEOERMDC63TRQGJIGZ5XE65KVMVPNL6SPUI3FYOBJ65HAPA@2@2/windows-jdk11-m3.5.x_build/src/main/java/org/apache/maven/plugins/help/DescribeMojo.java:[433,13] cannot find symbol
[windows-jdk11-m3.5.x_build] [ERROR]   symbol:   class ArtifactCoordinate
[windows-jdk11-m3.5.x_build] [ERROR]   location: class org.apache.maven.plugins.help.DescribeMojo
[windows-jdk11-m3.5.x_build] [ERROR] -> [Help 1]
[windows-jdk11-m3.5.x_build] org.apache.maven.lifecycle.LifecycleExecutionException: Failed to execute goal org.apache.maven.plugins:maven-compiler-plugin:3.7.0:compile (default-compile) on project maven-help-plugin: Compilation failure
[windows-jdk11-m3.5.x_build]     at org.apache.maven.lifecycle.internal.MojoExecutor.execute (MojoExecutor.java:213)
[windows-jdk11-m3.5.x_build]     at org.apache.maven.lifecycle.internal.MojoExecutor.execute (MojoExecutor.java:154)
[windows-jdk11-m3.5.x_build]     at org.apache.maven.lifecycle.internal.MojoExecutor.execute (MojoExecutor.java:146)
[windows-jdk11-m3.5.x_build]     at org.apache.maven.lifecycle.internal.LifecycleModuleBuilder.buildProject (LifecycleModuleBuilder.java:117)
[windows-jdk11-m3.5.x_build]     at org.apache.maven.lifecycle.internal.LifecycleModuleBuilder.buildProject (LifecycleModuleBuilder.java:81)
[windows-jdk11-m3.5.x_build]     at org.apache.maven.lifecycle.internal.builder.singlethreaded.SingleThreadedBuilder.build (SingleThreadedBuilder.java:51)
[windows-jdk11-m3.5.x_build]     at org.apache.maven.lifecycle.internal.LifecycleStarter.execute (LifecycleStarter.java:128)
[windows-jdk11-m3.5.x_build]     at org.apache.maven.DefaultMaven.doExecute (DefaultMaven.java:309)
[windows-jdk11-m3.5.x_build]     at org.apache.maven.DefaultMaven.doExecute (DefaultMaven.java:194)
[windows-jdk11-m3.5.x_build]     at org.apache.maven.DefaultMaven.execute (DefaultMaven.java:107)
[windows-jdk11-m3.5.x_build]     at org.apache.maven.cli.MavenCli.execute (MavenCli.java:955)
[windows-jdk11-m3.5.x_build]     at org.apache.maven.cli.MavenCli.doMain (MavenCli.java:290)
[windows-jdk11-m3.5.x_build]     at org.apache.maven.cli.MavenCli.main (MavenCli.java:194)
[windows-jdk11-m3.5.x_build]     at jdk.internal.reflect.NativeMethodAccessorImpl.invoke0 (Native Method)
[windows-jdk11-m3.5.x_build]     at jdk.internal.reflect.NativeMethodAccessorImpl.invoke (NativeMethodAccessorImpl.java:62)
[windows-jdk11-m3.5.x_build]     at jdk.internal.reflect.DelegatingMethodAccessorImpl.invoke (DelegatingMethodAccessorImpl.java:43)
[windows-jdk11-m3.5.x_build]     at java.lang.reflect.Method.invoke (Method.java:566)
[windows-jdk11-m3.5.x_build]     at org.codehaus.plexus.classworlds.launcher.Launcher.launchEnhanced (Launcher.java:289)
[windows-jdk11-m3.5.x_build]     at org.codehaus.plexus.classworlds.launcher.Launcher.launch (Launcher.java:229)
[windows-jdk11-m3.5.x_build]     at org.codehaus.plexus.classworlds.launcher.Launcher.mainWithExitCode (Launcher.java:415)
[windows-jdk11-m3.5.x_build]     at org.codehaus.plexus.classworlds.launcher.Launcher.main (Launcher.java:356)
[windows-jdk11-m3.5.x_build] Caused by: org.apache.maven.plugin.compiler.CompilationFailureException: Compilation failure
[windows-jdk11-m3.5.x_build]     at org.apache.maven.plugin.compiler.AbstractCompilerMojo.execute (AbstractCompilerMojo.java:1161)
[windows-jdk11-m3.5.x_build]     at org.apache.maven.plugin.compiler.CompilerMojo.execute (CompilerMojo.java:168)
[windows-jdk11-m3.5.x_build]     at org.apache.maven.plugin.DefaultBuildPluginManager.executeMojo (DefaultBuildPluginManager.java:134)
[windows-jdk11-m3.5.x_build]     at org.apache.maven.lifecycle.internal.MojoExecutor.execute (MojoExecutor.java:208)
[windows-jdk11-m3.5.x_build]     at org.apache.maven.lifecycle.internal.MojoExecutor.execute (MojoExecutor.java:154)
[windows-jdk11-m3.5.x_build]     at org.apache.maven.lifecycle.internal.MojoExecutor.execute (MojoExecutor.java:146)
[windows-jdk11-m3.5.x_build]     at org.apache.maven.lifecycle.internal.LifecycleModuleBuilder.buildProject (LifecycleModuleBuilder.java:117)
[windows-jdk11-m3.5.x_build]     at org.apache.maven.lifecycle.internal.LifecycleModuleBuilder.buildProject (LifecycleModuleBuilder.java:81)
[windows-jdk11-m3.5.x_build]     at org.apache.maven.lifecycle.internal.builder.singlethreaded.SingleThreadedBuilder.build (SingleThreadedBuilder.java:51)
[windows-jdk11-m3.5.x_build]     at org.apache.maven.lifecycle.internal.LifecycleStarter.execute (LifecycleStarter.java:128)
[windows-jdk11-m3.5.x_build]     at org.apache.maven.DefaultMaven.doExecute (DefaultMaven.java:309)
[windows-jdk11-m3.5.x_build]     at org.apache.maven.DefaultMaven.doExecute (DefaultMaven.java:194)
[windows-jdk11-m3.5.x_build]     at org.apache.maven.DefaultMaven.execute (DefaultMaven.java:107)
[windows-jdk11-m3.5.x_build]     at org.apache.maven.cli.MavenCli.execute (MavenCli.java:955)
[windows-jdk11-m3.5.x_build]     at org.apache.maven.cli.MavenCli.doMain (MavenCli.java:290)
[windows-jdk11-m3.5.x_build]     at org.apache.maven.cli.MavenCli.main (MavenCli.java:194)
[windows-jdk11-m3.5.x_build]     at jdk.internal.reflect.NativeMethodAccessorImpl.invoke0 (Native Method)
[windows-jdk11-m3.5.x_build]     at jdk.internal.reflect.NativeMethodAccessorImpl.invoke (NativeMethodAccessorImpl.java:62)
[windows-jdk11-m3.5.x_build]     at jdk.internal.reflect.DelegatingMethodAccessorImpl.invoke (DelegatingMethodAccessorImpl.java:43)
[windows-jdk11-m3.5.x_build]     at java.lang.reflect.Method.invoke (Method.java:566)
[windows-jdk11-m3.5.x_build]     at org.codehaus.plexus.classworlds.launcher.Launcher.launchEnhanced (Launcher.java:289)
[windows-jdk11-m3.5.x_build]     at org.codehaus.plexus.classworlds.launcher.Launcher.launch (Launcher.java:229)
[windows-jdk11-m3.5.x_build]     at org.codehaus.plexus.classworlds.launcher.Launcher.mainWithExitCode (Launcher.java:415)
[windows-jdk11-m3.5.x_build]     at org.codehaus.plexus.classworlds.launcher.Launcher.main (Launcher.java:356)
[windows-jdk11-m3.5.x_build] [ERROR]
[windows-jdk11-m3.5.x_build] [ERROR] Re-run Maven using the -X switch to enable full debug logging.
[windows-jdk11-m3.5.x_build] [ERROR]
[windows-jdk11-m3.5.x_build] [ERROR] For more information about the errors and possible solutions, please read the following articles:
[windows-jdk11-m3.5.x_build] [ERROR] [Help 1] http://cwiki.apache.org/confluence/display/MAVEN/MojoFailureException
[Pipeline] [windows-jdk11-m3.5.x_build] }
[Pipeline] [windows-jdk11-m3.5.x_build] // dir
[Pipeline] [windows-jdk11-m3.5.x_build] }
[windows-jdk11-m3.5.x_build] [Fast Archiver] No prior successful build to compare, so performing full copy of artifacts
[windows-jdk11-m3.5.x_build] [withMaven] openTasksPublisher - Scan Tasks for Maven artifact org.apache.maven.plugins:maven-help-plugin:3.1.1-SNAPSHOT in source directory windows-jdk11-m3.5.x_build\src\main\java
[windows-jdk11-m3.5.x_build] [TASKS] Scanning folder 'f:\jenkins\jenkins-slave\workspace\x_maven-help-plugin_MPH-156-ZWRP5IEOERMDC63TRQGJIGZ5XE65KVMVPNL6SPUI3FYOBJ65HAPA@2@2' for files matching the pattern 'windows-jdk11-m3.5.x_build\src\main\java\**\*' - excludes: null
[windows-jdk11-m3.5.x_build] [TASKS] Found 9 files to scan for tasks
[windows-jdk11-m3.5.x_build] [TASKS] Found 1 open tasks.
[windows-jdk11-m3.5.x_build] Skipping warnings blame since pipelines do not have an SCM link.%n
[Pipeline] [windows-jdk11-m3.5.x_build] // withMaven
[Pipeline] [windows-jdk11-m3.5.x_build] cleanWs
[windows-jdk11-m3.5.x_build] [WS-CLEANUP] Deleting project workspace...[WS-CLEANUP] done
[Pipeline] [windows-jdk11-m3.5.x_build] cleanWs
[windows-jdk11-m3.5.x_build] [WS-CLEANUP] Deleting project workspace...[WS-CLEANUP] done
[Pipeline] [windows-jdk11-m3.5.x_build] }
[Pipeline] [windows-jdk11-m3.5.x_build] // stage
[Pipeline] [windows-jdk11-m3.5.x_build] }
[Pipeline] [windows-jdk11-m3.5.x_build] // ws
[Pipeline] [windows-jdk11-m3.5.x_build] }
[Pipeline] [windows-jdk11-m3.5.x_build] // node
[Pipeline] [windows-jdk11-m3.5.x_build] }
[windows-jdk7-m3.3.x_build] [INFO] -------------------------------------------------------------
[windows-jdk7-m3.3.x_build] [ERROR] COMPILATION ERROR :
[windows-jdk7-m3.3.x_build] [INFO] -------------------------------------------------------------
[windows-jdk7-m3.3.x_build] [ERROR] /f:/jenkins/jenkins-slave/workspace/x_maven-help-plugin_MPH-156-ZWRP5IEOERMDC63TRQGJIGZ5XE65KVMVPNL6SPUI3FYOBJ65HAPA@3/windows-jdk7-m3.3.x_build/src/main/java/org/apache/maven/plugins/help/AbstractHelpMojo.java:[39,40] package org.apache.maven.shared.artifact does not exist
[windows-jdk7-m3.3.x_build] [ERROR] /f:/jenkins/jenkins-slave/workspace/x_maven-help-plugin_MPH-156-ZWRP5IEOERMDC63TRQGJIGZ5XE65KVMVPNL6SPUI3FYOBJ65HAPA@3/windows-jdk7-m3.3.x_build/src/main/java/org/apache/maven/plugins/help/AbstractHelpMojo.java:[40,40] package org.apache.maven.shared.artifact does not exist
[windows-jdk7-m3.3.x_build] [ERROR] /f:/jenkins/jenkins-slave/workspace/x_maven-help-plugin_MPH-156-ZWRP5IEOERMDC63TRQGJIGZ5XE65KVMVPNL6SPUI3FYOBJ65HAPA@3/windows-jdk7-m3.3.x_build/src/main/java/org/apache/maven/plugins/help/AbstractHelpMojo.java:[41,48] package org.apache.maven.shared.artifact.resolve does not exist
[windows-jdk7-m3.3.x_build] [ERROR] /f:/jenkins/jenkins-slave/workspace/x_maven-help-plugin_MPH-156-ZWRP5IEOERMDC63TRQGJIGZ5XE65KVMVPNL6SPUI3FYOBJ65HAPA@3/windows-jdk7-m3.3.x_build/src/main/java/org/apache/maven/plugins/help/AbstractHelpMojo.java:[71,15] cannot find symbol
[windows-jdk7-m3.3.x_build]   symbol:   class ArtifactResolver
[windows-jdk7-m3.3.x_build]   location: class org.apache.maven.plugins.help.AbstractHelpMojo
[windows-jdk7-m3.3.x_build] [ERROR] /f:/jenkins/jenkins-slave/workspace/x_maven-help-plugin_MPH-156-ZWRP5IEOERMDC63TRQGJIGZ5XE65KVMVPNL6SPUI3FYOBJ65HAPA@3/windows-jdk7-m3.3.x_build/src/main/java/org/apache/maven/plugins/help/AbstractHelpMojo.java:[155,15] cannot find symbol
[windows-jdk7-m3.3.x_build]   symbol:   class ArtifactCoordinate
[windows-jdk7-m3.3.x_build]   location: class org.apache.maven.plugins.help.AbstractHelpMojo
[windows-jdk7-m3.3.x_build] [ERROR] /f:/jenkins/jenkins-slave/workspace/x_maven-help-plugin_MPH-156-ZWRP5IEOERMDC63TRQGJIGZ5XE65KVMVPNL6SPUI3FYOBJ65HAPA@3/windows-jdk7-m3.3.x_build/src/main/java/org/apache/maven/plugins/help/AbstractHelpMojo.java:[187,15] cannot find symbol
[windows-jdk7-m3.3.x_build]   symbol:   class ArtifactCoordinate
[windows-jdk7-m3.3.x_build]   location: class org.apache.maven.plugins.help.AbstractHelpMojo
[windows-jdk7-m3.3.x_build] [ERROR] /f:/jenkins/jenkins-slave/workspace/x_maven-help-plugin_MPH-156-ZWRP5IEOERMDC63TRQGJIGZ5XE65KVMVPNL6SPUI3FYOBJ65HAPA@3/windows-jdk7-m3.3.x_build/src/main/java/org/apache/maven/plugins/help/EvaluateMojo.java:[54,40] package org.apache.maven.shared.artifact does not exist
[windows-jdk7-m3.3.x_build] [ERROR] /f:/jenkins/jenkins-slave/workspace/x_maven-help-plugin_MPH-156-ZWRP5IEOERMDC63TRQGJIGZ5XE65KVMVPNL6SPUI3FYOBJ65HAPA@3/windows-jdk7-m3.3.x_build/src/main/java/org/apache/maven/plugins/help/EvaluateMojo.java:[55,48] package org.apache.maven.shared.artifact.resolve does not exist
[windows-jdk7-m3.3.x_build] [ERROR] /f:/jenkins/jenkins-slave/workspace/x_maven-help-plugin_MPH-156-ZWRP5IEOERMDC63TRQGJIGZ5XE65KVMVPNL6SPUI3FYOBJ65HAPA@3/windows-jdk7-m3.3.x_build/src/main/java/org/apache/maven/plugins/help/EvaluateMojo.java:[583,66] cannot find symbol
[windows-jdk7-m3.3.x_build]   symbol:   class ArtifactResolverException
[windows-jdk7-m3.3.x_build]   location: class org.apache.maven.plugins.help.EvaluateMojo
[windows-jdk7-m3.3.x_build] [ERROR] /f:/jenkins/jenkins-slave/workspace/x_maven-help-plugin_MPH-156-ZWRP5IEOERMDC63TRQGJIGZ5XE65KVMVPNL6SPUI3FYOBJ65HAPA@3/windows-jdk7-m3.3.x_build/src/main/java/org/apache/maven/plugins/help/EvaluateMojo.java:[595,66] cannot find symbol
[windows-jdk7-m3.3.x_build]   symbol:   class ArtifactResolverException
[windows-jdk7-m3.3.x_build]   location: class org.apache.maven.plugins.help.EvaluateMojo
[windows-jdk7-m3.3.x_build] [ERROR] /f:/jenkins/jenkins-slave/workspace/x_maven-help-plugin_MPH-156-ZWRP5IEOERMDC63TRQGJIGZ5XE65KVMVPNL6SPUI3FYOBJ65HAPA@3/windows-jdk7-m3.3.x_build/src/main/java/org/apache/maven/plugins/help/EvaluateMojo.java:[610,66] cannot find symbol
[windows-jdk7-m3.3.x_build]   symbol:   class ArtifactResolverException
[windows-jdk7-m3.3.x_build]   location: class org.apache.maven.plugins.help.EvaluateMojo
[windows-jdk7-m3.3.x_build] [ERROR] /f:/jenkins/jenkins-slave/workspace/x_maven-help-plugin_MPH-156-ZWRP5IEOERMDC63TRQGJIGZ5XE65KVMVPNL6SPUI3FYOBJ65HAPA@3/windows-jdk7-m3.3.x_build/src/main/java/org/apache/maven/plugins/help/DescribeMojo.java:[59,40] package org.apache.maven.shared.artifact does not exist
[windows-jdk7-m3.3.x_build] [ERROR] /f:/jenkins/jenkins-slave/workspace/x_maven-help-plugin_MPH-156-ZWRP5IEOERMDC63TRQGJIGZ5XE65KVMVPNL6SPUI3FYOBJ65HAPA@3/windows-jdk7-m3.3.x_build/src/main/java/org/apache/maven/plugins/help/DescribeMojo.java:[1006,13] cannot find symbol
[windows-jdk7-m3.3.x_build]   symbol:   class ArtifactCoordinate
[windows-jdk7-m3.3.x_build]   location: class org.apache.maven.plugins.help.DescribeMojo
[windows-jdk7-m3.3.x_build] [ERROR] /f:/jenkins/jenkins-slave/workspace/x_maven-help-plugin_MPH-156-ZWRP5IEOERMDC63TRQGJIGZ5XE65KVMVPNL6SPUI3FYOBJ65HAPA@3/windows-jdk7-m3.3.x_build/src/main/java/org/apache/maven/plugins/help/AbstractHelpMojo.java:[189,9] cannot find symbol
[windows-jdk7-m3.3.x_build]   symbol:   class DefaultArtifactCoordinate
[windows-jdk7-m3.3.x_build]   location: class org.apache.maven.plugins.help.AbstractHelpMojo
[windows-jdk7-m3.3.x_build] [ERROR] /f:/jenkins/jenkins-slave/workspace/x_maven-help-plugin_MPH-156-ZWRP5IEOERMDC63TRQGJIGZ5XE65KVMVPNL6SPUI3FYOBJ65HAPA@3/windows-jdk7-m3.3.x_build/src/main/java/org/apache/maven/plugins/help/AbstractHelpMojo.java:[189,52] cannot find symbol
[windows-jdk7-m3.3.x_build]   symbol:   class DefaultArtifactCoordinate
[windows-jdk7-m3.3.x_build]   location: class org.apache.maven.plugins.help.AbstractHelpMojo
[windows-jdk7-m3.3.x_build] [ERROR] /f:/jenkins/jenkins-slave/workspace/x_maven-help-plugin_MPH-156-ZWRP5IEOERMDC63TRQGJIGZ5XE65KVMVPNL6SPUI3FYOBJ65HAPA@3/windows-jdk7-m3.3.x_build/src/main/java/org/apache/maven/plugins/help/AbstractHelpMojo.java:[209,9] cannot find symbol
[windows-jdk7-m3.3.x_build]   symbol:   class ArtifactCoordinate
[windows-jdk7-m3.3.x_build]   location: class org.apache.maven.plugins.help.AbstractHelpMojo
[windows-jdk7-m3.3.x_build] [ERROR] /f:/jenkins/jenkins-slave/workspace/x_maven-help-plugin_MPH-156-ZWRP5IEOERMDC63TRQGJIGZ5XE65KVMVPNL6SPUI3FYOBJ65HAPA@3/windows-jdk7-m3.3.x_build/src/main/java/org/apache/maven/plugins/help/EvaluateMojo.java:[501,17] cannot find symbol
[windows-jdk7-m3.3.x_build]   symbol:   class ArtifactResolverException
[windows-jdk7-m3.3.x_build]   location: class org.apache.maven.plugins.help.EvaluateMojo
[windows-jdk7-m3.3.x_build] [ERROR] /f:/jenkins/jenkins-slave/workspace/x_maven-help-plugin_MPH-156-ZWRP5IEOERMDC63TRQGJIGZ5XE65KVMVPNL6SPUI3FYOBJ65HAPA@3/windows-jdk7-m3.3.x_build/src/main/java/org/apache/maven/plugins/help/EvaluateMojo.java:[635,13] cannot find symbol
[windows-jdk7-m3.3.x_build]   symbol:   class ArtifactCoordinate
[windows-jdk7-m3.3.x_build]   location: class org.apache.maven.plugins.help.EvaluateMojo
[windows-jdk7-m3.3.x_build] [ERROR] /f:/jenkins/jenkins-slave/workspace/x_maven-help-plugin_MPH-156-ZWRP5IEOERMDC63TRQGJIGZ5XE65KVMVPNL6SPUI3FYOBJ65HAPA@3/windows-jdk7-m3.3.x_build/src/main/java/org/apache/maven/plugins/help/DescribeMojo.java:[433,13] cannot find symbol
[windows-jdk7-m3.3.x_build]   symbol:   class ArtifactCoordinate
[windows-jdk7-m3.3.x_build]   location: class org.apache.maven.plugins.help.DescribeMojo
[windows-jdk7-m3.3.x_build] [INFO] 19 errors
[windows-jdk7-m3.3.x_build] [INFO] -------------------------------------------------------------
[windows-jdk7-m3.3.x_build] [INFO] ------------------------------------------------------------------------
[windows-jdk7-m3.3.x_build] [INFO] BUILD FAILURE
[windows-jdk7-m3.3.x_build] [INFO] ------------------------------------------------------------------------
[windows-jdk7-m3.3.x_build] [INFO] Total time: 50.761 s
[windows-jdk7-m3.3.x_build] [INFO] Finished at: 2018-12-01T00:36:58-08:00
[windows-jdk11-m3.5.x_build] Failed in branch windows-jdk11-m3.5.x_build
[windows-jdk7-m3.3.x_build] [INFO] Final Memory: 34M/406M
[windows-jdk7-m3.3.x_build] [INFO] ------------------------------------------------------------------------
[windows-jdk7-m3.3.x_build] [INFO] [jenkins-event-spy] Generated F:\jenkins\jenkins-slave\workspace\x_maven-help-plugin_MPH-156-ZWRP5IEOERMDC63TRQGJIGZ5XE65KVMVPNL6SPUI3FYOBJ65HAPA@3@tmp\withMavene1ff66eb\maven-spy-20181201-003607-6332327352037067269370.log
[windows-jdk7-m3.3.x_build] [ERROR] Failed to execute goal org.apache.maven.plugins:maven-compiler-plugin:3.7.0:compile (default-compile) on project maven-help-plugin: Compilation failure: Compilation failure:
[windows-jdk7-m3.3.x_build] [ERROR] /f:/jenkins/jenkins-slave/workspace/x_maven-help-plugin_MPH-156-ZWRP5IEOERMDC63TRQGJIGZ5XE65KVMVPNL6SPUI3FYOBJ65HAPA@3/windows-jdk7-m3.3.x_build/src/main/java/org/apache/maven/plugins/help/AbstractHelpMojo.java:[39,40] package org.apache.maven.shared.artifact does not exist
[windows-jdk7-m3.3.x_build] [ERROR] /f:/jenkins/jenkins-slave/workspace/x_maven-help-plugin_MPH-156-ZWRP5IEOERMDC63TRQGJIGZ5XE65KVMVPNL6SPUI3FYOBJ65HAPA@3/windows-jdk7-m3.3.x_build/src/main/java/org/apache/maven/plugins/help/AbstractHelpMojo.java:[40,40] package org.apache.maven.shared.artifact does not exist
[windows-jdk7-m3.3.x_build] [ERROR] /f:/jenkins/jenkins-slave/workspace/x_maven-help-plugin_MPH-156-ZWRP5IEOERMDC63TRQGJIGZ5XE65KVMVPNL6SPUI3FYOBJ65HAPA@3/windows-jdk7-m3.3.x_build/src/main/java/org/apache/maven/plugins/help/AbstractHelpMojo.java:[41,48] package org.apache.maven.shared.artifact.resolve does not exist
[windows-jdk7-m3.3.x_build] [ERROR] /f:/jenkins/jenkins-slave/workspace/x_maven-help-plugin_MPH-156-ZWRP5IEOERMDC63TRQGJIGZ5XE65KVMVPNL6SPUI3FYOBJ65HAPA@3/windows-jdk7-m3.3.x_build/src/main/java/org/apache/maven/plugins/help/AbstractHelpMojo.java:[71,15] cannot find symbol
[windows-jdk7-m3.3.x_build] [ERROR] symbol:   class ArtifactResolver
[windows-jdk7-m3.3.x_build] [ERROR] location: class org.apache.maven.plugins.help.AbstractHelpMojo
[windows-jdk7-m3.3.x_build] [ERROR] /f:/jenkins/jenkins-slave/workspace/x_maven-help-plugin_MPH-156-ZWRP5IEOERMDC63TRQGJIGZ5XE65KVMVPNL6SPUI3FYOBJ65HAPA@3/windows-jdk7-m3.3.x_build/src/main/java/org/apache/maven/plugins/help/AbstractHelpMojo.java:[155,15] cannot find symbol
[windows-jdk7-m3.3.x_build] [ERROR] symbol:   class ArtifactCoordinate
[windows-jdk7-m3.3.x_build] [ERROR] location: class org.apache.maven.plugins.help.AbstractHelpMojo
[windows-jdk7-m3.3.x_build] [ERROR] /f:/jenkins/jenkins-slave/workspace/x_maven-help-plugin_MPH-156-ZWRP5IEOERMDC63TRQGJIGZ5XE65KVMVPNL6SPUI3FYOBJ65HAPA@3/windows-jdk7-m3.3.x_build/src/main/java/org/apache/maven/plugins/help/AbstractHelpMojo.java:[187,15] cannot find symbol
[windows-jdk7-m3.3.x_build] [ERROR] symbol:   class ArtifactCoordinate
[windows-jdk7-m3.3.x_build] [ERROR] location: class org.apache.maven.plugins.help.AbstractHelpMojo
[windows-jdk7-m3.3.x_build] [ERROR] /f:/jenkins/jenkins-slave/workspace/x_maven-help-plugin_MPH-156-ZWRP5IEOERMDC63TRQGJIGZ5XE65KVMVPNL6SPUI3FYOBJ65HAPA@3/windows-jdk7-m3.3.x_build/src/main/java/org/apache/maven/plugins/help/EvaluateMojo.java:[54,40] package org.apache.maven.shared.artifact does not exist
[windows-jdk7-m3.3.x_build] [ERROR] /f:/jenkins/jenkins-slave/workspace/x_maven-help-plugin_MPH-156-ZWRP5IEOERMDC63TRQGJIGZ5XE65KVMVPNL6SPUI3FYOBJ65HAPA@3/windows-jdk7-m3.3.x_build/src/main/java/org/apache/maven/plugins/help/EvaluateMojo.java:[55,48] package org.apache.maven.shared.artifact.resolve does not exist
[windows-jdk7-m3.3.x_build] [ERROR] /f:/jenkins/jenkins-slave/workspace/x_maven-help-plugin_MPH-156-ZWRP5IEOERMDC63TRQGJIGZ5XE65KVMVPNL6SPUI3FYOBJ65HAPA@3/windows-jdk7-m3.3.x_build/src/main/java/org/apache/maven/plugins/help/EvaluateMojo.java:[583,66] cannot find symbol
[windows-jdk7-m3.3.x_build] [ERROR] symbol:   class ArtifactResolverException
[windows-jdk7-m3.3.x_build] [ERROR] location: class org.apache.maven.plugins.help.EvaluateMojo
[windows-jdk7-m3.3.x_build] [ERROR] /f:/jenkins/jenkins-slave/workspace/x_maven-help-plugin_MPH-156-ZWRP5IEOERMDC63TRQGJIGZ5XE65KVMVPNL6SPUI3FYOBJ65HAPA@3/windows-jdk7-m3.3.x_build/src/main/java/org/apache/maven/plugins/help/EvaluateMojo.java:[595,66] cannot find symbol
[windows-jdk7-m3.3.x_build] [ERROR] symbol:   class ArtifactResolverException
[windows-jdk7-m3.3.x_build] [ERROR] location: class org.apache.maven.plugins.help.EvaluateMojo
[windows-jdk7-m3.3.x_build] [ERROR] /f:/jenkins/jenkins-slave/workspace/x_maven-help-plugin_MPH-156-ZWRP5IEOERMDC63TRQGJIGZ5XE65KVMVPNL6SPUI3FYOBJ65HAPA@3/windows-jdk7-m3.3.x_build/src/main/java/org/apache/maven/plugins/help/EvaluateMojo.java:[610,66] cannot find symbol
[windows-jdk7-m3.3.x_build] [ERROR] symbol:   class ArtifactResolverException
[windows-jdk7-m3.3.x_build] [ERROR] location: class org.apache.maven.plugins.help.EvaluateMojo
[windows-jdk7-m3.3.x_build] [ERROR] /f:/jenkins/jenkins-slave/workspace/x_maven-help-plugin_MPH-156-ZWRP5IEOERMDC63TRQGJIGZ5XE65KVMVPNL6SPUI3FYOBJ65HAPA@3/windows-jdk7-m3.3.x_build/src/main/java/org/apache/maven/plugins/help/DescribeMojo.java:[59,40] package org.apache.maven.shared.artifact does not exist
[windows-jdk7-m3.3.x_build] [ERROR] /f:/jenkins/jenkins-slave/workspace/x_maven-help-plugin_MPH-156-ZWRP5IEOERMDC63TRQGJIGZ5XE65KVMVPNL6SPUI3FYOBJ65HAPA@3/windows-jdk7-m3.3.x_build/src/main/java/org/apache/maven/plugins/help/DescribeMojo.java:[1006,13] cannot find symbol
[windows-jdk7-m3.3.x_build] [ERROR] symbol:   class ArtifactCoordinate
[windows-jdk7-m3.3.x_build] [ERROR] location: class org.apache.maven.plugins.help.DescribeMojo
[windows-jdk7-m3.3.x_build] [ERROR] /f:/jenkins/jenkins-slave/workspace/x_maven-help-plugin_MPH-156-ZWRP5IEOERMDC63TRQGJIGZ5XE65KVMVPNL6SPUI3FYOBJ65HAPA@3/windows-jdk7-m3.3.x_build/src/main/java/org/apache/maven/plugins/help/AbstractHelpMojo.java:[189,9] cannot find symbol
[windows-jdk7-m3.3.x_build] [ERROR] symbol:   class DefaultArtifactCoordinate
[windows-jdk7-m3.3.x_build] [ERROR] location: class org.apache.maven.plugins.help.AbstractHelpMojo
[windows-jdk7-m3.3.x_build] [ERROR] /f:/jenkins/jenkins-slave/workspace/x_maven-help-plugin_MPH-156-ZWRP5IEOERMDC63TRQGJIGZ5XE65KVMVPNL6SPUI3FYOBJ65HAPA@3/windows-jdk7-m3.3.x_build/src/main/java/org/apache/maven/plugins/help/AbstractHelpMojo.java:[189,52] cannot find symbol
[windows-jdk7-m3.3.x_build] [ERROR] symbol:   class DefaultArtifactCoordinate
[windows-jdk7-m3.3.x_build] [ERROR] location: class org.apache.maven.plugins.help.AbstractHelpMojo
[windows-jdk7-m3.3.x_build] [ERROR] /f:/jenkins/jenkins-slave/workspace/x_maven-help-plugin_MPH-156-ZWRP5IEOERMDC63TRQGJIGZ5XE65KVMVPNL6SPUI3FYOBJ65HAPA@3/windows-jdk7-m3.3.x_build/src/main/java/org/apache/maven/plugins/help/AbstractHelpMojo.java:[209,9] cannot find symbol
[windows-jdk7-m3.3.x_build] [ERROR] symbol:   class ArtifactCoordinate
[windows-jdk7-m3.3.x_build] [ERROR] location: class org.apache.maven.plugins.help.AbstractHelpMojo
[windows-jdk7-m3.3.x_build] [ERROR] /f:/jenkins/jenkins-slave/workspace/x_maven-help-plugin_MPH-156-ZWRP5IEOERMDC63TRQGJIGZ5XE65KVMVPNL6SPUI3FYOBJ65HAPA@3/windows-jdk7-m3.3.x_build/src/main/java/org/apache/maven/plugins/help/EvaluateMojo.java:[501,17] cannot find symbol
[windows-jdk7-m3.3.x_build] [ERROR] symbol:   class ArtifactResolverException
[windows-jdk7-m3.3.x_build] [ERROR] location: class org.apache.maven.plugins.help.EvaluateMojo
[windows-jdk7-m3.3.x_build] [ERROR] /f:/jenkins/jenkins-slave/workspace/x_maven-help-plugin_MPH-156-ZWRP5IEOERMDC63TRQGJIGZ5XE65KVMVPNL6SPUI3FYOBJ65HAPA@3/windows-jdk7-m3.3.x_build/src/main/java/org/apache/maven/plugins/help/EvaluateMojo.java:[635,13] cannot find symbol
[windows-jdk7-m3.3.x_build] [ERROR] symbol:   class ArtifactCoordinate
[windows-jdk7-m3.3.x_build] [ERROR] location: class org.apache.maven.plugins.help.EvaluateMojo
[windows-jdk7-m3.3.x_build] [ERROR] /f:/jenkins/jenkins-slave/workspace/x_maven-help-plugin_MPH-156-ZWRP5IEOERMDC63TRQGJIGZ5XE65KVMVPNL6SPUI3FYOBJ65HAPA@3/windows-jdk7-m3.3.x_build/src/main/java/org/apache/maven/plugins/help/DescribeMojo.java:[433,13] cannot find symbol
[windows-jdk7-m3.3.x_build] [ERROR] symbol:   class ArtifactCoordinate
[windows-jdk7-m3.3.x_build] [ERROR] location: class org.apache.maven.plugins.help.DescribeMojo
[windows-jdk7-m3.3.x_build] [ERROR] -> [Help 1]
[windows-jdk7-m3.3.x_build] org.apache.maven.lifecycle.LifecycleExecutionException: Failed to execute goal org.apache.maven.plugins:maven-compiler-plugin:3.7.0:compile (default-compile) on project maven-help-plugin: Compilation failure
[windows-jdk7-m3.3.x_build] at org.apache.maven.lifecycle.internal.MojoExecutor.execute(MojoExecutor.java:212)
[windows-jdk7-m3.3.x_build] at org.apache.maven.lifecycle.internal.MojoExecutor.execute(MojoExecutor.java:153)
[windows-jdk7-m3.3.x_build] at org.apache.maven.lifecycle.internal.MojoExecutor.execute(MojoExecutor.java:145)
[windows-jdk7-m3.3.x_build] at org.apache.maven.lifecycle.internal.LifecycleModuleBuilder.buildProject(LifecycleModuleBuilder.java:116)
[windows-jdk7-m3.3.x_build] at org.apache.maven.lifecycle.internal.LifecycleModuleBuilder.buildProject(LifecycleModuleBuilder.java:80)
[windows-jdk7-m3.3.x_build] at org.apache.maven.lifecycle.internal.builder.singlethreaded.SingleThreadedBuilder.build(SingleThreadedBuilder.java:51)
[windows-jdk7-m3.3.x_build] at org.apache.maven.lifecycle.internal.LifecycleStarter.execute(LifecycleStarter.java:128)
[windows-jdk7-m3.3.x_build] at org.apache.maven.DefaultMaven.doExecute(DefaultMaven.java:307)
[windows-jdk7-m3.3.x_build] at org.apache.maven.DefaultMaven.doExecute(DefaultMaven.java:193)
[windows-jdk7-m3.3.x_build] at org.apache.maven.DefaultMaven.execute(DefaultMaven.java:106)
[windows-jdk7-m3.3.x_build] at org.apache.maven.cli.MavenCli.execute(MavenCli.java:863)
[windows-jdk7-m3.3.x_build] at org.apache.maven.cli.MavenCli.doMain(MavenCli.java:288)
[windows-jdk7-m3.3.x_build] at org.apache.maven.cli.MavenCli.main(MavenCli.java:199)
[windows-jdk7-m3.3.x_build] at sun.reflect.NativeMethodAccessorImpl.invoke0(Native Method)
[windows-jdk7-m3.3.x_build] at sun.reflect.NativeMethodAccessorImpl.invoke(NativeMethodAccessorImpl.java:57)
[windows-jdk7-m3.3.x_build] at sun.reflect.DelegatingMethodAccessorImpl.invoke(DelegatingMethodAccessorImpl.java:43)
[windows-jdk7-m3.3.x_build] at java.lang.reflect.Method.invoke(Method.java:606)
[windows-jdk7-m3.3.x_build] at org.codehaus.plexus.classworlds.launcher.Launcher.launchEnhanced(Launcher.java:289)
[windows-jdk7-m3.3.x_build] at org.codehaus.plexus.classworlds.launcher.Launcher.launch(Launcher.java:229)
[windows-jdk7-m3.3.x_build] at org.codehaus.plexus.classworlds.launcher.Launcher.mainWithExitCode(Launcher.java:415)
[windows-jdk7-m3.3.x_build] at org.codehaus.plexus.classworlds.launcher.Launcher.main(Launcher.java:356)
[windows-jdk7-m3.3.x_build] Caused by: org.apache.maven.plugin.compiler.CompilationFailureException: Compilation failure
[windows-jdk7-m3.3.x_build] at org.apache.maven.plugin.compiler.AbstractCompilerMojo.execute(AbstractCompilerMojo.java:1161)
[windows-jdk7-m3.3.x_build] at org.apache.maven.plugin.compiler.CompilerMojo.execute(CompilerMojo.java:168)
[windows-jdk7-m3.3.x_build] at org.apache.maven.plugin.DefaultBuildPluginManager.executeMojo(DefaultBuildPluginManager.java:134)
[windows-jdk7-m3.3.x_build] at org.apache.maven.lifecycle.internal.MojoExecutor.execute(MojoExecutor.java:207)
[windows-jdk7-m3.3.x_build] ... 20 more
[windows-jdk7-m3.3.x_build] [ERROR]
[windows-jdk7-m3.3.x_build] [ERROR] Re-run Maven using the -X switch to enable full debug logging.
[windows-jdk7-m3.3.x_build] [ERROR]
[windows-jdk7-m3.3.x_build] [ERROR] For more information about the errors and possible solutions, please read the following articles:
[windows-jdk7-m3.3.x_build] [ERROR] [Help 1] http://cwiki.apache.org/confluence/display/MAVEN/MojoFailureException
[windows-jdk7-m3.3.x_build] Picked up JAVA_TOOL_OPTIONS: -Dmaven.ext.class.path="f:\jenkins\jenkins-slave\workspace\x_maven-help-plugin_MPH-156-ZWRP5IEOERMDC63TRQGJIGZ5XE65KVMVPNL6SPUI3FYOBJ65HAPA@3@tmp\withMavene1ff66eb\pipeline-maven-spy.jar" -Dorg.jenkinsci.plugins.pipeline.maven.reportsFolder="f:\jenkins\jenkins-slave\workspace\x_maven-help-plugin_MPH-156-ZWRP5IEOERMDC63TRQGJIGZ5XE65KVMVPNL6SPUI3FYOBJ65HAPA@3@tmp\withMavene1ff66eb"
[Pipeline] [windows-jdk7-m3.3.x_build] }
[Pipeline] [windows-jdk7-m3.3.x_build] // dir
[Pipeline] [windows-jdk7-m3.3.x_build] }
[windows-jdk7-m3.3.x_build] [Fast Archiver] No prior successful build to compare, so performing full copy of artifacts
[windows-jdk7-m3.3.x_build] [withMaven] openTasksPublisher - Scan Tasks for Maven artifact org.apache.maven.plugins:maven-help-plugin:3.1.1-SNAPSHOT in source directory windows-jdk7-m3.3.x_build\src\main\java
[windows-jdk7-m3.3.x_build] [TASKS] Scanning folder 'f:\jenkins\jenkins-slave\workspace\x_maven-help-plugin_MPH-156-ZWRP5IEOERMDC63TRQGJIGZ5XE65KVMVPNL6SPUI3FYOBJ65HAPA@3' for files matching the pattern 'windows-jdk7-m3.3.x_build\src\main\java\**\*' - excludes: null
[windows-jdk7-m3.3.x_build] [TASKS] Found 9 files to scan for tasks
[windows-jdk7-m3.3.x_build] [TASKS] Found 1 open tasks.
[windows-jdk7-m3.3.x_build] Skipping warnings blame since pipelines do not have an SCM link.%n
[Pipeline] [windows-jdk7-m3.3.x_build] // withMaven
[Pipeline] [windows-jdk7-m3.3.x_build] cleanWs
[windows-jdk7-m3.3.x_build] [WS-CLEANUP] Deleting project workspace...[WS-CLEANUP] done
[Pipeline] [windows-jdk7-m3.3.x_build] cleanWs
[windows-jdk7-m3.3.x_build] [WS-CLEANUP] Deleting project workspace...[WS-CLEANUP] done
[Pipeline] [windows-jdk7-m3.3.x_build] }
[Pipeline] [windows-jdk7-m3.3.x_build] // stage
[Pipeline] [windows-jdk7-m3.3.x_build] }
[Pipeline] [windows-jdk7-m3.3.x_build] // ws
[Pipeline] [windows-jdk7-m3.3.x_build] }
[Pipeline] [windows-jdk7-m3.3.x_build] // node
[Pipeline] [windows-jdk7-m3.3.x_build] }
[windows-jdk7-m3.3.x_build] Failed in branch windows-jdk7-m3.3.x_build
[Pipeline] // parallel
[Pipeline] stage
[Pipeline] { (Notifications)
[Pipeline] echo
Build result: FAILURE
[Pipeline] jiraIssueSelector
Reply | Threaded
Open this post in threaded view
|

Build succeeded in Jenkins: Maven TLP » maven-help-plugin » MPH-156 #2

Apache Jenkins Server-2