Build failed in Jenkins: Maven TLP » maven-help-plugin » MPH-154 #1

classic Classic list List threaded Threaded
3 messages Options
Reply | Threaded
Open this post in threaded view
|

Build failed in Jenkins: Maven TLP » maven-help-plugin » MPH-154 #1

Apache Jenkins Server-2
See https://builds.apache.org/job/maven-box/job/maven-help-plugin/job/MPH-154/1/

No changes.

All tests passed

Build log:
[...truncated 4.92 MB...]
[windows-jdk11-m3.5.x_build] [INFO] Downloaded from central: https://repo.maven.apache.org/maven2/commons-cli/commons-cli/1.3.1/commons-cli-1.3.1.pom (10 kB at 799 kB/s)
[windows-jdk11-m3.5.x_build] [INFO] Downloading from central: https://repo.maven.apache.org/maven2/com/google/guava/guava/19.0/guava-19.0.pom
[windows-jdk11-m3.5.x_build] [INFO] Downloaded from central: https://repo.maven.apache.org/maven2/com/google/guava/guava/19.0/guava-19.0.pom (6.8 kB at 522 kB/s)
[windows-jdk11-m3.5.x_build] [INFO] Downloading from central: https://repo.maven.apache.org/maven2/com/google/guava/guava-parent/19.0/guava-parent-19.0.pom
[windows-jdk11-m3.5.x_build] [INFO] Downloaded from central: https://repo.maven.apache.org/maven2/com/google/guava/guava-parent/19.0/guava-parent-19.0.pom (9.9 kB at 658 kB/s)
[windows-jdk11-m3.5.x_build] [INFO] Downloading from central: https://repo.maven.apache.org/maven2/org/sonatype/oss/oss-parent/7/oss-parent-7.pom
[windows-jdk11-m3.5.x_build] [INFO] Downloaded from central: https://repo.maven.apache.org/maven2/org/sonatype/oss/oss-parent/7/oss-parent-7.pom (4.8 kB at 439 kB/s)
[windows-jdk11-m3.5.x_build] [INFO] Downloading from central: https://repo.maven.apache.org/maven2/javax/xml/bind/jaxb-api/2.3.0/jaxb-api-2.3.0.pom
[windows-jdk11-m3.5.x_build] [INFO] Downloaded from central: https://repo.maven.apache.org/maven2/javax/xml/bind/jaxb-api/2.3.0/jaxb-api-2.3.0.pom (23 kB at 1.0 MB/s)
[windows-jdk11-m3.5.x_build] [INFO] Downloading from central: https://repo.maven.apache.org/maven2/javax/xml/bind/jaxb-api-parent/2.3.0/jaxb-api-parent-2.3.0.pom
[windows-jdk11-m3.5.x_build] [INFO] Downloaded from central: https://repo.maven.apache.org/maven2/javax/xml/bind/jaxb-api-parent/2.3.0/jaxb-api-parent-2.3.0.pom (5.6 kB at 564 kB/s)
[windows-jdk11-m3.5.x_build] [INFO] Downloading from central: https://repo.maven.apache.org/maven2/net/java/jvnet-parent/5/jvnet-parent-5.pom
[windows-jdk11-m3.5.x_build] [INFO] Downloaded from central: https://repo.maven.apache.org/maven2/net/java/jvnet-parent/5/jvnet-parent-5.pom (8.9 kB at 554 kB/s)
[windows-jdk11-m3.5.x_build] [INFO] Downloading from central: https://repo.maven.apache.org/maven2/org/apache/maven/doxia/doxia-core/1.2/doxia-core-1.2.jar
[windows-jdk11-m3.5.x_build] [INFO] Downloading from central: https://repo.maven.apache.org/maven2/org/apache/maven/shared/maven-shared-resources/2/maven-shared-resources-2.jar
[windows-jdk11-m3.5.x_build] [INFO] Downloading from central: https://repo.maven.apache.org/maven2/commons-digester/commons-digester/1.6/commons-digester-1.6.jar
[windows-jdk11-m3.5.x_build] [INFO] Downloading from central: https://repo.maven.apache.org/maven2/commons-logging/commons-logging/1.0.4/commons-logging-1.0.4.jar
[windows-jdk11-m3.5.x_build] [INFO] Downloading from central: https://repo.maven.apache.org/maven2/org/apache/maven/doxia/doxia-integration-tools/1.6/doxia-integration-tools-1.6.jar
[windows-jdk11-m3.5.x_build] [INFO] Downloaded from central: https://repo.maven.apache.org/maven2/commons-logging/commons-logging/1.0.4/commons-logging-1.0.4.jar (38 kB at 1.2 MB/s)
[windows-jdk11-m3.5.x_build] [INFO] Downloading from central: https://repo.maven.apache.org/maven2/commons-io/commons-io/1.4/commons-io-1.4.jar
[windows-jdk11-m3.5.x_build] [INFO] Downloaded from central: https://repo.maven.apache.org/maven2/org/apache/maven/doxia/doxia-core/1.2/doxia-core-1.2.jar (154 kB at 4.4 MB/s)
[windows-jdk11-m3.5.x_build] [INFO] Downloading from central: https://repo.maven.apache.org/maven2/org/codehaus/plexus/plexus-resources/1.1.0/plexus-resources-1.1.0.jar
[windows-jdk11-m3.5.x_build] [INFO] Downloaded from central: https://repo.maven.apache.org/maven2/commons-digester/commons-digester/1.6/commons-digester-1.6.jar (168 kB at 4.8 MB/s)
[windows-jdk11-m3.5.x_build] [INFO] Downloading from central: https://repo.maven.apache.org/maven2/com/puppycrawl/tools/checkstyle/6.18/checkstyle-6.18.jar
[windows-jdk11-m3.5.x_build] [INFO] Downloaded from central: https://repo.maven.apache.org/maven2/org/apache/maven/shared/maven-shared-resources/2/maven-shared-resources-2.jar (13 kB at 165 kB/s)
[windows-jdk11-m3.5.x_build] [INFO] Downloading from central: https://repo.maven.apache.org/maven2/antlr/antlr/2.7.7/antlr-2.7.7.jar
[windows-jdk11-m3.5.x_build] [INFO] Downloaded from central: https://repo.maven.apache.org/maven2/commons-io/commons-io/1.4/commons-io-1.4.jar (109 kB at 1.4 MB/s)
[windows-jdk11-m3.5.x_build] [INFO] Downloading from central: https://repo.maven.apache.org/maven2/org/antlr/antlr4-runtime/4.5.3/antlr4-runtime-4.5.3.jar
[windows-jdk11-m3.5.x_build] [INFO] Downloaded from central: https://repo.maven.apache.org/maven2/com/puppycrawl/tools/checkstyle/6.18/checkstyle-6.18.jar (1.2 MB at 12 MB/s)
[windows-jdk11-m3.5.x_build] [INFO] Downloading from central: https://repo.maven.apache.org/maven2/commons-beanutils/commons-beanutils/1.9.2/commons-beanutils-1.9.2.jar
[windows-jdk11-m3.5.x_build] [INFO] Downloaded from central: https://repo.maven.apache.org/maven2/org/antlr/antlr4-runtime/4.5.3/antlr4-runtime-4.5.3.jar (302 kB at 2.7 MB/s)
[windows-jdk11-m3.5.x_build] [INFO] Downloading from central: https://repo.maven.apache.org/maven2/commons-cli/commons-cli/1.3.1/commons-cli-1.3.1.jar
[windows-jdk11-m3.5.x_build] [INFO] Downloaded from central: https://repo.maven.apache.org/maven2/antlr/antlr/2.7.7/antlr-2.7.7.jar (445 kB at 3.9 MB/s)
[windows-jdk11-m3.5.x_build] [INFO] Downloading from central: https://repo.maven.apache.org/maven2/com/google/guava/guava/19.0/guava-19.0.jar
[windows-jdk11-m3.5.x_build] [INFO] Downloaded from central: https://repo.maven.apache.org/maven2/commons-beanutils/commons-beanutils/1.9.2/commons-beanutils-1.9.2.jar (234 kB at 2.1 MB/s)
[windows-jdk11-m3.5.x_build] [INFO] Downloading from central: https://repo.maven.apache.org/maven2/commons-lang/commons-lang/2.1/commons-lang-2.1.jar
[windows-jdk11-m3.5.x_build] [INFO] Downloaded from central: https://repo.maven.apache.org/maven2/commons-cli/commons-cli/1.3.1/commons-cli-1.3.1.jar (53 kB at 353 kB/s)
[windows-jdk11-m3.5.x_build] [INFO] Downloading from central: https://repo.maven.apache.org/maven2/javax/xml/bind/jaxb-api/2.3.0/jaxb-api-2.3.0.jar
[windows-jdk11-m3.5.x_build] [INFO] Downloaded from central: https://repo.maven.apache.org/maven2/commons-lang/commons-lang/2.1/commons-lang-2.1.jar (208 kB at 1.3 MB/s)
[windows-jdk11-m3.5.x_build] [INFO] Downloaded from central: https://repo.maven.apache.org/maven2/org/codehaus/plexus/plexus-resources/1.1.0/plexus-resources-1.1.0.jar (23 kB at 133 kB/s)
[windows-jdk11-m3.5.x_build] [INFO] Downloaded from central: https://repo.maven.apache.org/maven2/javax/xml/bind/jaxb-api/2.3.0/jaxb-api-2.3.0.jar (126 kB at 718 kB/s)
[windows-jdk11-m3.5.x_build] [INFO] Downloaded from central: https://repo.maven.apache.org/maven2/com/google/guava/guava/19.0/guava-19.0.jar (2.3 MB at 13 MB/s)
[windows-jdk11-m3.5.x_build] [INFO] Downloaded from central: https://repo.maven.apache.org/maven2/org/apache/maven/doxia/doxia-integration-tools/1.6/doxia-integration-tools-1.6.jar (45 kB at 197 kB/s)
[windows-jdk11-m3.5.x_build] [INFO]
[windows-jdk11-m3.5.x_build] [INFO] --- maven-invoker-plugin:3.1.0:verify (integration-test) @ maven-help-plugin ---
[windows-jdk11-m3.5.x_build] [INFO] -------------------------------------------------
[windows-jdk11-m3.5.x_build] [INFO] Build Summary:
[windows-jdk11-m3.5.x_build] [INFO]   Passed: 29, Failed: 1, Errors: 0, Skipped: 0
[windows-jdk11-m3.5.x_build] [INFO] -------------------------------------------------
[windows-jdk11-m3.5.x_build] [ERROR] The following builds failed:
[windows-jdk11-m3.5.x_build] [ERROR] *  evaluate-forceStdout\pom.xml
[windows-jdk11-m3.5.x_build] [INFO] -------------------------------------------------
[windows-jdk11-m3.5.x_build] [INFO] ------------------------------------------------------------------------
[windows-jdk11-m3.5.x_build] [INFO] BUILD FAILURE
[windows-jdk11-m3.5.x_build] [INFO] ------------------------------------------------------------------------
[windows-jdk11-m3.5.x_build] [INFO] Total time: 04:49 min
[windows-jdk11-m3.5.x_build] [INFO] Finished at: 2018-11-03T04:30:31-07:00
[windows-jdk11-m3.5.x_build] [INFO] Final Memory: 48M/167M
[windows-jdk11-m3.5.x_build] [INFO] ------------------------------------------------------------------------
[windows-jdk11-m3.5.x_build] [INFO] [jenkins-event-spy] Generated F:\jenkins\jenkins-slave\workspace\x_maven-help-plugin_MPH-154-VXM3V7GTTLVLHGRUAZFTHVW3TNC24PTAG7PGH3XZEYHZOZWCPWCQ@2@2@tmp\withMaven63f37019\maven-spy-20181103-042541-23112525980841324348956.log
[windows-jdk11-m3.5.x_build] [ERROR] Failed to execute goal org.apache.maven.plugins:maven-invoker-plugin:3.1.0:verify (integration-test) on project maven-help-plugin: 1 build failed. See console output above for details. -> [Help 1]
[windows-jdk11-m3.5.x_build] [ERROR]
[windows-jdk11-m3.5.x_build] [ERROR] To see the full stack trace of the errors, re-run Maven with the -e switch.
[windows-jdk11-m3.5.x_build] [ERROR] Re-run Maven using the -X switch to enable full debug logging.
[windows-jdk11-m3.5.x_build] [ERROR]
[windows-jdk11-m3.5.x_build] [ERROR] For more information about the errors and possible solutions, please read the following articles:
[windows-jdk11-m3.5.x_build] [ERROR] [Help 1] http://cwiki.apache.org/confluence/display/MAVEN/MojoFailureException
[Pipeline] [linux-jdk10-m3.5.x_build] }
[linux-jdk10-m3.5.x_build] Failed in branch linux-jdk10-m3.5.x_build
[Pipeline] [linux-jdk11-m3.5.x_build] }
[Pipeline] [windows-jdk8-m3.5.x_build] cleanWs
[windows-jdk8-m3.5.x_build] [WS-CLEANUP] Deleting project workspace...[WS-CLEANUP] done
[Pipeline] [windows-jdk7-m3.2.x_build] cleanWs
[windows-jdk7-m3.2.x_build] [WS-CLEANUP] Deleting project workspace...[WS-CLEANUP] done
[Pipeline] [windows-jdk7-m3.3.x_build] cleanWs
[windows-jdk7-m3.3.x_build] [WS-CLEANUP] Deleting project workspace...[WS-CLEANUP] done
[Pipeline] [windows-jdk7-m3.5.x_build] }
[windows-jdk7-m3.5.x_build] [Fast Archiver] No prior successful build to compare, so performing full copy of artifacts
[windows-jdk7-m3.5.x_build] [withMaven] invokerPublisher - Archive invoker results for Maven artifact MavenArtifact{org.apache.maven.plugins:maven-help-plugin::3.1.1-SNAPSHOT(version: 3.1.1-SNAPSHOT, snapshot:false) } generated by PluginInvocation{org.apache.maven.plugins:maven-invoker-plugin:3.1.0@integration-test  integration-test}: windows-jdk7-m3.5.x_build\target\invoker-reports\*.xml
[windows-jdk7-m3.5.x_build] performing MavenInvokerRecorder, reportsFilenamePattern:'**/windows-jdk7-m3.5.x_build\target\invoker-reports/BUILD*.xml', invokerBuildDir:'**/windows-jdk7-m3.5.x_build\target\it'
[windows-jdk7-m3.5.x_build] Found reports:[f:\jenkins\jenkins-slave\workspace\x_maven-help-plugin_MPH-154-VXM3V7GTTLVLHGRUAZFTHVW3TNC24PTAG7PGH3XZEYHZOZWCPWCQ@3\windows-jdk7-m3.5.x_build\target\invoker-reports\BUILD-active-profiles.xml, f:\jenkins\jenkins-slave\workspace\x_maven-help-plugin_MPH-154-VXM3V7GTTLVLHGRUAZFTHVW3TNC24PTAG7PGH3XZEYHZOZWCPWCQ@3\windows-jdk7-m3.5.x_build\target\invoker-reports\BUILD-active-profiles_multimodule.xml, f:\jenkins\jenkins-slave\workspace\x_maven-help-plugin_MPH-154-VXM3V7GTTLVLHGRUAZFTHVW3TNC24PTAG7PGH3XZEYHZOZWCPWCQ@3\windows-jdk7-m3.5.x_build\target\invoker-reports\BUILD-all-profiles-parent-pom.xml, f:\jenkins\jenkins-slave\workspace\x_maven-help-plugin_MPH-154-VXM3V7GTTLVLHGRUAZFTHVW3TNC24PTAG7PGH3XZEYHZOZWCPWCQ@3\windows-jdk7-m3.5.x_build\target\invoker-reports\BUILD-all-profiles.xml, f:\jenkins\jenkins-slave\workspace\x_maven-help-plugin_MPH-154-VXM3V7GTTLVLHGRUAZFTHVW3TNC24PTAG7PGH3XZEYHZOZWCPWCQ@3\windows-jdk7-m3.5.x_build\target\invoker-reports\BUILD-describe-cmd-invalid.xml, f:\jenkins\jenkins-slave\workspace\x_maven-help-plugin_MPH-154-VXM3V7GTTLVLHGRUAZFTHVW3TNC24PTAG7PGH3XZEYHZOZWCPWCQ@3\windows-jdk7-m3.5.x_build\target\invoker-reports\BUILD-describe-cmd-with-goal-invalid.xml, f:\jenkins\jenkins-slave\workspace\x_maven-help-plugin_MPH-154-VXM3V7GTTLVLHGRUAZFTHVW3TNC24PTAG7PGH3XZEYHZOZWCPWCQ@3\windows-jdk7-m3.5.x_build\target\invoker-reports\BUILD-describe-cmd-with-goal-report.xml, f:\jenkins\jenkins-slave\workspace\x_maven-help-plugin_MPH-154-VXM3V7GTTLVLHGRUAZFTHVW3TNC24PTAG7PGH3XZEYHZOZWCPWCQ@3\windows-jdk7-m3.5.x_build\target\invoker-reports\BUILD-describe-cmd-with-goal.xml, f:\jenkins\jenkins-slave\workspace\x_maven-help-plugin_MPH-154-VXM3V7GTTLVLHGRUAZFTHVW3TNC24PTAG7PGH3XZEYHZOZWCPWCQ@3\windows-jdk7-m3.5.x_build\target\invoker-reports\BUILD-describe-cmd.xml, f:\jenkins\jenkins-slave\workspace\x_maven-help-plugin_MPH-154-VXM3V7GTTLVLHGRUAZFTHVW3TNC24PTAG7PGH3XZEYHZOZWCPWCQ@3\windows-jdk7-m3.5.x_build\target\invoker-reports\BUILD-describe-ga.xml, f:\jenkins\jenkins-slave\workspace\x_maven-help-plugin_MPH-154-VXM3V7GTTLVLHGRUAZFTHVW3TNC24PTAG7PGH3XZEYHZOZWCPWCQ@3\windows-jdk7-m3.5.x_build\target\invoker-reports\BUILD-describe-gav.xml, f:\jenkins\jenkins-slave\workspace\x_maven-help-plugin_MPH-154-VXM3V7GTTLVLHGRUAZFTHVW3TNC24PTAG7PGH3XZEYHZOZWCPWCQ@3\windows-jdk7-m3.5.x_build\target\invoker-reports\BUILD-describe-plugin-in-plugin-management.xml, f:\jenkins\jenkins-slave\workspace\x_maven-help-plugin_MPH-154-VXM3V7GTTLVLHGRUAZFTHVW3TNC24PTAG7PGH3XZEYHZOZWCPWCQ@3\windows-jdk7-m3.5.x_build\target\invoker-reports\BUILD-describe-plugin-without-name.xml, f:\jenkins\jenkins-slave\workspace\x_maven-help-plugin_MPH-154-VXM3V7GTTLVLHGRUAZFTHVW3TNC24PTAG7PGH3XZEYHZOZWCPWCQ@3\windows-jdk7-m3.5.x_build\target\invoker-reports\BUILD-describe-prefix-and-invalid-mojo.xml, f:\jenkins\jenkins-slave\workspace\x_maven-help-plugin_MPH-154-VXM3V7GTTLVLHGRUAZFTHVW3TNC24PTAG7PGH3XZEYHZOZWCPWCQ@3\windows-jdk7-m3.5.x_build\target\invoker-reports\BUILD-describe-prefix-and-mojo.xml, f:\jenkins\jenkins-slave\workspace\x_maven-help-plugin_MPH-154-VXM3V7GTTLVLHGRUAZFTHVW3TNC24PTAG7PGH3XZEYHZOZWCPWCQ@3\windows-jdk7-m3.5.x_build\target\invoker-reports\BUILD-describe-prefix.xml, f:\jenkins\jenkins-slave\workspace\x_maven-help-plugin_MPH-154-VXM3V7GTTLVLHGRUAZFTHVW3TNC24PTAG7PGH3XZEYHZOZWCPWCQ@3\windows-jdk7-m3.5.x_build\target\invoker-reports\BUILD-effective-pom-artifact.xml, f:\jenkins\jenkins-slave\workspace\x_maven-help-plugin_MPH-154-VXM3V7GTTLVLHGRUAZFTHVW3TNC24PTAG7PGH3XZEYHZOZWCPWCQ@3\windows-jdk7-m3.5.x_build\target\invoker-reports\BUILD-effective-pom-from-lifecycle.xml, f:\jenkins\jenkins-slave\workspace\x_maven-help-plugin_MPH-154-VXM3V7GTTLVLHGRUAZFTHVW3TNC24PTAG7PGH3XZEYHZOZWCPWCQ@3\windows-jdk7-m3.5.x_build\target\invoker-reports\BUILD-effective-pom-multimodule-unlink-parent.xml, f:\jenkins\jenkins-slave\workspace\x_maven-help-plugin_MPH-154-VXM3V7GTTLVLHGRUAZFTHVW3TNC24PTAG7PGH3XZEYHZOZWCPWCQ@3\windows-jdk7-m3.5.x_build\target\invoker-reports\BUILD-effective-pom-multimodule.xml, f:\jenkins\jenkins-slave\workspace\x_maven-help-plugin_MPH-154-VXM3V7GTTLVLHGRUAZFTHVW3TNC24PTAG7PGH3XZEYHZOZWCPWCQ@3\windows-jdk7-m3.5.x_build\target\invoker-reports\BUILD-effective-pom.xml, f:\jenkins\jenkins-slave\workspace\x_maven-help-plugin_MPH-154-VXM3V7GTTLVLHGRUAZFTHVW3TNC24PTAG7PGH3XZEYHZOZWCPWCQ@3\windows-jdk7-m3.5.x_build\target\invoker-reports\BUILD-effective-pom_properties.xml, f:\jenkins\jenkins-slave\workspace\x_maven-help-plugin_MPH-154-VXM3V7GTTLVLHGRUAZFTHVW3TNC24PTAG7PGH3XZEYHZOZWCPWCQ@3\windows-jdk7-m3.5.x_build\target\invoker-reports\BUILD-effective-settings.xml, f:\jenkins\jenkins-slave\workspace\x_maven-help-plugin_MPH-154-VXM3V7GTTLVLHGRUAZFTHVW3TNC24PTAG7PGH3XZEYHZOZWCPWCQ@3\windows-jdk7-m3.5.x_build\target\invoker-reports\BUILD-effective-settings_deep-clone.xml, f:\jenkins\jenkins-slave\workspace\x_maven-help-plugin_MPH-154-VXM3V7GTTLVLHGRUAZFTHVW3TNC24PTAG7PGH3XZEYHZOZWCPWCQ@3\windows-jdk7-m3.5.x_build\target\invoker-reports\BUILD-evaluate-artifact-with-expression-with-output.xml, f:\jenkins\jenkins-slave\workspace\x_maven-help-plugin_MPH-154-VXM3V7GTTLVLHGRUAZFTHVW3TNC24PTAG7PGH3XZEYHZOZWCPWCQ@3\windows-jdk7-m3.5.x_build\target\invoker-reports\BUILD-evaluate-forceStdout.xml, f:\jenkins\jenkins-slave\workspace\x_maven-help-plugin_MPH-154-VXM3V7GTTLVLHGRUAZFTHVW3TNC24PTAG7PGH3XZEYHZOZWCPWCQ@3\windows-jdk7-m3.5.x_build\target\invoker-reports\BUILD-evaluate-settings-servers.xml, f:\jenkins\jenkins-slave\workspace\x_maven-help-plugin_MPH-154-VXM3V7GTTLVLHGRUAZFTHVW3TNC24PTAG7PGH3XZEYHZOZWCPWCQ@3\windows-jdk7-m3.5.x_build\target\invoker-reports\BUILD-evaluate-with-expression-with-output.xml, f:\jenkins\jenkins-slave\workspace\x_maven-help-plugin_MPH-154-VXM3V7GTTLVLHGRUAZFTHVW3TNC24PTAG7PGH3XZEYHZOZWCPWCQ@3\windows-jdk7-m3.5.x_build\target\invoker-reports\BUILD-evaluate.xml, f:\jenkins\jenkins-slave\workspace\x_maven-help-plugin_MPH-154-VXM3V7GTTLVLHGRUAZFTHVW3TNC24PTAG7PGH3XZEYHZOZWCPWCQ@3\windows-jdk7-m3.5.x_build\target\invoker-reports\BUILD-system.xml]
[windows-jdk7-m3.5.x_build] Found logs:[f:\jenkins\jenkins-slave\workspace\x_maven-help-plugin_MPH-154-VXM3V7GTTLVLHGRUAZFTHVW3TNC24PTAG7PGH3XZEYHZOZWCPWCQ@3\windows-jdk7-m3.5.x_build\target\it\active-profiles\build.log, f:\jenkins\jenkins-slave\workspace\x_maven-help-plugin_MPH-154-VXM3V7GTTLVLHGRUAZFTHVW3TNC24PTAG7PGH3XZEYHZOZWCPWCQ@3\windows-jdk7-m3.5.x_build\target\it\active-profiles_multimodule\build.log, f:\jenkins\jenkins-slave\workspace\x_maven-help-plugin_MPH-154-VXM3V7GTTLVLHGRUAZFTHVW3TNC24PTAG7PGH3XZEYHZOZWCPWCQ@3\windows-jdk7-m3.5.x_build\target\it\all-profiles-parent-pom\build.log, f:\jenkins\jenkins-slave\workspace\x_maven-help-plugin_MPH-154-VXM3V7GTTLVLHGRUAZFTHVW3TNC24PTAG7PGH3XZEYHZOZWCPWCQ@3\windows-jdk7-m3.5.x_build\target\it\all-profiles\build.log, f:\jenkins\jenkins-slave\workspace\x_maven-help-plugin_MPH-154-VXM3V7GTTLVLHGRUAZFTHVW3TNC24PTAG7PGH3XZEYHZOZWCPWCQ@3\windows-jdk7-m3.5.x_build\target\it\describe-cmd-invalid\build.log, f:\jenkins\jenkins-slave\workspace\x_maven-help-plugin_MPH-154-VXM3V7GTTLVLHGRUAZFTHVW3TNC24PTAG7PGH3XZEYHZOZWCPWCQ@3\windows-jdk7-m3.5.x_build\target\it\describe-cmd-with-goal-invalid\build.log, f:\jenkins\jenkins-slave\workspace\x_maven-help-plugin_MPH-154-VXM3V7GTTLVLHGRUAZFTHVW3TNC24PTAG7PGH3XZEYHZOZWCPWCQ@3\windows-jdk7-m3.5.x_build\target\it\describe-cmd-with-goal-report\build.log, f:\jenkins\jenkins-slave\workspace\x_maven-help-plugin_MPH-154-VXM3V7GTTLVLHGRUAZFTHVW3TNC24PTAG7PGH3XZEYHZOZWCPWCQ@3\windows-jdk7-m3.5.x_build\target\it\describe-cmd-with-goal\build.log, f:\jenkins\jenkins-slave\workspace\x_maven-help-plugin_MPH-154-VXM3V7GTTLVLHGRUAZFTHVW3TNC24PTAG7PGH3XZEYHZOZWCPWCQ@3\windows-jdk7-m3.5.x_build\target\it\describe-cmd\build.log, f:\jenkins\jenkins-slave\workspace\x_maven-help-plugin_MPH-154-VXM3V7GTTLVLHGRUAZFTHVW3TNC24PTAG7PGH3XZEYHZOZWCPWCQ@3\windows-jdk7-m3.5.x_build\target\it\describe-ga\build.log, f:\jenkins\jenkins-slave\workspace\x_maven-help-plugin_MPH-154-VXM3V7GTTLVLHGRUAZFTHVW3TNC24PTAG7PGH3XZEYHZOZWCPWCQ@3\windows-jdk7-m3.5.x_build\target\it\describe-gav\build.log, f:\jenkins\jenkins-slave\workspace\x_maven-help-plugin_MPH-154-VXM3V7GTTLVLHGRUAZFTHVW3TNC24PTAG7PGH3XZEYHZOZWCPWCQ@3\windows-jdk7-m3.5.x_build\target\it\describe-plugin-in-plugin-management\build.log, f:\jenkins\jenkins-slave\workspace\x_maven-help-plugin_MPH-154-VXM3V7GTTLVLHGRUAZFTHVW3TNC24PTAG7PGH3XZEYHZOZWCPWCQ@3\windows-jdk7-m3.5.x_build\target\it\describe-plugin-without-name\build.log, f:\jenkins\jenkins-slave\workspace\x_maven-help-plugin_MPH-154-VXM3V7GTTLVLHGRUAZFTHVW3TNC24PTAG7PGH3XZEYHZOZWCPWCQ@3\windows-jdk7-m3.5.x_build\target\it\describe-prefix-and-invalid-mojo\build.log, f:\jenkins\jenkins-slave\workspace\x_maven-help-plugin_MPH-154-VXM3V7GTTLVLHGRUAZFTHVW3TNC24PTAG7PGH3XZEYHZOZWCPWCQ@3\windows-jdk7-m3.5.x_build\target\it\describe-prefix-and-mojo\build.log, f:\jenkins\jenkins-slave\workspace\x_maven-help-plugin_MPH-154-VXM3V7GTTLVLHGRUAZFTHVW3TNC24PTAG7PGH3XZEYHZOZWCPWCQ@3\windows-jdk7-m3.5.x_build\target\it\describe-prefix\build.log, f:\jenkins\jenkins-slave\workspace\x_maven-help-plugin_MPH-154-VXM3V7GTTLVLHGRUAZFTHVW3TNC24PTAG7PGH3XZEYHZOZWCPWCQ@3\windows-jdk7-m3.5.x_build\target\it\effective-pom-artifact\build.log, f:\jenkins\jenkins-slave\workspace\x_maven-help-plugin_MPH-154-VXM3V7GTTLVLHGRUAZFTHVW3TNC24PTAG7PGH3XZEYHZOZWCPWCQ@3\windows-jdk7-m3.5.x_build\target\it\effective-pom-from-lifecycle\build.log, f:\jenkins\jenkins-slave\workspace\x_maven-help-plugin_MPH-154-VXM3V7GTTLVLHGRUAZFTHVW3TNC24PTAG7PGH3XZEYHZOZWCPWCQ@3\windows-jdk7-m3.5.x_build\target\it\effective-pom-multimodule-unlink-parent\build.log, f:\jenkins\jenkins-slave\workspace\x_maven-help-plugin_MPH-154-VXM3V7GTTLVLHGRUAZFTHVW3TNC24PTAG7PGH3XZEYHZOZWCPWCQ@3\windows-jdk7-m3.5.x_build\target\it\effective-pom-multimodule\build.log, f:\jenkins\jenkins-slave\workspace\x_maven-help-plugin_MPH-154-VXM3V7GTTLVLHGRUAZFTHVW3TNC24PTAG7PGH3XZEYHZOZWCPWCQ@3\windows-jdk7-m3.5.x_build\target\it\effective-pom\build.log, f:\jenkins\jenkins-slave\workspace\x_maven-help-plugin_MPH-154-VXM3V7GTTLVLHGRUAZFTHVW3TNC24PTAG7PGH3XZEYHZOZWCPWCQ@3\windows-jdk7-m3.5.x_build\target\it\effective-pom_properties\build.log, f:\jenkins\jenkins-slave\workspace\x_maven-help-plugin_MPH-154-VXM3V7GTTLVLHGRUAZFTHVW3TNC24PTAG7PGH3XZEYHZOZWCPWCQ@3\windows-jdk7-m3.5.x_build\target\it\effective-settings\build.log, f:\jenkins\jenkins-slave\workspace\x_maven-help-plugin_MPH-154-VXM3V7GTTLVLHGRUAZFTHVW3TNC24PTAG7PGH3XZEYHZOZWCPWCQ@3\windows-jdk7-m3.5.x_build\target\it\effective-settings_deep-clone\build.log, f:\jenkins\jenkins-slave\workspace\x_maven-help-plugin_MPH-154-VXM3V7GTTLVLHGRUAZFTHVW3TNC24PTAG7PGH3XZEYHZOZWCPWCQ@3\windows-jdk7-m3.5.x_build\target\it\evaluate-artifact-with-expression-with-output\build.log, f:\jenkins\jenkins-slave\workspace\x_maven-help-plugin_MPH-154-VXM3V7GTTLVLHGRUAZFTHVW3TNC24PTAG7PGH3XZEYHZOZWCPWCQ@3\windows-jdk7-m3.5.x_build\target\it\evaluate-forceStdout\build.log, f:\jenkins\jenkins-slave\workspace\x_maven-help-plugin_MPH-154-VXM3V7GTTLVLHGRUAZFTHVW3TNC24PTAG7PGH3XZEYHZOZWCPWCQ@3\windows-jdk7-m3.5.x_build\target\it\evaluate-settings-servers\build.log, f:\jenkins\jenkins-slave\workspace\x_maven-help-plugin_MPH-154-VXM3V7GTTLVLHGRUAZFTHVW3TNC24PTAG7PGH3XZEYHZOZWCPWCQ@3\windows-jdk7-m3.5.x_build\target\it\evaluate-with-expression-with-output\build.log, f:\jenkins\jenkins-slave\workspace\x_maven-help-plugin_MPH-154-VXM3V7GTTLVLHGRUAZFTHVW3TNC24PTAG7PGH3XZEYHZOZWCPWCQ@3\windows-jdk7-m3.5.x_build\target\it\evaluate\build.log, f:\jenkins\jenkins-slave\workspace\x_maven-help-plugin_MPH-154-VXM3V7GTTLVLHGRUAZFTHVW3TNC24PTAG7PGH3XZEYHZOZWCPWCQ@3\windows-jdk7-m3.5.x_build\target\it\system\build.log]
[windows-jdk7-m3.5.x_build] Finished parsing Maven Invoker results (found 30)
[windows-jdk7-m3.5.x_build] [withMaven] junitPublisher - Archive test results for Maven artifact org.apache.maven.plugins:maven-help-plugin:3.1.1-SNAPSHOT generated by maven-surefire-plugin:test (default-test): windows-jdk7-m3.5.x_build\target\surefire-reports\*.xml
[windows-jdk7-m3.5.x_build] Recording test results
[windows-jdk7-m3.5.x_build] [withMaven] openTasksPublisher - Scan Tasks for Maven artifact org.apache.maven.plugins:maven-help-plugin:3.1.1-SNAPSHOT in source directory windows-jdk7-m3.5.x_build\src\main\java
[windows-jdk7-m3.5.x_build] [TASKS] Scanning folder 'f:\jenkins\jenkins-slave\workspace\x_maven-help-plugin_MPH-154-VXM3V7GTTLVLHGRUAZFTHVW3TNC24PTAG7PGH3XZEYHZOZWCPWCQ@3' for files matching the pattern 'windows-jdk7-m3.5.x_build\src\main\java\**\*' - excludes: null
[windows-jdk7-m3.5.x_build] [TASKS] Found 9 files to scan for tasks
[windows-jdk7-m3.5.x_build] [TASKS] Found 1 open tasks.
[windows-jdk7-m3.5.x_build] Skipping warnings blame since pipelines do not have an SCM link.%n
[Pipeline] [windows-jdk10-m3.5.x_build] }
[windows-jdk10-m3.5.x_build] [Fast Archiver] No prior successful build to compare, so performing full copy of artifacts
[windows-jdk10-m3.5.x_build] [withMaven] invokerPublisher - Archive invoker results for Maven artifact MavenArtifact{org.apache.maven.plugins:maven-help-plugin::3.1.1-SNAPSHOT(version: 3.1.1-SNAPSHOT, snapshot:false) } generated by PluginInvocation{org.apache.maven.plugins:maven-invoker-plugin:3.1.0@integration-test  integration-test}: windows-jdk10-m3.5.x_build\target\invoker-reports\*.xml
[windows-jdk10-m3.5.x_build] performing MavenInvokerRecorder, reportsFilenamePattern:'**/windows-jdk10-m3.5.x_build\target\invoker-reports/BUILD*.xml', invokerBuildDir:'**/windows-jdk10-m3.5.x_build\target\it'
[windows-jdk10-m3.5.x_build] Found reports:[f:\jenkins\jenkins-slave\workspace\x_maven-help-plugin_MPH-154-VXM3V7GTTLVLHGRUAZFTHVW3TNC24PTAG7PGH3XZEYHZOZWCPWCQ@3\windows-jdk10-m3.5.x_build\target\invoker-reports\BUILD-active-profiles.xml, f:\jenkins\jenkins-slave\workspace\x_maven-help-plugin_MPH-154-VXM3V7GTTLVLHGRUAZFTHVW3TNC24PTAG7PGH3XZEYHZOZWCPWCQ@3\windows-jdk10-m3.5.x_build\target\invoker-reports\BUILD-active-profiles_multimodule.xml, f:\jenkins\jenkins-slave\workspace\x_maven-help-plugin_MPH-154-VXM3V7GTTLVLHGRUAZFTHVW3TNC24PTAG7PGH3XZEYHZOZWCPWCQ@3\windows-jdk10-m3.5.x_build\target\invoker-reports\BUILD-all-profiles-parent-pom.xml, f:\jenkins\jenkins-slave\workspace\x_maven-help-plugin_MPH-154-VXM3V7GTTLVLHGRUAZFTHVW3TNC24PTAG7PGH3XZEYHZOZWCPWCQ@3\windows-jdk10-m3.5.x_build\target\invoker-reports\BUILD-all-profiles.xml, f:\jenkins\jenkins-slave\workspace\x_maven-help-plugin_MPH-154-VXM3V7GTTLVLHGRUAZFTHVW3TNC24PTAG7PGH3XZEYHZOZWCPWCQ@3\windows-jdk10-m3.5.x_build\target\invoker-reports\BUILD-describe-cmd-invalid.xml, f:\jenkins\jenkins-slave\workspace\x_maven-help-plugin_MPH-154-VXM3V7GTTLVLHGRUAZFTHVW3TNC24PTAG7PGH3XZEYHZOZWCPWCQ@3\windows-jdk10-m3.5.x_build\target\invoker-reports\BUILD-describe-cmd-with-goal-invalid.xml, f:\jenkins\jenkins-slave\workspace\x_maven-help-plugin_MPH-154-VXM3V7GTTLVLHGRUAZFTHVW3TNC24PTAG7PGH3XZEYHZOZWCPWCQ@3\windows-jdk10-m3.5.x_build\target\invoker-reports\BUILD-describe-cmd-with-goal-report.xml, f:\jenkins\jenkins-slave\workspace\x_maven-help-plugin_MPH-154-VXM3V7GTTLVLHGRUAZFTHVW3TNC24PTAG7PGH3XZEYHZOZWCPWCQ@3\windows-jdk10-m3.5.x_build\target\invoker-reports\BUILD-describe-cmd-with-goal.xml, f:\jenkins\jenkins-slave\workspace\x_maven-help-plugin_MPH-154-VXM3V7GTTLVLHGRUAZFTHVW3TNC24PTAG7PGH3XZEYHZOZWCPWCQ@3\windows-jdk10-m3.5.x_build\target\invoker-reports\BUILD-describe-cmd.xml, f:\jenkins\jenkins-slave\workspace\x_maven-help-plugin_MPH-154-VXM3V7GTTLVLHGRUAZFTHVW3TNC24PTAG7PGH3XZEYHZOZWCPWCQ@3\windows-jdk10-m3.5.x_build\target\invoker-reports\BUILD-describe-ga.xml, f:\jenkins\jenkins-slave\workspace\x_maven-help-plugin_MPH-154-VXM3V7GTTLVLHGRUAZFTHVW3TNC24PTAG7PGH3XZEYHZOZWCPWCQ@3\windows-jdk10-m3.5.x_build\target\invoker-reports\BUILD-describe-gav.xml, f:\jenkins\jenkins-slave\workspace\x_maven-help-plugin_MPH-154-VXM3V7GTTLVLHGRUAZFTHVW3TNC24PTAG7PGH3XZEYHZOZWCPWCQ@3\windows-jdk10-m3.5.x_build\target\invoker-reports\BUILD-describe-plugin-in-plugin-management.xml, f:\jenkins\jenkins-slave\workspace\x_maven-help-plugin_MPH-154-VXM3V7GTTLVLHGRUAZFTHVW3TNC24PTAG7PGH3XZEYHZOZWCPWCQ@3\windows-jdk10-m3.5.x_build\target\invoker-reports\BUILD-describe-plugin-without-name.xml, f:\jenkins\jenkins-slave\workspace\x_maven-help-plugin_MPH-154-VXM3V7GTTLVLHGRUAZFTHVW3TNC24PTAG7PGH3XZEYHZOZWCPWCQ@3\windows-jdk10-m3.5.x_build\target\invoker-reports\BUILD-describe-prefix-and-invalid-mojo.xml, f:\jenkins\jenkins-slave\workspace\x_maven-help-plugin_MPH-154-VXM3V7GTTLVLHGRUAZFTHVW3TNC24PTAG7PGH3XZEYHZOZWCPWCQ@3\windows-jdk10-m3.5.x_build\target\invoker-reports\BUILD-describe-prefix-and-mojo.xml, f:\jenkins\jenkins-slave\workspace\x_maven-help-plugin_MPH-154-VXM3V7GTTLVLHGRUAZFTHVW3TNC24PTAG7PGH3XZEYHZOZWCPWCQ@3\windows-jdk10-m3.5.x_build\target\invoker-reports\BUILD-describe-prefix.xml, f:\jenkins\jenkins-slave\workspace\x_maven-help-plugin_MPH-154-VXM3V7GTTLVLHGRUAZFTHVW3TNC24PTAG7PGH3XZEYHZOZWCPWCQ@3\windows-jdk10-m3.5.x_build\target\invoker-reports\BUILD-effective-pom-artifact.xml, f:\jenkins\jenkins-slave\workspace\x_maven-help-plugin_MPH-154-VXM3V7GTTLVLHGRUAZFTHVW3TNC24PTAG7PGH3XZEYHZOZWCPWCQ@3\windows-jdk10-m3.5.x_build\target\invoker-reports\BUILD-effective-pom-from-lifecycle.xml, f:\jenkins\jenkins-slave\workspace\x_maven-help-plugin_MPH-154-VXM3V7GTTLVLHGRUAZFTHVW3TNC24PTAG7PGH3XZEYHZOZWCPWCQ@3\windows-jdk10-m3.5.x_build\target\invoker-reports\BUILD-effective-pom-multimodule-unlink-parent.xml, f:\jenkins\jenkins-slave\workspace\x_maven-help-plugin_MPH-154-VXM3V7GTTLVLHGRUAZFTHVW3TNC24PTAG7PGH3XZEYHZOZWCPWCQ@3\windows-jdk10-m3.5.x_build\target\invoker-reports\BUILD-effective-pom-multimodule.xml, f:\jenkins\jenkins-slave\workspace\x_maven-help-plugin_MPH-154-VXM3V7GTTLVLHGRUAZFTHVW3TNC24PTAG7PGH3XZEYHZOZWCPWCQ@3\windows-jdk10-m3.5.x_build\target\invoker-reports\BUILD-effective-pom.xml, f:\jenkins\jenkins-slave\workspace\x_maven-help-plugin_MPH-154-VXM3V7GTTLVLHGRUAZFTHVW3TNC24PTAG7PGH3XZEYHZOZWCPWCQ@3\windows-jdk10-m3.5.x_build\target\invoker-reports\BUILD-effective-pom_properties.xml, f:\jenkins\jenkins-slave\workspace\x_maven-help-plugin_MPH-154-VXM3V7GTTLVLHGRUAZFTHVW3TNC24PTAG7PGH3XZEYHZOZWCPWCQ@3\windows-jdk10-m3.5.x_build\target\invoker-reports\BUILD-effective-settings.xml, f:\jenkins\jenkins-slave\workspace\x_maven-help-plugin_MPH-154-VXM3V7GTTLVLHGRUAZFTHVW3TNC24PTAG7PGH3XZEYHZOZWCPWCQ@3\windows-jdk10-m3.5.x_build\target\invoker-reports\BUILD-effective-settings_deep-clone.xml, f:\jenkins\jenkins-slave\workspace\x_maven-help-plugin_MPH-154-VXM3V7GTTLVLHGRUAZFTHVW3TNC24PTAG7PGH3XZEYHZOZWCPWCQ@3\windows-jdk10-m3.5.x_build\target\invoker-reports\BUILD-evaluate-artifact-with-expression-with-output.xml, f:\jenkins\jenkins-slave\workspace\x_maven-help-plugin_MPH-154-VXM3V7GTTLVLHGRUAZFTHVW3TNC24PTAG7PGH3XZEYHZOZWCPWCQ@3\windows-jdk10-m3.5.x_build\target\invoker-reports\BUILD-evaluate-forceStdout.xml, f:\jenkins\jenkins-slave\workspace\x_maven-help-plugin_MPH-154-VXM3V7GTTLVLHGRUAZFTHVW3TNC24PTAG7PGH3XZEYHZOZWCPWCQ@3\windows-jdk10-m3.5.x_build\target\invoker-reports\BUILD-evaluate-settings-servers.xml, f:\jenkins\jenkins-slave\workspace\x_maven-help-plugin_MPH-154-VXM3V7GTTLVLHGRUAZFTHVW3TNC24PTAG7PGH3XZEYHZOZWCPWCQ@3\windows-jdk10-m3.5.x_build\target\invoker-reports\BUILD-evaluate-with-expression-with-output.xml, f:\jenkins\jenkins-slave\workspace\x_maven-help-plugin_MPH-154-VXM3V7GTTLVLHGRUAZFTHVW3TNC24PTAG7PGH3XZEYHZOZWCPWCQ@3\windows-jdk10-m3.5.x_build\target\invoker-reports\BUILD-evaluate.xml, f:\jenkins\jenkins-slave\workspace\x_maven-help-plugin_MPH-154-VXM3V7GTTLVLHGRUAZFTHVW3TNC24PTAG7PGH3XZEYHZOZWCPWCQ@3\windows-jdk10-m3.5.x_build\target\invoker-reports\BUILD-system.xml]
[windows-jdk10-m3.5.x_build] Found logs:[f:\jenkins\jenkins-slave\workspace\x_maven-help-plugin_MPH-154-VXM3V7GTTLVLHGRUAZFTHVW3TNC24PTAG7PGH3XZEYHZOZWCPWCQ@3\windows-jdk10-m3.5.x_build\target\it\active-profiles\build.log, f:\jenkins\jenkins-slave\workspace\x_maven-help-plugin_MPH-154-VXM3V7GTTLVLHGRUAZFTHVW3TNC24PTAG7PGH3XZEYHZOZWCPWCQ@3\windows-jdk10-m3.5.x_build\target\it\active-profiles_multimodule\build.log, f:\jenkins\jenkins-slave\workspace\x_maven-help-plugin_MPH-154-VXM3V7GTTLVLHGRUAZFTHVW3TNC24PTAG7PGH3XZEYHZOZWCPWCQ@3\windows-jdk10-m3.5.x_build\target\it\all-profiles-parent-pom\build.log, f:\jenkins\jenkins-slave\workspace\x_maven-help-plugin_MPH-154-VXM3V7GTTLVLHGRUAZFTHVW3TNC24PTAG7PGH3XZEYHZOZWCPWCQ@3\windows-jdk10-m3.5.x_build\target\it\all-profiles\build.log, f:\jenkins\jenkins-slave\workspace\x_maven-help-plugin_MPH-154-VXM3V7GTTLVLHGRUAZFTHVW3TNC24PTAG7PGH3XZEYHZOZWCPWCQ@3\windows-jdk10-m3.5.x_build\target\it\describe-cmd-invalid\build.log, f:\jenkins\jenkins-slave\workspace\x_maven-help-plugin_MPH-154-VXM3V7GTTLVLHGRUAZFTHVW3TNC24PTAG7PGH3XZEYHZOZWCPWCQ@3\windows-jdk10-m3.5.x_build\target\it\describe-cmd-with-goal-invalid\build.log, f:\jenkins\jenkins-slave\workspace\x_maven-help-plugin_MPH-154-VXM3V7GTTLVLHGRUAZFTHVW3TNC24PTAG7PGH3XZEYHZOZWCPWCQ@3\windows-jdk10-m3.5.x_build\target\it\describe-cmd-with-goal-report\build.log, f:\jenkins\jenkins-slave\workspace\x_maven-help-plugin_MPH-154-VXM3V7GTTLVLHGRUAZFTHVW3TNC24PTAG7PGH3XZEYHZOZWCPWCQ@3\windows-jdk10-m3.5.x_build\target\it\describe-cmd-with-goal\build.log, f:\jenkins\jenkins-slave\workspace\x_maven-help-plugin_MPH-154-VXM3V7GTTLVLHGRUAZFTHVW3TNC24PTAG7PGH3XZEYHZOZWCPWCQ@3\windows-jdk10-m3.5.x_build\target\it\describe-cmd\build.log, f:\jenkins\jenkins-slave\workspace\x_maven-help-plugin_MPH-154-VXM3V7GTTLVLHGRUAZFTHVW3TNC24PTAG7PGH3XZEYHZOZWCPWCQ@3\windows-jdk10-m3.5.x_build\target\it\describe-ga\build.log, f:\jenkins\jenkins-slave\workspace\x_maven-help-plugin_MPH-154-VXM3V7GTTLVLHGRUAZFTHVW3TNC24PTAG7PGH3XZEYHZOZWCPWCQ@3\windows-jdk10-m3.5.x_build\target\it\describe-gav\build.log, f:\jenkins\jenkins-slave\workspace\x_maven-help-plugin_MPH-154-VXM3V7GTTLVLHGRUAZFTHVW3TNC24PTAG7PGH3XZEYHZOZWCPWCQ@3\windows-jdk10-m3.5.x_build\target\it\describe-plugin-in-plugin-management\build.log, f:\jenkins\jenkins-slave\workspace\x_maven-help-plugin_MPH-154-VXM3V7GTTLVLHGRUAZFTHVW3TNC24PTAG7PGH3XZEYHZOZWCPWCQ@3\windows-jdk10-m3.5.x_build\target\it\describe-plugin-without-name\build.log, f:\jenkins\jenkins-slave\workspace\x_maven-help-plugin_MPH-154-VXM3V7GTTLVLHGRUAZFTHVW3TNC24PTAG7PGH3XZEYHZOZWCPWCQ@3\windows-jdk10-m3.5.x_build\target\it\describe-prefix-and-invalid-mojo\build.log, f:\jenkins\jenkins-slave\workspace\x_maven-help-plugin_MPH-154-VXM3V7GTTLVLHGRUAZFTHVW3TNC24PTAG7PGH3XZEYHZOZWCPWCQ@3\windows-jdk10-m3.5.x_build\target\it\describe-prefix-and-mojo\build.log, f:\jenkins\jenkins-slave\workspace\x_maven-help-plugin_MPH-154-VXM3V7GTTLVLHGRUAZFTHVW3TNC24PTAG7PGH3XZEYHZOZWCPWCQ@3\windows-jdk10-m3.5.x_build\target\it\describe-prefix\build.log, f:\jenkins\jenkins-slave\workspace\x_maven-help-plugin_MPH-154-VXM3V7GTTLVLHGRUAZFTHVW3TNC24PTAG7PGH3XZEYHZOZWCPWCQ@3\windows-jdk10-m3.5.x_build\target\it\effective-pom-artifact\build.log, f:\jenkins\jenkins-slave\workspace\x_maven-help-plugin_MPH-154-VXM3V7GTTLVLHGRUAZFTHVW3TNC24PTAG7PGH3XZEYHZOZWCPWCQ@3\windows-jdk10-m3.5.x_build\target\it\effective-pom-from-lifecycle\build.log, f:\jenkins\jenkins-slave\workspace\x_maven-help-plugin_MPH-154-VXM3V7GTTLVLHGRUAZFTHVW3TNC24PTAG7PGH3XZEYHZOZWCPWCQ@3\windows-jdk10-m3.5.x_build\target\it\effective-pom-multimodule-unlink-parent\build.log, f:\jenkins\jenkins-slave\workspace\x_maven-help-plugin_MPH-154-VXM3V7GTTLVLHGRUAZFTHVW3TNC24PTAG7PGH3XZEYHZOZWCPWCQ@3\windows-jdk10-m3.5.x_build\target\it\effective-pom-multimodule\build.log, f:\jenkins\jenkins-slave\workspace\x_maven-help-plugin_MPH-154-VXM3V7GTTLVLHGRUAZFTHVW3TNC24PTAG7PGH3XZEYHZOZWCPWCQ@3\windows-jdk10-m3.5.x_build\target\it\effective-pom\build.log, f:\jenkins\jenkins-slave\workspace\x_maven-help-plugin_MPH-154-VXM3V7GTTLVLHGRUAZFTHVW3TNC24PTAG7PGH3XZEYHZOZWCPWCQ@3\windows-jdk10-m3.5.x_build\target\it\effective-pom_properties\build.log, f:\jenkins\jenkins-slave\workspace\x_maven-help-plugin_MPH-154-VXM3V7GTTLVLHGRUAZFTHVW3TNC24PTAG7PGH3XZEYHZOZWCPWCQ@3\windows-jdk10-m3.5.x_build\target\it\effective-settings\build.log, f:\jenkins\jenkins-slave\workspace\x_maven-help-plugin_MPH-154-VXM3V7GTTLVLHGRUAZFTHVW3TNC24PTAG7PGH3XZEYHZOZWCPWCQ@3\windows-jdk10-m3.5.x_build\target\it\effective-settings_deep-clone\build.log, f:\jenkins\jenkins-slave\workspace\x_maven-help-plugin_MPH-154-VXM3V7GTTLVLHGRUAZFTHVW3TNC24PTAG7PGH3XZEYHZOZWCPWCQ@3\windows-jdk10-m3.5.x_build\target\it\evaluate-artifact-with-expression-with-output\build.log, f:\jenkins\jenkins-slave\workspace\x_maven-help-plugin_MPH-154-VXM3V7GTTLVLHGRUAZFTHVW3TNC24PTAG7PGH3XZEYHZOZWCPWCQ@3\windows-jdk10-m3.5.x_build\target\it\evaluate-forceStdout\build.log, f:\jenkins\jenkins-slave\workspace\x_maven-help-plugin_MPH-154-VXM3V7GTTLVLHGRUAZFTHVW3TNC24PTAG7PGH3XZEYHZOZWCPWCQ@3\windows-jdk10-m3.5.x_build\target\it\evaluate-settings-servers\build.log, f:\jenkins\jenkins-slave\workspace\x_maven-help-plugin_MPH-154-VXM3V7GTTLVLHGRUAZFTHVW3TNC24PTAG7PGH3XZEYHZOZWCPWCQ@3\windows-jdk10-m3.5.x_build\target\it\evaluate-with-expression-with-output\build.log, f:\jenkins\jenkins-slave\workspace\x_maven-help-plugin_MPH-154-VXM3V7GTTLVLHGRUAZFTHVW3TNC24PTAG7PGH3XZEYHZOZWCPWCQ@3\windows-jdk10-m3.5.x_build\target\it\evaluate\build.log, f:\jenkins\jenkins-slave\workspace\x_maven-help-plugin_MPH-154-VXM3V7GTTLVLHGRUAZFTHVW3TNC24PTAG7PGH3XZEYHZOZWCPWCQ@3\windows-jdk10-m3.5.x_build\target\it\system\build.log]
[windows-jdk10-m3.5.x_build] Finished parsing Maven Invoker results (found 30)
[windows-jdk10-m3.5.x_build] [withMaven] junitPublisher - Archive test results for Maven artifact org.apache.maven.plugins:maven-help-plugin:3.1.1-SNAPSHOT generated by maven-surefire-plugin:test (default-test): windows-jdk10-m3.5.x_build\target\surefire-reports\*.xml
[windows-jdk10-m3.5.x_build] Recording test results
[windows-jdk10-m3.5.x_build] [withMaven] openTasksPublisher - Scan Tasks for Maven artifact org.apache.maven.plugins:maven-help-plugin:3.1.1-SNAPSHOT in source directory windows-jdk10-m3.5.x_build\src\main\java
[windows-jdk10-m3.5.x_build] [TASKS] Scanning folder 'f:\jenkins\jenkins-slave\workspace\x_maven-help-plugin_MPH-154-VXM3V7GTTLVLHGRUAZFTHVW3TNC24PTAG7PGH3XZEYHZOZWCPWCQ@3' for files matching the pattern 'windows-jdk10-m3.5.x_build\src\main\java\**\*' - excludes: null
[windows-jdk10-m3.5.x_build] [TASKS] Found 9 files to scan for tasks
[windows-jdk10-m3.5.x_build] [TASKS] Found 1 open tasks.
[windows-jdk10-m3.5.x_build] Skipping warnings blame since pipelines do not have an SCM link.%n
[Pipeline] [linux-jdk11-m3.5.x_build] // ws
[Pipeline] [windows-jdk7-m3.5.x_build] // withMaven
[Pipeline] [windows-jdk10-m3.5.x_build] // withMaven
[Pipeline] [linux-jdk11-m3.5.x_build] }
[Pipeline] [windows-jdk8-m3.5.x_build] }
[Pipeline] [windows-jdk7-m3.2.x_build] }
[Pipeline] [windows-jdk7-m3.3.x_build] }
[Pipeline] [windows-jdk7-m3.5.x_build] cleanWs
[Pipeline] [linux-jdk7-m3.5.x_build] }
[Pipeline] [linux-jdk9-m3.5.x_build] cleanWs
[Pipeline] [linux-jdk8-m3.5.x_build] cleanWs
[Pipeline] [linux-jdk7-m3.2.x_build] }
[Pipeline] [linux-jdk7-m3.3.x_build] cleanWs
[Pipeline] [windows-jdk9-m3.5.x_build] }
[Pipeline] [windows-jdk10-m3.5.x_build] cleanWs
[Pipeline] [windows-jdk11-m3.5.x_build] }
[Pipeline] [linux-jdk11-m3.5.x_build] // node
[windows-jdk7-m3.5.x_build] [WS-CLEANUP] Deleting project workspace...[WS-CLEANUP] done
[Pipeline] [windows-jdk8-m3.5.x_build] // stage
[windows-jdk10-m3.5.x_build] [WS-CLEANUP] Deleting project workspace...[WS-CLEANUP] done
[Pipeline] [windows-jdk7-m3.2.x_build] // stage
[Pipeline] [windows-jdk7-m3.3.x_build] // stage
[Pipeline] [linux-jdk7-m3.5.x_build] // stage
[Pipeline] [linux-jdk7-m3.2.x_build] // stage
[Pipeline] [windows-jdk9-m3.5.x_build] // stage
[Pipeline] [windows-jdk11-m3.5.x_build] // dir
[linux-jdk9-m3.5.x_build] [WS-CLEANUP] Deleting project workspace...[WS-CLEANUP] done
[linux-jdk8-m3.5.x_build] [WS-CLEANUP] Deleting project workspace...[WS-CLEANUP] done
[linux-jdk7-m3.3.x_build] [WS-CLEANUP] Deleting project workspace...[WS-CLEANUP] done
[Pipeline] [linux-jdk11-m3.5.x_build] }
[linux-jdk11-m3.5.x_build] Failed in branch linux-jdk11-m3.5.x_build
[Pipeline] [linux-jdk7-m3.2.x_build] }
[Pipeline] [linux-jdk7-m3.5.x_build] }
[Pipeline] [windows-jdk7-m3.2.x_build] }
[Pipeline] [windows-jdk7-m3.3.x_build] }
[Pipeline] [windows-jdk8-m3.5.x_build] }
[Pipeline] [windows-jdk9-m3.5.x_build] }
[Pipeline] [windows-jdk11-m3.5.x_build] }
[windows-jdk11-m3.5.x_build] [Fast Archiver] No prior successful build to compare, so performing full copy of artifacts
[windows-jdk11-m3.5.x_build] [withMaven] invokerPublisher - Archive invoker results for Maven artifact MavenArtifact{org.apache.maven.plugins:maven-help-plugin::3.1.1-SNAPSHOT(version: 3.1.1-SNAPSHOT, snapshot:false) } generated by PluginInvocation{org.apache.maven.plugins:maven-invoker-plugin:3.1.0@integration-test  integration-test}: windows-jdk11-m3.5.x_build\target\invoker-reports\*.xml
[windows-jdk11-m3.5.x_build] performing MavenInvokerRecorder, reportsFilenamePattern:'**/windows-jdk11-m3.5.x_build\target\invoker-reports/BUILD*.xml', invokerBuildDir:'**/windows-jdk11-m3.5.x_build\target\it'
[windows-jdk11-m3.5.x_build] Found reports:[f:\jenkins\jenkins-slave\workspace\x_maven-help-plugin_MPH-154-VXM3V7GTTLVLHGRUAZFTHVW3TNC24PTAG7PGH3XZEYHZOZWCPWCQ@2@2\windows-jdk11-m3.5.x_build\target\invoker-reports\BUILD-active-profiles.xml, f:\jenkins\jenkins-slave\workspace\x_maven-help-plugin_MPH-154-VXM3V7GTTLVLHGRUAZFTHVW3TNC24PTAG7PGH3XZEYHZOZWCPWCQ@2@2\windows-jdk11-m3.5.x_build\target\invoker-reports\BUILD-active-profiles_multimodule.xml, f:\jenkins\jenkins-slave\workspace\x_maven-help-plugin_MPH-154-VXM3V7GTTLVLHGRUAZFTHVW3TNC24PTAG7PGH3XZEYHZOZWCPWCQ@2@2\windows-jdk11-m3.5.x_build\target\invoker-reports\BUILD-all-profiles-parent-pom.xml, f:\jenkins\jenkins-slave\workspace\x_maven-help-plugin_MPH-154-VXM3V7GTTLVLHGRUAZFTHVW3TNC24PTAG7PGH3XZEYHZOZWCPWCQ@2@2\windows-jdk11-m3.5.x_build\target\invoker-reports\BUILD-all-profiles.xml, f:\jenkins\jenkins-slave\workspace\x_maven-help-plugin_MPH-154-VXM3V7GTTLVLHGRUAZFTHVW3TNC24PTAG7PGH3XZEYHZOZWCPWCQ@2@2\windows-jdk11-m3.5.x_build\target\invoker-reports\BUILD-describe-cmd-invalid.xml, f:\jenkins\jenkins-slave\workspace\x_maven-help-plugin_MPH-154-VXM3V7GTTLVLHGRUAZFTHVW3TNC24PTAG7PGH3XZEYHZOZWCPWCQ@2@2\windows-jdk11-m3.5.x_build\target\invoker-reports\BUILD-describe-cmd-with-goal-invalid.xml, f:\jenkins\jenkins-slave\workspace\x_maven-help-plugin_MPH-154-VXM3V7GTTLVLHGRUAZFTHVW3TNC24PTAG7PGH3XZEYHZOZWCPWCQ@2@2\windows-jdk11-m3.5.x_build\target\invoker-reports\BUILD-describe-cmd-with-goal-report.xml, f:\jenkins\jenkins-slave\workspace\x_maven-help-plugin_MPH-154-VXM3V7GTTLVLHGRUAZFTHVW3TNC24PTAG7PGH3XZEYHZOZWCPWCQ@2@2\windows-jdk11-m3.5.x_build\target\invoker-reports\BUILD-describe-cmd-with-goal.xml, f:\jenkins\jenkins-slave\workspace\x_maven-help-plugin_MPH-154-VXM3V7GTTLVLHGRUAZFTHVW3TNC24PTAG7PGH3XZEYHZOZWCPWCQ@2@2\windows-jdk11-m3.5.x_build\target\invoker-reports\BUILD-describe-cmd.xml, f:\jenkins\jenkins-slave\workspace\x_maven-help-plugin_MPH-154-VXM3V7GTTLVLHGRUAZFTHVW3TNC24PTAG7PGH3XZEYHZOZWCPWCQ@2@2\windows-jdk11-m3.5.x_build\target\invoker-reports\BUILD-describe-ga.xml, f:\jenkins\jenkins-slave\workspace\x_maven-help-plugin_MPH-154-VXM3V7GTTLVLHGRUAZFTHVW3TNC24PTAG7PGH3XZEYHZOZWCPWCQ@2@2\windows-jdk11-m3.5.x_build\target\invoker-reports\BUILD-describe-gav.xml, f:\jenkins\jenkins-slave\workspace\x_maven-help-plugin_MPH-154-VXM3V7GTTLVLHGRUAZFTHVW3TNC24PTAG7PGH3XZEYHZOZWCPWCQ@2@2\windows-jdk11-m3.5.x_build\target\invoker-reports\BUILD-describe-plugin-in-plugin-management.xml, f:\jenkins\jenkins-slave\workspace\x_maven-help-plugin_MPH-154-VXM3V7GTTLVLHGRUAZFTHVW3TNC24PTAG7PGH3XZEYHZOZWCPWCQ@2@2\windows-jdk11-m3.5.x_build\target\invoker-reports\BUILD-describe-plugin-without-name.xml, f:\jenkins\jenkins-slave\workspace\x_maven-help-plugin_MPH-154-VXM3V7GTTLVLHGRUAZFTHVW3TNC24PTAG7PGH3XZEYHZOZWCPWCQ@2@2\windows-jdk11-m3.5.x_build\target\invoker-reports\BUILD-describe-prefix-and-invalid-mojo.xml, f:\jenkins\jenkins-slave\workspace\x_maven-help-plugin_MPH-154-VXM3V7GTTLVLHGRUAZFTHVW3TNC24PTAG7PGH3XZEYHZOZWCPWCQ@2@2\windows-jdk11-m3.5.x_build\target\invoker-reports\BUILD-describe-prefix-and-mojo.xml, f:\jenkins\jenkins-slave\workspace\x_maven-help-plugin_MPH-154-VXM3V7GTTLVLHGRUAZFTHVW3TNC24PTAG7PGH3XZEYHZOZWCPWCQ@2@2\windows-jdk11-m3.5.x_build\target\invoker-reports\BUILD-describe-prefix.xml, f:\jenkins\jenkins-slave\workspace\x_maven-help-plugin_MPH-154-VXM3V7GTTLVLHGRUAZFTHVW3TNC24PTAG7PGH3XZEYHZOZWCPWCQ@2@2\windows-jdk11-m3.5.x_build\target\invoker-reports\BUILD-effective-pom-artifact.xml, f:\jenkins\jenkins-slave\workspace\x_maven-help-plugin_MPH-154-VXM3V7GTTLVLHGRUAZFTHVW3TNC24PTAG7PGH3XZEYHZOZWCPWCQ@2@2\windows-jdk11-m3.5.x_build\target\invoker-reports\BUILD-effective-pom-from-lifecycle.xml, f:\jenkins\jenkins-slave\workspace\x_maven-help-plugin_MPH-154-VXM3V7GTTLVLHGRUAZFTHVW3TNC24PTAG7PGH3XZEYHZOZWCPWCQ@2@2\windows-jdk11-m3.5.x_build\target\invoker-reports\BUILD-effective-pom-multimodule-unlink-parent.xml, f:\jenkins\jenkins-slave\workspace\x_maven-help-plugin_MPH-154-VXM3V7GTTLVLHGRUAZFTHVW3TNC24PTAG7PGH3XZEYHZOZWCPWCQ@2@2\windows-jdk11-m3.5.x_build\target\invoker-reports\BUILD-effective-pom-multimodule.xml, f:\jenkins\jenkins-slave\workspace\x_maven-help-plugin_MPH-154-VXM3V7GTTLVLHGRUAZFTHVW3TNC24PTAG7PGH3XZEYHZOZWCPWCQ@2@2\windows-jdk11-m3.5.x_build\target\invoker-reports\BUILD-effective-pom.xml, f:\jenkins\jenkins-slave\workspace\x_maven-help-plugin_MPH-154-VXM3V7GTTLVLHGRUAZFTHVW3TNC24PTAG7PGH3XZEYHZOZWCPWCQ@2@2\windows-jdk11-m3.5.x_build\target\invoker-reports\BUILD-effective-pom_properties.xml, f:\jenkins\jenkins-slave\workspace\x_maven-help-plugin_MPH-154-VXM3V7GTTLVLHGRUAZFTHVW3TNC24PTAG7PGH3XZEYHZOZWCPWCQ@2@2\windows-jdk11-m3.5.x_build\target\invoker-reports\BUILD-effective-settings.xml, f:\jenkins\jenkins-slave\workspace\x_maven-help-plugin_MPH-154-VXM3V7GTTLVLHGRUAZFTHVW3TNC24PTAG7PGH3XZEYHZOZWCPWCQ@2@2\windows-jdk11-m3.5.x_build\target\invoker-reports\BUILD-effective-settings_deep-clone.xml, f:\jenkins\jenkins-slave\workspace\x_maven-help-plugin_MPH-154-VXM3V7GTTLVLHGRUAZFTHVW3TNC24PTAG7PGH3XZEYHZOZWCPWCQ@2@2\windows-jdk11-m3.5.x_build\target\invoker-reports\BUILD-evaluate-artifact-with-expression-with-output.xml, f:\jenkins\jenkins-slave\workspace\x_maven-help-plugin_MPH-154-VXM3V7GTTLVLHGRUAZFTHVW3TNC24PTAG7PGH3XZEYHZOZWCPWCQ@2@2\windows-jdk11-m3.5.x_build\target\invoker-reports\BUILD-evaluate-forceStdout.xml, f:\jenkins\jenkins-slave\workspace\x_maven-help-plugin_MPH-154-VXM3V7GTTLVLHGRUAZFTHVW3TNC24PTAG7PGH3XZEYHZOZWCPWCQ@2@2\windows-jdk11-m3.5.x_build\target\invoker-reports\BUILD-evaluate-settings-servers.xml, f:\jenkins\jenkins-slave\workspace\x_maven-help-plugin_MPH-154-VXM3V7GTTLVLHGRUAZFTHVW3TNC24PTAG7PGH3XZEYHZOZWCPWCQ@2@2\windows-jdk11-m3.5.x_build\target\invoker-reports\BUILD-evaluate-with-expression-with-output.xml, f:\jenkins\jenkins-slave\workspace\x_maven-help-plugin_MPH-154-VXM3V7GTTLVLHGRUAZFTHVW3TNC24PTAG7PGH3XZEYHZOZWCPWCQ@2@2\windows-jdk11-m3.5.x_build\target\invoker-reports\BUILD-evaluate.xml, f:\jenkins\jenkins-slave\workspace\x_maven-help-plugin_MPH-154-VXM3V7GTTLVLHGRUAZFTHVW3TNC24PTAG7PGH3XZEYHZOZWCPWCQ@2@2\windows-jdk11-m3.5.x_build\target\invoker-reports\BUILD-system.xml]
[windows-jdk11-m3.5.x_build] Found logs:[f:\jenkins\jenkins-slave\workspace\x_maven-help-plugin_MPH-154-VXM3V7GTTLVLHGRUAZFTHVW3TNC24PTAG7PGH3XZEYHZOZWCPWCQ@2@2\windows-jdk11-m3.5.x_build\target\it\active-profiles\build.log, f:\jenkins\jenkins-slave\workspace\x_maven-help-plugin_MPH-154-VXM3V7GTTLVLHGRUAZFTHVW3TNC24PTAG7PGH3XZEYHZOZWCPWCQ@2@2\windows-jdk11-m3.5.x_build\target\it\active-profiles_multimodule\build.log, f:\jenkins\jenkins-slave\workspace\x_maven-help-plugin_MPH-154-VXM3V7GTTLVLHGRUAZFTHVW3TNC24PTAG7PGH3XZEYHZOZWCPWCQ@2@2\windows-jdk11-m3.5.x_build\target\it\all-profiles-parent-pom\build.log, f:\jenkins\jenkins-slave\workspace\x_maven-help-plugin_MPH-154-VXM3V7GTTLVLHGRUAZFTHVW3TNC24PTAG7PGH3XZEYHZOZWCPWCQ@2@2\windows-jdk11-m3.5.x_build\target\it\all-profiles\build.log, f:\jenkins\jenkins-slave\workspace\x_maven-help-plugin_MPH-154-VXM3V7GTTLVLHGRUAZFTHVW3TNC24PTAG7PGH3XZEYHZOZWCPWCQ@2@2\windows-jdk11-m3.5.x_build\target\it\describe-cmd-invalid\build.log, f:\jenkins\jenkins-slave\workspace\x_maven-help-plugin_MPH-154-VXM3V7GTTLVLHGRUAZFTHVW3TNC24PTAG7PGH3XZEYHZOZWCPWCQ@2@2\windows-jdk11-m3.5.x_build\target\it\describe-cmd-with-goal-invalid\build.log, f:\jenkins\jenkins-slave\workspace\x_maven-help-plugin_MPH-154-VXM3V7GTTLVLHGRUAZFTHVW3TNC24PTAG7PGH3XZEYHZOZWCPWCQ@2@2\windows-jdk11-m3.5.x_build\target\it\describe-cmd-with-goal-report\build.log, f:\jenkins\jenkins-slave\workspace\x_maven-help-plugin_MPH-154-VXM3V7GTTLVLHGRUAZFTHVW3TNC24PTAG7PGH3XZEYHZOZWCPWCQ@2@2\windows-jdk11-m3.5.x_build\target\it\describe-cmd-with-goal\build.log, f:\jenkins\jenkins-slave\workspace\x_maven-help-plugin_MPH-154-VXM3V7GTTLVLHGRUAZFTHVW3TNC24PTAG7PGH3XZEYHZOZWCPWCQ@2@2\windows-jdk11-m3.5.x_build\target\it\describe-cmd\build.log, f:\jenkins\jenkins-slave\workspace\x_maven-help-plugin_MPH-154-VXM3V7GTTLVLHGRUAZFTHVW3TNC24PTAG7PGH3XZEYHZOZWCPWCQ@2@2\windows-jdk11-m3.5.x_build\target\it\describe-ga\build.log, f:\jenkins\jenkins-slave\workspace\x_maven-help-plugin_MPH-154-VXM3V7GTTLVLHGRUAZFTHVW3TNC24PTAG7PGH3XZEYHZOZWCPWCQ@2@2\windows-jdk11-m3.5.x_build\target\it\describe-gav\build.log, f:\jenkins\jenkins-slave\workspace\x_maven-help-plugin_MPH-154-VXM3V7GTTLVLHGRUAZFTHVW3TNC24PTAG7PGH3XZEYHZOZWCPWCQ@2@2\windows-jdk11-m3.5.x_build\target\it\describe-plugin-in-plugin-management\build.log, f:\jenkins\jenkins-slave\workspace\x_maven-help-plugin_MPH-154-VXM3V7GTTLVLHGRUAZFTHVW3TNC24PTAG7PGH3XZEYHZOZWCPWCQ@2@2\windows-jdk11-m3.5.x_build\target\it\describe-plugin-without-name\build.log, f:\jenkins\jenkins-slave\workspace\x_maven-help-plugin_MPH-154-VXM3V7GTTLVLHGRUAZFTHVW3TNC24PTAG7PGH3XZEYHZOZWCPWCQ@2@2\windows-jdk11-m3.5.x_build\target\it\describe-prefix-and-invalid-mojo\build.log, f:\jenkins\jenkins-slave\workspace\x_maven-help-plugin_MPH-154-VXM3V7GTTLVLHGRUAZFTHVW3TNC24PTAG7PGH3XZEYHZOZWCPWCQ@2@2\windows-jdk11-m3.5.x_build\target\it\describe-prefix-and-mojo\build.log, f:\jenkins\jenkins-slave\workspace\x_maven-help-plugin_MPH-154-VXM3V7GTTLVLHGRUAZFTHVW3TNC24PTAG7PGH3XZEYHZOZWCPWCQ@2@2\windows-jdk11-m3.5.x_build\target\it\describe-prefix\build.log, f:\jenkins\jenkins-slave\workspace\x_maven-help-plugin_MPH-154-VXM3V7GTTLVLHGRUAZFTHVW3TNC24PTAG7PGH3XZEYHZOZWCPWCQ@2@2\windows-jdk11-m3.5.x_build\target\it\effective-pom-artifact\build.log, f:\jenkins\jenkins-slave\workspace\x_maven-help-plugin_MPH-154-VXM3V7GTTLVLHGRUAZFTHVW3TNC24PTAG7PGH3XZEYHZOZWCPWCQ@2@2\windows-jdk11-m3.5.x_build\target\it\effective-pom-from-lifecycle\build.log, f:\jenkins\jenkins-slave\workspace\x_maven-help-plugin_MPH-154-VXM3V7GTTLVLHGRUAZFTHVW3TNC24PTAG7PGH3XZEYHZOZWCPWCQ@2@2\windows-jdk11-m3.5.x_build\target\it\effective-pom-multimodule-unlink-parent\build.log, f:\jenkins\jenkins-slave\workspace\x_maven-help-plugin_MPH-154-VXM3V7GTTLVLHGRUAZFTHVW3TNC24PTAG7PGH3XZEYHZOZWCPWCQ@2@2\windows-jdk11-m3.5.x_build\target\it\effective-pom-multimodule\build.log, f:\jenkins\jenkins-slave\workspace\x_maven-help-plugin_MPH-154-VXM3V7GTTLVLHGRUAZFTHVW3TNC24PTAG7PGH3XZEYHZOZWCPWCQ@2@2\windows-jdk11-m3.5.x_build\target\it\effective-pom\build.log, f:\jenkins\jenkins-slave\workspace\x_maven-help-plugin_MPH-154-VXM3V7GTTLVLHGRUAZFTHVW3TNC24PTAG7PGH3XZEYHZOZWCPWCQ@2@2\windows-jdk11-m3.5.x_build\target\it\effective-pom_properties\build.log, f:\jenkins\jenkins-slave\workspace\x_maven-help-plugin_MPH-154-VXM3V7GTTLVLHGRUAZFTHVW3TNC24PTAG7PGH3XZEYHZOZWCPWCQ@2@2\windows-jdk11-m3.5.x_build\target\it\effective-settings\build.log, f:\jenkins\jenkins-slave\workspace\x_maven-help-plugin_MPH-154-VXM3V7GTTLVLHGRUAZFTHVW3TNC24PTAG7PGH3XZEYHZOZWCPWCQ@2@2\windows-jdk11-m3.5.x_build\target\it\effective-settings_deep-clone\build.log, f:\jenkins\jenkins-slave\workspace\x_maven-help-plugin_MPH-154-VXM3V7GTTLVLHGRUAZFTHVW3TNC24PTAG7PGH3XZEYHZOZWCPWCQ@2@2\windows-jdk11-m3.5.x_build\target\it\evaluate-artifact-with-expression-with-output\build.log, f:\jenkins\jenkins-slave\workspace\x_maven-help-plugin_MPH-154-VXM3V7GTTLVLHGRUAZFTHVW3TNC24PTAG7PGH3XZEYHZOZWCPWCQ@2@2\windows-jdk11-m3.5.x_build\target\it\evaluate-forceStdout\build.log, f:\jenkins\jenkins-slave\workspace\x_maven-help-plugin_MPH-154-VXM3V7GTTLVLHGRUAZFTHVW3TNC24PTAG7PGH3XZEYHZOZWCPWCQ@2@2\windows-jdk11-m3.5.x_build\target\it\evaluate-settings-servers\build.log, f:\jenkins\jenkins-slave\workspace\x_maven-help-plugin_MPH-154-VXM3V7GTTLVLHGRUAZFTHVW3TNC24PTAG7PGH3XZEYHZOZWCPWCQ@2@2\windows-jdk11-m3.5.x_build\target\it\evaluate-with-expression-with-output\build.log, f:\jenkins\jenkins-slave\workspace\x_maven-help-plugin_MPH-154-VXM3V7GTTLVLHGRUAZFTHVW3TNC24PTAG7PGH3XZEYHZOZWCPWCQ@2@2\windows-jdk11-m3.5.x_build\target\it\evaluate\build.log, f:\jenkins\jenkins-slave\workspace\x_maven-help-plugin_MPH-154-VXM3V7GTTLVLHGRUAZFTHVW3TNC24PTAG7PGH3XZEYHZOZWCPWCQ@2@2\windows-jdk11-m3.5.x_build\target\it\system\build.log]
[windows-jdk11-m3.5.x_build] Finished parsing Maven Invoker results (found 30)
[windows-jdk11-m3.5.x_build] [withMaven] junitPublisher - Archive test results for Maven artifact org.apache.maven.plugins:maven-help-plugin:3.1.1-SNAPSHOT generated by maven-surefire-plugin:test (default-test): windows-jdk11-m3.5.x_build\target\surefire-reports\*.xml
[windows-jdk11-m3.5.x_build] Recording test results
[windows-jdk11-m3.5.x_build] [withMaven] openTasksPublisher - Scan Tasks for Maven artifact org.apache.maven.plugins:maven-help-plugin:3.1.1-SNAPSHOT in source directory windows-jdk11-m3.5.x_build\src\main\java
[windows-jdk11-m3.5.x_build] [TASKS] Scanning folder 'f:\jenkins\jenkins-slave\workspace\x_maven-help-plugin_MPH-154-VXM3V7GTTLVLHGRUAZFTHVW3TNC24PTAG7PGH3XZEYHZOZWCPWCQ@2@2' for files matching the pattern 'windows-jdk11-m3.5.x_build\src\main\java\**\*' - excludes: null
[windows-jdk11-m3.5.x_build] [TASKS] Found 9 files to scan for tasks
[windows-jdk11-m3.5.x_build] [TASKS] Found 1 open tasks.
[windows-jdk11-m3.5.x_build] Skipping warnings blame since pipelines do not have an SCM link.%n
[Pipeline] [windows-jdk7-m3.5.x_build] cleanWs
[Pipeline] [windows-jdk10-m3.5.x_build] cleanWs
[Pipeline] [linux-jdk7-m3.2.x_build] // ws
[windows-jdk7-m3.5.x_build] [WS-CLEANUP] Deleting project workspace...[WS-CLEANUP] done
[Pipeline] [linux-jdk7-m3.5.x_build] // ws
[windows-jdk10-m3.5.x_build] [WS-CLEANUP] Deleting project workspace...[WS-CLEANUP] done
[Pipeline] [windows-jdk7-m3.2.x_build] // ws
[Pipeline] [windows-jdk7-m3.3.x_build] // ws
[Pipeline] [windows-jdk8-m3.5.x_build] // ws
[Pipeline] [windows-jdk9-m3.5.x_build] // ws
[Pipeline] [windows-jdk11-m3.5.x_build] // withMaven
[Pipeline] [linux-jdk7-m3.2.x_build] }
[Pipeline] [linux-jdk7-m3.5.x_build] }
[Pipeline] [windows-jdk7-m3.2.x_build] }
[Pipeline] [windows-jdk7-m3.3.x_build] }
[Pipeline] [windows-jdk8-m3.5.x_build] }
[Pipeline] [linux-jdk9-m3.5.x_build] }
[Pipeline] [linux-jdk8-m3.5.x_build] }
[Pipeline] [linux-jdk7-m3.3.x_build] }
[Pipeline] [windows-jdk9-m3.5.x_build] }
[Pipeline] [windows-jdk11-m3.5.x_build] cleanWs
[Pipeline] [windows-jdk7-m3.5.x_build] }
[Pipeline] [windows-jdk10-m3.5.x_build] }
[windows-jdk11-m3.5.x_build] [WS-CLEANUP] Deleting project workspace...[WS-CLEANUP] done
[Pipeline] [linux-jdk7-m3.2.x_build] // node
[Pipeline] [linux-jdk7-m3.5.x_build] // node
[Pipeline] [windows-jdk7-m3.2.x_build] // node
[Pipeline] [windows-jdk7-m3.3.x_build] // node
[Pipeline] [windows-jdk8-m3.5.x_build] // node
[Pipeline] [linux-jdk9-m3.5.x_build] // stage
[Pipeline] [linux-jdk8-m3.5.x_build] // stage
[Pipeline] [linux-jdk7-m3.3.x_build] // stage
[Pipeline] [windows-jdk9-m3.5.x_build] // node
[Pipeline] [linux-jdk7-m3.2.x_build] }
[linux-jdk7-m3.2.x_build] Failed in branch linux-jdk7-m3.2.x_build
[Pipeline] [linux-jdk7-m3.5.x_build] }
[linux-jdk7-m3.5.x_build] Failed in branch linux-jdk7-m3.5.x_build
[Pipeline] [windows-jdk7-m3.2.x_build] }
[windows-jdk7-m3.2.x_build] Failed in branch windows-jdk7-m3.2.x_build
[Pipeline] [windows-jdk7-m3.3.x_build] }
[windows-jdk7-m3.3.x_build] Failed in branch windows-jdk7-m3.3.x_build
[Pipeline] [windows-jdk8-m3.5.x_build] }
[windows-jdk8-m3.5.x_build] Failed in branch windows-jdk8-m3.5.x_build
[Pipeline] [windows-jdk9-m3.5.x_build] }
[windows-jdk9-m3.5.x_build] Failed in branch windows-jdk9-m3.5.x_build
[Pipeline] [linux-jdk7-m3.3.x_build] }
[Pipeline] [linux-jdk8-m3.5.x_build] }
[Pipeline] [linux-jdk9-m3.5.x_build] }
[Pipeline] [windows-jdk7-m3.5.x_build] // stage
[Pipeline] [windows-jdk7-m3.5.x_build] }
[Pipeline] [windows-jdk10-m3.5.x_build] // stage
[Pipeline] [windows-jdk10-m3.5.x_build] }
[Pipeline] [windows-jdk11-m3.5.x_build] cleanWs
[Pipeline] [linux-jdk7-m3.3.x_build] // ws
[windows-jdk11-m3.5.x_build] [WS-CLEANUP] Deleting project workspace...[WS-CLEANUP] done
[Pipeline] [linux-jdk8-m3.5.x_build] // ws
[Pipeline] [linux-jdk9-m3.5.x_build] // ws
[Pipeline] [linux-jdk7-m3.3.x_build] }
[Pipeline] [linux-jdk8-m3.5.x_build] }
[Pipeline] [linux-jdk9-m3.5.x_build] }
[Pipeline] [windows-jdk7-m3.5.x_build] // ws
[Pipeline] [windows-jdk7-m3.5.x_build] }
[Pipeline] [windows-jdk10-m3.5.x_build] // ws
[Pipeline] [windows-jdk10-m3.5.x_build] }
[Pipeline] [windows-jdk11-m3.5.x_build] }
[Pipeline] [linux-jdk7-m3.3.x_build] // node
[Pipeline] [linux-jdk8-m3.5.x_build] // node
[Pipeline] [linux-jdk9-m3.5.x_build] // node
[Pipeline] [linux-jdk7-m3.3.x_build] }
[linux-jdk7-m3.3.x_build] Failed in branch linux-jdk7-m3.3.x_build
[Pipeline] [linux-jdk8-m3.5.x_build] }
[linux-jdk8-m3.5.x_build] Failed in branch linux-jdk8-m3.5.x_build
[Pipeline] [linux-jdk9-m3.5.x_build] }
[linux-jdk9-m3.5.x_build] Failed in branch linux-jdk9-m3.5.x_build
[Pipeline] [windows-jdk7-m3.5.x_build] // node
[Pipeline] [windows-jdk7-m3.5.x_build] }
[windows-jdk7-m3.5.x_build] Failed in branch windows-jdk7-m3.5.x_build
[Pipeline] [windows-jdk10-m3.5.x_build] // node
[Pipeline] [windows-jdk10-m3.5.x_build] }
[windows-jdk10-m3.5.x_build] Failed in branch windows-jdk10-m3.5.x_build
[Pipeline] [windows-jdk11-m3.5.x_build] // stage
[Pipeline] [windows-jdk11-m3.5.x_build] }
[Pipeline] [windows-jdk11-m3.5.x_build] // ws
[Pipeline] [windows-jdk11-m3.5.x_build] }
[Pipeline] [windows-jdk11-m3.5.x_build] // node
[Pipeline] [windows-jdk11-m3.5.x_build] }
[windows-jdk11-m3.5.x_build] Failed in branch windows-jdk11-m3.5.x_build
[Pipeline] // parallel
[Pipeline] stage
[Pipeline] { (Notifications)
[Pipeline] echo
Build result: FAILURE
[Pipeline] jiraIssueSelector
[Pipeline] emailext
Reply | Threaded
Open this post in threaded view
|

Build failed in Jenkins: Maven TLP » maven-help-plugin » MPH-154 #2

Apache Jenkins Server-2
See https://builds.apache.org/job/maven-box/job/maven-help-plugin/job/MPH-154/2/

Changes:

* Stream logs
* Stream logs
* Stream logs
* Stream logs
* Stream logs
* Stream logs
* Stream logs
* Stream logs
* Stream logs
* Stream logs
* Stream logs
* Stream logs
* Stream logs
* Stream logs

All tests passed

Build log:
[...truncated 30.56 MB...]
[windows-jdk7-m3.3.x_build] [INFO] java.class.path=F:\jenkins\tools\maven\apache-maven-3.3.9\boot\plexus-classworlds-2.5.2.jar
[windows-jdk7-m3.3.x_build] [INFO] org.slf4j.simpleLogger.defaultLogLevel=debug
[windows-jdk7-m3.3.x_build] [INFO] java.vm.specification.version=1.7
[windows-jdk7-m3.3.x_build] [INFO] sun.arch.data.model=64
[windows-jdk7-m3.3.x_build] [INFO] java.home=f:\jenkins\tools\java\latest1.7\jre
[windows-jdk7-m3.3.x_build] [INFO] sun.java.command=org.codehaus.plexus.classworlds.launcher.Launcher -B -X -D maven.repo.local=F:\jenkins\jenkins-slave\workspace\x_maven-help-plugin_MPH-154-VXM3V7GTTLVLHGRUAZFTHVW3TNC24PTAG7PGH3XZEYHZOZWCPWCQ@2\windows-jdk7-m3.3.x_build\target\local-repo -s F:\jenkins\jenkins-slave\workspace\x_maven-help-plugin_MPH-154-VXM3V7GTTLVLHGRUAZFTHVW3TNC24PTAG7PGH3XZEYHZOZWCPWCQ@2\windows-jdk7-m3.3.x_build\target\it\interpolated-settings.xml -D https.protocols=TLSv1.2 -D maven.compiler.source=1.7 -D maven.compiler.target=1.7 org.apache.maven.plugins:maven-help-plugin:3.1.1-SNAPSHOT:system
[windows-jdk7-m3.3.x_build] [INFO] java.specification.vendor=Oracle Corporation
[windows-jdk7-m3.3.x_build] [INFO] user.language=en
[windows-jdk7-m3.3.x_build] [INFO] awt.toolkit=sun.awt.windows.WToolkit
[windows-jdk7-m3.3.x_build] [INFO] java.vm.info=mixed mode
[windows-jdk7-m3.3.x_build] [INFO] java.version=1.7.0_79
[windows-jdk7-m3.3.x_build] [INFO] java.ext.dirs=f:\jenkins\tools\java\latest1.7\jre\lib\ext;C:\Windows\Sun\Java\lib\ext
[windows-jdk7-m3.3.x_build] [INFO] sun.boot.class.path=f:\jenkins\tools\java\latest1.7\jre\lib\resources.jar;f:\jenkins\tools\java\latest1.7\jre\lib\rt.jar;f:\jenkins\tools\java\latest1.7\jre\lib\sunrsasign.jar;f:\jenkins\tools\java\latest1.7\jre\lib\jsse.jar;f:\jenkins\tools\java\latest1.7\jre\lib\jce.jar;f:\jenkins\tools\java\latest1.7\jre\lib\charsets.jar;f:\jenkins\tools\java\latest1.7\jre\lib\jfr.jar;f:\jenkins\tools\java\latest1.7\jre\classes
[windows-jdk7-m3.3.x_build] [INFO] java.vendor=Oracle Corporation
[windows-jdk7-m3.3.x_build] [INFO] maven.home=F:\jenkins\tools\maven\apache-maven-3.3.9
[windows-jdk7-m3.3.x_build] [INFO] file.separator=\
[windows-jdk7-m3.3.x_build] [INFO] java.vendor.url.bug=http://bugreport.sun.com/bugreport/
[windows-jdk7-m3.3.x_build] [INFO] sun.cpu.endian=little
[windows-jdk7-m3.3.x_build] [INFO] sun.io.unicode.encoding=UnicodeLittle
[windows-jdk7-m3.3.x_build] [INFO] sun.desktop=windows
[windows-jdk7-m3.3.x_build] [INFO] sun.cpu.isalist=amd64
[windows-jdk7-m3.3.x_build] [INFO]
[windows-jdk7-m3.3.x_build] [INFO] ===============================================================================
[windows-jdk7-m3.3.x_build] [INFO] Environment Variables
[windows-jdk7-m3.3.x_build] [INFO] ===============================================================================
[windows-jdk7-m3.3.x_build] [INFO]
[windows-jdk7-m3.3.x_build] [INFO] JOB_NAME=maven-box/maven-help-plugin/MPH-154
[windows-jdk7-m3.3.x_build] [INFO] COMSPEC=C:\Windows\system32\cmd.exe
[windows-jdk7-m3.3.x_build] [INFO] NUMBER_OF_PROCESSORS=4
[windows-jdk7-m3.3.x_build] [INFO] SYSTEMROOT=C:\Windows
[windows-jdk7-m3.3.x_build] [INFO] JENKINS_HOME=/x1/jenkins/jenkins-home
[windows-jdk7-m3.3.x_build] [INFO] PATH=f:\\jenkins\\tools\\java\\latest1.7/bin;f:\jenkins\jenkins-slave\workspace\x_maven-help-plugin_MPH-154-VXM3V7GTTLVLHGRUAZFTHVW3TNC24PTAG7PGH3XZEYHZOZWCPWCQ@2@tmp\withMaven0560b768;C:\Program Files (x86)\Common Files\Oracle\Java\javapath;C:\ProgramData\Oracle\Java\javapath;C:\Windows\system32;C:\Windows;C:\Windows\System32\Wbem;
[windows-jdk7-m3.3.x_build] [INFO] C:\Windows\System32\WindowsPowerShell\v1.0\;C:\Program Files\Amazon\cfn-bootstrap\;C:\Program Files\Puppet Labs\Puppet\bin;c:\Program Files (x86)\Subversion\bin;C:\Pro
[windows-jdk7-m3.3.x_build] [INFO] gram Files\Git\cmd;C:\Program Files\Microsoft SQL Server\130\Tools\Binn\;C:\Users\Administrator\.dnx\bin;C:\Program Files\Microsoft DNX\Dnvm\;C:\Program Files (x86)\Wi
[windows-jdk7-m3.3.x_build] [INFO] ndows Kits\8.1\Windows Performance Toolkit\;F:\Program Files\CMake\bin;C:\Users\Administrator\AppData\Local\Microsoft\WindowsApps;
[windows-jdk7-m3.3.x_build] [INFO] CLASSWORLDS_LAUNCHER=org.codehaus.plexus.classworlds.launcher.Launcher
[windows-jdk7-m3.3.x_build] [INFO] HUDSON_SERVER_COOKIE=f4ebd1e6b0d976e8
[windows-jdk7-m3.3.x_build] [INFO] EXECUTOR_NUMBER=1
[windows-jdk7-m3.3.x_build] [INFO] PSMODULEPATH=C:\Program Files\WindowsPowerShell\Modules;C:\Windows\system32\WindowsPowerShell\v1.0\Modules
[windows-jdk7-m3.3.x_build] [INFO] PATHEXT=.COM;.EXE;.BAT;.CMD;.VBS;.VBE;.JS;.JSE;.WSF;.WSH;.MSC
[windows-jdk7-m3.3.x_build] [INFO] NODE_LABELS=Windows windows-2016-2
[windows-jdk7-m3.3.x_build] [INFO] JENKINS_NODE_COOKIE=3bd19962-9105-4107-890c-d8c2ed8c9608
[windows-jdk7-m3.3.x_build] [INFO] TEMP=C:\Users\jenkins\AppData\Local\Temp\1
[windows-jdk7-m3.3.x_build] [INFO] MAVEN_CMD_LINE_ARGS=-B -X -D maven.repo.local=F:\jenkins\jenkins-slave\workspace\x_maven-help-plugin_MPH-154-VXM3V7GTTLVLHGRUAZFTHVW3TNC24PTAG7PGH3XZEYHZOZWCPWCQ@2\windows-jdk7-m3.3.x_build\target\local-repo -s F:\jenkins\jenkins-slave\workspace\x_maven-help-plugin_MPH-154-VXM3V7GTTLVLHGRUAZFTHVW3TNC24PTAG7PGH3XZEYHZOZWCPWCQ@2\windows-jdk7-m3.3.x_build\target\it\interpolated-settings.xml -D https.protocols=TLSv1.2 -D maven.compiler.source=1.7 -D maven.compiler.target=1.7 org.apache.maven.plugins:maven-help-plugin:3.1.1-SNAPSHOT:system
[windows-jdk7-m3.3.x_build] [INFO] PROGRAMW6432=C:\Program Files
[windows-jdk7-m3.3.x_build] [INFO] MVN_CMD_DIR=f:\jenkins\jenkins-slave\workspace\x_maven-help-plugin_MPH-154-VXM3V7GTTLVLHGRUAZFTHVW3TNC24PTAG7PGH3XZEYHZOZWCPWCQ@2@tmp\withMaven0560b768
[windows-jdk7-m3.3.x_build] [INFO] CLASSWORLDS_JAR="F:\jenkins\tools\maven\apache-maven-3.3.9\boot\plexus-classworlds-2.5.2.jar"
[windows-jdk7-m3.3.x_build] [INFO] MAVEN_TERMINATE_CMD=on
[windows-jdk7-m3.3.x_build] [INFO] PROMPT=$P$G
[windows-jdk7-m3.3.x_build] [INFO] JOB_BASE_NAME=MPH-154
[windows-jdk7-m3.3.x_build] [INFO] RUN_CHANGES_DISPLAY_URL=https://builds.apache.org/job/maven-box/job/maven-help-plugin/job/MPH-154/2/display/redirect?page=changes
[windows-jdk7-m3.3.x_build] [INFO] BUILD_DISPLAY_NAME=#2
[windows-jdk7-m3.3.x_build] [INFO] JENKINS_MAVEN_AGENT_DISABLED=true
[windows-jdk7-m3.3.x_build] [INFO] LOCALAPPDATA=C:\Users\jenkins\AppData\Local
[windows-jdk7-m3.3.x_build] [INFO] JAVA_TOOL_OPTIONS=-Dmaven.ext.class.path="f:\jenkins\jenkins-slave\workspace\x_maven-help-plugin_MPH-154-VXM3V7GTTLVLHGRUAZFTHVW3TNC24PTAG7PGH3XZEYHZOZWCPWCQ@2@tmp\withMaven0560b768\pipeline-maven-spy.jar" -Dorg.jenkinsci.plugins.pipeline.maven.reportsFolder="f:\jenkins\jenkins-slave\workspace\x_maven-help-plugin_MPH-154-VXM3V7GTTLVLHGRUAZFTHVW3TNC24PTAG7PGH3XZEYHZOZWCPWCQ@2@tmp\withMaven0560b768"
[windows-jdk7-m3.3.x_build] [INFO] PROCESSOR_LEVEL=6
[windows-jdk7-m3.3.x_build] [INFO] USERNAME=jenkins
[windows-jdk7-m3.3.x_build] [INFO] NODE_NAME=windows-2016-2
[windows-jdk7-m3.3.x_build] [INFO] BUILD_ID=2
[windows-jdk7-m3.3.x_build] [INFO] CLIENTNAME=JENKINS-WIN2016
[windows-jdk7-m3.3.x_build] [INFO] HOMEDRIVE=C:
[windows-jdk7-m3.3.x_build] [INFO] SYSTEMDRIVE=C:
[windows-jdk7-m3.3.x_build] [INFO] COMMONPROGRAMFILES(X86)=C:\Program Files (x86)\Common Files
[windows-jdk7-m3.3.x_build] [INFO] ALLUSERSPROFILE=C:\ProgramData
[windows-jdk7-m3.3.x_build] [INFO] VS140COMNTOOLS=F:\Microsoft\Visual Studio CE 2015\Common7\Tools\
[windows-jdk7-m3.3.x_build] [INFO] =F:=F:\jenkins\jenkins-slave\workspace\x_maven-help-plugin_MPH-154-VXM3V7GTTLVLHGRUAZFTHVW3TNC24PTAG7PGH3XZEYHZOZWCPWCQ@2\windows-jdk7-m3.3.x_build\target\it\system
[windows-jdk7-m3.3.x_build] [INFO] WINDIR=C:\Windows
[windows-jdk7-m3.3.x_build] [INFO] RUN_DISPLAY_URL=https://builds.apache.org/job/maven-box/job/maven-help-plugin/job/MPH-154/2/display/redirect
[windows-jdk7-m3.3.x_build] [INFO] NIX_LABEL=ubuntu
[windows-jdk7-m3.3.x_build] [INFO] HUDSON_COOKIE=d59b0ea6-b938-4b4d-8f1f-add0dcf96120
[windows-jdk7-m3.3.x_build] [INFO] TMP=C:\Users\jenkins\AppData\Local\Temp\1
[windows-jdk7-m3.3.x_build] [INFO] MVN_CMD=f:\jenkins\jenkins-slave\workspace\x_maven-help-plugin_MPH-154-VXM3V7GTTLVLHGRUAZFTHVW3TNC24PTAG7PGH3XZEYHZOZWCPWCQ@2@tmp\withMaven0560b768\mvn.cmd
[windows-jdk7-m3.3.x_build] [INFO] WIN_LABEL=Windows
[windows-jdk7-m3.3.x_build] [INFO] =EXITCODE=00000001
[windows-jdk7-m3.3.x_build] [INFO] JOB_DISPLAY_URL=https://builds.apache.org/job/maven-box/job/maven-help-plugin/job/MPH-154/display/redirect
[windows-jdk7-m3.3.x_build] [INFO] USERDOMAIN_ROAMINGPROFILE=JENKINS-WIN2016
[windows-jdk7-m3.3.x_build] [INFO] JAVA_HOME=f:\\jenkins\\tools\\java\\latest1.7
[windows-jdk7-m3.3.x_build] [INFO] MAVEN_PROJECTBASEDIR=F:\jenkins\jenkins-slave\workspace\x_maven-help-plugin_MPH-154-VXM3V7GTTLVLHGRUAZFTHVW3TNC24PTAG7PGH3XZEYHZOZWCPWCQ@2\windows-jdk7-m3.3.x_build\target\it\system
[windows-jdk7-m3.3.x_build] [INFO] HOMEPATH=\Users\jenkins
[windows-jdk7-m3.3.x_build] [INFO] HOME=C:\Users\jenkins
[windows-jdk7-m3.3.x_build] [INFO] COMPUTERNAME=JENKINS-WIN2016
[windows-jdk7-m3.3.x_build] [INFO] PUBLIC=C:\Users\Public
[windows-jdk7-m3.3.x_build] [INFO] BUILD_TAG=jenkins-maven-box-maven-help-plugin-MPH-154-2
[windows-jdk7-m3.3.x_build] [INFO] JENKINS_SERVER_COOKIE=durable-558752dd5d2f45423f04caef704b9b7d
[windows-jdk7-m3.3.x_build] [INFO] HUDSON_URL=https://builds.apache.org/
[windows-jdk7-m3.3.x_build] [INFO] MAVEN_CONFIG=--batch-mode --show-version "-Dmaven.repo.local=f:\jenkins\jenkins-slave\workspace\x_maven-help-plugin_MPH-154-VXM3V7GTTLVLHGRUAZFTHVW3TNC24PTAG7PGH3XZEYHZOZWCPWCQ@2\.repository"
[windows-jdk7-m3.3.x_build] [INFO] USERPROFILE=C:\Users\jenkins
[windows-jdk7-m3.3.x_build] [INFO] MAVEN_JAVA_EXE="f:\\jenkins\\tools\\java\\latest1.7\bin\java.exe"
[windows-jdk7-m3.3.x_build] [INFO] APPDATA=C:\Users\jenkins\AppData\Roaming
[windows-jdk7-m3.3.x_build] [INFO] COMMONPROGRAMFILES=C:\Program Files\Common Files
[windows-jdk7-m3.3.x_build] [INFO] PROCESSOR_ARCHITECTURE=AMD64
[windows-jdk7-m3.3.x_build] [INFO] SESSIONNAME=RDP-Tcp#13
[windows-jdk7-m3.3.x_build] [INFO] PROCESSOR_IDENTIFIER=Intel64 Family 6 Model 42 Stepping 1, GenuineIntel
[windows-jdk7-m3.3.x_build] [INFO] EXEC_DIR=F:\jenkins\jenkins-slave\workspace\x_maven-help-plugin_MPH-154-VXM3V7GTTLVLHGRUAZFTHVW3TNC24PTAG7PGH3XZEYHZOZWCPWCQ@2\windows-jdk7-m3.3.x_build\target\it\system
[windows-jdk7-m3.3.x_build] [INFO] M2_HOME=F:\jenkins\tools\maven\apache-maven-3.3.9
[windows-jdk7-m3.3.x_build] [INFO] OS=Windows_NT
[windows-jdk7-m3.3.x_build] [INFO] HUDSON_HOME=/x1/jenkins/jenkins-home
[windows-jdk7-m3.3.x_build] [INFO] LIBRARY.JENKINS-LIB.VERSION=master
[windows-jdk7-m3.3.x_build] [INFO] BUILD_URL=https://builds.apache.org/job/maven-box/job/maven-help-plugin/job/MPH-154/2/
[windows-jdk7-m3.3.x_build] [INFO] ERROR_CODE=0
[windows-jdk7-m3.3.x_build] [INFO] JOB_URL=https://builds.apache.org/job/maven-box/job/maven-help-plugin/job/MPH-154/
[windows-jdk7-m3.3.x_build] [INFO] BRANCH_NAME=MPH-154
[windows-jdk7-m3.3.x_build] [INFO] LOGONSERVER=\\JENKINS-WIN2016
[windows-jdk7-m3.3.x_build] [INFO] COMMONPROGRAMW6432=C:\Program Files\Common Files
[windows-jdk7-m3.3.x_build] [INFO] USERDOMAIN=JENKINS-WIN2016
[windows-jdk7-m3.3.x_build] [INFO] MAVEN_HOME=F:\\jenkins\\tools\\maven\\apache-maven-3.3.9
[windows-jdk7-m3.3.x_build] [INFO] BUILD_NUMBER=2
[windows-jdk7-m3.3.x_build] [INFO] JENKINS_URL=https://builds.apache.org/
[windows-jdk7-m3.3.x_build] [INFO] PROCESSOR_REVISION=2a01
[windows-jdk7-m3.3.x_build] [INFO] PROGRAMFILES(X86)=C:\Program Files (x86)
[windows-jdk7-m3.3.x_build] [INFO] WDIR=F:\
[windows-jdk7-m3.3.x_build] [INFO] PROGRAMDATA=C:\ProgramData
[windows-jdk7-m3.3.x_build] [INFO] WORKSPACE=f:\jenkins\jenkins-slave\workspace\x_maven-help-plugin_MPH-154-VXM3V7GTTLVLHGRUAZFTHVW3TNC24PTAG7PGH3XZEYHZOZWCPWCQ@2
[windows-jdk7-m3.3.x_build] [INFO] LIBRARY.JENKINS-ENV.VERSION=master
[windows-jdk7-m3.3.x_build] [INFO] STAGE_NAME=Build windows-jdk7-m3.3.x_build
[windows-jdk7-m3.3.x_build] [INFO] PROGRAMFILES=C:\Program Files
[windows-jdk7-m3.3.x_build] [INFO]
[windows-jdk7-m3.3.x_build] [INFO] [INFO] ------------------------------------------------------------------------
[windows-jdk7-m3.3.x_build] [INFO] [INFO] BUILD SUCCESS
[windows-jdk7-m3.3.x_build] [INFO] [INFO] ------------------------------------------------------------------------
[windows-jdk7-m3.3.x_build] [INFO] [INFO] Total time: 1.685 s
[windows-jdk7-m3.3.x_build] [INFO] [INFO] Finished at: 2018-11-06T14:40:33-08:00
[windows-jdk7-m3.3.x_build] [INFO] [INFO] Final Memory: 9M/184M
[windows-jdk7-m3.3.x_build] [INFO] [INFO] ------------------------------------------------------------------------
[windows-jdk7-m3.3.x_build] [INFO] Picked up JAVA_TOOL_OPTIONS: -Dmaven.ext.class.path="f:\jenkins\jenkins-slave\workspace\x_maven-help-plugin_MPH-154-VXM3V7GTTLVLHGRUAZFTHVW3TNC24PTAG7PGH3XZEYHZOZWCPWCQ@2@tmp\withMaven0560b768\pipeline-maven-spy.jar" -Dorg.jenkinsci.plugins.pipeline.maven.reportsFolder="f:\jenkins\jenkins-slave\workspace\x_maven-help-plugin_MPH-154-VXM3V7GTTLVLHGRUAZFTHVW3TNC24PTAG7PGH3XZEYHZOZWCPWCQ@2@tmp\withMaven0560b768"
[windows-jdk7-m3.3.x_build] [INFO]           system\pom.xml ................................... SUCCESS (5.3 s)
[windows-jdk7-m3.3.x_build] [INFO]
[windows-jdk7-m3.3.x_build] [INFO] --- maven-checkstyle-plugin:3.0.0:check (checkstyle-check) @ maven-help-plugin ---
[windows-jdk7-m3.3.x_build] [INFO] Downloading: https://repo.maven.apache.org/maven2/org/apache/maven/shared/maven-shared-resources/2/maven-shared-resources-2.pom
[windows-jdk7-m3.3.x_build] [INFO] Downloaded: https://repo.maven.apache.org/maven2/org/apache/maven/shared/maven-shared-resources/2/maven-shared-resources-2.pom (3 KB at 99.5 KB/sec)
[windows-jdk7-m3.3.x_build] [INFO] Downloading: https://repo.maven.apache.org/maven2/org/codehaus/plexus/plexus-utils/3.0.10/plexus-utils-3.0.10.pom
[windows-jdk7-m3.3.x_build] [INFO] Downloaded: https://repo.maven.apache.org/maven2/org/codehaus/plexus/plexus-utils/3.0.10/plexus-utils-3.0.10.pom (4 KB at 105.9 KB/sec)
[windows-jdk7-m3.3.x_build] [INFO] Downloading: https://repo.maven.apache.org/maven2/org/codehaus/plexus/plexus/3.3/plexus-3.3.pom
[windows-jdk7-m3.3.x_build] [INFO] Downloaded: https://repo.maven.apache.org/maven2/org/codehaus/plexus/plexus/3.3/plexus-3.3.pom (20 KB at 670.1 KB/sec)
[windows-jdk7-m3.3.x_build] [INFO] Downloading: https://repo.maven.apache.org/maven2/org/apache/maven/doxia/doxia-integration-tools/1.6/doxia-integration-tools-1.6.pom
[windows-jdk7-m3.3.x_build] [INFO] Downloaded: https://repo.maven.apache.org/maven2/org/apache/maven/doxia/doxia-integration-tools/1.6/doxia-integration-tools-1.6.pom (7 KB at 283.1 KB/sec)
[windows-jdk7-m3.3.x_build] [INFO] Downloading: https://repo.maven.apache.org/maven2/org/apache/maven/doxia/doxia-tools/3/doxia-tools-3.pom
[windows-jdk7-m3.3.x_build] [INFO] Downloaded: https://repo.maven.apache.org/maven2/org/apache/maven/doxia/doxia-tools/3/doxia-tools-3.pom (10 KB at 440.7 KB/sec)
[windows-jdk7-m3.3.x_build] [INFO] Downloading: https://repo.maven.apache.org/maven2/org/codehaus/plexus/plexus-resources/1.1.0/plexus-resources-1.1.0.pom
[windows-jdk7-m3.3.x_build] [INFO] Downloaded: https://repo.maven.apache.org/maven2/org/codehaus/plexus/plexus-resources/1.1.0/plexus-resources-1.1.0.pom (4 KB at 114.9 KB/sec)
[windows-jdk7-m3.3.x_build] [INFO] Downloading: https://repo.maven.apache.org/maven2/com/puppycrawl/tools/checkstyle/6.18/checkstyle-6.18.pom
[windows-jdk7-m3.3.x_build] [INFO] Downloaded: https://repo.maven.apache.org/maven2/com/puppycrawl/tools/checkstyle/6.18/checkstyle-6.18.pom (70 KB at 2237.5 KB/sec)
[windows-jdk7-m3.3.x_build] [INFO] Downloading: https://repo.maven.apache.org/maven2/antlr/antlr/2.7.7/antlr-2.7.7.pom
[windows-jdk7-m3.3.x_build] [INFO] Downloaded: https://repo.maven.apache.org/maven2/antlr/antlr/2.7.7/antlr-2.7.7.pom (632 B at 23.7 KB/sec)
[windows-jdk7-m3.3.x_build] [INFO] Downloading: https://repo.maven.apache.org/maven2/org/antlr/antlr4-runtime/4.5.3/antlr4-runtime-4.5.3.pom
[windows-jdk7-m3.3.x_build] [INFO] Downloaded: https://repo.maven.apache.org/maven2/org/antlr/antlr4-runtime/4.5.3/antlr4-runtime-4.5.3.pom (3 KB at 102.5 KB/sec)
[windows-jdk7-m3.3.x_build] [INFO] Downloading: https://repo.maven.apache.org/maven2/org/antlr/antlr4-master/4.5.3/antlr4-master-4.5.3.pom
[windows-jdk7-m3.3.x_build] [INFO] Downloaded: https://repo.maven.apache.org/maven2/org/antlr/antlr4-master/4.5.3/antlr4-master-4.5.3.pom (4 KB at 149.9 KB/sec)
[windows-jdk7-m3.3.x_build] [INFO] Downloading: https://repo.maven.apache.org/maven2/commons-beanutils/commons-beanutils/1.9.2/commons-beanutils-1.9.2.pom
[windows-jdk7-m3.3.x_build] [INFO] Downloaded: https://repo.maven.apache.org/maven2/commons-beanutils/commons-beanutils/1.9.2/commons-beanutils-1.9.2.pom (14 KB at 481.7 KB/sec)
[windows-jdk7-m3.3.x_build] [INFO] Downloading: https://repo.maven.apache.org/maven2/org/apache/commons/commons-parent/33/commons-parent-33.pom
[windows-jdk7-m3.3.x_build] [INFO] Downloaded: https://repo.maven.apache.org/maven2/org/apache/commons/commons-parent/33/commons-parent-33.pom (52 KB at 1728.1 KB/sec)
[windows-jdk7-m3.3.x_build] [INFO] Downloading: https://repo.maven.apache.org/maven2/commons-cli/commons-cli/1.3.1/commons-cli-1.3.1.pom
[windows-jdk7-m3.3.x_build] [INFO] Downloaded: https://repo.maven.apache.org/maven2/commons-cli/commons-cli/1.3.1/commons-cli-1.3.1.pom (11 KB at 327.4 KB/sec)
[windows-jdk7-m3.3.x_build] [INFO] Downloading: https://repo.maven.apache.org/maven2/com/google/guava/guava/19.0/guava-19.0.pom
[windows-jdk7-m3.3.x_build] [INFO] Downloaded: https://repo.maven.apache.org/maven2/com/google/guava/guava/19.0/guava-19.0.pom (7 KB at 236.9 KB/sec)
[windows-jdk7-m3.3.x_build] [INFO] Downloading: https://repo.maven.apache.org/maven2/com/google/guava/guava-parent/19.0/guava-parent-19.0.pom
[windows-jdk7-m3.3.x_build] [INFO] Downloaded: https://repo.maven.apache.org/maven2/com/google/guava/guava-parent/19.0/guava-parent-19.0.pom (10 KB at 401.9 KB/sec)
[windows-jdk7-m3.3.x_build] [INFO] Downloading: https://repo.maven.apache.org/maven2/org/sonatype/oss/oss-parent/7/oss-parent-7.pom
[windows-jdk7-m3.3.x_build] [INFO] Downloaded: https://repo.maven.apache.org/maven2/org/sonatype/oss/oss-parent/7/oss-parent-7.pom (5 KB at 196.3 KB/sec)
[windows-jdk7-m3.3.x_build] [INFO] Downloading: https://repo.maven.apache.org/maven2/org/apache/maven/shared/maven-shared-resources/2/maven-shared-resources-2.jar
[windows-jdk7-m3.3.x_build] [INFO] Downloading: https://repo.maven.apache.org/maven2/org/apache/maven/doxia/doxia-core/1.2/doxia-core-1.2.jar
[windows-jdk7-m3.3.x_build] [INFO] Downloading: https://repo.maven.apache.org/maven2/commons-digester/commons-digester/1.6/commons-digester-1.6.jar
[windows-jdk7-m3.3.x_build] [INFO] Downloading: https://repo.maven.apache.org/maven2/commons-logging/commons-logging/1.0.4/commons-logging-1.0.4.jar
[windows-jdk7-m3.3.x_build] [INFO] Downloading: https://repo.maven.apache.org/maven2/org/apache/maven/doxia/doxia-integration-tools/1.6/doxia-integration-tools-1.6.jar
[windows-jdk7-m3.3.x_build] [INFO] Downloaded: https://repo.maven.apache.org/maven2/commons-logging/commons-logging/1.0.4/commons-logging-1.0.4.jar (38 KB at 1031.2 KB/sec)
[windows-jdk7-m3.3.x_build] [INFO] Downloading: https://repo.maven.apache.org/maven2/commons-io/commons-io/1.4/commons-io-1.4.jar
[windows-jdk7-m3.3.x_build] [INFO] Downloaded: https://repo.maven.apache.org/maven2/org/apache/maven/doxia/doxia-core/1.2/doxia-core-1.2.jar (151 KB at 3960.8 KB/sec)
[windows-jdk7-m3.3.x_build] [INFO] Downloading: https://repo.maven.apache.org/maven2/org/codehaus/plexus/plexus-resources/1.1.0/plexus-resources-1.1.0.jar
[windows-jdk7-m3.3.x_build] [INFO] Downloaded: https://repo.maven.apache.org/maven2/commons-digester/commons-digester/1.6/commons-digester-1.6.jar (165 KB at 3825.5 KB/sec)
[windows-jdk7-m3.3.x_build] [INFO] Downloading: https://repo.maven.apache.org/maven2/com/puppycrawl/tools/checkstyle/6.18/checkstyle-6.18.jar
[windows-jdk7-m3.3.x_build] [INFO] Downloaded: https://repo.maven.apache.org/maven2/commons-io/commons-io/1.4/commons-io-1.4.jar (107 KB at 1196.5 KB/sec)
[windows-jdk7-m3.3.x_build] [INFO] Downloading: https://repo.maven.apache.org/maven2/antlr/antlr/2.7.7/antlr-2.7.7.jar
[windows-jdk7-m3.3.x_build] [INFO] Downloaded: https://repo.maven.apache.org/maven2/org/apache/maven/shared/maven-shared-resources/2/maven-shared-resources-2.jar (13 KB at 135.6 KB/sec)
[windows-jdk7-m3.3.x_build] [INFO] Downloading: https://repo.maven.apache.org/maven2/org/antlr/antlr4-runtime/4.5.3/antlr4-runtime-4.5.3.jar
[windows-jdk7-m3.3.x_build] [INFO] Downloaded: https://repo.maven.apache.org/maven2/com/puppycrawl/tools/checkstyle/6.18/checkstyle-6.18.jar (1132 KB at 9586.1 KB/sec)
[windows-jdk7-m3.3.x_build] [INFO] Downloading: https://repo.maven.apache.org/maven2/commons-beanutils/commons-beanutils/1.9.2/commons-beanutils-1.9.2.jar
[windows-jdk7-m3.3.x_build] [INFO] Downloaded: https://repo.maven.apache.org/maven2/org/antlr/antlr4-runtime/4.5.3/antlr4-runtime-4.5.3.jar (296 KB at 2219.3 KB/sec)
[windows-jdk7-m3.3.x_build] [INFO] Downloading: https://repo.maven.apache.org/maven2/commons-cli/commons-cli/1.3.1/commons-cli-1.3.1.jar
[windows-jdk7-m3.3.x_build] [INFO] Downloaded: https://repo.maven.apache.org/maven2/antlr/antlr/2.7.7/antlr-2.7.7.jar (435 KB at 3174.1 KB/sec)
[windows-jdk7-m3.3.x_build] [INFO] Downloading: https://repo.maven.apache.org/maven2/com/google/guava/guava/19.0/guava-19.0.jar
[windows-jdk7-m3.3.x_build] [INFO] Downloaded: https://repo.maven.apache.org/maven2/commons-cli/commons-cli/1.3.1/commons-cli-1.3.1.jar (52 KB at 313.6 KB/sec)
[windows-jdk7-m3.3.x_build] [INFO] Downloading: https://repo.maven.apache.org/maven2/commons-lang/commons-lang/2.1/commons-lang-2.1.jar
[windows-jdk7-m3.3.x_build] [INFO] Downloaded: https://repo.maven.apache.org/maven2/commons-beanutils/commons-beanutils/1.9.2/commons-beanutils-1.9.2.jar (229 KB at 1351.3 KB/sec)
[windows-jdk7-m3.3.x_build] [INFO] Downloaded: https://repo.maven.apache.org/maven2/commons-lang/commons-lang/2.1/commons-lang-2.1.jar (203 KB at 1073.3 KB/sec)
[windows-jdk7-m3.3.x_build] [INFO] Downloaded: https://repo.maven.apache.org/maven2/org/codehaus/plexus/plexus-resources/1.1.0/plexus-resources-1.1.0.jar (23 KB at 113.3 KB/sec)
[windows-jdk7-m3.3.x_build] [INFO] Downloaded: https://repo.maven.apache.org/maven2/com/google/guava/guava/19.0/guava-19.0.jar (2255 KB at 9164.3 KB/sec)
[windows-jdk7-m3.3.x_build] [INFO] Downloaded: https://repo.maven.apache.org/maven2/org/apache/maven/doxia/doxia-integration-tools/1.6/doxia-integration-tools-1.6.jar (44 KB at 175.0 KB/sec)
[windows-jdk7-m3.3.x_build] [INFO]
[windows-jdk7-m3.3.x_build] [INFO] --- maven-invoker-plugin:3.1.0:verify (integration-test) @ maven-help-plugin ---
[windows-jdk7-m3.3.x_build] [INFO] -------------------------------------------------
[windows-jdk7-m3.3.x_build] [INFO] Build Summary:
[windows-jdk7-m3.3.x_build] [INFO]   Passed: 29, Failed: 1, Errors: 0, Skipped: 0
[windows-jdk7-m3.3.x_build] [INFO] -------------------------------------------------
[windows-jdk7-m3.3.x_build] [ERROR] The following builds failed:
[windows-jdk7-m3.3.x_build] [ERROR] *  evaluate-forceStdout\pom.xml
[windows-jdk7-m3.3.x_build] [INFO] -------------------------------------------------
[windows-jdk7-m3.3.x_build] [INFO] ------------------------------------------------------------------------
[windows-jdk7-m3.3.x_build] [INFO] BUILD FAILURE
[windows-jdk7-m3.3.x_build] [INFO] ------------------------------------------------------------------------
[windows-jdk7-m3.3.x_build] [INFO] Total time: 05:40 min
[windows-jdk7-m3.3.x_build] [INFO] Finished at: 2018-11-06T14:40:38-08:00
[windows-jdk7-m3.3.x_build] [INFO] Final Memory: 50M/376M
[windows-jdk7-m3.3.x_build] [INFO] ------------------------------------------------------------------------
[windows-jdk7-m3.3.x_build] [INFO] [jenkins-event-spy] Generated F:\jenkins\jenkins-slave\workspace\x_maven-help-plugin_MPH-154-VXM3V7GTTLVLHGRUAZFTHVW3TNC24PTAG7PGH3XZEYHZOZWCPWCQ@2@tmp\withMaven0560b768\maven-spy-20181106-143457-6034409549706604917827.log
[windows-jdk7-m3.3.x_build] [ERROR] Failed to execute goal org.apache.maven.plugins:maven-invoker-plugin:3.1.0:verify (integration-test) on project maven-help-plugin: 1 build failed. See console output above for details. -> [Help 1]
[windows-jdk7-m3.3.x_build] [ERROR]
[windows-jdk7-m3.3.x_build] [ERROR] To see the full stack trace of the errors, re-run Maven with the -e switch.
[windows-jdk7-m3.3.x_build] [ERROR] Re-run Maven using the -X switch to enable full debug logging.
[windows-jdk7-m3.3.x_build] [ERROR]
[windows-jdk7-m3.3.x_build] [ERROR] For more information about the errors and possible solutions, please read the following articles:
[windows-jdk7-m3.3.x_build] [ERROR] [Help 1] http://cwiki.apache.org/confluence/display/MAVEN/MojoFailureException
[windows-jdk7-m3.3.x_build] Picked up JAVA_TOOL_OPTIONS: -Dmaven.ext.class.path="f:\jenkins\jenkins-slave\workspace\x_maven-help-plugin_MPH-154-VXM3V7GTTLVLHGRUAZFTHVW3TNC24PTAG7PGH3XZEYHZOZWCPWCQ@2@tmp\withMaven0560b768\pipeline-maven-spy.jar" -Dorg.jenkinsci.plugins.pipeline.maven.reportsFolder="f:\jenkins\jenkins-slave\workspace\x_maven-help-plugin_MPH-154-VXM3V7GTTLVLHGRUAZFTHVW3TNC24PTAG7PGH3XZEYHZOZWCPWCQ@2@tmp\withMaven0560b768"
[Pipeline] [windows-jdk7-m3.3.x_build] }
[Pipeline] [windows-jdk7-m3.3.x_build] // dir
[Pipeline] [windows-jdk7-m3.3.x_build] }
[windows-jdk7-m3.3.x_build] [Fast Archiver] No prior successful build to compare, so performing full copy of artifacts
[windows-jdk7-m3.3.x_build] [withMaven] invokerPublisher - Archive invoker results for Maven artifact MavenArtifact{org.apache.maven.plugins:maven-help-plugin::3.1.1-SNAPSHOT(version: 3.1.1-SNAPSHOT, snapshot:false) } generated by PluginInvocation{org.apache.maven.plugins:maven-invoker-plugin:3.1.0@integration-test  integration-test}: windows-jdk7-m3.3.x_build\target\invoker-reports\*.xml
[windows-jdk7-m3.3.x_build] performing MavenInvokerRecorder, reportsFilenamePattern:'**/windows-jdk7-m3.3.x_build\target\invoker-reports/BUILD*.xml', invokerBuildDir:'**/windows-jdk7-m3.3.x_build\target\it'
[windows-jdk7-m3.3.x_build] Found reports:[f:\jenkins\jenkins-slave\workspace\x_maven-help-plugin_MPH-154-VXM3V7GTTLVLHGRUAZFTHVW3TNC24PTAG7PGH3XZEYHZOZWCPWCQ@2\windows-jdk7-m3.3.x_build\target\invoker-reports\BUILD-active-profiles.xml, f:\jenkins\jenkins-slave\workspace\x_maven-help-plugin_MPH-154-VXM3V7GTTLVLHGRUAZFTHVW3TNC24PTAG7PGH3XZEYHZOZWCPWCQ@2\windows-jdk7-m3.3.x_build\target\invoker-reports\BUILD-active-profiles_multimodule.xml, f:\jenkins\jenkins-slave\workspace\x_maven-help-plugin_MPH-154-VXM3V7GTTLVLHGRUAZFTHVW3TNC24PTAG7PGH3XZEYHZOZWCPWCQ@2\windows-jdk7-m3.3.x_build\target\invoker-reports\BUILD-all-profiles-parent-pom.xml, f:\jenkins\jenkins-slave\workspace\x_maven-help-plugin_MPH-154-VXM3V7GTTLVLHGRUAZFTHVW3TNC24PTAG7PGH3XZEYHZOZWCPWCQ@2\windows-jdk7-m3.3.x_build\target\invoker-reports\BUILD-all-profiles.xml, f:\jenkins\jenkins-slave\workspace\x_maven-help-plugin_MPH-154-VXM3V7GTTLVLHGRUAZFTHVW3TNC24PTAG7PGH3XZEYHZOZWCPWCQ@2\windows-jdk7-m3.3.x_build\target\invoker-reports\BUILD-describe-cmd-invalid.xml, f:\jenkins\jenkins-slave\workspace\x_maven-help-plugin_MPH-154-VXM3V7GTTLVLHGRUAZFTHVW3TNC24PTAG7PGH3XZEYHZOZWCPWCQ@2\windows-jdk7-m3.3.x_build\target\invoker-reports\BUILD-describe-cmd-with-goal-invalid.xml, f:\jenkins\jenkins-slave\workspace\x_maven-help-plugin_MPH-154-VXM3V7GTTLVLHGRUAZFTHVW3TNC24PTAG7PGH3XZEYHZOZWCPWCQ@2\windows-jdk7-m3.3.x_build\target\invoker-reports\BUILD-describe-cmd-with-goal-report.xml, f:\jenkins\jenkins-slave\workspace\x_maven-help-plugin_MPH-154-VXM3V7GTTLVLHGRUAZFTHVW3TNC24PTAG7PGH3XZEYHZOZWCPWCQ@2\windows-jdk7-m3.3.x_build\target\invoker-reports\BUILD-describe-cmd-with-goal.xml, f:\jenkins\jenkins-slave\workspace\x_maven-help-plugin_MPH-154-VXM3V7GTTLVLHGRUAZFTHVW3TNC24PTAG7PGH3XZEYHZOZWCPWCQ@2\windows-jdk7-m3.3.x_build\target\invoker-reports\BUILD-describe-cmd.xml, f:\jenkins\jenkins-slave\workspace\x_maven-help-plugin_MPH-154-VXM3V7GTTLVLHGRUAZFTHVW3TNC24PTAG7PGH3XZEYHZOZWCPWCQ@2\windows-jdk7-m3.3.x_build\target\invoker-reports\BUILD-describe-ga.xml, f:\jenkins\jenkins-slave\workspace\x_maven-help-plugin_MPH-154-VXM3V7GTTLVLHGRUAZFTHVW3TNC24PTAG7PGH3XZEYHZOZWCPWCQ@2\windows-jdk7-m3.3.x_build\target\invoker-reports\BUILD-describe-gav.xml, f:\jenkins\jenkins-slave\workspace\x_maven-help-plugin_MPH-154-VXM3V7GTTLVLHGRUAZFTHVW3TNC24PTAG7PGH3XZEYHZOZWCPWCQ@2\windows-jdk7-m3.3.x_build\target\invoker-reports\BUILD-describe-plugin-in-plugin-management.xml, f:\jenkins\jenkins-slave\workspace\x_maven-help-plugin_MPH-154-VXM3V7GTTLVLHGRUAZFTHVW3TNC24PTAG7PGH3XZEYHZOZWCPWCQ@2\windows-jdk7-m3.3.x_build\target\invoker-reports\BUILD-describe-plugin-without-name.xml, f:\jenkins\jenkins-slave\workspace\x_maven-help-plugin_MPH-154-VXM3V7GTTLVLHGRUAZFTHVW3TNC24PTAG7PGH3XZEYHZOZWCPWCQ@2\windows-jdk7-m3.3.x_build\target\invoker-reports\BUILD-describe-prefix-and-invalid-mojo.xml, f:\jenkins\jenkins-slave\workspace\x_maven-help-plugin_MPH-154-VXM3V7GTTLVLHGRUAZFTHVW3TNC24PTAG7PGH3XZEYHZOZWCPWCQ@2\windows-jdk7-m3.3.x_build\target\invoker-reports\BUILD-describe-prefix-and-mojo.xml, f:\jenkins\jenkins-slave\workspace\x_maven-help-plugin_MPH-154-VXM3V7GTTLVLHGRUAZFTHVW3TNC24PTAG7PGH3XZEYHZOZWCPWCQ@2\windows-jdk7-m3.3.x_build\target\invoker-reports\BUILD-describe-prefix.xml, f:\jenkins\jenkins-slave\workspace\x_maven-help-plugin_MPH-154-VXM3V7GTTLVLHGRUAZFTHVW3TNC24PTAG7PGH3XZEYHZOZWCPWCQ@2\windows-jdk7-m3.3.x_build\target\invoker-reports\BUILD-effective-pom-artifact.xml, f:\jenkins\jenkins-slave\workspace\x_maven-help-plugin_MPH-154-VXM3V7GTTLVLHGRUAZFTHVW3TNC24PTAG7PGH3XZEYHZOZWCPWCQ@2\windows-jdk7-m3.3.x_build\target\invoker-reports\BUILD-effective-pom-from-lifecycle.xml, f:\jenkins\jenkins-slave\workspace\x_maven-help-plugin_MPH-154-VXM3V7GTTLVLHGRUAZFTHVW3TNC24PTAG7PGH3XZEYHZOZWCPWCQ@2\windows-jdk7-m3.3.x_build\target\invoker-reports\BUILD-effective-pom-multimodule-unlink-parent.xml, f:\jenkins\jenkins-slave\workspace\x_maven-help-plugin_MPH-154-VXM3V7GTTLVLHGRUAZFTHVW3TNC24PTAG7PGH3XZEYHZOZWCPWCQ@2\windows-jdk7-m3.3.x_build\target\invoker-reports\BUILD-effective-pom-multimodule.xml, f:\jenkins\jenkins-slave\workspace\x_maven-help-plugin_MPH-154-VXM3V7GTTLVLHGRUAZFTHVW3TNC24PTAG7PGH3XZEYHZOZWCPWCQ@2\windows-jdk7-m3.3.x_build\target\invoker-reports\BUILD-effective-pom.xml, f:\jenkins\jenkins-slave\workspace\x_maven-help-plugin_MPH-154-VXM3V7GTTLVLHGRUAZFTHVW3TNC24PTAG7PGH3XZEYHZOZWCPWCQ@2\windows-jdk7-m3.3.x_build\target\invoker-reports\BUILD-effective-pom_properties.xml, f:\jenkins\jenkins-slave\workspace\x_maven-help-plugin_MPH-154-VXM3V7GTTLVLHGRUAZFTHVW3TNC24PTAG7PGH3XZEYHZOZWCPWCQ@2\windows-jdk7-m3.3.x_build\target\invoker-reports\BUILD-effective-settings.xml, f:\jenkins\jenkins-slave\workspace\x_maven-help-plugin_MPH-154-VXM3V7GTTLVLHGRUAZFTHVW3TNC24PTAG7PGH3XZEYHZOZWCPWCQ@2\windows-jdk7-m3.3.x_build\target\invoker-reports\BUILD-effective-settings_deep-clone.xml, f:\jenkins\jenkins-slave\workspace\x_maven-help-plugin_MPH-154-VXM3V7GTTLVLHGRUAZFTHVW3TNC24PTAG7PGH3XZEYHZOZWCPWCQ@2\windows-jdk7-m3.3.x_build\target\invoker-reports\BUILD-evaluate-artifact-with-expression-with-output.xml, f:\jenkins\jenkins-slave\workspace\x_maven-help-plugin_MPH-154-VXM3V7GTTLVLHGRUAZFTHVW3TNC24PTAG7PGH3XZEYHZOZWCPWCQ@2\windows-jdk7-m3.3.x_build\target\invoker-reports\BUILD-evaluate-forceStdout.xml, f:\jenkins\jenkins-slave\workspace\x_maven-help-plugin_MPH-154-VXM3V7GTTLVLHGRUAZFTHVW3TNC24PTAG7PGH3XZEYHZOZWCPWCQ@2\windows-jdk7-m3.3.x_build\target\invoker-reports\BUILD-evaluate-settings-servers.xml, f:\jenkins\jenkins-slave\workspace\x_maven-help-plugin_MPH-154-VXM3V7GTTLVLHGRUAZFTHVW3TNC24PTAG7PGH3XZEYHZOZWCPWCQ@2\windows-jdk7-m3.3.x_build\target\invoker-reports\BUILD-evaluate-with-expression-with-output.xml, f:\jenkins\jenkins-slave\workspace\x_maven-help-plugin_MPH-154-VXM3V7GTTLVLHGRUAZFTHVW3TNC24PTAG7PGH3XZEYHZOZWCPWCQ@2\windows-jdk7-m3.3.x_build\target\invoker-reports\BUILD-evaluate.xml, f:\jenkins\jenkins-slave\workspace\x_maven-help-plugin_MPH-154-VXM3V7GTTLVLHGRUAZFTHVW3TNC24PTAG7PGH3XZEYHZOZWCPWCQ@2\windows-jdk7-m3.3.x_build\target\invoker-reports\BUILD-system.xml]
[windows-jdk7-m3.3.x_build] Found logs:[f:\jenkins\jenkins-slave\workspace\x_maven-help-plugin_MPH-154-VXM3V7GTTLVLHGRUAZFTHVW3TNC24PTAG7PGH3XZEYHZOZWCPWCQ@2\windows-jdk7-m3.3.x_build\target\it\active-profiles\build.log, f:\jenkins\jenkins-slave\workspace\x_maven-help-plugin_MPH-154-VXM3V7GTTLVLHGRUAZFTHVW3TNC24PTAG7PGH3XZEYHZOZWCPWCQ@2\windows-jdk7-m3.3.x_build\target\it\active-profiles_multimodule\build.log, f:\jenkins\jenkins-slave\workspace\x_maven-help-plugin_MPH-154-VXM3V7GTTLVLHGRUAZFTHVW3TNC24PTAG7PGH3XZEYHZOZWCPWCQ@2\windows-jdk7-m3.3.x_build\target\it\all-profiles-parent-pom\build.log, f:\jenkins\jenkins-slave\workspace\x_maven-help-plugin_MPH-154-VXM3V7GTTLVLHGRUAZFTHVW3TNC24PTAG7PGH3XZEYHZOZWCPWCQ@2\windows-jdk7-m3.3.x_build\target\it\all-profiles\build.log, f:\jenkins\jenkins-slave\workspace\x_maven-help-plugin_MPH-154-VXM3V7GTTLVLHGRUAZFTHVW3TNC24PTAG7PGH3XZEYHZOZWCPWCQ@2\windows-jdk7-m3.3.x_build\target\it\describe-cmd-invalid\build.log, f:\jenkins\jenkins-slave\workspace\x_maven-help-plugin_MPH-154-VXM3V7GTTLVLHGRUAZFTHVW3TNC24PTAG7PGH3XZEYHZOZWCPWCQ@2\windows-jdk7-m3.3.x_build\target\it\describe-cmd-with-goal-invalid\build.log, f:\jenkins\jenkins-slave\workspace\x_maven-help-plugin_MPH-154-VXM3V7GTTLVLHGRUAZFTHVW3TNC24PTAG7PGH3XZEYHZOZWCPWCQ@2\windows-jdk7-m3.3.x_build\target\it\describe-cmd-with-goal-report\build.log, f:\jenkins\jenkins-slave\workspace\x_maven-help-plugin_MPH-154-VXM3V7GTTLVLHGRUAZFTHVW3TNC24PTAG7PGH3XZEYHZOZWCPWCQ@2\windows-jdk7-m3.3.x_build\target\it\describe-cmd-with-goal\build.log, f:\jenkins\jenkins-slave\workspace\x_maven-help-plugin_MPH-154-VXM3V7GTTLVLHGRUAZFTHVW3TNC24PTAG7PGH3XZEYHZOZWCPWCQ@2\windows-jdk7-m3.3.x_build\target\it\describe-cmd\build.log, f:\jenkins\jenkins-slave\workspace\x_maven-help-plugin_MPH-154-VXM3V7GTTLVLHGRUAZFTHVW3TNC24PTAG7PGH3XZEYHZOZWCPWCQ@2\windows-jdk7-m3.3.x_build\target\it\describe-ga\build.log, f:\jenkins\jenkins-slave\workspace\x_maven-help-plugin_MPH-154-VXM3V7GTTLVLHGRUAZFTHVW3TNC24PTAG7PGH3XZEYHZOZWCPWCQ@2\windows-jdk7-m3.3.x_build\target\it\describe-gav\build.log, f:\jenkins\jenkins-slave\workspace\x_maven-help-plugin_MPH-154-VXM3V7GTTLVLHGRUAZFTHVW3TNC24PTAG7PGH3XZEYHZOZWCPWCQ@2\windows-jdk7-m3.3.x_build\target\it\describe-plugin-in-plugin-management\build.log, f:\jenkins\jenkins-slave\workspace\x_maven-help-plugin_MPH-154-VXM3V7GTTLVLHGRUAZFTHVW3TNC24PTAG7PGH3XZEYHZOZWCPWCQ@2\windows-jdk7-m3.3.x_build\target\it\describe-plugin-without-name\build.log, f:\jenkins\jenkins-slave\workspace\x_maven-help-plugin_MPH-154-VXM3V7GTTLVLHGRUAZFTHVW3TNC24PTAG7PGH3XZEYHZOZWCPWCQ@2\windows-jdk7-m3.3.x_build\target\it\describe-prefix-and-invalid-mojo\build.log, f:\jenkins\jenkins-slave\workspace\x_maven-help-plugin_MPH-154-VXM3V7GTTLVLHGRUAZFTHVW3TNC24PTAG7PGH3XZEYHZOZWCPWCQ@2\windows-jdk7-m3.3.x_build\target\it\describe-prefix-and-mojo\build.log, f:\jenkins\jenkins-slave\workspace\x_maven-help-plugin_MPH-154-VXM3V7GTTLVLHGRUAZFTHVW3TNC24PTAG7PGH3XZEYHZOZWCPWCQ@2\windows-jdk7-m3.3.x_build\target\it\describe-prefix\build.log, f:\jenkins\jenkins-slave\workspace\x_maven-help-plugin_MPH-154-VXM3V7GTTLVLHGRUAZFTHVW3TNC24PTAG7PGH3XZEYHZOZWCPWCQ@2\windows-jdk7-m3.3.x_build\target\it\effective-pom-artifact\build.log, f:\jenkins\jenkins-slave\workspace\x_maven-help-plugin_MPH-154-VXM3V7GTTLVLHGRUAZFTHVW3TNC24PTAG7PGH3XZEYHZOZWCPWCQ@2\windows-jdk7-m3.3.x_build\target\it\effective-pom-from-lifecycle\build.log, f:\jenkins\jenkins-slave\workspace\x_maven-help-plugin_MPH-154-VXM3V7GTTLVLHGRUAZFTHVW3TNC24PTAG7PGH3XZEYHZOZWCPWCQ@2\windows-jdk7-m3.3.x_build\target\it\effective-pom-multimodule-unlink-parent\build.log, f:\jenkins\jenkins-slave\workspace\x_maven-help-plugin_MPH-154-VXM3V7GTTLVLHGRUAZFTHVW3TNC24PTAG7PGH3XZEYHZOZWCPWCQ@2\windows-jdk7-m3.3.x_build\target\it\effective-pom-multimodule\build.log, f:\jenkins\jenkins-slave\workspace\x_maven-help-plugin_MPH-154-VXM3V7GTTLVLHGRUAZFTHVW3TNC24PTAG7PGH3XZEYHZOZWCPWCQ@2\windows-jdk7-m3.3.x_build\target\it\effective-pom\build.log, f:\jenkins\jenkins-slave\workspace\x_maven-help-plugin_MPH-154-VXM3V7GTTLVLHGRUAZFTHVW3TNC24PTAG7PGH3XZEYHZOZWCPWCQ@2\windows-jdk7-m3.3.x_build\target\it\effective-pom_properties\build.log, f:\jenkins\jenkins-slave\workspace\x_maven-help-plugin_MPH-154-VXM3V7GTTLVLHGRUAZFTHVW3TNC24PTAG7PGH3XZEYHZOZWCPWCQ@2\windows-jdk7-m3.3.x_build\target\it\effective-settings\build.log, f:\jenkins\jenkins-slave\workspace\x_maven-help-plugin_MPH-154-VXM3V7GTTLVLHGRUAZFTHVW3TNC24PTAG7PGH3XZEYHZOZWCPWCQ@2\windows-jdk7-m3.3.x_build\target\it\effective-settings_deep-clone\build.log, f:\jenkins\jenkins-slave\workspace\x_maven-help-plugin_MPH-154-VXM3V7GTTLVLHGRUAZFTHVW3TNC24PTAG7PGH3XZEYHZOZWCPWCQ@2\windows-jdk7-m3.3.x_build\target\it\evaluate-artifact-with-expression-with-output\build.log, f:\jenkins\jenkins-slave\workspace\x_maven-help-plugin_MPH-154-VXM3V7GTTLVLHGRUAZFTHVW3TNC24PTAG7PGH3XZEYHZOZWCPWCQ@2\windows-jdk7-m3.3.x_build\target\it\evaluate-forceStdout\build.log, f:\jenkins\jenkins-slave\workspace\x_maven-help-plugin_MPH-154-VXM3V7GTTLVLHGRUAZFTHVW3TNC24PTAG7PGH3XZEYHZOZWCPWCQ@2\windows-jdk7-m3.3.x_build\target\it\evaluate-settings-servers\build.log, f:\jenkins\jenkins-slave\workspace\x_maven-help-plugin_MPH-154-VXM3V7GTTLVLHGRUAZFTHVW3TNC24PTAG7PGH3XZEYHZOZWCPWCQ@2\windows-jdk7-m3.3.x_build\target\it\evaluate-with-expression-with-output\build.log, f:\jenkins\jenkins-slave\workspace\x_maven-help-plugin_MPH-154-VXM3V7GTTLVLHGRUAZFTHVW3TNC24PTAG7PGH3XZEYHZOZWCPWCQ@2\windows-jdk7-m3.3.x_build\target\it\evaluate\build.log, f:\jenkins\jenkins-slave\workspace\x_maven-help-plugin_MPH-154-VXM3V7GTTLVLHGRUAZFTHVW3TNC24PTAG7PGH3XZEYHZOZWCPWCQ@2\windows-jdk7-m3.3.x_build\target\it\system\build.log]
[windows-jdk7-m3.3.x_build] Finished parsing Maven Invoker results (found 30)
[windows-jdk7-m3.3.x_build] [withMaven] junitPublisher - Archive test results for Maven artifact org.apache.maven.plugins:maven-help-plugin:3.1.1-SNAPSHOT generated by maven-surefire-plugin:test (default-test): windows-jdk7-m3.3.x_build\target\surefire-reports\*.xml
[windows-jdk7-m3.3.x_build] Recording test results
[windows-jdk7-m3.3.x_build] [withMaven] openTasksPublisher - Scan Tasks for Maven artifact org.apache.maven.plugins:maven-help-plugin:3.1.1-SNAPSHOT in source directory windows-jdk7-m3.3.x_build\src\main\java
[windows-jdk7-m3.3.x_build] [TASKS] Scanning folder 'f:\jenkins\jenkins-slave\workspace\x_maven-help-plugin_MPH-154-VXM3V7GTTLVLHGRUAZFTHVW3TNC24PTAG7PGH3XZEYHZOZWCPWCQ@2' for files matching the pattern 'windows-jdk7-m3.3.x_build\src\main\java\**\*' - excludes: null
[windows-jdk7-m3.3.x_build] [TASKS] Found 9 files to scan for tasks
[windows-jdk7-m3.3.x_build] [TASKS] Found 1 open tasks.
[windows-jdk7-m3.3.x_build] Skipping warnings blame since pipelines do not have an SCM link.%n
[Pipeline] [windows-jdk7-m3.3.x_build] // withMaven
[Pipeline] [windows-jdk7-m3.3.x_build] cleanWs
[windows-jdk7-m3.3.x_build] [WS-CLEANUP] Deleting project workspace...[WS-CLEANUP] done
[Pipeline] [windows-jdk7-m3.3.x_build] cleanWs
[windows-jdk7-m3.3.x_build] [WS-CLEANUP] Deleting project workspace...[WS-CLEANUP] done
[Pipeline] [windows-jdk7-m3.3.x_build] }
[Pipeline] [windows-jdk7-m3.3.x_build] // stage
[Pipeline] [windows-jdk7-m3.3.x_build] }
[Pipeline] [windows-jdk7-m3.3.x_build] // ws
[Pipeline] [windows-jdk7-m3.3.x_build] }
[Pipeline] [windows-jdk7-m3.3.x_build] // node
[Pipeline] [windows-jdk7-m3.3.x_build] }
[windows-jdk7-m3.3.x_build] Failed in branch windows-jdk7-m3.3.x_build
[Pipeline] // parallel
[Pipeline] stage
[Pipeline] { (Notifications)
[Pipeline] echo
Build result: FAILURE
[Pipeline] jiraIssueSelector
[Pipeline] emailext
Reply | Threaded
Open this post in threaded view
|

Build succeeded in Jenkins: Maven TLP » maven-help-plugin » MPH-154 #3

Apache Jenkins Server-2
See https://builds.apache.org/job/maven-box/job/maven-help-plugin/job/MPH-154/3/

Changes:

* Ignore logline starting with 'Picked up JAVA_TOOL_OPTIONS: '
* Ignore logline starting with 'Picked up JAVA_TOOL_OPTIONS: '
* Ignore logline starting with 'Picked up JAVA_TOOL_OPTIONS: '
* Ignore logline starting with 'Picked up JAVA_TOOL_OPTIONS: '
* Ignore logline starting with 'Picked up JAVA_TOOL_OPTIONS: '
* Ignore logline starting with 'Picked up JAVA_TOOL_OPTIONS: '
* Ignore logline starting with 'Picked up JAVA_TOOL_OPTIONS: '
* Ignore logline starting with 'Picked up JAVA_TOOL_OPTIONS: '
* Ignore logline starting with 'Picked up JAVA_TOOL_OPTIONS: '
* Ignore logline starting with 'Picked up JAVA_TOOL_OPTIONS: '
* Ignore logline starting with 'Picked up JAVA_TOOL_OPTIONS: '
* Ignore logline starting with 'Picked up JAVA_TOOL_OPTIONS: '
* Ignore logline starting with 'Picked up JAVA_TOOL_OPTIONS: '
* Ignore logline starting with 'Picked up JAVA_TOOL_OPTIONS: '

All tests passed