Build failed in Jenkins: Maven TLP » maven-gpg-plugin » stabilize #2

classic Classic list List threaded Threaded
6 messages Options
Reply | Threaded
Open this post in threaded view
|

Build failed in Jenkins: Maven TLP » maven-gpg-plugin » stabilize #2

Apache Jenkins Server-2
See https://builds.apache.org/job/maven-box/job/maven-gpg-plugin/job/stabilize/2/

Changes:

* Apply deleteOnExit after file creation

All tests passed

Build log:
[...truncated 43660 lines...]
[INFO] --- maven-checkstyle-plugin:3.0.0:check (checkstyle-check) @ maven-gpg-plugin ---
[DEBUG] Dependency collection stats: {ConflictMarker.analyzeTime=1715819, ConflictMarker.markTime=1408054, ConflictMarker.nodeCount=274, ConflictIdSorter.graphTime=1069881, ConflictIdSorter.topsortTime=264164, ConflictIdSorter.conflictIdCount=72, ConflictIdSorter.conflictIdCycleCount=0, ConflictResolver.totalTime=14376160, ConflictResolver.conflictItemCount=177, DefaultDependencyCollector.collectTime=103462944, DefaultDependencyCollector.transformTime=19059294}
[DEBUG] org.apache.maven.plugins:maven-checkstyle-plugin:jar:3.0.0
[DEBUG]    org.apache.maven.shared:maven-shared-resources:jar:2:runtime
[DEBUG]    org.apache.maven:maven-artifact:jar:3.0:compile
[DEBUG]    org.apache.maven:maven-core:jar:3.0:compile
[DEBUG]       org.apache.maven:maven-settings:jar:3.0:compile
[DEBUG]       org.apache.maven:maven-settings-builder:jar:3.0:compile
[DEBUG]       org.apache.maven:maven-repository-metadata:jar:3.0:compile
[DEBUG]       org.apache.maven:maven-model-builder:jar:3.0:compile
[DEBUG]       org.apache.maven:maven-aether-provider:jar:3.0:runtime
[DEBUG]       org.sonatype.aether:aether-impl:jar:1.7:compile
[DEBUG]          org.sonatype.aether:aether-spi:jar:1.7:compile
[DEBUG]       org.sonatype.aether:aether-api:jar:1.7:compile
[DEBUG]       org.sonatype.aether:aether-util:jar:1.7:compile
[DEBUG]       org.sonatype.sisu:sisu-inject-plexus:jar:1.4.2:compile
[DEBUG]          org.sonatype.sisu:sisu-inject-bean:jar:1.4.2:compile
[DEBUG]             org.sonatype.sisu:sisu-guice:jar:noaop:2.1.7:compile
[DEBUG]       org.codehaus.plexus:plexus-classworlds:jar:2.2.3:compile
[DEBUG]       org.sonatype.plexus:plexus-sec-dispatcher:jar:1.3:compile
[DEBUG]          org.sonatype.plexus:plexus-cipher:jar:1.4:compile
[DEBUG]    org.apache.maven:maven-model:jar:3.0:compile
[DEBUG]    org.apache.maven:maven-plugin-api:jar:3.0:compile
[DEBUG]    org.apache.maven.reporting:maven-reporting-api:jar:3.0:compile
[DEBUG]    org.apache.maven.reporting:maven-reporting-impl:jar:2.3:compile
[DEBUG]       org.apache.maven.shared:maven-shared-utils:jar:0.6:compile
[DEBUG]          com.google.code.findbugs:jsr305:jar:2.0.1:compile
[DEBUG]       org.apache.maven.doxia:doxia-core:jar:1.2:compile
[DEBUG]          xerces:xercesImpl:jar:2.9.1:compile
[DEBUG]             xml-apis:xml-apis:jar:1.3.04:compile
[DEBUG]          org.apache.httpcomponents:httpclient:jar:4.0.2:compile
[DEBUG]             org.apache.httpcomponents:httpcore:jar:4.0.1:compile
[DEBUG]             commons-codec:commons-codec:jar:1.3:compile
[DEBUG]       commons-validator:commons-validator:jar:1.3.1:compile
[DEBUG]          commons-digester:commons-digester:jar:1.6:compile
[DEBUG]          commons-logging:commons-logging:jar:1.0.4:compile
[DEBUG]    org.apache.maven.doxia:doxia-sink-api:jar:1.4:compile
[DEBUG]       org.apache.maven.doxia:doxia-logging-api:jar:1.4:compile
[DEBUG]    org.apache.maven.doxia:doxia-decoration-model:jar:1.4:compile
[DEBUG]    org.apache.maven.doxia:doxia-site-renderer:jar:1.4:compile
[DEBUG]       org.apache.maven.doxia:doxia-module-xhtml:jar:1.4:compile
[DEBUG]       org.apache.maven.doxia:doxia-module-fml:jar:1.4:compile
[DEBUG]       org.codehaus.plexus:plexus-i18n:jar:1.0-beta-7:compile
[DEBUG]       org.apache.velocity:velocity-tools:jar:2.0:compile
[DEBUG]          commons-chain:commons-chain:jar:1.1:compile
[DEBUG]          dom4j:dom4j:jar:1.1:compile
[DEBUG]          sslext:sslext:jar:1.2-0:compile
[DEBUG]          org.apache.struts:struts-core:jar:1.3.8:compile
[DEBUG]          org.apache.struts:struts-taglib:jar:1.3.8:compile
[DEBUG]          org.apache.struts:struts-tiles:jar:1.3.8:compile
[DEBUG]    org.apache.maven.doxia:doxia-integration-tools:jar:1.6:compile
[DEBUG]       commons-io:commons-io:jar:1.4:compile
[DEBUG]       org.codehaus.plexus:plexus-container-default:jar:1.0-alpha-9:compile
[DEBUG]          junit:junit:jar:3.8.1:compile
[DEBUG]          classworlds:classworlds:jar:1.1-alpha-2:compile
[DEBUG]    org.codehaus.plexus:plexus-component-annotations:jar:1.6:compile
[DEBUG]    org.codehaus.plexus:plexus-resources:jar:1.1.0:compile
[DEBUG]    org.codehaus.plexus:plexus-utils:jar:3.0.24:compile
[DEBUG]    org.codehaus.plexus:plexus-interpolation:jar:1.24:compile
[DEBUG]    org.codehaus.plexus:plexus-velocity:jar:1.1.8:compile
[DEBUG]    com.puppycrawl.tools:checkstyle:jar:6.18:compile
[DEBUG]       antlr:antlr:jar:2.7.7:compile
[DEBUG]       org.antlr:antlr4-runtime:jar:4.5.3:compile
[DEBUG]       commons-beanutils:commons-beanutils:jar:1.9.2:compile
[DEBUG]       commons-cli:commons-cli:jar:1.3.1:compile
[DEBUG]       com.google.guava:guava:jar:19.0:compile
[DEBUG]    org.apache.velocity:velocity:jar:1.5:compile
[DEBUG]       commons-lang:commons-lang:jar:2.1:compile
[DEBUG]       oro:oro:jar:2.0.8:compile
[DEBUG]    commons-collections:commons-collections:jar:3.2.1:compile
[DEBUG] Created new class realm plugin>org.apache.maven.plugins:maven-checkstyle-plugin:3.0.0
[DEBUG] Importing foreign packages into class realm plugin>org.apache.maven.plugins:maven-checkstyle-plugin:3.0.0
[DEBUG]   Imported:  < maven.api
[DEBUG] Populating class realm plugin>org.apache.maven.plugins:maven-checkstyle-plugin:3.0.0
[DEBUG]   Included: org.apache.maven.plugins:maven-checkstyle-plugin:jar:3.0.0
[DEBUG]   Included: org.apache.maven.shared:maven-shared-resources:jar:2
[DEBUG]   Included: org.sonatype.aether:aether-util:jar:1.7
[DEBUG]   Included: org.sonatype.sisu:sisu-inject-bean:jar:1.4.2
[DEBUG]   Included: org.sonatype.sisu:sisu-guice:jar:noaop:2.1.7
[DEBUG]   Included: org.sonatype.plexus:plexus-sec-dispatcher:jar:1.3
[DEBUG]   Included: org.sonatype.plexus:plexus-cipher:jar:1.4
[DEBUG]   Included: org.apache.maven.reporting:maven-reporting-api:jar:3.0
[DEBUG]   Included: org.apache.maven.reporting:maven-reporting-impl:jar:2.3
[DEBUG]   Included: org.apache.maven.shared:maven-shared-utils:jar:0.6
[DEBUG]   Included: com.google.code.findbugs:jsr305:jar:2.0.1
[DEBUG]   Included: org.apache.maven.doxia:doxia-core:jar:1.2
[DEBUG]   Included: xerces:xercesImpl:jar:2.9.1
[DEBUG]   Included: xml-apis:xml-apis:jar:1.3.04
[DEBUG]   Included: org.apache.httpcomponents:httpclient:jar:4.0.2
[DEBUG]   Included: org.apache.httpcomponents:httpcore:jar:4.0.1
[DEBUG]   Included: commons-codec:commons-codec:jar:1.3
[DEBUG]   Included: commons-validator:commons-validator:jar:1.3.1
[DEBUG]   Included: commons-digester:commons-digester:jar:1.6
[DEBUG]   Included: commons-logging:commons-logging:jar:1.0.4
[DEBUG]   Included: org.apache.maven.doxia:doxia-sink-api:jar:1.4
[DEBUG]   Included: org.apache.maven.doxia:doxia-logging-api:jar:1.4
[DEBUG]   Included: org.apache.maven.doxia:doxia-decoration-model:jar:1.4
[DEBUG]   Included: org.apache.maven.doxia:doxia-site-renderer:jar:1.4
[DEBUG]   Included: org.apache.maven.doxia:doxia-module-xhtml:jar:1.4
[DEBUG]   Included: org.apache.maven.doxia:doxia-module-fml:jar:1.4
[DEBUG]   Included: org.codehaus.plexus:plexus-i18n:jar:1.0-beta-7
[DEBUG]   Included: org.apache.velocity:velocity-tools:jar:2.0
[DEBUG]   Included: commons-chain:commons-chain:jar:1.1
[DEBUG]   Included: dom4j:dom4j:jar:1.1
[DEBUG]   Included: sslext:sslext:jar:1.2-0
[DEBUG]   Included: org.apache.struts:struts-core:jar:1.3.8
[DEBUG]   Included: org.apache.struts:struts-taglib:jar:1.3.8
[DEBUG]   Included: org.apache.struts:struts-tiles:jar:1.3.8
[DEBUG]   Included: org.apache.maven.doxia:doxia-integration-tools:jar:1.6
[DEBUG]   Included: commons-io:commons-io:jar:1.4
[DEBUG]   Included: junit:junit:jar:3.8.1
[DEBUG]   Included: org.codehaus.plexus:plexus-component-annotations:jar:1.6
[DEBUG]   Included: org.codehaus.plexus:plexus-resources:jar:1.1.0
[DEBUG]   Included: org.codehaus.plexus:plexus-utils:jar:3.0.24
[DEBUG]   Included: org.codehaus.plexus:plexus-interpolation:jar:1.24
[DEBUG]   Included: org.codehaus.plexus:plexus-velocity:jar:1.1.8
[DEBUG]   Included: com.puppycrawl.tools:checkstyle:jar:6.18
[DEBUG]   Included: antlr:antlr:jar:2.7.7
[DEBUG]   Included: org.antlr:antlr4-runtime:jar:4.5.3
[DEBUG]   Included: commons-beanutils:commons-beanutils:jar:1.9.2
[DEBUG]   Included: commons-cli:commons-cli:jar:1.3.1
[DEBUG]   Included: com.google.guava:guava:jar:19.0
[DEBUG]   Included: org.apache.velocity:velocity:jar:1.5
[DEBUG]   Included: commons-lang:commons-lang:jar:2.1
[DEBUG]   Included: oro:oro:jar:2.0.8
[DEBUG]   Included: commons-collections:commons-collections:jar:3.2.1
[DEBUG] Configuring mojo org.apache.maven.plugins:maven-checkstyle-plugin:3.0.0:check from plugin realm ClassRealm[plugin>org.apache.maven.plugins:maven-checkstyle-plugin:3.0.0, parent: sun.misc.Launcher$AppClassLoader@4069b25f]
[DEBUG] Configuring mojo 'org.apache.maven.plugins:maven-checkstyle-plugin:3.0.0:check' with basic configurator -->
[DEBUG]   (f) cacheFile = /home/jenkins/jenkins-slave/workspace/n-box_maven-gpg-plugin_stabilize@2/linux-jdk7-m3.6.x_build/target/checkstyle-cachefile
[DEBUG]   (f) configLocation = config/maven_checks.xml
[DEBUG]   (f) consoleOutput = false
[DEBUG]   (f) encoding = UTF-8
[DEBUG]   (f) failOnViolation = true
[DEBUG]   (f) failsOnError = false
[DEBUG]   (f) headerLocation = config/maven-header.txt
[DEBUG]   (f) includeResources = true
[DEBUG]   (f) includeTestResources = true
[DEBUG]   (f) includeTestSourceDirectory = false
[DEBUG]   (f) includes = **\/*.java
[DEBUG]   (f) logViolationsToConsole = true
[DEBUG]   (f) maxAllowedViolations = 0
[DEBUG]   (f) omitIgnoredModules = false
[DEBUG]   (f) outputFile = /home/jenkins/jenkins-slave/workspace/n-box_maven-gpg-plugin_stabilize@2/linux-jdk7-m3.6.x_build/target/checkstyle-result.xml
[DEBUG]   (f) outputFileFormat = xml
[DEBUG]   (f) plugin = Component Descriptor: role: 'org.apache.maven.plugin.Mojo', implementation: 'org.apache.maven.plugins.checkstyle.CheckstyleViolationCheckMojo', role hint: 'org.apache.maven.plugins:maven-checkstyle-plugin:3.0.0:check'
role: 'org.apache.maven.plugin.Mojo', implementation: 'org.apache.maven.plugins.checkstyle.CheckstyleReport', role hint: 'org.apache.maven.plugins:maven-checkstyle-plugin:3.0.0:checkstyle'
role: 'org.apache.maven.plugin.Mojo', implementation: 'org.apache.maven.plugins.checkstyle.CheckstyleAggregateReport', role hint: 'org.apache.maven.plugins:maven-checkstyle-plugin:3.0.0:checkstyle-aggregate'
role: 'org.apache.maven.plugin.Mojo', implementation: 'org.apache.maven.plugins.checkstyle.HelpMojo', role hint: 'org.apache.maven.plugins:maven-checkstyle-plugin:3.0.0:help'
---
[DEBUG]   (f) project = MavenProject: org.apache.maven.plugins:maven-gpg-plugin:3.0.1-SNAPSHOT @ /home/jenkins/jenkins-slave/workspace/n-box_maven-gpg-plugin_stabilize@2/linux-jdk7-m3.6.x_build/dependency-reduced-pom.xml
[DEBUG]   (f) resourceIncludes = **/*.properties
[DEBUG]   (f) resources = [Resource {targetPath: null, filtering: false, FileSet {directory: /home/jenkins/jenkins-slave/workspace/n-box_maven-gpg-plugin_stabilize@2/linux-jdk7-m3.6.x_build/src/main/resources, PatternSet [includes: {}, excludes: {}]}}, Resource {targetPath: null, filtering: false, FileSet {directory: /home/jenkins/jenkins-slave/workspace/n-box_maven-gpg-plugin_stabilize@2/linux-jdk7-m3.6.x_build/target/maven-shared-archive-resources, PatternSet [includes: {}, excludes: {}]}}]
[DEBUG]   (f) rulesFiles = /home/jenkins/jenkins-slave/workspace/n-box_maven-gpg-plugin_stabilize@2/linux-jdk7-m3.6.x_build/target/checkstyle-rules.xml
[DEBUG]   (f) skip = false
[DEBUG]   (f) skipExec = false
[DEBUG]   (f) sourceDirectories = [src/main/java]
[DEBUG]   (f) suppressionsFileExpression = checkstyle.suppressions.file
[DEBUG]   (f) testResources = [Resource {targetPath: null, filtering: false, FileSet {directory: /home/jenkins/jenkins-slave/workspace/n-box_maven-gpg-plugin_stabilize@2/linux-jdk7-m3.6.x_build/src/test/resources, PatternSet [includes: {}, excludes: {}]}}, Resource {targetPath: null, filtering: false, FileSet {directory: /home/jenkins/jenkins-slave/workspace/n-box_maven-gpg-plugin_stabilize@2/linux-jdk7-m3.6.x_build/target/maven-shared-archive-resources, PatternSet [includes: {}, excludes: {}]}}]
[DEBUG]   (f) testSourceDirectories = [src/test/java]
[DEBUG]   (f) violationIgnore = RedundantThrows,NewlineAtEndOfFile,ParameterNumber,MethodLength,FileLength
[DEBUG]   (f) violationSeverity = error
[DEBUG] -- end configuration --
[DEBUG] executeCheckstyle start headerLocation : config/maven-header.txt
[DEBUG] Added 10 source files found in '/home/jenkins/jenkins-slave/workspace/n-box_maven-gpg-plugin_stabilize@2/linux-jdk7-m3.6.x_build/src/main/java'.
[DEBUG] Added 0 resource files found in '/home/jenkins/jenkins-slave/workspace/n-box_maven-gpg-plugin_stabilize@2/linux-jdk7-m3.6.x_build/src/main/resources'.
[DEBUG] Added 0 resource files found in '/home/jenkins/jenkins-slave/workspace/n-box_maven-gpg-plugin_stabilize@2/linux-jdk7-m3.6.x_build/target/maven-shared-archive-resources'.
[DEBUG] Added 0 resource files found in '/home/jenkins/jenkins-slave/workspace/n-box_maven-gpg-plugin_stabilize@2/linux-jdk7-m3.6.x_build/src/test/resources'.
[DEBUG] Added 0 resource files found in '/home/jenkins/jenkins-slave/workspace/n-box_maven-gpg-plugin_stabilize@2/linux-jdk7-m3.6.x_build/target/maven-shared-archive-resources'.
[DEBUG] Added 10 files to process.
[DEBUG] Adding the outputDirectory file:/home/jenkins/jenkins-slave/workspace/n-box_maven-gpg-plugin_stabilize@2/linux-jdk7-m3.6.x_build/target/classes/ to the Checkstyle class path
[DEBUG] request.getConfigLocation() config/maven_checks.xml
[DEBUG] The resource 'config/maven_checks.xml' was found as jar:file:/home/jenkins/jenkins-slave/workspace/.maven_repositories/1/org/apache/maven/shared/maven-shared-resources/2/maven-shared-resources-2.jar!/config/maven_checks.xml.
[DEBUG] headerLocation config/maven-header.txt
[DEBUG] The resource 'config/maven-header.txt' was found as jar:file:/home/jenkins/jenkins-slave/workspace/.maven_repositories/1/org/apache/maven/shared/maven-shared-resources/2/maven-shared-resources-2.jar!/config/maven-header.txt.
[DEBUG] Added '/home/jenkins/jenkins-slave/workspace/n-box_maven-gpg-plugin_stabilize@2/linux-jdk7-m3.6.x_build/src/main/resources' as a source directory.
[DEBUG] Added '/home/jenkins/jenkins-slave/workspace/n-box_maven-gpg-plugin_stabilize@2/linux-jdk7-m3.6.x_build/target/maven-shared-archive-resources' as a source directory.
[INFO] There is 1 error reported by Checkstyle 6.18 with config/maven_checks.xml ruleset.
[INFO] Ignored 1 error, 0 violation remaining.
[INFO]
[INFO] --- maven-invoker-plugin:3.2.1:verify (integration-test) @ maven-gpg-plugin ---
[DEBUG] Configuring mojo org.apache.maven.plugins:maven-invoker-plugin:3.2.1:verify from plugin realm ClassRealm[plugin>org.apache.maven.plugins:maven-invoker-plugin:3.2.1, parent: sun.misc.Launcher$AppClassLoader@4069b25f]
[DEBUG] Configuring mojo 'org.apache.maven.plugins:maven-invoker-plugin:3.2.1:verify' with basic configurator -->
[DEBUG]   (f) ignoreFailures = false
[DEBUG]   (f) reportsDirectory = /home/jenkins/jenkins-slave/workspace/n-box_maven-gpg-plugin_stabilize@2/linux-jdk7-m3.6.x_build/target/invoker-reports
[DEBUG]   (f) skipInvocation = false
[DEBUG]   (f) suppressSummaries = false
[DEBUG] -- end configuration --
[INFO] -------------------------------------------------
[INFO] Build Summary:
[INFO]   Passed: 8, Failed: 0, Errors: 0, Skipped: 0
[INFO] -------------------------------------------------
[INFO] ------------------------------------------------------------------------
[INFO] BUILD SUCCESS
[INFO] ------------------------------------------------------------------------
[INFO] Total time:  01:27 min
[INFO] Finished at: 2020-06-12T11:01:32Z
[INFO] ------------------------------------------------------------------------
[INFO] [jenkins-event-spy] Generated /home/jenkins/jenkins-slave/workspace/n-box_maven-gpg-plugin_stabilize@2@tmp/withMavena9df5a69/maven-spy-20200612-110003-6983195313813942971783.log
[Pipeline] }
[Pipeline] // dir
[Pipeline] }
[withMaven] artifactsPublisher - Archive artifact linux-jdk7-m3.6.x_build/pom.xml under org/apache/maven/plugins/maven-gpg-plugin/3.0.1-SNAPSHOT/maven-gpg-plugin-3.0.1-SNAPSHOT.pom
[withMaven] artifactsPublisher - Archive artifact linux-jdk7-m3.6.x_build/target/maven-gpg-plugin-3.0.1-SNAPSHOT.jar under org/apache/maven/plugins/maven-gpg-plugin/3.0.1-SNAPSHOT/maven-gpg-plugin-3.0.1-SNAPSHOT.jar
[Fast Archiver] No prior successful build to compare, so performing full copy of artifacts
[withMaven] junitPublisher - Archive test results for Maven artifact org.apache.maven.plugins:maven-gpg-plugin:maven-plugin:3.0.1-SNAPSHOT generated by maven-surefire-plugin:test (default-test): linux-jdk7-m3.6.x_build/target/surefire-reports/*.xml
Recording test results
[withMaven] Publishers: Generated Artifacts Publisher: 2742 ms, Junit Publisher: 1164 ms, Open Task Scanner Publisher: 521 ms, Invoker Publisher: 9861 ms, Pipeline Graph Publisher: 1 ms
[withMaven] openTasksPublisher - Scan Tasks for Maven artifact org.apache.maven.plugins:maven-gpg-plugin:maven-plugin:3.0.1-SNAPSHOT in source directory linux-jdk7-m3.6.x_build/src/main/java
[Pipeline] // withMaven
[TASKS] Scanning folder '/home/jenkins/jenkins-slave/workspace/n-box_maven-gpg-plugin_stabilize@2' for files matching the pattern 'linux-jdk7-m3.6.x_build/src/main/java/**/*' - excludes: null
[TASKS] Found 10 files to scan for tasks
[TASKS] Found 1 open tasks.
Skipping warnings blame since pipelines do not have an SCM link.%n
[Pipeline] cleanWs
[WS-CLEANUP] Deleting project workspace...
[WS-CLEANUP] Deferred wipeout is used...
[withMaven] invokerPublisher - Archive invoker results for Maven artifact MavenArtifact{org.apache.maven.plugins:maven-gpg-plugin:maven-plugin:3.0.1-SNAPSHOT(version: 3.0.1-SNAPSHOT, snapshot:false) } generated by PluginInvocation{org.apache.maven.plugins:maven-invoker-plugin:3.2.1@integration-test  integration-test}: linux-jdk7-m3.6.x_build/target/invoker-reports/*.xml
[WS-CLEANUP] done
[Pipeline] }
[Pipeline] // stage
[Pipeline] }
[Pipeline] // ws
[Pipeline] }
[Pipeline] // node
[Pipeline] }
[withMaven] Publishers: Generated Artifacts Publisher: 956 ms, Junit Publisher: 1127 ms, Open Task Scanner Publisher: 522 ms, Invoker Publisher: 7151 ms, Pipeline Graph Publisher: 1 ms
[Pipeline] // withMaven
[Pipeline] cleanWs
[WS-CLEANUP] Deleting project workspace...
[WS-CLEANUP] Deferred wipeout is used...
[WS-CLEANUP] done
[Pipeline] }
[Pipeline] // stage
[Pipeline] }
[Pipeline] // ws
[Pipeline] }
[Pipeline] // node
[Pipeline] }
[Pipeline] // parallel
[Pipeline] stage
[Pipeline] { (Notifications)
[Pipeline] echo
Build result: FAILURE
[Pipeline] jiraIssueSelector
[Pipeline] echo
The authors of changes [rfscholte].
[Pipeline] echo
Sending email ...
[Pipeline] emailext
Reply | Threaded
Open this post in threaded view
|

Build failed in Jenkins: Maven TLP » maven-gpg-plugin » stabilize #3

Apache Jenkins Server-2
See https://builds.apache.org/job/maven-box/job/maven-gpg-plugin/job/stabilize/3/

Changes:

* Check if the deleteOnExit is causing an issue, or some temp policy

All tests passed

Build log:
[...truncated 43690 lines...]
[DEBUG]          dom4j:dom4j:jar:1.1:compile
[DEBUG]          sslext:sslext:jar:1.2-0:compile
[DEBUG]          org.apache.struts:struts-core:jar:1.3.8:compile
[DEBUG]          org.apache.struts:struts-taglib:jar:1.3.8:compile
[DEBUG]          org.apache.struts:struts-tiles:jar:1.3.8:compile
[DEBUG]    org.apache.maven.doxia:doxia-integration-tools:jar:1.6:compile
[DEBUG]       commons-io:commons-io:jar:1.4:compile
[DEBUG]       org.codehaus.plexus:plexus-container-default:jar:1.0-alpha-9:compile
[DEBUG]          junit:junit:jar:3.8.1:compile
[DEBUG]          classworlds:classworlds:jar:1.1-alpha-2:compile
[DEBUG]    org.codehaus.plexus:plexus-component-annotations:jar:1.6:compile
[DEBUG]    org.codehaus.plexus:plexus-resources:jar:1.1.0:compile
[DEBUG]    org.codehaus.plexus:plexus-utils:jar:3.0.24:compile
[DEBUG]    org.codehaus.plexus:plexus-interpolation:jar:1.24:compile
[DEBUG]    org.codehaus.plexus:plexus-velocity:jar:1.1.8:compile
[DEBUG]    com.puppycrawl.tools:checkstyle:jar:6.18:compile
[DEBUG]       antlr:antlr:jar:2.7.7:compile
[DEBUG]       org.antlr:antlr4-runtime:jar:4.5.3:compile
[DEBUG]       commons-beanutils:commons-beanutils:jar:1.9.2:compile
[DEBUG]       commons-cli:commons-cli:jar:1.3.1:compile
[DEBUG]       com.google.guava:guava:jar:19.0:compile
[DEBUG]    org.apache.velocity:velocity:jar:1.5:compile
[DEBUG]       commons-lang:commons-lang:jar:2.1:compile
[DEBUG]       oro:oro:jar:2.0.8:compile
[DEBUG]    commons-collections:commons-collections:jar:3.2.1:compile
[DEBUG] Created new class realm plugin>org.apache.maven.plugins:maven-checkstyle-plugin:3.0.0
[DEBUG] Importing foreign packages into class realm plugin>org.apache.maven.plugins:maven-checkstyle-plugin:3.0.0
[DEBUG]   Imported:  < maven.api
[DEBUG] Populating class realm plugin>org.apache.maven.plugins:maven-checkstyle-plugin:3.0.0
[DEBUG]   Included: org.apache.maven.plugins:maven-checkstyle-plugin:jar:3.0.0
[DEBUG]   Included: org.apache.maven.shared:maven-shared-resources:jar:2
[DEBUG]   Included: org.sonatype.aether:aether-util:jar:1.7
[DEBUG]   Included: org.sonatype.sisu:sisu-inject-bean:jar:1.4.2
[DEBUG]   Included: org.sonatype.sisu:sisu-guice:jar:noaop:2.1.7
[DEBUG]   Included: org.sonatype.plexus:plexus-sec-dispatcher:jar:1.3
[DEBUG]   Included: org.sonatype.plexus:plexus-cipher:jar:1.4
[DEBUG]   Included: org.apache.maven.reporting:maven-reporting-api:jar:3.0
[DEBUG]   Included: org.apache.maven.reporting:maven-reporting-impl:jar:2.3
[DEBUG]   Included: org.apache.maven.shared:maven-shared-utils:jar:0.6
[DEBUG]   Included: com.google.code.findbugs:jsr305:jar:2.0.1
[DEBUG]   Included: org.apache.maven.doxia:doxia-core:jar:1.2
[DEBUG]   Included: xerces:xercesImpl:jar:2.9.1
[DEBUG]   Included: xml-apis:xml-apis:jar:1.3.04
[DEBUG]   Included: org.apache.httpcomponents:httpclient:jar:4.0.2
[DEBUG]   Included: org.apache.httpcomponents:httpcore:jar:4.0.1
[DEBUG]   Included: commons-codec:commons-codec:jar:1.3
[DEBUG]   Included: commons-validator:commons-validator:jar:1.3.1
[DEBUG]   Included: commons-digester:commons-digester:jar:1.6
[DEBUG]   Included: commons-logging:commons-logging:jar:1.0.4
[DEBUG]   Included: org.apache.maven.doxia:doxia-sink-api:jar:1.4
[DEBUG]   Included: org.apache.maven.doxia:doxia-logging-api:jar:1.4
[DEBUG]   Included: org.apache.maven.doxia:doxia-decoration-model:jar:1.4
[DEBUG]   Included: org.apache.maven.doxia:doxia-site-renderer:jar:1.4
[DEBUG]   Included: org.apache.maven.doxia:doxia-module-xhtml:jar:1.4
[DEBUG]   Included: org.apache.maven.doxia:doxia-module-fml:jar:1.4
[DEBUG]   Included: org.codehaus.plexus:plexus-i18n:jar:1.0-beta-7
[DEBUG]   Included: org.apache.velocity:velocity-tools:jar:2.0
[DEBUG]   Included: commons-chain:commons-chain:jar:1.1
[DEBUG]   Included: dom4j:dom4j:jar:1.1
[DEBUG]   Included: sslext:sslext:jar:1.2-0
[DEBUG]   Included: org.apache.struts:struts-core:jar:1.3.8
[DEBUG]   Included: org.apache.struts:struts-taglib:jar:1.3.8
[DEBUG]   Included: org.apache.struts:struts-tiles:jar:1.3.8
[DEBUG]   Included: org.apache.maven.doxia:doxia-integration-tools:jar:1.6
[DEBUG]   Included: commons-io:commons-io:jar:1.4
[DEBUG]   Included: junit:junit:jar:3.8.1
[DEBUG]   Included: org.codehaus.plexus:plexus-component-annotations:jar:1.6
[DEBUG]   Included: org.codehaus.plexus:plexus-resources:jar:1.1.0
[DEBUG]   Included: org.codehaus.plexus:plexus-utils:jar:3.0.24
[DEBUG]   Included: org.codehaus.plexus:plexus-interpolation:jar:1.24
[DEBUG]   Included: org.codehaus.plexus:plexus-velocity:jar:1.1.8
[DEBUG]   Included: com.puppycrawl.tools:checkstyle:jar:6.18
[DEBUG]   Included: antlr:antlr:jar:2.7.7
[DEBUG]   Included: org.antlr:antlr4-runtime:jar:4.5.3
[DEBUG]   Included: commons-beanutils:commons-beanutils:jar:1.9.2
[DEBUG]   Included: commons-cli:commons-cli:jar:1.3.1
[DEBUG]   Included: com.google.guava:guava:jar:19.0
[DEBUG]   Included: org.apache.velocity:velocity:jar:1.5
[DEBUG]   Included: commons-lang:commons-lang:jar:2.1
[DEBUG]   Included: oro:oro:jar:2.0.8
[DEBUG]   Included: commons-collections:commons-collections:jar:3.2.1
[DEBUG] Configuring mojo org.apache.maven.plugins:maven-checkstyle-plugin:3.0.0:check from plugin realm ClassRealm[plugin>org.apache.maven.plugins:maven-checkstyle-plugin:3.0.0, parent: sun.misc.Launcher$AppClassLoader@4069b25f]
[DEBUG] Configuring mojo 'org.apache.maven.plugins:maven-checkstyle-plugin:3.0.0:check' with basic configurator -->
[DEBUG]   (f) cacheFile = /home/jenkins/jenkins-slave/workspace/n-box_maven-gpg-plugin_stabilize@2/linux-jdk7-m3.5.x_build/target/checkstyle-cachefile
[DEBUG]   (f) configLocation = config/maven_checks.xml
[DEBUG]   (f) consoleOutput = false
[DEBUG]   (f) encoding = UTF-8
[DEBUG]   (f) failOnViolation = true
[DEBUG]   (f) failsOnError = false
[DEBUG]   (f) headerLocation = config/maven-header.txt
[DEBUG]   (f) includeResources = true
[DEBUG]   (f) includeTestResources = true
[DEBUG]   (f) includeTestSourceDirectory = false
[DEBUG]   (f) includes = **\/*.java
[DEBUG]   (f) logViolationsToConsole = true
[DEBUG]   (f) maxAllowedViolations = 0
[DEBUG]   (f) omitIgnoredModules = false
[DEBUG]   (f) outputFile = /home/jenkins/jenkins-slave/workspace/n-box_maven-gpg-plugin_stabilize@2/linux-jdk7-m3.5.x_build/target/checkstyle-result.xml
[DEBUG]   (f) outputFileFormat = xml
[DEBUG]   (f) plugin = Component Descriptor: role: 'org.apache.maven.plugin.Mojo', implementation: 'org.apache.maven.plugins.checkstyle.CheckstyleViolationCheckMojo', role hint: 'org.apache.maven.plugins:maven-checkstyle-plugin:3.0.0:check'
role: 'org.apache.maven.plugin.Mojo', implementation: 'org.apache.maven.plugins.checkstyle.CheckstyleReport', role hint: 'org.apache.maven.plugins:maven-checkstyle-plugin:3.0.0:checkstyle'
role: 'org.apache.maven.plugin.Mojo', implementation: 'org.apache.maven.plugins.checkstyle.CheckstyleAggregateReport', role hint: 'org.apache.maven.plugins:maven-checkstyle-plugin:3.0.0:checkstyle-aggregate'
role: 'org.apache.maven.plugin.Mojo', implementation: 'org.apache.maven.plugins.checkstyle.HelpMojo', role hint: 'org.apache.maven.plugins:maven-checkstyle-plugin:3.0.0:help'
---
[DEBUG]   (f) project = MavenProject: org.apache.maven.plugins:maven-gpg-plugin:3.0.1-SNAPSHOT @ /home/jenkins/jenkins-slave/workspace/n-box_maven-gpg-plugin_stabilize@2/linux-jdk7-m3.5.x_build/dependency-reduced-pom.xml
[DEBUG]   (f) resourceIncludes = **/*.properties
[DEBUG]   (f) resources = [Resource {targetPath: null, filtering: false, FileSet {directory: /home/jenkins/jenkins-slave/workspace/n-box_maven-gpg-plugin_stabilize@2/linux-jdk7-m3.5.x_build/src/main/resources, PatternSet [includes: {}, excludes: {}]}}, Resource {targetPath: null, filtering: false, FileSet {directory: /home/jenkins/jenkins-slave/workspace/n-box_maven-gpg-plugin_stabilize@2/linux-jdk7-m3.5.x_build/target/maven-shared-archive-resources, PatternSet [includes: {}, excludes: {}]}}]
[DEBUG]   (f) rulesFiles = /home/jenkins/jenkins-slave/workspace/n-box_maven-gpg-plugin_stabilize@2/linux-jdk7-m3.5.x_build/target/checkstyle-rules.xml
[DEBUG]   (f) skip = false
[DEBUG]   (f) skipExec = false
[DEBUG]   (f) sourceDirectories = [src/main/java]
[DEBUG]   (f) suppressionsFileExpression = checkstyle.suppressions.file
[DEBUG]   (f) testResources = [Resource {targetPath: null, filtering: false, FileSet {directory: /home/jenkins/jenkins-slave/workspace/n-box_maven-gpg-plugin_stabilize@2/linux-jdk7-m3.5.x_build/src/test/resources, PatternSet [includes: {}, excludes: {}]}}, Resource {targetPath: null, filtering: false, FileSet {directory: /home/jenkins/jenkins-slave/workspace/n-box_maven-gpg-plugin_stabilize@2/linux-jdk7-m3.5.x_build/target/maven-shared-archive-resources, PatternSet [includes: {}, excludes: {}]}}]
[DEBUG]   (f) testSourceDirectories = [src/test/java]
[DEBUG]   (f) violationIgnore = RedundantThrows,NewlineAtEndOfFile,ParameterNumber,MethodLength,FileLength
[DEBUG]   (f) violationSeverity = error
[DEBUG] -- end configuration --
[DEBUG] executeCheckstyle start headerLocation : config/maven-header.txt
[DEBUG] Added 10 source files found in '/home/jenkins/jenkins-slave/workspace/n-box_maven-gpg-plugin_stabilize@2/linux-jdk7-m3.5.x_build/src/main/java'.
[DEBUG] Added 0 resource files found in '/home/jenkins/jenkins-slave/workspace/n-box_maven-gpg-plugin_stabilize@2/linux-jdk7-m3.5.x_build/src/main/resources'.
[DEBUG] Added 0 resource files found in '/home/jenkins/jenkins-slave/workspace/n-box_maven-gpg-plugin_stabilize@2/linux-jdk7-m3.5.x_build/target/maven-shared-archive-resources'.
[DEBUG] Added 0 resource files found in '/home/jenkins/jenkins-slave/workspace/n-box_maven-gpg-plugin_stabilize@2/linux-jdk7-m3.5.x_build/src/test/resources'.
[DEBUG] Added 0 resource files found in '/home/jenkins/jenkins-slave/workspace/n-box_maven-gpg-plugin_stabilize@2/linux-jdk7-m3.5.x_build/target/maven-shared-archive-resources'.
[DEBUG] Added 10 files to process.
[DEBUG] Adding the outputDirectory file:/home/jenkins/jenkins-slave/workspace/n-box_maven-gpg-plugin_stabilize@2/linux-jdk7-m3.5.x_build/target/classes/ to the Checkstyle class path
[DEBUG] request.getConfigLocation() config/maven_checks.xml
[DEBUG] The resource 'config/maven_checks.xml' was not found with resourceLoader org.codehaus.plexus.resource.loader.FileResourceLoader.
[DEBUG] The resource 'config/maven_checks.xml' was not found with resourceLoader org.codehaus.plexus.resource.loader.JarResourceLoader.
[DEBUG] URLResourceLoader: No valid URL 'config/maven_checks.xml'
[DEBUG] URLResourceLoader: No valid URL 'config/maven_checks.xml'
[DEBUG] The resource 'config/maven_checks.xml' was not found with resourceLoader org.codehaus.plexus.resource.loader.URLResourceLoader.
[DEBUG] The resource 'config/maven_checks.xml' was found as jar:file:/home/jenkins/jenkins-slave/workspace/.maven_repositories/0/org/apache/maven/shared/maven-shared-resources/2/maven-shared-resources-2.jar!/config/maven_checks.xml.
[DEBUG] headerLocation config/maven-header.txt
[DEBUG] The resource 'config/maven-header.txt' was not found with resourceLoader org.codehaus.plexus.resource.loader.FileResourceLoader.
[DEBUG] JarResourceLoader : trying to load "jar:file:/home/jenkins/jenkins-slave/workspace/.maven_repositories/0/org/apache/maven/shared/maven-shared-resources/2/maven-shared-resources-2.jar"
[DEBUG] The resource 'config/maven-header.txt' was found as jar:file:/home/jenkins/jenkins-slave/workspace/.maven_repositories/0/org/apache/maven/shared/maven-shared-resources/2/maven-shared-resources-2.jar!/config/maven-header.txt.
[DEBUG] Added '/home/jenkins/jenkins-slave/workspace/n-box_maven-gpg-plugin_stabilize@3@2/linux-jdk7-m3.6.x_build/src/main/resources' as a source directory.
[DEBUG] Added '/home/jenkins/jenkins-slave/workspace/n-box_maven-gpg-plugin_stabilize@3@2/linux-jdk7-m3.6.x_build/target/maven-shared-archive-resources' as a source directory.
[DEBUG] Added '/home/jenkins/jenkins-slave/workspace/n-box_maven-gpg-plugin_stabilize@2/linux-jdk7-m3.5.x_build/src/main/resources' as a source directory.
[DEBUG] Added '/home/jenkins/jenkins-slave/workspace/n-box_maven-gpg-plugin_stabilize@2/linux-jdk7-m3.5.x_build/target/maven-shared-archive-resources' as a source directory.
[INFO] There is 1 error reported by Checkstyle 6.18 with config/maven_checks.xml ruleset.
[INFO] Ignored 1 error, 0 violation remaining.
[INFO]
[INFO] --- maven-invoker-plugin:3.2.1:verify (integration-test) @ maven-gpg-plugin ---
[DEBUG] Configuring mojo org.apache.maven.plugins:maven-invoker-plugin:3.2.1:verify from plugin realm ClassRealm[plugin>org.apache.maven.plugins:maven-invoker-plugin:3.2.1, parent: sun.misc.Launcher$AppClassLoader@29cd761a]
[DEBUG] Configuring mojo 'org.apache.maven.plugins:maven-invoker-plugin:3.2.1:verify' with basic configurator -->
[DEBUG]   (f) ignoreFailures = false
[DEBUG]   (f) reportsDirectory = /home/jenkins/jenkins-slave/workspace/n-box_maven-gpg-plugin_stabilize@3@2/linux-jdk7-m3.6.x_build/target/invoker-reports
[DEBUG]   (f) skipInvocation = false
[DEBUG]   (f) suppressSummaries = false
[DEBUG] -- end configuration --
[INFO] -------------------------------------------------
[INFO] Build Summary:
[INFO]   Passed: 8, Failed: 0, Errors: 0, Skipped: 0
[INFO] -------------------------------------------------
[INFO] ------------------------------------------------------------------------
[INFO] BUILD SUCCESS
[INFO] ------------------------------------------------------------------------
[INFO] Total time:  01:24 min
[INFO] Finished at: 2020-06-12T11:31:26Z
[INFO] ------------------------------------------------------------------------
[INFO] [jenkins-event-spy] Generated /home/jenkins/jenkins-slave/workspace/n-box_maven-gpg-plugin_stabilize@3@2@tmp/withMaven00b8a010/maven-spy-20200612-113001-503819778696445344093.log
[Pipeline] }
[Pipeline] // dir
[Pipeline] }
[INFO] There is 1 error reported by Checkstyle 6.18 with config/maven_checks.xml ruleset.
[INFO] Ignored 1 error, 0 violation remaining.
[INFO]
[INFO] --- maven-invoker-plugin:3.2.1:verify (integration-test) @ maven-gpg-plugin ---
[DEBUG] Configuring mojo org.apache.maven.plugins:maven-invoker-plugin:3.2.1:verify from plugin realm ClassRealm[plugin>org.apache.maven.plugins:maven-invoker-plugin:3.2.1, parent: sun.misc.Launcher$AppClassLoader@4069b25f]
[DEBUG] Configuring mojo 'org.apache.maven.plugins:maven-invoker-plugin:3.2.1:verify' with basic configurator -->
[DEBUG]   (f) ignoreFailures = false
[DEBUG]   (f) reportsDirectory = /home/jenkins/jenkins-slave/workspace/n-box_maven-gpg-plugin_stabilize@2/linux-jdk7-m3.5.x_build/target/invoker-reports
[DEBUG]   (f) skipInvocation = false
[DEBUG]   (f) suppressSummaries = false
[DEBUG] -- end configuration --
[INFO] -------------------------------------------------
[INFO] Build Summary:
[INFO]   Passed: 8, Failed: 0, Errors: 0, Skipped: 0
[INFO] -------------------------------------------------
[INFO] ------------------------------------------------------------------------
[INFO] BUILD SUCCESS
[INFO] ------------------------------------------------------------------------
[INFO] Total time: 01:26 min
[INFO] Finished at: 2020-06-12T11:31:26Z
[INFO] ------------------------------------------------------------------------
[INFO] [jenkins-event-spy] Generated /home/jenkins/jenkins-slave/workspace/n-box_maven-gpg-plugin_stabilize@2@tmp/withMavenf9f52e87/maven-spy-20200612-113000-608862289505458300892.log
[withMaven] artifactsPublisher - Archive artifact linux-jdk7-m3.6.x_build/pom.xml under org/apache/maven/plugins/maven-gpg-plugin/3.0.1-SNAPSHOT/maven-gpg-plugin-3.0.1-SNAPSHOT.pom
[Pipeline] }
[Pipeline] // dir
[Pipeline] }
[withMaven] artifactsPublisher - Archive artifact linux-jdk7-m3.6.x_build/target/maven-gpg-plugin-3.0.1-SNAPSHOT.jar under org/apache/maven/plugins/maven-gpg-plugin/3.0.1-SNAPSHOT/maven-gpg-plugin-3.0.1-SNAPSHOT.jar
[Fast Archiver] No prior successful build to compare, so performing full copy of artifacts
[withMaven] junitPublisher - Archive test results for Maven artifact org.apache.maven.plugins:maven-gpg-plugin:maven-plugin:3.0.1-SNAPSHOT generated by maven-surefire-plugin:test (default-test): linux-jdk7-m3.6.x_build/target/surefire-reports/*.xml
Recording test results
[withMaven] artifactsPublisher - Archive artifact linux-jdk7-m3.5.x_build/pom.xml under org/apache/maven/plugins/maven-gpg-plugin/3.0.1-SNAPSHOT/maven-gpg-plugin-3.0.1-SNAPSHOT.pom
[withMaven] artifactsPublisher - Archive artifact linux-jdk7-m3.5.x_build/target/maven-gpg-plugin-3.0.1-SNAPSHOT.jar under org/apache/maven/plugins/maven-gpg-plugin/3.0.1-SNAPSHOT/maven-gpg-plugin-3.0.1-SNAPSHOT.jar
[Fast Archiver] No prior successful build to compare, so performing full copy of artifacts
[withMaven] junitPublisher - Archive test results for Maven artifact org.apache.maven.plugins:maven-gpg-plugin:maven-plugin:3.0.1-SNAPSHOT generated by maven-surefire-plugin:test (default-test): linux-jdk7-m3.5.x_build/target/surefire-reports/*.xml
Recording test results
[withMaven] openTasksPublisher - Scan Tasks for Maven artifact org.apache.maven.plugins:maven-gpg-plugin:maven-plugin:3.0.1-SNAPSHOT in source directory linux-jdk7-m3.6.x_build/src/main/java
[TASKS] Scanning folder '/home/jenkins/jenkins-slave/workspace/n-box_maven-gpg-plugin_stabilize@3@2' for files matching the pattern 'linux-jdk7-m3.6.x_build/src/main/java/**/*' - excludes: null
[TASKS] Found 10 files to scan for tasks
[TASKS] Found 1 open tasks.
Skipping warnings blame since pipelines do not have an SCM link.%n
[withMaven] invokerPublisher - Archive invoker results for Maven artifact MavenArtifact{org.apache.maven.plugins:maven-gpg-plugin:maven-plugin:3.0.1-SNAPSHOT(version: 3.0.1-SNAPSHOT, snapshot:false) } generated by PluginInvocation{org.apache.maven.plugins:maven-invoker-plugin:3.2.1@integration-test  integration-test}: linux-jdk7-m3.6.x_build/target/invoker-reports/*.xml
[withMaven] openTasksPublisher - Scan Tasks for Maven artifact org.apache.maven.plugins:maven-gpg-plugin:maven-plugin:3.0.1-SNAPSHOT in source directory linux-jdk7-m3.5.x_build/src/main/java
[TASKS] Scanning folder '/home/jenkins/jenkins-slave/workspace/n-box_maven-gpg-plugin_stabilize@2' for files matching the pattern 'linux-jdk7-m3.5.x_build/src/main/java/**/*' - excludes: null
[TASKS] Found 10 files to scan for tasks
[TASKS] Found 1 open tasks.
Skipping warnings blame since pipelines do not have an SCM link.%n
[withMaven] invokerPublisher - Archive invoker results for Maven artifact MavenArtifact{org.apache.maven.plugins:maven-gpg-plugin:maven-plugin:3.0.1-SNAPSHOT(version: 3.0.1-SNAPSHOT, snapshot:false) } generated by PluginInvocation{org.apache.maven.plugins:maven-invoker-plugin:3.2.1@integration-test  integration-test}: linux-jdk7-m3.5.x_build/target/invoker-reports/*.xml
[withMaven] Publishers: Generated Artifacts Publisher: 975 ms, Junit Publisher: 1119 ms, Open Task Scanner Publisher: 514 ms, Invoker Publisher: 9236 ms, Pipeline Graph Publisher: 2 ms
[Pipeline] // withMaven
[Pipeline] cleanWs
[WS-CLEANUP] Deleting project workspace...
[WS-CLEANUP] Deferred wipeout is used...
[WS-CLEANUP] done
[Pipeline] }
[Pipeline] // stage
[Pipeline] }
[Pipeline] // ws
[Pipeline] }
[Pipeline] // node
[Pipeline] }
[withMaven] Publishers: Generated Artifacts Publisher: 1015 ms, Junit Publisher: 1190 ms, Open Task Scanner Publisher: 510 ms, Invoker Publisher: 9510 ms, Pipeline Graph Publisher: 1 ms
[Pipeline] // withMaven
[Pipeline] cleanWs
[WS-CLEANUP] Deleting project workspace...
[WS-CLEANUP] Deferred wipeout is used...
[WS-CLEANUP] done
[Pipeline] }
[Pipeline] // stage
[Pipeline] }
[Pipeline] // ws
[Pipeline] }
[Pipeline] // node
[Pipeline] }
[Pipeline] // parallel
[Pipeline] stage
[Pipeline] { (Notifications)
[Pipeline] echo
Build result: FAILURE
[Pipeline] jiraIssueSelector
[Pipeline] echo
The authors of changes [rfscholte].
[Pipeline] echo
Sending email ...
[Pipeline] emailext
Reply | Threaded
Open this post in threaded view
|

Build failed in Jenkins: Maven TLP » maven-gpg-plugin » stabilize #4

Apache Jenkins Server-2
See https://builds.apache.org/job/maven-box/job/maven-gpg-plugin/job/stabilize/4/

Changes:

* try with canonicalFile

All tests passed

Build log:
[...truncated 43666 lines...]
[WS-CLEANUP] Deferred wipeout is used...
[WS-CLEANUP] done
[Pipeline] }
[Pipeline] // stage
[Pipeline] }
[Pipeline] // ws
[Pipeline] }
[Pipeline] // node
[Pipeline] }
[INFO] run post-build script verify.bsh
[DEBUG] Running script with BeanShellScriptInterpreter: /home/jenkins/jenkins-slave/workspace/n-box_maven-gpg-plugin_stabilize@3/linux-jdk7-m3.6.x_build/target/it/sign-release/verify.bsh
[INFO]           sign-release/pom.xml ............................. SUCCESS (7.9 s)
[INFO]
[INFO] --- maven-checkstyle-plugin:3.0.0:check (checkstyle-check) @ maven-gpg-plugin ---
[DEBUG] Dependency collection stats: {ConflictMarker.analyzeTime=1531904, ConflictMarker.markTime=1438902, ConflictMarker.nodeCount=274, ConflictIdSorter.graphTime=1075805, ConflictIdSorter.topsortTime=203825, ConflictIdSorter.conflictIdCount=72, ConflictIdSorter.conflictIdCycleCount=0, ConflictResolver.totalTime=13329305, ConflictResolver.conflictItemCount=177, DefaultDependencyCollector.collectTime=95201509, DefaultDependencyCollector.transformTime=17729671}
[DEBUG] org.apache.maven.plugins:maven-checkstyle-plugin:jar:3.0.0
[DEBUG]    org.apache.maven.shared:maven-shared-resources:jar:2:runtime
[DEBUG]    org.apache.maven:maven-artifact:jar:3.0:compile
[DEBUG]    org.apache.maven:maven-core:jar:3.0:compile
[DEBUG]       org.apache.maven:maven-settings:jar:3.0:compile
[DEBUG]       org.apache.maven:maven-settings-builder:jar:3.0:compile
[DEBUG]       org.apache.maven:maven-repository-metadata:jar:3.0:compile
[DEBUG]       org.apache.maven:maven-model-builder:jar:3.0:compile
[DEBUG]       org.apache.maven:maven-aether-provider:jar:3.0:runtime
[DEBUG]       org.sonatype.aether:aether-impl:jar:1.7:compile
[DEBUG]          org.sonatype.aether:aether-spi:jar:1.7:compile
[DEBUG]       org.sonatype.aether:aether-api:jar:1.7:compile
[DEBUG]       org.sonatype.aether:aether-util:jar:1.7:compile
[DEBUG]       org.sonatype.sisu:sisu-inject-plexus:jar:1.4.2:compile
[DEBUG]          org.sonatype.sisu:sisu-inject-bean:jar:1.4.2:compile
[DEBUG]             org.sonatype.sisu:sisu-guice:jar:noaop:2.1.7:compile
[DEBUG]       org.codehaus.plexus:plexus-classworlds:jar:2.2.3:compile
[DEBUG]       org.sonatype.plexus:plexus-sec-dispatcher:jar:1.3:compile
[DEBUG]          org.sonatype.plexus:plexus-cipher:jar:1.4:compile
[DEBUG]    org.apache.maven:maven-model:jar:3.0:compile
[DEBUG]    org.apache.maven:maven-plugin-api:jar:3.0:compile
[DEBUG]    org.apache.maven.reporting:maven-reporting-api:jar:3.0:compile
[DEBUG]    org.apache.maven.reporting:maven-reporting-impl:jar:2.3:compile
[DEBUG]       org.apache.maven.shared:maven-shared-utils:jar:0.6:compile
[DEBUG]          com.google.code.findbugs:jsr305:jar:2.0.1:compile
[DEBUG]       org.apache.maven.doxia:doxia-core:jar:1.2:compile
[DEBUG]          xerces:xercesImpl:jar:2.9.1:compile
[DEBUG]             xml-apis:xml-apis:jar:1.3.04:compile
[DEBUG]          org.apache.httpcomponents:httpclient:jar:4.0.2:compile
[DEBUG]             org.apache.httpcomponents:httpcore:jar:4.0.1:compile
[DEBUG]             commons-codec:commons-codec:jar:1.3:compile
[DEBUG]       commons-validator:commons-validator:jar:1.3.1:compile
[DEBUG]          commons-digester:commons-digester:jar:1.6:compile
[DEBUG]          commons-logging:commons-logging:jar:1.0.4:compile
[DEBUG]    org.apache.maven.doxia:doxia-sink-api:jar:1.4:compile
[DEBUG]       org.apache.maven.doxia:doxia-logging-api:jar:1.4:compile
[DEBUG]    org.apache.maven.doxia:doxia-decoration-model:jar:1.4:compile
[DEBUG]    org.apache.maven.doxia:doxia-site-renderer:jar:1.4:compile
[DEBUG]       org.apache.maven.doxia:doxia-module-xhtml:jar:1.4:compile
[DEBUG]       org.apache.maven.doxia:doxia-module-fml:jar:1.4:compile
[DEBUG]       org.codehaus.plexus:plexus-i18n:jar:1.0-beta-7:compile
[DEBUG]       org.apache.velocity:velocity-tools:jar:2.0:compile
[DEBUG]          commons-chain:commons-chain:jar:1.1:compile
[DEBUG]          dom4j:dom4j:jar:1.1:compile
[DEBUG]          sslext:sslext:jar:1.2-0:compile
[DEBUG]          org.apache.struts:struts-core:jar:1.3.8:compile
[DEBUG]          org.apache.struts:struts-taglib:jar:1.3.8:compile
[DEBUG]          org.apache.struts:struts-tiles:jar:1.3.8:compile
[DEBUG]    org.apache.maven.doxia:doxia-integration-tools:jar:1.6:compile
[DEBUG]       commons-io:commons-io:jar:1.4:compile
[DEBUG]       org.codehaus.plexus:plexus-container-default:jar:1.0-alpha-9:compile
[DEBUG]          junit:junit:jar:3.8.1:compile
[DEBUG]          classworlds:classworlds:jar:1.1-alpha-2:compile
[DEBUG]    org.codehaus.plexus:plexus-component-annotations:jar:1.6:compile
[DEBUG]    org.codehaus.plexus:plexus-resources:jar:1.1.0:compile
[DEBUG]    org.codehaus.plexus:plexus-utils:jar:3.0.24:compile
[DEBUG]    org.codehaus.plexus:plexus-interpolation:jar:1.24:compile
[DEBUG]    org.codehaus.plexus:plexus-velocity:jar:1.1.8:compile
[DEBUG]    com.puppycrawl.tools:checkstyle:jar:6.18:compile
[DEBUG]       antlr:antlr:jar:2.7.7:compile
[DEBUG]       org.antlr:antlr4-runtime:jar:4.5.3:compile
[DEBUG]       commons-beanutils:commons-beanutils:jar:1.9.2:compile
[DEBUG]       commons-cli:commons-cli:jar:1.3.1:compile
[DEBUG]       com.google.guava:guava:jar:19.0:compile
[DEBUG]    org.apache.velocity:velocity:jar:1.5:compile
[DEBUG]       commons-lang:commons-lang:jar:2.1:compile
[DEBUG]       oro:oro:jar:2.0.8:compile
[DEBUG]    commons-collections:commons-collections:jar:3.2.1:compile
[DEBUG] Created new class realm plugin>org.apache.maven.plugins:maven-checkstyle-plugin:3.0.0
[DEBUG] Importing foreign packages into class realm plugin>org.apache.maven.plugins:maven-checkstyle-plugin:3.0.0
[DEBUG]   Imported:  < maven.api
[DEBUG] Populating class realm plugin>org.apache.maven.plugins:maven-checkstyle-plugin:3.0.0
[DEBUG]   Included: org.apache.maven.plugins:maven-checkstyle-plugin:jar:3.0.0
[DEBUG]   Included: org.apache.maven.shared:maven-shared-resources:jar:2
[DEBUG]   Included: org.sonatype.aether:aether-util:jar:1.7
[DEBUG]   Included: org.sonatype.sisu:sisu-inject-bean:jar:1.4.2
[DEBUG]   Included: org.sonatype.sisu:sisu-guice:jar:noaop:2.1.7
[DEBUG]   Included: org.sonatype.plexus:plexus-sec-dispatcher:jar:1.3
[DEBUG]   Included: org.sonatype.plexus:plexus-cipher:jar:1.4
[DEBUG]   Included: org.apache.maven.reporting:maven-reporting-api:jar:3.0
[DEBUG]   Included: org.apache.maven.reporting:maven-reporting-impl:jar:2.3
[DEBUG]   Included: org.apache.maven.shared:maven-shared-utils:jar:0.6
[DEBUG]   Included: com.google.code.findbugs:jsr305:jar:2.0.1
[DEBUG]   Included: org.apache.maven.doxia:doxia-core:jar:1.2
[DEBUG]   Included: xerces:xercesImpl:jar:2.9.1
[DEBUG]   Included: xml-apis:xml-apis:jar:1.3.04
[DEBUG]   Included: org.apache.httpcomponents:httpclient:jar:4.0.2
[DEBUG]   Included: org.apache.httpcomponents:httpcore:jar:4.0.1
[DEBUG]   Included: commons-codec:commons-codec:jar:1.3
[DEBUG]   Included: commons-validator:commons-validator:jar:1.3.1
[DEBUG]   Included: commons-digester:commons-digester:jar:1.6
[DEBUG]   Included: commons-logging:commons-logging:jar:1.0.4
[DEBUG]   Included: org.apache.maven.doxia:doxia-sink-api:jar:1.4
[DEBUG]   Included: org.apache.maven.doxia:doxia-logging-api:jar:1.4
[DEBUG]   Included: org.apache.maven.doxia:doxia-decoration-model:jar:1.4
[DEBUG]   Included: org.apache.maven.doxia:doxia-site-renderer:jar:1.4
[DEBUG]   Included: org.apache.maven.doxia:doxia-module-xhtml:jar:1.4
[DEBUG]   Included: org.apache.maven.doxia:doxia-module-fml:jar:1.4
[DEBUG]   Included: org.codehaus.plexus:plexus-i18n:jar:1.0-beta-7
[DEBUG]   Included: org.apache.velocity:velocity-tools:jar:2.0
[DEBUG]   Included: commons-chain:commons-chain:jar:1.1
[DEBUG]   Included: dom4j:dom4j:jar:1.1
[DEBUG]   Included: sslext:sslext:jar:1.2-0
[DEBUG]   Included: org.apache.struts:struts-core:jar:1.3.8
[DEBUG]   Included: org.apache.struts:struts-taglib:jar:1.3.8
[DEBUG]   Included: org.apache.struts:struts-tiles:jar:1.3.8
[DEBUG]   Included: org.apache.maven.doxia:doxia-integration-tools:jar:1.6
[DEBUG]   Included: commons-io:commons-io:jar:1.4
[DEBUG]   Included: junit:junit:jar:3.8.1
[DEBUG]   Included: org.codehaus.plexus:plexus-component-annotations:jar:1.6
[DEBUG]   Included: org.codehaus.plexus:plexus-resources:jar:1.1.0
[DEBUG]   Included: org.codehaus.plexus:plexus-utils:jar:3.0.24
[DEBUG]   Included: org.codehaus.plexus:plexus-interpolation:jar:1.24
[DEBUG]   Included: org.codehaus.plexus:plexus-velocity:jar:1.1.8
[DEBUG]   Included: com.puppycrawl.tools:checkstyle:jar:6.18
[DEBUG]   Included: antlr:antlr:jar:2.7.7
[DEBUG]   Included: org.antlr:antlr4-runtime:jar:4.5.3
[DEBUG]   Included: commons-beanutils:commons-beanutils:jar:1.9.2
[DEBUG]   Included: commons-cli:commons-cli:jar:1.3.1
[DEBUG]   Included: com.google.guava:guava:jar:19.0
[DEBUG]   Included: org.apache.velocity:velocity:jar:1.5
[DEBUG]   Included: commons-lang:commons-lang:jar:2.1
[DEBUG]   Included: oro:oro:jar:2.0.8
[DEBUG]   Included: commons-collections:commons-collections:jar:3.2.1
[DEBUG] Configuring mojo org.apache.maven.plugins:maven-checkstyle-plugin:3.0.0:check from plugin realm ClassRealm[plugin>org.apache.maven.plugins:maven-checkstyle-plugin:3.0.0, parent: sun.misc.Launcher$AppClassLoader@927e4be]
[DEBUG] Configuring mojo 'org.apache.maven.plugins:maven-checkstyle-plugin:3.0.0:check' with basic configurator -->
[DEBUG]   (f) cacheFile = /home/jenkins/jenkins-slave/workspace/n-box_maven-gpg-plugin_stabilize@3/linux-jdk7-m3.6.x_build/target/checkstyle-cachefile
[DEBUG]   (f) configLocation = config/maven_checks.xml
[DEBUG]   (f) consoleOutput = false
[DEBUG]   (f) encoding = UTF-8
[DEBUG]   (f) failOnViolation = true
[DEBUG]   (f) failsOnError = false
[DEBUG]   (f) headerLocation = config/maven-header.txt
[DEBUG]   (f) includeResources = true
[DEBUG]   (f) includeTestResources = true
[DEBUG]   (f) includeTestSourceDirectory = false
[DEBUG]   (f) includes = **\/*.java
[DEBUG]   (f) logViolationsToConsole = true
[DEBUG]   (f) maxAllowedViolations = 0
[DEBUG]   (f) omitIgnoredModules = false
[DEBUG]   (f) outputFile = /home/jenkins/jenkins-slave/workspace/n-box_maven-gpg-plugin_stabilize@3/linux-jdk7-m3.6.x_build/target/checkstyle-result.xml
[DEBUG]   (f) outputFileFormat = xml
[DEBUG]   (f) plugin = Component Descriptor: role: 'org.apache.maven.plugin.Mojo', implementation: 'org.apache.maven.plugins.checkstyle.CheckstyleViolationCheckMojo', role hint: 'org.apache.maven.plugins:maven-checkstyle-plugin:3.0.0:check'
role: 'org.apache.maven.plugin.Mojo', implementation: 'org.apache.maven.plugins.checkstyle.CheckstyleReport', role hint: 'org.apache.maven.plugins:maven-checkstyle-plugin:3.0.0:checkstyle'
role: 'org.apache.maven.plugin.Mojo', implementation: 'org.apache.maven.plugins.checkstyle.CheckstyleAggregateReport', role hint: 'org.apache.maven.plugins:maven-checkstyle-plugin:3.0.0:checkstyle-aggregate'
role: 'org.apache.maven.plugin.Mojo', implementation: 'org.apache.maven.plugins.checkstyle.HelpMojo', role hint: 'org.apache.maven.plugins:maven-checkstyle-plugin:3.0.0:help'
---
[DEBUG]   (f) project = MavenProject: org.apache.maven.plugins:maven-gpg-plugin:3.0.1-SNAPSHOT @ /home/jenkins/jenkins-slave/workspace/n-box_maven-gpg-plugin_stabilize@3/linux-jdk7-m3.6.x_build/dependency-reduced-pom.xml
[DEBUG]   (f) resourceIncludes = **/*.properties
[DEBUG]   (f) resources = [Resource {targetPath: null, filtering: false, FileSet {directory: /home/jenkins/jenkins-slave/workspace/n-box_maven-gpg-plugin_stabilize@3/linux-jdk7-m3.6.x_build/src/main/resources, PatternSet [includes: {}, excludes: {}]}}, Resource {targetPath: null, filtering: false, FileSet {directory: /home/jenkins/jenkins-slave/workspace/n-box_maven-gpg-plugin_stabilize@3/linux-jdk7-m3.6.x_build/target/maven-shared-archive-resources, PatternSet [includes: {}, excludes: {}]}}]
[DEBUG]   (f) rulesFiles = /home/jenkins/jenkins-slave/workspace/n-box_maven-gpg-plugin_stabilize@3/linux-jdk7-m3.6.x_build/target/checkstyle-rules.xml
[DEBUG]   (f) skip = false
[DEBUG]   (f) skipExec = false
[DEBUG]   (f) sourceDirectories = [src/main/java]
[DEBUG]   (f) suppressionsFileExpression = checkstyle.suppressions.file
[DEBUG]   (f) testResources = [Resource {targetPath: null, filtering: false, FileSet {directory: /home/jenkins/jenkins-slave/workspace/n-box_maven-gpg-plugin_stabilize@3/linux-jdk7-m3.6.x_build/src/test/resources, PatternSet [includes: {}, excludes: {}]}}, Resource {targetPath: null, filtering: false, FileSet {directory: /home/jenkins/jenkins-slave/workspace/n-box_maven-gpg-plugin_stabilize@3/linux-jdk7-m3.6.x_build/target/maven-shared-archive-resources, PatternSet [includes: {}, excludes: {}]}}]
[DEBUG]   (f) testSourceDirectories = [src/test/java]
[DEBUG]   (f) violationIgnore = RedundantThrows,NewlineAtEndOfFile,ParameterNumber,MethodLength,FileLength
[DEBUG]   (f) violationSeverity = error
[DEBUG] -- end configuration --
[DEBUG] executeCheckstyle start headerLocation : config/maven-header.txt
[DEBUG] Added 10 source files found in '/home/jenkins/jenkins-slave/workspace/n-box_maven-gpg-plugin_stabilize@3/linux-jdk7-m3.6.x_build/src/main/java'.
[DEBUG] Added 0 resource files found in '/home/jenkins/jenkins-slave/workspace/n-box_maven-gpg-plugin_stabilize@3/linux-jdk7-m3.6.x_build/src/main/resources'.
[DEBUG] Added 0 resource files found in '/home/jenkins/jenkins-slave/workspace/n-box_maven-gpg-plugin_stabilize@3/linux-jdk7-m3.6.x_build/target/maven-shared-archive-resources'.
[DEBUG] Added 0 resource files found in '/home/jenkins/jenkins-slave/workspace/n-box_maven-gpg-plugin_stabilize@3/linux-jdk7-m3.6.x_build/src/test/resources'.
[DEBUG] Added 0 resource files found in '/home/jenkins/jenkins-slave/workspace/n-box_maven-gpg-plugin_stabilize@3/linux-jdk7-m3.6.x_build/target/maven-shared-archive-resources'.
[DEBUG] Added 10 files to process.
[DEBUG] Adding the outputDirectory file:/home/jenkins/jenkins-slave/workspace/n-box_maven-gpg-plugin_stabilize@3/linux-jdk7-m3.6.x_build/target/classes/ to the Checkstyle class path
[DEBUG] request.getConfigLocation() config/maven_checks.xml
[DEBUG] The resource 'config/maven_checks.xml' was found as jar:file:/home/jenkins/jenkins-slave/workspace/.maven_repositories/1/org/apache/maven/shared/maven-shared-resources/2/maven-shared-resources-2.jar!/config/maven_checks.xml.
[DEBUG] headerLocation config/maven-header.txt
[DEBUG] The resource 'config/maven-header.txt' was found as jar:file:/home/jenkins/jenkins-slave/workspace/.maven_repositories/1/org/apache/maven/shared/maven-shared-resources/2/maven-shared-resources-2.jar!/config/maven-header.txt.
[DEBUG] Added '/home/jenkins/jenkins-slave/workspace/n-box_maven-gpg-plugin_stabilize@3/linux-jdk7-m3.6.x_build/src/main/resources' as a source directory.
[DEBUG] Added '/home/jenkins/jenkins-slave/workspace/n-box_maven-gpg-plugin_stabilize@3/linux-jdk7-m3.6.x_build/target/maven-shared-archive-resources' as a source directory.
[INFO] There is 1 error reported by Checkstyle 6.18 with config/maven_checks.xml ruleset.
[INFO] Ignored 1 error, 0 violation remaining.
[INFO]
[INFO] --- maven-invoker-plugin:3.2.1:verify (integration-test) @ maven-gpg-plugin ---
[DEBUG] Configuring mojo org.apache.maven.plugins:maven-invoker-plugin:3.2.1:verify from plugin realm ClassRealm[plugin>org.apache.maven.plugins:maven-invoker-plugin:3.2.1, parent: sun.misc.Launcher$AppClassLoader@927e4be]
[DEBUG] Configuring mojo 'org.apache.maven.plugins:maven-invoker-plugin:3.2.1:verify' with basic configurator -->
[DEBUG]   (f) ignoreFailures = false
[DEBUG]   (f) reportsDirectory = /home/jenkins/jenkins-slave/workspace/n-box_maven-gpg-plugin_stabilize@3/linux-jdk7-m3.6.x_build/target/invoker-reports
[DEBUG]   (f) skipInvocation = false
[DEBUG]   (f) suppressSummaries = false
[DEBUG] -- end configuration --
[INFO] -------------------------------------------------
[INFO] Build Summary:
[INFO]   Passed: 8, Failed: 0, Errors: 0, Skipped: 0
[INFO] -------------------------------------------------
[INFO] ------------------------------------------------------------------------
[INFO] BUILD SUCCESS
[INFO] ------------------------------------------------------------------------
[INFO] Total time:  01:25 min
[INFO] Finished at: 2020-06-12T11:45:50Z
[INFO] ------------------------------------------------------------------------
[INFO] [jenkins-event-spy] Generated /home/jenkins/jenkins-slave/workspace/n-box_maven-gpg-plugin_stabilize@3@tmp/withMaven432c887a/maven-spy-20200612-114424-1884758726133739863437.log
[Pipeline] }
[Pipeline] // dir
[Pipeline] }
[withMaven] artifactsPublisher - Archive artifact linux-jdk7-m3.6.x_build/pom.xml under org/apache/maven/plugins/maven-gpg-plugin/3.0.1-SNAPSHOT/maven-gpg-plugin-3.0.1-SNAPSHOT.pom
[withMaven] artifactsPublisher - Archive artifact linux-jdk7-m3.6.x_build/target/maven-gpg-plugin-3.0.1-SNAPSHOT.jar under org/apache/maven/plugins/maven-gpg-plugin/3.0.1-SNAPSHOT/maven-gpg-plugin-3.0.1-SNAPSHOT.jar
[Fast Archiver] No prior successful build to compare, so performing full copy of artifacts
[withMaven] junitPublisher - Archive test results for Maven artifact org.apache.maven.plugins:maven-gpg-plugin:maven-plugin:3.0.1-SNAPSHOT generated by maven-surefire-plugin:test (default-test): linux-jdk7-m3.6.x_build/target/surefire-reports/*.xml
Recording test results
[withMaven] openTasksPublisher - Scan Tasks for Maven artifact org.apache.maven.plugins:maven-gpg-plugin:maven-plugin:3.0.1-SNAPSHOT in source directory linux-jdk7-m3.6.x_build/src/main/java
[TASKS] Scanning folder '/home/jenkins/jenkins-slave/workspace/n-box_maven-gpg-plugin_stabilize@3' for files matching the pattern 'linux-jdk7-m3.6.x_build/src/main/java/**/*' - excludes: null
[TASKS] Found 10 files to scan for tasks
[TASKS] Found 1 open tasks.
Skipping warnings blame since pipelines do not have an SCM link.%n
[withMaven] invokerPublisher - Archive invoker results for Maven artifact MavenArtifact{org.apache.maven.plugins:maven-gpg-plugin:maven-plugin:3.0.1-SNAPSHOT(version: 3.0.1-SNAPSHOT, snapshot:false) } generated by PluginInvocation{org.apache.maven.plugins:maven-invoker-plugin:3.2.1@integration-test  integration-test}: linux-jdk7-m3.6.x_build/target/invoker-reports/*.xml
[withMaven] Publishers: Generated Artifacts Publisher: 963 ms, Junit Publisher: 1130 ms, Open Task Scanner Publisher: 511 ms, Invoker Publisher: 6996 ms, Pipeline Graph Publisher: 1 ms
[Pipeline] // withMaven
[Pipeline] cleanWs
[WS-CLEANUP] Deleting project workspace...
[WS-CLEANUP] Deferred wipeout is used...
[WS-CLEANUP] done
[Pipeline] }
[Pipeline] // stage
[Pipeline] }
[Pipeline] // ws
[Pipeline] }
[Pipeline] // node
[Pipeline] }
[Pipeline] // parallel
[Pipeline] stage
[Pipeline] { (Notifications)
[Pipeline] echo
Build result: FAILURE
[Pipeline] jiraIssueSelector
[Pipeline] echo
The authors of changes [rfscholte].
[Pipeline] echo
Sending email ...
[Pipeline] emailext
Reply | Threaded
Open this post in threaded view
|

Build failed in Jenkins: Maven TLP » maven-gpg-plugin » stabilize #5

Apache Jenkins Server-2
See https://builds.apache.org/job/maven-box/job/maven-gpg-plugin/job/stabilize/5/

Changes:

* AbsolutePath?

All tests passed

Build log:
[...truncated 43672 lines...]
[DEBUG]   (f) skipExec = false
[DEBUG]   (f) sourceDirectories = [src/main/java]
[DEBUG]   (f) suppressionsFileExpression = checkstyle.suppressions.file
[DEBUG]   (f) testResources = [Resource {targetPath: null, filtering: false, FileSet {directory: /home/jenkins/jenkins-slave/workspace/n-box_maven-gpg-plugin_stabilize@2@2/linux-jdk7-m3.5.x_build/src/test/resources, PatternSet [includes: {}, excludes: {}]}}, Resource {targetPath: null, filtering: false, FileSet {directory: /home/jenkins/jenkins-slave/workspace/n-box_maven-gpg-plugin_stabilize@2@2/linux-jdk7-m3.5.x_build/target/maven-shared-archive-resources, PatternSet [includes: {}, excludes: {}]}}]
[DEBUG]   (f) testSourceDirectories = [src/test/java]
[DEBUG]   (f) violationIgnore = RedundantThrows,NewlineAtEndOfFile,ParameterNumber,MethodLength,FileLength
[DEBUG]   (f) violationSeverity = error
[DEBUG] -- end configuration --
[DEBUG] executeCheckstyle start headerLocation : config/maven-header.txt
[DEBUG] Added 10 source files found in '/home/jenkins/jenkins-slave/workspace/n-box_maven-gpg-plugin_stabilize@2@2/linux-jdk7-m3.5.x_build/src/main/java'.
[DEBUG] Added 0 resource files found in '/home/jenkins/jenkins-slave/workspace/n-box_maven-gpg-plugin_stabilize@2@2/linux-jdk7-m3.5.x_build/src/main/resources'.
[DEBUG] Added 0 resource files found in '/home/jenkins/jenkins-slave/workspace/n-box_maven-gpg-plugin_stabilize@2@2/linux-jdk7-m3.5.x_build/target/maven-shared-archive-resources'.
[DEBUG] Added 0 resource files found in '/home/jenkins/jenkins-slave/workspace/n-box_maven-gpg-plugin_stabilize@2@2/linux-jdk7-m3.5.x_build/src/test/resources'.
[DEBUG] Added 0 resource files found in '/home/jenkins/jenkins-slave/workspace/n-box_maven-gpg-plugin_stabilize@2@2/linux-jdk7-m3.5.x_build/target/maven-shared-archive-resources'.
[DEBUG] Added 10 files to process.
[DEBUG] Adding the outputDirectory file:/home/jenkins/jenkins-slave/workspace/n-box_maven-gpg-plugin_stabilize@2@2/linux-jdk7-m3.5.x_build/target/classes/ to the Checkstyle class path
[DEBUG] request.getConfigLocation() config/maven_checks.xml
[DEBUG] URLResourceLoader: No valid URL 'config/maven_checks.xml'
[DEBUG] URLResourceLoader: No valid URL 'config/maven_checks.xml'
[DEBUG] The resource 'config/maven_checks.xml' was not found with resourceLoader org.codehaus.plexus.resource.loader.URLResourceLoader.
[DEBUG] The resource 'config/maven_checks.xml' was not found with resourceLoader org.codehaus.plexus.resource.loader.JarResourceLoader.
[DEBUG] The resource 'config/maven_checks.xml' was not found with resourceLoader org.codehaus.plexus.resource.loader.FileResourceLoader.
[DEBUG] The resource 'config/maven_checks.xml' was found as jar:file:/home/jenkins/jenkins-slave/workspace/.maven_repositories/0/org/apache/maven/shared/maven-shared-resources/2/maven-shared-resources-2.jar!/config/maven_checks.xml.
[DEBUG] headerLocation config/maven-header.txt
[DEBUG] URLResourceLoader: No valid URL 'config/maven-header.txt'
[DEBUG] URLResourceLoader: No valid URL 'config/maven-header.txt'
[DEBUG] The resource 'config/maven-header.txt' was not found with resourceLoader org.codehaus.plexus.resource.loader.URLResourceLoader.
[DEBUG] JarResourceLoader : trying to load "jar:file:/home/jenkins/jenkins-slave/workspace/.maven_repositories/0/org/apache/maven/shared/maven-shared-resources/2/maven-shared-resources-2.jar"
[DEBUG] The resource 'config/maven-header.txt' was found as jar:file:/home/jenkins/jenkins-slave/workspace/.maven_repositories/0/org/apache/maven/shared/maven-shared-resources/2/maven-shared-resources-2.jar!/config/maven-header.txt.
[withMaven] artifactsPublisher - Archive artifact linux-jdk7-m3.3.x_build/pom.xml under org/apache/maven/plugins/maven-gpg-plugin/3.0.1-SNAPSHOT/maven-gpg-plugin-3.0.1-SNAPSHOT.pom
[INFO] run post-build script verify.bsh
[INFO]           sign-release/pom.xml ............................. SUCCESS (6.0 s)
[INFO]
[INFO] --- maven-checkstyle-plugin:3.0.0:check (checkstyle-check) @ maven-gpg-plugin ---
[withMaven] artifactsPublisher - Archive artifact linux-jdk7-m3.3.x_build/target/maven-gpg-plugin-3.0.1-SNAPSHOT.jar under org/apache/maven/plugins/maven-gpg-plugin/3.0.1-SNAPSHOT/maven-gpg-plugin-3.0.1-SNAPSHOT.jar
[Fast Archiver] No prior successful build to compare, so performing full copy of artifacts
[withMaven] junitPublisher - Archive test results for Maven artifact org.apache.maven.plugins:maven-gpg-plugin:maven-plugin:3.0.1-SNAPSHOT generated by maven-surefire-plugin:test (default-test): linux-jdk7-m3.3.x_build/target/surefire-reports/*.xml
Recording test results
[DEBUG] Added '/home/jenkins/jenkins-slave/workspace/n-box_maven-gpg-plugin_stabilize@2@2/linux-jdk7-m3.5.x_build/src/main/resources' as a source directory.
[DEBUG] Added '/home/jenkins/jenkins-slave/workspace/n-box_maven-gpg-plugin_stabilize@2@2/linux-jdk7-m3.5.x_build/target/maven-shared-archive-resources' as a source directory.
[INFO] There is 1 error reported by Checkstyle 6.18 with config/maven_checks.xml ruleset.
[INFO] Ignored 1 error, 0 violation remaining.
[INFO]
[INFO] --- maven-invoker-plugin:3.2.1:verify (integration-test) @ maven-gpg-plugin ---
[DEBUG] Configuring mojo org.apache.maven.plugins:maven-invoker-plugin:3.2.1:verify from plugin realm ClassRealm[plugin>org.apache.maven.plugins:maven-invoker-plugin:3.2.1, parent: sun.misc.Launcher$AppClassLoader@5b3d9c02]
[DEBUG] Configuring mojo 'org.apache.maven.plugins:maven-invoker-plugin:3.2.1:verify' with basic configurator -->
[DEBUG]   (f) ignoreFailures = false
[DEBUG]   (f) reportsDirectory = /home/jenkins/jenkins-slave/workspace/n-box_maven-gpg-plugin_stabilize@2@2/linux-jdk7-m3.5.x_build/target/invoker-reports
[DEBUG]   (f) skipInvocation = false
[DEBUG]   (f) suppressSummaries = false
[DEBUG] -- end configuration --
[INFO] -------------------------------------------------
[INFO] Build Summary:
[INFO]   Passed: 8, Failed: 0, Errors: 0, Skipped: 0
[INFO] -------------------------------------------------
[INFO] ------------------------------------------------------------------------
[INFO] BUILD SUCCESS
[INFO] ------------------------------------------------------------------------
[INFO] Total time: 56.473 s
[INFO] Finished at: 2020-06-12T11:56:09Z
[INFO] ------------------------------------------------------------------------
[INFO] [jenkins-event-spy] Generated /home/jenkins/jenkins-slave/workspace/n-box_maven-gpg-plugin_stabilize@2@2@tmp/withMaven4beefb90/maven-spy-20200612-115512-56383754758572430563.log
[Pipeline] }
[INFO] run post-build script verify.bsh
[INFO]           sign-and-deploy-not-jar-packaging ................ SUCCESS (4.5 s)
[INFO] Building: sign-release/pom.xml
[Pipeline] // dir
[Pipeline] }
[withMaven] Publishers: Generated Artifacts Publisher: 960 ms, Junit Publisher: 1151 ms, Open Task Scanner Publisher: 507 ms, Invoker Publisher: 7237 ms, Pipeline Graph Publisher: 1 ms
[INFO] There is 1 error reported by Checkstyle 6.18 with config/maven_checks.xml ruleset.
[INFO] Ignored 1 error, 0 violation remaining.
[INFO]
[INFO] --- maven-invoker-plugin:3.2.1:verify (integration-test) @ maven-gpg-plugin ---
[INFO] -------------------------------------------------
[INFO] Build Summary:
[INFO]   Passed: 8, Failed: 0, Errors: 0, Skipped: 0
[INFO] -------------------------------------------------
[INFO] ------------------------------------------------------------------------
[INFO] BUILD SUCCESS
[INFO] ------------------------------------------------------------------------
[INFO] Total time:  01:02 min
[INFO] Finished at: 2020-06-12T11:56:08Z
[INFO] ------------------------------------------------------------------------
[INFO] [jenkins-event-spy] Generated /home/jenkins/jenkins-slave/workspace/n-box_maven-gpg-plugin_stabilize@3@tmp/withMavenfc06496e/maven-spy-20200612-115505-967112334846720680466.log
[withMaven] openTasksPublisher - Scan Tasks for Maven artifact org.apache.maven.plugins:maven-gpg-plugin:maven-plugin:3.0.1-SNAPSHOT in source directory linux-jdk7-m3.3.x_build/src/main/java
[Pipeline] // withMaven
[TASKS] Scanning folder '/home/jenkins/jenkins-slave/workspace/n-box_maven-gpg-plugin_stabilize@3' for files matching the pattern 'linux-jdk7-m3.3.x_build/src/main/java/**/*' - excludes: null
[TASKS] Found 10 files to scan for tasks
[TASKS] Found 1 open tasks.
Skipping warnings blame since pipelines do not have an SCM link.%n
[Pipeline] cleanWs
[Pipeline] }
[Pipeline] // dir
[Pipeline] }
[withMaven] artifactsPublisher - Archive artifact linux-jdk7-m3.5.x_build/pom.xml under org/apache/maven/plugins/maven-gpg-plugin/3.0.1-SNAPSHOT/maven-gpg-plugin-3.0.1-SNAPSHOT.pom
[WS-CLEANUP] Deleting project workspace...
[WS-CLEANUP] Deferred wipeout is used...
[withMaven] invokerPublisher - Archive invoker results for Maven artifact MavenArtifact{org.apache.maven.plugins:maven-gpg-plugin:maven-plugin:3.0.1-SNAPSHOT(version: 3.0.1-SNAPSHOT, snapshot:false) } generated by PluginInvocation{org.apache.maven.plugins:maven-invoker-plugin:3.2.1@integration-test  integration-test}: linux-jdk7-m3.3.x_build/target/invoker-reports/*.xml
[withMaven] artifactsPublisher - Archive artifact linux-jdk7-m3.5.x_build/target/maven-gpg-plugin-3.0.1-SNAPSHOT.jar under org/apache/maven/plugins/maven-gpg-plugin/3.0.1-SNAPSHOT/maven-gpg-plugin-3.0.1-SNAPSHOT.jar
[withMaven] Publishers: Generated Artifacts Publisher: 963 ms, Junit Publisher: 1379 ms, Open Task Scanner Publisher: 510 ms, Invoker Publisher: 7138 ms, Pipeline Graph Publisher: 1 ms
[WS-CLEANUP] done
[Pipeline] }
[Fast Archiver] No prior successful build to compare, so performing full copy of artifacts
[Pipeline] // stage
[Pipeline] }
[Pipeline] // ws
[Pipeline] }
[Pipeline] // node
[Pipeline] // withMaven
[Pipeline] }
[Pipeline] cleanWs
[withMaven] junitPublisher - Archive test results for Maven artifact org.apache.maven.plugins:maven-gpg-plugin:maven-plugin:3.0.1-SNAPSHOT generated by maven-surefire-plugin:test (default-test): linux-jdk7-m3.5.x_build/target/surefire-reports/*.xml
Recording test results
[WS-CLEANUP] Deleting project workspace...
[WS-CLEANUP] Deferred wipeout is used...
[withMaven] artifactsPublisher - Archive artifact linux-jdk8-m3.6.x_build/pom.xml under org/apache/maven/plugins/maven-gpg-plugin/3.0.1-SNAPSHOT/maven-gpg-plugin-3.0.1-SNAPSHOT.pom
[WS-CLEANUP] done
[Pipeline] }
[withMaven] artifactsPublisher - Archive artifact linux-jdk8-m3.6.x_build/target/maven-gpg-plugin-3.0.1-SNAPSHOT.jar under org/apache/maven/plugins/maven-gpg-plugin/3.0.1-SNAPSHOT/maven-gpg-plugin-3.0.1-SNAPSHOT.jar
[Fast Archiver] No prior successful build to compare, so performing full copy of artifacts
[Pipeline] // stage
[withMaven] junitPublisher - Archive test results for Maven artifact org.apache.maven.plugins:maven-gpg-plugin:maven-plugin:3.0.1-SNAPSHOT generated by maven-surefire-plugin:test (default-test): linux-jdk8-m3.6.x_build/target/surefire-reports/*.xml
Recording test results
[Pipeline] }
[Pipeline] // ws
[Pipeline] }
[Pipeline] // node
[withMaven] openTasksPublisher - Scan Tasks for Maven artifact org.apache.maven.plugins:maven-gpg-plugin:maven-plugin:3.0.1-SNAPSHOT in source directory linux-jdk7-m3.5.x_build/src/main/java
[TASKS] Scanning folder '/home/jenkins/jenkins-slave/workspace/n-box_maven-gpg-plugin_stabilize@2@2' for files matching the pattern 'linux-jdk7-m3.5.x_build/src/main/java/**/*' - excludes: null
[TASKS] Found 10 files to scan for tasks
[TASKS] Found 1 open tasks.
Skipping warnings blame since pipelines do not have an SCM link.%n
[withMaven] invokerPublisher - Archive invoker results for Maven artifact MavenArtifact{org.apache.maven.plugins:maven-gpg-plugin:maven-plugin:3.0.1-SNAPSHOT(version: 3.0.1-SNAPSHOT, snapshot:false) } generated by PluginInvocation{org.apache.maven.plugins:maven-invoker-plugin:3.2.1@integration-test  integration-test}: linux-jdk7-m3.5.x_build/target/invoker-reports/*.xml
[Pipeline] }
[withMaven] Publishers: Generated Artifacts Publisher: 960 ms, Junit Publisher: 1122 ms, Open Task Scanner Publisher: 504 ms, Invoker Publisher: 7364 ms, Pipeline Graph Publisher: 1 ms
[withMaven] openTasksPublisher - Scan Tasks for Maven artifact org.apache.maven.plugins:maven-gpg-plugin:maven-plugin:3.0.1-SNAPSHOT in source directory linux-jdk8-m3.6.x_build/src/main/java
[Pipeline] // withMaven
[TASKS] Scanning folder '/home/jenkins/jenkins-slave/workspace/n-box_maven-gpg-plugin_stabilize@3' for files matching the pattern 'linux-jdk8-m3.6.x_build/src/main/java/**/*' - excludes: null
[TASKS] Found 10 files to scan for tasks
[TASKS] Found 1 open tasks.
Skipping warnings blame since pipelines do not have an SCM link.%n
[Pipeline] cleanWs
[WS-CLEANUP] Deleting project workspace...
[WS-CLEANUP] Deferred wipeout is used...
[withMaven] invokerPublisher - Archive invoker results for Maven artifact MavenArtifact{org.apache.maven.plugins:maven-gpg-plugin:maven-plugin:3.0.1-SNAPSHOT(version: 3.0.1-SNAPSHOT, snapshot:false) } generated by PluginInvocation{org.apache.maven.plugins:maven-invoker-plugin:3.2.1@integration-test  integration-test}: linux-jdk8-m3.6.x_build/target/invoker-reports/*.xml
[WS-CLEANUP] done
[Pipeline] }
[Pipeline] // stage
[Pipeline] }
[Pipeline] // ws
[Pipeline] }
[Pipeline] // node
[Pipeline] }
[INFO] run post-build script verify.bsh
[INFO]           sign-release/pom.xml ............................. SUCCESS (6.2 s)
[INFO]
[INFO] --- maven-checkstyle-plugin:3.0.0:check (checkstyle-check) @ maven-gpg-plugin ---
[INFO] There is 1 error reported by Checkstyle 6.18 with config/maven_checks.xml ruleset.
[INFO] Ignored 1 error, 0 violation remaining.
[INFO]
[INFO] --- maven-invoker-plugin:3.2.1:verify (integration-test) @ maven-gpg-plugin ---
[INFO] -------------------------------------------------
[INFO] Build Summary:
[INFO]   Passed: 8, Failed: 0, Errors: 0, Skipped: 0
[INFO] -------------------------------------------------
[INFO] ------------------------------------------------------------------------
[INFO] BUILD SUCCESS
[INFO] ------------------------------------------------------------------------
[INFO] Total time:  01:05 min
[INFO] Finished at: 2020-06-12T11:56:15Z
[INFO] ------------------------------------------------------------------------
[INFO] [jenkins-event-spy] Generated /home/jenkins/jenkins-slave/workspace/n-box_maven-gpg-plugin_stabilize@2@2@tmp/withMaven4e4cd482/maven-spy-20200612-115510-347601191859029658621.log
[Pipeline] }
[Pipeline] // dir
[Pipeline] }
[withMaven] Publishers: Generated Artifacts Publisher: 989 ms, Junit Publisher: 1115 ms, Open Task Scanner Publisher: 519 ms, Invoker Publisher: 6823 ms, Pipeline Graph Publisher: 1 ms
[Pipeline] // withMaven
[Pipeline] cleanWs
[WS-CLEANUP] Deleting project workspace...
[WS-CLEANUP] Deferred wipeout is used...
[withMaven] artifactsPublisher - Archive artifact linux-jdk11-m3.6.x_build/pom.xml under org/apache/maven/plugins/maven-gpg-plugin/3.0.1-SNAPSHOT/maven-gpg-plugin-3.0.1-SNAPSHOT.pom
[WS-CLEANUP] done
[Pipeline] }
[Pipeline] // stage
[Pipeline] }
[withMaven] artifactsPublisher - Archive artifact linux-jdk11-m3.6.x_build/target/maven-gpg-plugin-3.0.1-SNAPSHOT.jar under org/apache/maven/plugins/maven-gpg-plugin/3.0.1-SNAPSHOT/maven-gpg-plugin-3.0.1-SNAPSHOT.jar
[Pipeline] // ws
[Pipeline] }
[Pipeline] // node
[Pipeline] }
[Fast Archiver] No prior successful build to compare, so performing full copy of artifacts
[withMaven] junitPublisher - Archive test results for Maven artifact org.apache.maven.plugins:maven-gpg-plugin:maven-plugin:3.0.1-SNAPSHOT generated by maven-surefire-plugin:test (default-test): linux-jdk11-m3.6.x_build/target/surefire-reports/*.xml
Recording test results
[withMaven] Publishers: Generated Artifacts Publisher: 960 ms, Junit Publisher: 1133 ms, Open Task Scanner Publisher: 504 ms, Invoker Publisher: 7033 ms
[withMaven] openTasksPublisher - Scan Tasks for Maven artifact org.apache.maven.plugins:maven-gpg-plugin:maven-plugin:3.0.1-SNAPSHOT in source directory linux-jdk11-m3.6.x_build/src/main/java
[Pipeline] // withMaven
[TASKS] Scanning folder '/home/jenkins/jenkins-slave/workspace/n-box_maven-gpg-plugin_stabilize@2@2' for files matching the pattern 'linux-jdk11-m3.6.x_build/src/main/java/**/*' - excludes: null
[TASKS] Found 10 files to scan for tasks
[TASKS] Found 1 open tasks.
Skipping warnings blame since pipelines do not have an SCM link.%n
[Pipeline] cleanWs
[WS-CLEANUP] Deleting project workspace...
[WS-CLEANUP] Deferred wipeout is used...
[withMaven] invokerPublisher - Archive invoker results for Maven artifact MavenArtifact{org.apache.maven.plugins:maven-gpg-plugin:maven-plugin:3.0.1-SNAPSHOT(version: 3.0.1-SNAPSHOT, snapshot:false) } generated by PluginInvocation{org.apache.maven.plugins:maven-invoker-plugin:3.2.1@integration-test  integration-test}: linux-jdk11-m3.6.x_build/target/invoker-reports/*.xml
[WS-CLEANUP] done
[Pipeline] }
[Pipeline] // stage
[Pipeline] }
[Pipeline] // ws
[Pipeline] }
[Pipeline] // node
[Pipeline] }
[withMaven] Publishers: Generated Artifacts Publisher: 975 ms, Junit Publisher: 1129 ms, Open Task Scanner Publisher: 509 ms, Invoker Publisher: 7394 ms, Pipeline Graph Publisher: 1 ms
[Pipeline] // withMaven
[Pipeline] cleanWs
[WS-CLEANUP] Deleting project workspace...
[WS-CLEANUP] Deferred wipeout is used...
[WS-CLEANUP] done
[Pipeline] }
[Pipeline] // stage
[Pipeline] }
[Pipeline] // ws
[Pipeline] }
[Pipeline] // node
[Pipeline] }
[withMaven] Publishers: Generated Artifacts Publisher: 968 ms, Junit Publisher: 1133 ms, Open Task Scanner Publisher: 503 ms, Invoker Publisher: 7135 ms, Pipeline Graph Publisher: 1 ms
[Pipeline] // withMaven
[Pipeline] cleanWs
[WS-CLEANUP] Deleting project workspace...
[WS-CLEANUP] Deferred wipeout is used...
[WS-CLEANUP] done
[Pipeline] }
[Pipeline] // stage
[Pipeline] }
[Pipeline] // ws
[Pipeline] }
[Pipeline] // node
[Pipeline] }
[Pipeline] // parallel
[Pipeline] stage
[Pipeline] { (Notifications)
[Pipeline] echo
Build result: FAILURE
[Pipeline] jiraIssueSelector
[Pipeline] echo
The authors of changes [rfscholte].
[Pipeline] echo
Sending email ...
[Pipeline] emailext
Reply | Threaded
Open this post in threaded view
|

Build failed in Jenkins: Maven TLP » maven-gpg-plugin » stabilize #6

Apache Jenkins Server-2
See https://builds.apache.org/job/maven-box/job/maven-gpg-plugin/job/stabilize/6/

Changes:

* verify if pom was created

All tests passed

Build log:
[...truncated 43684 lines...]
[INFO]           sign-with-passphase-from-maven-settings\pom.xml .. SUCCESS (4.9 s)
[INFO]
[INFO] --- maven-checkstyle-plugin:3.0.0:check (checkstyle-check) @ maven-gpg-plugin ---
[WS-CLEANUP] done
[Pipeline] }
[Pipeline] // stage
[Pipeline] }
[Pipeline] // ws
[Pipeline] }
[Pipeline] // node
[Pipeline] // withMaven
[Pipeline] }
[Pipeline] cleanWs
[WS-CLEANUP] Deleting project workspace...
[WS-CLEANUP] Deferred wipeout is used...
[WS-CLEANUP] done
[Pipeline] }
[Pipeline] // stage
[Pipeline] }
[Pipeline] // ws
[Pipeline] }
[Pipeline] // node
[Pipeline] }
[INFO] There is 1 error reported by Checkstyle 6.18 with config/maven_checks.xml ruleset.
[INFO] Ignored 1 error, 0 violation remaining.
[INFO]
[INFO] --- maven-invoker-plugin:3.2.1:verify (integration-test) @ maven-gpg-plugin ---
[INFO] There is 1 error reported by Checkstyle 6.18 with config/maven_checks.xml ruleset.
[INFO] Ignored 1 error, 0 violation remaining.
[INFO]
[INFO] --- maven-invoker-plugin:3.2.1:verify (integration-test) @ maven-gpg-plugin ---
[INFO] -------------------------------------------------
[INFO] Build Summary:
[INFO]   Passed: 7, Failed: 1, Errors: 0, Skipped: 0
[INFO] -------------------------------------------------
[ERROR] The following builds failed:
[ERROR] *  sign-and-deploy-file-without-pom
[INFO] -------------------------------------------------
[INFO] ------------------------------------------------------------------------
[INFO] BUILD FAILURE
[INFO] ------------------------------------------------------------------------
[INFO] Total time:  01:26 min
[INFO] Finished at: 2020-06-12T05:13:25-07:00
[INFO] ------------------------------------------------------------------------
[INFO] [jenkins-event-spy] Generated F:\short\m-gpg-p-stabilize-6@2@tmp\withMavenf4f0d8c4\maven-spy-20200612-051158-6213803089998403495511.log
[ERROR] Failed to execute goal org.apache.maven.plugins:maven-invoker-plugin:3.2.1:verify (integration-test) on project maven-gpg-plugin: 1 build failed. See console output above for details. -> [Help 1]
org.apache.maven.lifecycle.LifecycleExecutionException: Failed to execute goal org.apache.maven.plugins:maven-invoker-plugin:3.2.1:verify (integration-test) on project maven-gpg-plugin: 1 build failed. See console output above for details.
    at org.apache.maven.lifecycle.internal.MojoExecutor.execute (MojoExecutor.java:215)
    at org.apache.maven.lifecycle.internal.MojoExecutor.execute (MojoExecutor.java:156)
    at org.apache.maven.lifecycle.internal.MojoExecutor.execute (MojoExecutor.java:148)
    at org.apache.maven.lifecycle.internal.LifecycleModuleBuilder.buildProject (LifecycleModuleBuilder.java:117)
    at org.apache.maven.lifecycle.internal.LifecycleModuleBuilder.buildProject (LifecycleModuleBuilder.java:81)
    at org.apache.maven.lifecycle.internal.builder.singlethreaded.SingleThreadedBuilder.build (SingleThreadedBuilder.java:56)
    at org.apache.maven.lifecycle.internal.LifecycleStarter.execute (LifecycleStarter.java:128)
    at org.apache.maven.DefaultMaven.doExecute (DefaultMaven.java:305)
    at org.apache.maven.DefaultMaven.doExecute (DefaultMaven.java:192)
    at org.apache.maven.DefaultMaven.execute (DefaultMaven.java:105)
    at org.apache.maven.cli.MavenCli.execute (MavenCli.java:956)
    at org.apache.maven.cli.MavenCli.doMain (MavenCli.java:288)
    at org.apache.maven.cli.MavenCli.main (MavenCli.java:192)
    at jdk.internal.reflect.NativeMethodAccessorImpl.invoke0 (Native Method)
    at jdk.internal.reflect.NativeMethodAccessorImpl.invoke (NativeMethodAccessorImpl.java:62)
    at jdk.internal.reflect.DelegatingMethodAccessorImpl.invoke (DelegatingMethodAccessorImpl.java:43)
    at java.lang.reflect.Method.invoke (Method.java:567)
    at org.codehaus.plexus.classworlds.launcher.Launcher.launchEnhanced (Launcher.java:282)
    at org.codehaus.plexus.classworlds.launcher.Launcher.launch (Launcher.java:225)
    at org.codehaus.plexus.classworlds.launcher.Launcher.mainWithExitCode (Launcher.java:406)
    at org.codehaus.plexus.classworlds.launcher.Launcher.main (Launcher.java:347)
Caused by: org.apache.maven.plugin.MojoFailureException: 1 build failed. See console output above for details.
    at org.apache.maven.plugins.invoker.InvokerSession.handleFailures (InvokerSession.java:259)
    at org.apache.maven.plugins.invoker.VerifyMojo.execute (VerifyMojo.java:140)
    at org.apache.maven.plugin.DefaultBuildPluginManager.executeMojo (DefaultBuildPluginManager.java:137)
    at org.apache.maven.lifecycle.internal.MojoExecutor.execute (MojoExecutor.java:210)
    at org.apache.maven.lifecycle.internal.MojoExecutor.execute (MojoExecutor.java:156)
    at org.apache.maven.lifecycle.internal.MojoExecutor.execute (MojoExecutor.java:148)
    at org.apache.maven.lifecycle.internal.LifecycleModuleBuilder.buildProject (LifecycleModuleBuilder.java:117)
    at org.apache.maven.lifecycle.internal.LifecycleModuleBuilder.buildProject (LifecycleModuleBuilder.java:81)
    at org.apache.maven.lifecycle.internal.builder.singlethreaded.SingleThreadedBuilder.build (SingleThreadedBuilder.java:56)
    at org.apache.maven.lifecycle.internal.LifecycleStarter.execute (LifecycleStarter.java:128)
    at org.apache.maven.DefaultMaven.doExecute (DefaultMaven.java:305)
    at org.apache.maven.DefaultMaven.doExecute (DefaultMaven.java:192)
    at org.apache.maven.DefaultMaven.execute (DefaultMaven.java:105)
    at org.apache.maven.cli.MavenCli.execute (MavenCli.java:956)
    at org.apache.maven.cli.MavenCli.doMain (MavenCli.java:288)
    at org.apache.maven.cli.MavenCli.main (MavenCli.java:192)
    at jdk.internal.reflect.NativeMethodAccessorImpl.invoke0 (Native Method)
    at jdk.internal.reflect.NativeMethodAccessorImpl.invoke (NativeMethodAccessorImpl.java:62)
    at jdk.internal.reflect.DelegatingMethodAccessorImpl.invoke (DelegatingMethodAccessorImpl.java:43)
    at java.lang.reflect.Method.invoke (Method.java:567)
    at org.codehaus.plexus.classworlds.launcher.Launcher.launchEnhanced (Launcher.java:282)
    at org.codehaus.plexus.classworlds.launcher.Launcher.launch (Launcher.java:225)
    at org.codehaus.plexus.classworlds.launcher.Launcher.mainWithExitCode (Launcher.java:406)
    at org.codehaus.plexus.classworlds.launcher.Launcher.main (Launcher.java:347)
[ERROR]
[ERROR] Re-run Maven using the -X switch to enable full debug logging.
[ERROR]
[ERROR] For more information about the errors and possible solutions, please read the following articles:
[ERROR] [Help 1] http://cwiki.apache.org/confluence/display/MAVEN/MojoFailureException
[Pipeline] }
[Pipeline] // dir
[Pipeline] }
[INFO] -------------------------------------------------
[INFO] Build Summary:
[INFO]   Passed: 7, Failed: 1, Errors: 0, Skipped: 0
[INFO] -------------------------------------------------
[ERROR] The following builds failed:
[ERROR] *  sign-and-deploy-file-without-pom
[INFO] -------------------------------------------------
[INFO] ------------------------------------------------------------------------
[INFO] BUILD FAILURE
[INFO] ------------------------------------------------------------------------
[INFO] Total time:  01:26 min
[INFO] Finished at: 2020-06-12T05:13:25-07:00
[INFO] ------------------------------------------------------------------------
[INFO] [jenkins-event-spy] Generated F:\short\m-gpg-p-stabilize-6@tmp\withMavenb643d6cc\maven-spy-20200612-051158-69817718472724003265209.log
[ERROR] Failed to execute goal org.apache.maven.plugins:maven-invoker-plugin:3.2.1:verify (integration-test) on project maven-gpg-plugin: 1 build failed. See console output above for details. -> [Help 1]
org.apache.maven.lifecycle.LifecycleExecutionException: Failed to execute goal org.apache.maven.plugins:maven-invoker-plugin:3.2.1:verify (integration-test) on project maven-gpg-plugin: 1 build failed. See console output above for details.
    at org.apache.maven.lifecycle.internal.MojoExecutor.execute (MojoExecutor.java:215)
    at org.apache.maven.lifecycle.internal.MojoExecutor.execute (MojoExecutor.java:156)
    at org.apache.maven.lifecycle.internal.MojoExecutor.execute (MojoExecutor.java:148)
    at org.apache.maven.lifecycle.internal.LifecycleModuleBuilder.buildProject (LifecycleModuleBuilder.java:117)
    at org.apache.maven.lifecycle.internal.LifecycleModuleBuilder.buildProject (LifecycleModuleBuilder.java:81)
    at org.apache.maven.lifecycle.internal.builder.singlethreaded.SingleThreadedBuilder.build (SingleThreadedBuilder.java:56)
    at org.apache.maven.lifecycle.internal.LifecycleStarter.execute (LifecycleStarter.java:128)
    at org.apache.maven.DefaultMaven.doExecute (DefaultMaven.java:305)
    at org.apache.maven.DefaultMaven.doExecute (DefaultMaven.java:192)
    at org.apache.maven.DefaultMaven.execute (DefaultMaven.java:105)
    at org.apache.maven.cli.MavenCli.execute (MavenCli.java:956)
    at org.apache.maven.cli.MavenCli.doMain (MavenCli.java:288)
    at org.apache.maven.cli.MavenCli.main (MavenCli.java:192)
    at jdk.internal.reflect.NativeMethodAccessorImpl.invoke0 (Native Method)
    at jdk.internal.reflect.NativeMethodAccessorImpl.invoke (NativeMethodAccessorImpl.java:62)
    at jdk.internal.reflect.DelegatingMethodAccessorImpl.invoke (DelegatingMethodAccessorImpl.java:43)
    at java.lang.reflect.Method.invoke (Method.java:566)
    at org.codehaus.plexus.classworlds.launcher.Launcher.launchEnhanced (Launcher.java:282)
    at org.codehaus.plexus.classworlds.launcher.Launcher.launch (Launcher.java:225)
    at org.codehaus.plexus.classworlds.launcher.Launcher.mainWithExitCode (Launcher.java:406)
    at org.codehaus.plexus.classworlds.launcher.Launcher.main (Launcher.java:347)
Caused by: org.apache.maven.plugin.MojoFailureException: 1 build failed. See console output above for details.
    at org.apache.maven.plugins.invoker.InvokerSession.handleFailures (InvokerSession.java:259)
    at org.apache.maven.plugins.invoker.VerifyMojo.execute (VerifyMojo.java:140)
    at org.apache.maven.plugin.DefaultBuildPluginManager.executeMojo (DefaultBuildPluginManager.java:137)
    at org.apache.maven.lifecycle.internal.MojoExecutor.execute (MojoExecutor.java:210)
    at org.apache.maven.lifecycle.internal.MojoExecutor.execute (MojoExecutor.java:156)
    at org.apache.maven.lifecycle.internal.MojoExecutor.execute (MojoExecutor.java:148)
    at org.apache.maven.lifecycle.internal.LifecycleModuleBuilder.buildProject (LifecycleModuleBuilder.java:117)
    at org.apache.maven.lifecycle.internal.LifecycleModuleBuilder.buildProject (LifecycleModuleBuilder.java:81)
    at org.apache.maven.lifecycle.internal.builder.singlethreaded.SingleThreadedBuilder.build (SingleThreadedBuilder.java:56)
    at org.apache.maven.lifecycle.internal.LifecycleStarter.execute (LifecycleStarter.java:128)
    at org.apache.maven.DefaultMaven.doExecute (DefaultMaven.java:305)
    at org.apache.maven.DefaultMaven.doExecute (DefaultMaven.java:192)
    at org.apache.maven.DefaultMaven.execute (DefaultMaven.java:105)
    at org.apache.maven.cli.MavenCli.execute (MavenCli.java:956)
    at org.apache.maven.cli.MavenCli.doMain (MavenCli.java:288)
    at org.apache.maven.cli.MavenCli.main (MavenCli.java:192)
    at jdk.internal.reflect.NativeMethodAccessorImpl.invoke0 (Native Method)
    at jdk.internal.reflect.NativeMethodAccessorImpl.invoke (NativeMethodAccessorImpl.java:62)
    at jdk.internal.reflect.DelegatingMethodAccessorImpl.invoke (DelegatingMethodAccessorImpl.java:43)
    at java.lang.reflect.Method.invoke (Method.java:566)
    at org.codehaus.plexus.classworlds.launcher.Launcher.launchEnhanced (Launcher.java:282)
    at org.codehaus.plexus.classworlds.launcher.Launcher.launch (Launcher.java:225)
    at org.codehaus.plexus.classworlds.launcher.Launcher.mainWithExitCode (Launcher.java:406)
    at org.codehaus.plexus.classworlds.launcher.Launcher.main (Launcher.java:347)
[ERROR]
[ERROR] Re-run Maven using the -X switch to enable full debug logging.
[ERROR]
[ERROR] For more information about the errors and possible solutions, please read the following articles:
[ERROR] [Help 1] http://cwiki.apache.org/confluence/display/MAVEN/MojoFailureException
[Pipeline] }
[Fast Archiver] No prior successful build to compare, so performing full copy of artifacts
[withMaven] junitPublisher - Archive test results for Maven artifact org.apache.maven.plugins:maven-gpg-plugin:maven-plugin:3.0.1-SNAPSHOT generated by maven-surefire-plugin:test (default-test): j14m3.6.xb\target\surefire-reports\*.xml
Recording test results
[Pipeline] // dir
[Pipeline] }
[Fast Archiver] No prior successful build to compare, so performing full copy of artifacts
[withMaven] junitPublisher - Archive test results for Maven artifact org.apache.maven.plugins:maven-gpg-plugin:maven-plugin:3.0.1-SNAPSHOT generated by maven-surefire-plugin:test (default-test): j11m3.6.xb\target\surefire-reports\*.xml
[withMaven] openTasksPublisher - Scan Tasks for Maven artifact org.apache.maven.plugins:maven-gpg-plugin:maven-plugin:3.0.1-SNAPSHOT in source directory j14m3.6.xb\src\main\java
Recording test results
[TASKS] Scanning folder 'F:\short\m-gpg-p-stabilize-6@2' for files matching the pattern 'j14m3.6.xb\src\main\java\**\*' - excludes: null
[TASKS] Found 10 files to scan for tasks
[TASKS] Found 1 open tasks.
Skipping warnings blame since pipelines do not have an SCM link.%n
[withMaven] invokerPublisher - Archive invoker results for Maven artifact MavenArtifact{org.apache.maven.plugins:maven-gpg-plugin:maven-plugin:3.0.1-SNAPSHOT(version: 3.0.1-SNAPSHOT, snapshot:false) } generated by PluginInvocation{org.apache.maven.plugins:maven-invoker-plugin:3.2.1@integration-test  integration-test}: j14m3.6.xb\target\invoker-reports\*.xml
[withMaven] openTasksPublisher - Scan Tasks for Maven artifact org.apache.maven.plugins:maven-gpg-plugin:maven-plugin:3.0.1-SNAPSHOT in source directory j11m3.6.xb\src\main\java
[TASKS] Scanning folder 'F:\short\m-gpg-p-stabilize-6' for files matching the pattern 'j11m3.6.xb\src\main\java\**\*' - excludes: null
[TASKS] Found 10 files to scan for tasks
[TASKS] Found 1 open tasks.
Skipping warnings blame since pipelines do not have an SCM link.%n
[withMaven] invokerPublisher - Archive invoker results for Maven artifact MavenArtifact{org.apache.maven.plugins:maven-gpg-plugin:maven-plugin:3.0.1-SNAPSHOT(version: 3.0.1-SNAPSHOT, snapshot:false) } generated by PluginInvocation{org.apache.maven.plugins:maven-invoker-plugin:3.2.1@integration-test  integration-test}: j11m3.6.xb\target\invoker-reports\*.xml
[withMaven] Publishers: Generated Artifacts Publisher: 11 ms, Junit Publisher: 124 ms, Open Task Scanner Publisher: 61 ms, Invoker Publisher: 1888 ms
[Pipeline] // withMaven
[Pipeline] cleanWs
[WS-CLEANUP] Deleting project workspace...
[WS-CLEANUP] Deferred wipeout is used...
[WS-CLEANUP] done
[Pipeline] cleanWs
[WS-CLEANUP] Deleting project workspace...
[WS-CLEANUP] Deferred wipeout is used...
[WS-CLEANUP] done
[Pipeline] }
[withMaven] Publishers: Generated Artifacts Publisher: 39 ms, Junit Publisher: 100 ms, Open Task Scanner Publisher: 57 ms, Invoker Publisher: 1948 ms
[Pipeline] // stage
[Pipeline] // withMaven
[Pipeline] }
[Pipeline] cleanWs
[WS-CLEANUP] Deleting project workspace...
[WS-CLEANUP] Deferred wipeout is used...
[Pipeline] // ws
[WS-CLEANUP] done
[Pipeline] }
[Pipeline] // node
[Pipeline] }
Failed in branch windows-jdk14-m3.6.x_build
[Pipeline] cleanWs
[WS-CLEANUP] Deleting project workspace...
[WS-CLEANUP] Deferred wipeout is used...
[WS-CLEANUP] done
[Pipeline] }
[Pipeline] // stage
[Pipeline] }
[Pipeline] // ws
[Pipeline] }
[Pipeline] // node
[Pipeline] }
Failed in branch windows-jdk11-m3.6.x_build
[withMaven] Publishers: Generated Artifacts Publisher: 963 ms, Junit Publisher: 1125 ms, Open Task Scanner Publisher: 512 ms, Invoker Publisher: 6872 ms, Pipeline Graph Publisher: 1 ms
[Pipeline] // withMaven
[Pipeline] cleanWs
[WS-CLEANUP] Deleting project workspace...
[WS-CLEANUP] Deferred wipeout is used...
[WS-CLEANUP] done
[Pipeline] }
[Pipeline] // stage
[Pipeline] }
[Pipeline] // ws
[Pipeline] }
[Pipeline] // node
[Pipeline] }
[Pipeline] // parallel
[Pipeline] stage
[Pipeline] { (Notifications)
[Pipeline] echo
Build result: FAILURE
[Pipeline] jiraIssueSelector
[Pipeline] echo
The authors of changes [rfscholte].
[Pipeline] echo
Sending email ...
[Pipeline] emailext
Reply | Threaded
Open this post in threaded view
|

Build succeeded in Jenkins: Maven TLP » maven-gpg-plugin » stabilize #7

Apache Jenkins Server-2