Build failed in Jenkins: Maven TLP » maven-file-management » MSHARED-719 #1

Previous Topic Next Topic
 
classic Classic list List threaded Threaded
6 messages Options
Reply | Threaded
Open this post in threaded view
|

Build failed in Jenkins: Maven TLP » maven-file-management » MSHARED-719 #1

Apache Jenkins Server-2
See https://builds.apache.org/job/maven-box/job/maven-file-management/job/MSHARED-719/1/

No changes.

No tests ran.

Build log:
[...truncated 43.60 KB...]
[linux-jdk8] Fetching upstream changes from https://gitbox.apache.org/repos/asf/maven-file-management.git
[linux-jdk8]  > git fetch --no-tags --progress https://gitbox.apache.org/repos/asf/maven-file-management.git +refs/heads/*:refs/remotes/origin/*
[linux-jdk9] Checking out Revision c93f2a7cb9b6b82589c615ee53a56f3ab427894c (MSHARED-719)
[linux-jdk10] Checking out Revision c93f2a7cb9b6b82589c615ee53a56f3ab427894c (MSHARED-719)
[windows-jdk8] fatal: bad object 090e7ee9c188397dc0a755b7eb60600eb6c2c0c9
[Pipeline] [windows-jdk10] withMaven
[windows-jdk10] [withMaven] Options: [org.jenkinsci.plugins.pipeline.maven.publishers.GeneratedArtifactsPublisher[disabled=true], org.jenkinsci.plugins.pipeline.maven.publishers.JunitTestsPublisher[disabled=false], org.jenkinsci.plugins.pipeline.maven.publishers.FindbugsAnalysisPublisher[disabled=true], org.jenkinsci.plugins.pipeline.maven.publishers.TasksScannerPublisher[disabled=true], org.jenkinsci.plugins.pipeline.maven.publishers.DependenciesFingerprintPublisher[disabled=false, scopes=[compile, provided, runtime], versions={snapshot:true, release:false}], org.jenkinsci.plugins.pipeline.maven.publishers.InvokerRunsPublisher[disabled=false], org.jenkinsci.plugins.pipeline.maven.publishers.PipelineGraphPublisher[disabled=false, scopes=[compile, provided, runtime], versions={snapshot:true, release:false}, skipDownstreamTriggers=false, lifecycleThreshold=deploy, ignoreUpstreamTriggers=false]]
[windows-jdk10] [withMaven] Available options:
[windows-jdk10] [withMaven] using JDK installation JDK 10 b46 (Windows Only)
[windows-jdk10] [withMaven] using Maven installation 'Maven 3.5.0 (Windows)'
[Pipeline] [windows-jdk10] {
[linux-jdk7] Checking out Revision c93f2a7cb9b6b82589c615ee53a56f3ab427894c (MSHARED-719)
[Pipeline] [windows-jdk7] // dir
[Pipeline] [windows-jdk7] }
[Pipeline] [windows-jdk10] dir
[windows-jdk10] Running in f:\jenkins\jenkins-slave\workspace\file-management_MSHARED-719-35QPTJNE7ZVAHNXOCBD2Y6S677IDRPYDJFRD5KGMFOL5Z3PZX73Q@2\m
[Pipeline] [windows-jdk10] {
[linux-jdk7]  > git config core.sparsecheckout # timeout=10
[linux-jdk7]  > git checkout -f c93f2a7cb9b6b82589c615ee53a56f3ab427894c
[linux-jdk9]  > git config core.sparsecheckout # timeout=10
[linux-jdk9]  > git checkout -f c93f2a7cb9b6b82589c615ee53a56f3ab427894c
[linux-jdk10]  > git config core.sparsecheckout # timeout=10
[linux-jdk10]  > git checkout -f c93f2a7cb9b6b82589c615ee53a56f3ab427894c
[windows-jdk9]
[windows-jdk9] f:\jenkins\jenkins-slave\workspace\file-management_MSHARED-719-35QPTJNE7ZVAHNXOCBD2Y6S677IDRPYDJFRD5KGMFOL5Z3PZX73Q\m>mvn -P+run-its -Dmaven.test.failure.ignore=true -Dfindbugs.failOnError=false -Dfindbugs.skip=true clean verify
[windows-jdk9] ----- withMaven Wrapper script -----
[Pipeline] [windows-jdk8] }
[Pipeline] [windows-jdk10] isUnix
[Pipeline] [windows-jdk10] bat
[windows-jdk10] [m] Running batch script
[Pipeline] [windows-jdk7] // stage
[Pipeline] [windows-jdk7] stage
[Pipeline] [windows-jdk7] { (Build windows-jdk7)
[linux-jdk7] Commit message: "[MSHARED-719] - Upgrade mave-surefire/failsafe-plugin 2.21.0"
[linux-jdk7] Cleaning workspace
[linux-jdk10] Commit message: "[MSHARED-719] - Upgrade mave-surefire/failsafe-plugin 2.21.0"
[linux-jdk10] Cleaning workspace
[Pipeline] [windows-jdk8] // dir
[Pipeline] [windows-jdk8] }
[Pipeline] [windows-jdk7] withMaven
[windows-jdk7] [withMaven] Options: [org.jenkinsci.plugins.pipeline.maven.publishers.GeneratedArtifactsPublisher[disabled=true], org.jenkinsci.plugins.pipeline.maven.publishers.JunitTestsPublisher[disabled=false], org.jenkinsci.plugins.pipeline.maven.publishers.FindbugsAnalysisPublisher[disabled=true], org.jenkinsci.plugins.pipeline.maven.publishers.TasksScannerPublisher[disabled=true], org.jenkinsci.plugins.pipeline.maven.publishers.DependenciesFingerprintPublisher[disabled=false, scopes=[compile, provided, runtime], versions={snapshot:true, release:false}], org.jenkinsci.plugins.pipeline.maven.publishers.InvokerRunsPublisher[disabled=false], org.jenkinsci.plugins.pipeline.maven.publishers.PipelineGraphPublisher[disabled=false, scopes=[compile, provided, runtime], versions={snapshot:true, release:false}, skipDownstreamTriggers=false, lifecycleThreshold=deploy, ignoreUpstreamTriggers=false]]
[windows-jdk7] [withMaven] Available options:
[windows-jdk7] [withMaven] using JDK installation JDK 1.7 (latest)
[windows-jdk7] [withMaven] using Maven installation 'Maven 3.5.0 (Windows)'
[Pipeline] [windows-jdk7] {
[Pipeline] [windows-jdk7] dir
[windows-jdk7] Running in f:\jenkins\jenkins-slave\workspace\file-management_MSHARED-719-35QPTJNE7ZVAHNXOCBD2Y6S677IDRPYDJFRD5KGMFOL5Z3PZX73Q\m
[Pipeline] [windows-jdk7] {
[windows-jdk10]
[windows-jdk10] f:\jenkins\jenkins-slave\workspace\file-management_MSHARED-719-35QPTJNE7ZVAHNXOCBD2Y6S677IDRPYDJFRD5KGMFOL5Z3PZX73Q@2\m>mvn -P+run-its -Dmaven.test.failure.ignore=true -Dfindbugs.failOnError=false -Dfindbugs.skip=true clean verify
[windows-jdk10] ----- withMaven Wrapper script -----
[linux-jdk7]  > git rev-parse --verify HEAD # timeout=10
[linux-jdk7] Resetting working tree
[linux-jdk7]  > git reset --hard # timeout=10
[linux-jdk7]  > git clean -fdx # timeout=10
[linux-jdk10]  > git rev-parse --verify HEAD # timeout=10
[linux-jdk10] Resetting working tree
[linux-jdk10]  > git reset --hard # timeout=10
[linux-jdk10]  > git clean -fdx # timeout=10
[windows-jdk9] Picked up JAVA_TOOL_OPTIONS: -Dmaven.ext.class.path="f:\jenkins\jenkins-slave\workspace\file-management_MSHARED-719-35QPTJNE7ZVAHNXOCBD2Y6S677IDRPYDJFRD5KGMFOL5Z3PZX73Q@tmp\withMavene976b975\pipeline-maven-spy.jar" -Dorg.jenkinsci.plugins.pipeline.maven.reportsFolder="f:\jenkins\jenkins-slave\workspace\file-management_MSHARED-719-35QPTJNE7ZVAHNXOCBD2Y6S677IDRPYDJFRD5KGMFOL5Z3PZX73Q@tmp\withMavene976b975"
[Pipeline] [windows-jdk7] isUnix
[Pipeline] [windows-jdk7] bat
[windows-jdk7] [m] Running batch script
[Pipeline] [windows-jdk8] // stage
[Pipeline] [windows-jdk8] stage
[Pipeline] [windows-jdk8] { (Build windows-jdk8)
[Pipeline] [linux-jdk9] }
[Pipeline] [windows-jdk8] withMaven
[windows-jdk8] [withMaven] Options: [org.jenkinsci.plugins.pipeline.maven.publishers.GeneratedArtifactsPublisher[disabled=true], org.jenkinsci.plugins.pipeline.maven.publishers.JunitTestsPublisher[disabled=false], org.jenkinsci.plugins.pipeline.maven.publishers.FindbugsAnalysisPublisher[disabled=true], org.jenkinsci.plugins.pipeline.maven.publishers.TasksScannerPublisher[disabled=true], org.jenkinsci.plugins.pipeline.maven.publishers.DependenciesFingerprintPublisher[disabled=false, scopes=[compile, provided, runtime], versions={snapshot:true, release:false}], org.jenkinsci.plugins.pipeline.maven.publishers.InvokerRunsPublisher[disabled=false], org.jenkinsci.plugins.pipeline.maven.publishers.PipelineGraphPublisher[disabled=false, scopes=[compile, provided, runtime], versions={snapshot:true, release:false}, skipDownstreamTriggers=false, lifecycleThreshold=deploy, ignoreUpstreamTriggers=false]]
[windows-jdk8] [withMaven] Available options:
[windows-jdk8] [withMaven] using JDK installation JDK 1.8 (latest)
[windows-jdk8] [withMaven] using Maven installation 'Maven 3.5.0 (Windows)'
[Pipeline] [windows-jdk8] {
[windows-jdk10] Picked up JAVA_TOOL_OPTIONS: -Dmaven.ext.class.path="f:\jenkins\jenkins-slave\workspace\file-management_MSHARED-719-35QPTJNE7ZVAHNXOCBD2Y6S677IDRPYDJFRD5KGMFOL5Z3PZX73Q@2@tmp\withMaven923df0fd\pipeline-maven-spy.jar" -Dorg.jenkinsci.plugins.pipeline.maven.reportsFolder="f:\jenkins\jenkins-slave\workspace\file-management_MSHARED-719-35QPTJNE7ZVAHNXOCBD2Y6S677IDRPYDJFRD5KGMFOL5Z3PZX73Q@2@tmp\withMaven923df0fd"
[Pipeline] [windows-jdk8] dir
[windows-jdk8] Running in f:\jenkins\jenkins-slave\workspace\file-management_MSHARED-719-35QPTJNE7ZVAHNXOCBD2Y6S677IDRPYDJFRD5KGMFOL5Z3PZX73Q@2\m
[Pipeline] [windows-jdk8] {
[windows-jdk7]
[windows-jdk7] f:\jenkins\jenkins-slave\workspace\file-management_MSHARED-719-35QPTJNE7ZVAHNXOCBD2Y6S677IDRPYDJFRD5KGMFOL5Z3PZX73Q\m>mvn -P+run-its -Dmaven.test.failure.ignore=true -Dfindbugs.failOnError=false -Dfindbugs.skip=true clean verify
[windows-jdk7] ----- withMaven Wrapper script -----
[linux-jdk8] Checking out Revision c93f2a7cb9b6b82589c615ee53a56f3ab427894c (MSHARED-719)
[Pipeline] [windows-jdk8] isUnix
[Pipeline] [windows-jdk8] bat
[windows-jdk8] [m] Running batch script
[linux-jdk8]  > git config core.sparsecheckout # timeout=10
[linux-jdk8]  > git checkout -f c93f2a7cb9b6b82589c615ee53a56f3ab427894c
[Pipeline] [linux-jdk9] // dir
[Pipeline] [linux-jdk9] echo
[linux-jdk9] [FAIL FAST] This is the first failure and likely root cause
[Pipeline] [linux-jdk9] }
[Pipeline] [linux-jdk9] // stage
[Pipeline] [linux-jdk9] }
[Pipeline] [linux-jdk9] // node
[Pipeline] [linux-jdk9] }
[windows-jdk10] Apache Maven 3.5.0 (ff8f5e7444045639af65f6095c62210b5713f426; 2017-04-03T19:39:06Z)
[windows-jdk10] Maven home: F:\jenkins\tools\maven\apache-maven-3.5.0\bin\..
[windows-jdk10] Java version: 10, vendor: Oracle Corporation
[windows-jdk10] Java home: F:\jenkins\tools\java\jdk10_46
[windows-jdk10] Default locale: en_US, platform encoding: Cp1252
[windows-jdk10] OS name: "windows server 2012 r2", version: "6.3", arch: "amd64", family: "windows"
[windows-jdk7] Sending interrupt signal to process
[windows-jdk7] Apache Maven 3.5.0 (ff8f5e7444045639af65f6095c62210b5713f426; 2017-04-03T19:39:06Z)
[windows-jdk7] Maven home: F:\jenkins\tools\maven\apache-maven-3.5.0\bin\..
[windows-jdk7] Java version: 1.7.0_79, vendor: Oracle Corporation
[windows-jdk7] Java home: f:\jenkins\tools\java\latest1.7\jre
[windows-jdk7] Default locale: en_US, platform encoding: Cp1252
[windows-jdk7] OS name: "windows server 2012 r2", version: "6.3", arch: "amd64", family: "windows"
[windows-jdk8] Sending interrupt signal to process
[windows-jdk8]
[windows-jdk8] f:\jenkins\jenkins-slave\workspace\file-management_MSHARED-719-35QPTJNE7ZVAHNXOCBD2Y6S677IDRPYDJFRD5KGMFOL5Z3PZX73Q@2\m>mvn -P+run-its -Dmaven.test.failure.ignore=true -Dfindbugs.failOnError=false -Dfindbugs.skip=true clean verify
[windows-jdk8] ----- withMaven Wrapper script -----
[linux-jdk9] Failed in branch linux-jdk9
[linux-jdk8] ERROR: Unable to retrieve commit message
[linux-jdk8] java.lang.InterruptedException
[linux-jdk8] at java.lang.Object.wait(Native Method)
[linux-jdk8] at hudson.remoting.Request.call(Request.java:167)
[linux-jdk8] at hudson.remoting.Channel.call(Channel.java:907)
[linux-jdk8] at hudson.remoting.RemoteInvocationHandler.invoke(RemoteInvocationHandler.java:281)
[linux-jdk8] at com.sun.proxy.$Proxy109.withRepository(Unknown Source)
[linux-jdk8] at org.jenkinsci.plugins.gitclient.RemoteGitImpl.withRepository(RemoteGitImpl.java:235)
[linux-jdk8] at hudson.plugins.git.GitSCM.printCommitMessageToLog(GitSCM.java:1245)
[linux-jdk8] at hudson.plugins.git.GitSCM.checkout(GitSCM.java:1218)
[linux-jdk8] at org.jenkinsci.plugins.workflow.steps.scm.SCMStep.checkout(SCMStep.java:113)
[linux-jdk8] at org.jenkinsci.plugins.workflow.steps.scm.SCMStep$StepExecutionImpl.run(SCMStep.java:85)
[linux-jdk8] at org.jenkinsci.plugins.workflow.steps.scm.SCMStep$StepExecutionImpl.run(SCMStep.java:75)
[linux-jdk8] at org.jenkinsci.plugins.workflow.steps.AbstractSynchronousNonBlockingStepExecution$1$1.call(AbstractSynchronousNonBlockingStepExecution.java:47)
[linux-jdk8] at hudson.security.ACL.impersonate(ACL.java:260)
[linux-jdk8] at org.jenkinsci.plugins.workflow.steps.AbstractSynchronousNonBlockingStepExecution$1.run(AbstractSynchronousNonBlockingStepExecution.java:44)
[linux-jdk8] at java.util.concurrent.Executors$RunnableAdapter.call(Executors.java:511)
[linux-jdk8] at java.util.concurrent.FutureTask.run(FutureTask.java:266)
[linux-jdk8] at java.util.concurrent.ThreadPoolExecutor.runWorker(ThreadPoolExecutor.java:1149)
[linux-jdk8] at java.util.concurrent.ThreadPoolExecutor$Worker.run(ThreadPoolExecutor.java:624)
[linux-jdk8] at java.lang.Thread.run(Thread.java:748)
[linux-jdk8] Cleaning workspace
[linux-jdk8]  > git rev-parse --verify HEAD # timeout=10
[linux-jdk8] Resetting working tree
[linux-jdk8]  > git reset --hard # timeout=10
[linux-jdk8]  > git clean -fdx # timeout=10
[windows-jdk9] Apache Maven 3.5.0 (ff8f5e7444045639af65f6095c62210b5713f426; 2017-04-03T19:39:06Z)
[windows-jdk9] Maven home: F:\jenkins\tools\maven\apache-maven-3.5.0\bin\..
[windows-jdk9] Java version: 9.0.1, vendor: Oracle Corporation
[windows-jdk9] Java home: f:\jenkins\tools\java\latest9
[windows-jdk9] Default locale: en_US, platform encoding: Cp1252
[windows-jdk9] OS name: "windows server 2012 r2", version: "6.3", arch: "amd64", family: "windows"
[windows-jdk10] Sending interrupt signal to process
[windows-jdk9] Sending interrupt signal to process
[Pipeline] [linux-jdk7] }
[Pipeline] [linux-jdk10] }
[Pipeline] [windows-jdk9] }
[Pipeline] [linux-jdk7] // dir
[Pipeline] [linux-jdk10] // dir
[Pipeline] [windows-jdk9] // dir
[Pipeline] [linux-jdk7] echo
[linux-jdk7] [FAIL FAST] linux-jdk9 had first failure, ignoring java.lang.InterruptedException
[Pipeline] [linux-jdk7] }
[Pipeline] [linux-jdk10] echo
[linux-jdk10] [FAIL FAST] linux-jdk9 had first failure, ignoring java.lang.InterruptedException
[Pipeline] [linux-jdk10] }
[Pipeline] [windows-jdk9] }
[Pipeline] [linux-jdk7] // stage
[Pipeline] [linux-jdk10] // stage
[Pipeline] [windows-jdk9] // withMaven
[Pipeline] [linux-jdk7] stage
[Pipeline] [linux-jdk7] { (Build linux-jdk7)
[Pipeline] [linux-jdk10] stage
[Pipeline] [linux-jdk10] { (Build linux-jdk10)
[Pipeline] [windows-jdk9] echo
[windows-jdk9] [FAIL FAST] linux-jdk9 had first failure, ignoring script returned exit code -1
[Pipeline] [windows-jdk9] }
[Pipeline] [linux-jdk7] echo
[linux-jdk7] [FAIL FAST] linux-jdk9 has failed. Skipping linux-jdk7.
[Pipeline] [linux-jdk7] }
[Pipeline] [linux-jdk10] echo
[linux-jdk10] [FAIL FAST] linux-jdk9 has failed. Skipping linux-jdk10.
[Pipeline] [linux-jdk10] }
[Pipeline] [windows-jdk9] // stage
[Pipeline] [windows-jdk9] }
[Pipeline] [linux-jdk7] // stage
[Pipeline] [linux-jdk10] // stage
[Pipeline] [linux-jdk7] }
[Pipeline] [linux-jdk10] }
[linux-jdk8] fatal: bad object 090e7ee9c188397dc0a755b7eb60600eb6c2c0c9
[Pipeline] [windows-jdk9] // node
[Pipeline] [windows-jdk9] }
[Pipeline] [linux-jdk7] // node
[Pipeline] [linux-jdk10] // node
[Pipeline] [linux-jdk7] }
[Pipeline] [linux-jdk10] }
[Pipeline] [linux-jdk8] }
[Pipeline] [linux-jdk8] // dir
[Pipeline] [linux-jdk8] }
[Pipeline] [linux-jdk8] // stage
[Pipeline] [linux-jdk8] stage
[Pipeline] [linux-jdk8] { (Build linux-jdk8)
[Pipeline] [linux-jdk8] echo
[linux-jdk8] [FAIL FAST] linux-jdk9 has failed. Skipping linux-jdk8.
[Pipeline] [linux-jdk8] }
[Pipeline] [linux-jdk8] // stage
[Pipeline] [linux-jdk8] }
[Pipeline] [linux-jdk8] // node
[Pipeline] [linux-jdk8] }
[windows-jdk7] After 10s process did not stop
[Pipeline] [windows-jdk7] }
[Pipeline] [windows-jdk7] // dir
[Pipeline] [windows-jdk7] }
[Pipeline] [windows-jdk7] // withMaven
[Pipeline] [windows-jdk7] echo
[windows-jdk7] [FAIL FAST] linux-jdk9 had first failure, ignoring null
[Pipeline] [windows-jdk7] }
[Pipeline] [windows-jdk7] // stage
[Pipeline] [windows-jdk7] }
[Pipeline] [windows-jdk7] // node
[windows-jdk8] After 10s process did not stop
[Pipeline] [windows-jdk7] }
[Pipeline] [windows-jdk8] }
[Pipeline] [windows-jdk8] // dir
[Pipeline] [windows-jdk8] }
[Pipeline] [windows-jdk8] // withMaven
[Pipeline] [windows-jdk8] echo
[windows-jdk8] [FAIL FAST] linux-jdk9 had first failure, ignoring null
[Pipeline] [windows-jdk8] }
[Pipeline] [windows-jdk8] // stage
[Pipeline] [windows-jdk8] }
[Pipeline] [windows-jdk8] // node
[Pipeline] [windows-jdk8] }
[windows-jdk10] After 10s process did not stop
[Pipeline] [windows-jdk10] }
[Pipeline] [windows-jdk10] // dir
[Pipeline] [windows-jdk10] }
[Pipeline] [windows-jdk10] // withMaven
[Pipeline] [windows-jdk10] echo
[windows-jdk10] [FAIL FAST] linux-jdk9 had first failure, ignoring null
[Pipeline] [windows-jdk10] }
[Pipeline] [windows-jdk10] // stage
[Pipeline] [windows-jdk10] }
[Pipeline] [windows-jdk10] // node
[Pipeline] [windows-jdk10] }
[Pipeline] // parallel
[Pipeline] echo
***** FAST FAILURE *****

Fast failure triggered by linux-jdk9

***** FAST FAILURE *****
[Pipeline] stage
[Pipeline] { (Notifications)
[Pipeline] echo
Build result: FAILURE
[Pipeline] jiraIssueSelector
Reply | Threaded
Open this post in threaded view
|

Build failed in Jenkins: Maven TLP » maven-file-management » MSHARED-719 #2

Apache Jenkins Server-2
See https://builds.apache.org/job/maven-box/job/maven-file-management/job/MSHARED-719/2/

No changes.

No tests ran.

Build log:
[...truncated 22.32 KB...]
[linux-jdk7]  > git --version # timeout=10
[linux-jdk7]  > git fetch --no-tags --progress https://gitbox.apache.org/repos/asf/maven-file-management.git +refs/heads/*:refs/remotes/origin/*
[linux-jdk8]  > git rev-parse --is-inside-work-tree # timeout=10
[linux-jdk8] Fetching changes from the remote Git repository
[linux-jdk8]  > git config remote.origin.url https://gitbox.apache.org/repos/asf/maven-file-management.git # timeout=10
[linux-jdk8] Fetching without tags
[linux-jdk8] Fetching upstream changes from https://gitbox.apache.org/repos/asf/maven-file-management.git
[linux-jdk8]  > git --version # timeout=10
[linux-jdk8]  > git fetch --no-tags --progress https://gitbox.apache.org/repos/asf/maven-file-management.git +refs/heads/*:refs/remotes/origin/*
[linux-jdk9]  > git rev-parse --is-inside-work-tree # timeout=10
[linux-jdk9] Fetching changes from the remote Git repository
[linux-jdk9]  > git config remote.origin.url https://gitbox.apache.org/repos/asf/maven-file-management.git # timeout=10
[linux-jdk9] Fetching without tags
[linux-jdk9] Fetching upstream changes from https://gitbox.apache.org/repos/asf/maven-file-management.git
[linux-jdk9]  > git --version # timeout=10
[linux-jdk9]  > git fetch --no-tags --progress https://gitbox.apache.org/repos/asf/maven-file-management.git +refs/heads/*:refs/remotes/origin/*
[linux-jdk10]  > git rev-parse --is-inside-work-tree # timeout=10
[linux-jdk10] Fetching changes from the remote Git repository
[linux-jdk10]  > git config remote.origin.url https://gitbox.apache.org/repos/asf/maven-file-management.git # timeout=10
[linux-jdk10] Fetching without tags
[linux-jdk10] Fetching upstream changes from https://gitbox.apache.org/repos/asf/maven-file-management.git
[linux-jdk10]  > git --version # timeout=10
[linux-jdk10]  > git fetch --no-tags --progress https://gitbox.apache.org/repos/asf/maven-file-management.git +refs/heads/*:refs/remotes/origin/*
[windows-jdk7] Checking out Revision c93f2a7cb9b6b82589c615ee53a56f3ab427894c (MSHARED-719)
[windows-jdk7]  > git config core.sparsecheckout # timeout=10
[windows-jdk7]  > git checkout -f c93f2a7cb9b6b82589c615ee53a56f3ab427894c
[windows-jdk7] Commit message: "[MSHARED-719] - Upgrade mave-surefire/failsafe-plugin 2.21.0"
[windows-jdk7]  > git rev-list --no-walk c93f2a7cb9b6b82589c615ee53a56f3ab427894c # timeout=10
[windows-jdk7] Cleaning workspace
[windows-jdk7]  > git rev-parse --verify HEAD # timeout=10
[windows-jdk8] Checking out Revision c93f2a7cb9b6b82589c615ee53a56f3ab427894c (MSHARED-719)
[windows-jdk8]  > git config core.sparsecheckout # timeout=10
[windows-jdk8]  > git checkout -f c93f2a7cb9b6b82589c615ee53a56f3ab427894c
[windows-jdk8] Commit message: "[MSHARED-719] - Upgrade mave-surefire/failsafe-plugin 2.21.0"
[windows-jdk8] Cleaning workspace
[windows-jdk8]  > git rev-parse --verify HEAD # timeout=10
[windows-jdk8] Resetting working tree
[windows-jdk8]  > git reset --hard # timeout=10
[windows-jdk8]  > git clean -fdx # timeout=10
[Pipeline] [windows-jdk8] }
[Pipeline] [windows-jdk8] // dir
[windows-jdk7] Resetting working tree
[windows-jdk7]  > git reset --hard # timeout=10
[Pipeline] [windows-jdk8] }
[Pipeline] [windows-jdk8] // stage
[Pipeline] [windows-jdk8] stage
[Pipeline] [windows-jdk8] { (Build windows-jdk8)
[windows-jdk7]  > git clean -fdx # timeout=10
[Pipeline] [windows-jdk8] withMaven
[windows-jdk8] [withMaven] Options: [org.jenkinsci.plugins.pipeline.maven.publishers.GeneratedArtifactsPublisher[disabled=true], org.jenkinsci.plugins.pipeline.maven.publishers.JunitTestsPublisher[disabled=false], org.jenkinsci.plugins.pipeline.maven.publishers.FindbugsAnalysisPublisher[disabled=true], org.jenkinsci.plugins.pipeline.maven.publishers.TasksScannerPublisher[disabled=true], org.jenkinsci.plugins.pipeline.maven.publishers.DependenciesFingerprintPublisher[disabled=false, scopes=[compile, provided, runtime], versions={snapshot:true, release:false}], org.jenkinsci.plugins.pipeline.maven.publishers.InvokerRunsPublisher[disabled=false], org.jenkinsci.plugins.pipeline.maven.publishers.PipelineGraphPublisher[disabled=false, scopes=[compile, provided, runtime], versions={snapshot:true, release:false}, skipDownstreamTriggers=false, lifecycleThreshold=deploy, ignoreUpstreamTriggers=false]]
[windows-jdk8] [withMaven] Available options:
[windows-jdk8] [withMaven] using JDK installation JDK 1.8 (latest)
[windows-jdk8] [withMaven] using Maven installation 'Maven 3.5.0 (Windows)'
[Pipeline] [windows-jdk8] {
[Pipeline] [windows-jdk7] }
[Pipeline] [windows-jdk8] dir
[windows-jdk8] Running in f:\jenkins\jenkins-slave\workspace\file-management_MSHARED-719-35QPTJNE7ZVAHNXOCBD2Y6S677IDRPYDJFRD5KGMFOL5Z3PZX73Q@2\m
[Pipeline] [windows-jdk8] {
[Pipeline] [windows-jdk7] // dir
[Pipeline] [windows-jdk7] }
[Pipeline] [windows-jdk8] isUnix
[Pipeline] [windows-jdk8] bat
[windows-jdk8] [m] Running batch script
[Pipeline] [windows-jdk7] // stage
[Pipeline] [windows-jdk7] stage
[Pipeline] [windows-jdk7] { (Build windows-jdk7)
[linux-jdk9] Checking out Revision c93f2a7cb9b6b82589c615ee53a56f3ab427894c (MSHARED-719)
[Pipeline] [windows-jdk7] withMaven
[windows-jdk7] [withMaven] Options: [org.jenkinsci.plugins.pipeline.maven.publishers.GeneratedArtifactsPublisher[disabled=true], org.jenkinsci.plugins.pipeline.maven.publishers.JunitTestsPublisher[disabled=false], org.jenkinsci.plugins.pipeline.maven.publishers.FindbugsAnalysisPublisher[disabled=true], org.jenkinsci.plugins.pipeline.maven.publishers.TasksScannerPublisher[disabled=true], org.jenkinsci.plugins.pipeline.maven.publishers.DependenciesFingerprintPublisher[disabled=false, scopes=[compile, provided, runtime], versions={snapshot:true, release:false}], org.jenkinsci.plugins.pipeline.maven.publishers.InvokerRunsPublisher[disabled=false], org.jenkinsci.plugins.pipeline.maven.publishers.PipelineGraphPublisher[disabled=false, scopes=[compile, provided, runtime], versions={snapshot:true, release:false}, skipDownstreamTriggers=false, lifecycleThreshold=deploy, ignoreUpstreamTriggers=false]]
[windows-jdk7] [withMaven] Available options:
[windows-jdk7] [withMaven] using JDK installation JDK 1.7 (latest)
[windows-jdk7] [withMaven] using Maven installation 'Maven 3.5.0 (Windows)'
[Pipeline] [windows-jdk7] {
[Pipeline] [windows-jdk7] dir
[windows-jdk7] Running in f:\jenkins\jenkins-slave\workspace\file-management_MSHARED-719-35QPTJNE7ZVAHNXOCBD2Y6S677IDRPYDJFRD5KGMFOL5Z3PZX73Q\m
[Pipeline] [windows-jdk7] {
[linux-jdk7] Checking out Revision c93f2a7cb9b6b82589c615ee53a56f3ab427894c (MSHARED-719)
[linux-jdk10] Checking out Revision c93f2a7cb9b6b82589c615ee53a56f3ab427894c (MSHARED-719)
[windows-jdk8]
[windows-jdk8] f:\jenkins\jenkins-slave\workspace\file-management_MSHARED-719-35QPTJNE7ZVAHNXOCBD2Y6S677IDRPYDJFRD5KGMFOL5Z3PZX73Q@2\m>mvn -P+run-its -Dmaven.test.failure.ignore=true -Dfindbugs.failOnError=false -Dfindbugs.skip=true clean verify
[windows-jdk8] ----- withMaven Wrapper script -----
[Pipeline] [windows-jdk7] isUnix
[Pipeline] [windows-jdk7] bat
[windows-jdk9] Running on windows-2012-3 in f:\jenkins\jenkins-slave\workspace\file-management_MSHARED-719-35QPTJNE7ZVAHNXOCBD2Y6S677IDRPYDJFRD5KGMFOL5Z3PZX73Q
[linux-jdk9]  > git config core.sparsecheckout # timeout=10
[linux-jdk9]  > git checkout -f c93f2a7cb9b6b82589c615ee53a56f3ab427894c
[windows-jdk7] [m] Running batch script
[Pipeline] [windows-jdk9] {
[linux-jdk10]  > git config core.sparsecheckout # timeout=10
[linux-jdk10]  > git checkout -f c93f2a7cb9b6b82589c615ee53a56f3ab427894c
[Pipeline] [windows-jdk9] stage
[Pipeline] [windows-jdk9] { (Checkout windows-jdk9)
[Pipeline] [windows-jdk9] dir
[windows-jdk9] Running in f:\jenkins\jenkins-slave\workspace\file-management_MSHARED-719-35QPTJNE7ZVAHNXOCBD2Y6S677IDRPYDJFRD5KGMFOL5Z3PZX73Q\m
[Pipeline] [windows-jdk9] {
[linux-jdk7]  > git config core.sparsecheckout # timeout=10
[linux-jdk7]  > git checkout -f c93f2a7cb9b6b82589c615ee53a56f3ab427894c
[Pipeline] [windows-jdk9] checkout
[linux-jdk8] Checking out Revision c93f2a7cb9b6b82589c615ee53a56f3ab427894c (MSHARED-719)
[Pipeline] [linux-jdk9] }
[windows-jdk9]  > git rev-parse --is-inside-work-tree # timeout=10
[Pipeline] [linux-jdk9] // dir
[linux-jdk10] Commit message: "[MSHARED-719] - Upgrade mave-surefire/failsafe-plugin 2.21.0"
[linux-jdk10] Cleaning workspace
[Pipeline] [linux-jdk9] echo
[linux-jdk9] [FAIL FAST] This is the first failure and likely root cause
[Pipeline] [linux-jdk9] }
[Pipeline] [linux-jdk9] // stage
[windows-jdk9] Fetching changes from the remote Git repository
[linux-jdk7] Commit message: "[MSHARED-719] - Upgrade mave-surefire/failsafe-plugin 2.21.0"
[linux-jdk7] Cleaning workspace
[linux-jdk8]  > git config core.sparsecheckout # timeout=10
[linux-jdk8]  > git checkout -f c93f2a7cb9b6b82589c615ee53a56f3ab427894c
[linux-jdk10]  > git rev-parse --verify HEAD # timeout=10
[linux-jdk10] Resetting working tree
[linux-jdk10]  > git reset --hard # timeout=10
[linux-jdk10]  > git clean -fdx # timeout=10
[Pipeline] [linux-jdk9] }
[windows-jdk10] Running on windows-2012-3 in f:\jenkins\jenkins-slave\workspace\file-management_MSHARED-719-35QPTJNE7ZVAHNXOCBD2Y6S677IDRPYDJFRD5KGMFOL5Z3PZX73Q@2
[Pipeline] [linux-jdk9] // node
[windows-jdk9]  > git config remote.origin.url https://gitbox.apache.org/repos/asf/maven-file-management.git # timeout=10
[Pipeline] [windows-jdk10] {
[windows-jdk9] Fetching without tags
[windows-jdk8] Apache Maven 3.5.0 (ff8f5e7444045639af65f6095c62210b5713f426; 2017-04-03T19:39:06Z)
[windows-jdk8] Maven home: F:\jenkins\tools\maven\apache-maven-3.5.0\bin\..
[windows-jdk8] Java version: 1.8.0_152, vendor: Oracle Corporation
[windows-jdk8] Java home: f:\jenkins\tools\java\latest1.8\jre
[windows-jdk8] Default locale: en_US, platform encoding: Cp1252
[windows-jdk8] OS name: "windows server 2012 r2", version: "6.3", arch: "amd64", family: "windows"
[windows-jdk7]
[windows-jdk7] f:\jenkins\jenkins-slave\workspace\file-management_MSHARED-719-35QPTJNE7ZVAHNXOCBD2Y6S677IDRPYDJFRD5KGMFOL5Z3PZX73Q\m>mvn -P+run-its -Dmaven.test.failure.ignore=true -Dfindbugs.failOnError=false -Dfindbugs.skip=true clean verify
[windows-jdk7] ----- withMaven Wrapper script -----
[Pipeline] [linux-jdk9] }
[linux-jdk9] Failed in branch linux-jdk9
[Pipeline] [linux-jdk10] }
[Pipeline] [windows-jdk10] stage
[Pipeline] [windows-jdk10] { (Checkout windows-jdk10)
[windows-jdk9] Fetching upstream changes from https://gitbox.apache.org/repos/asf/maven-file-management.git
[windows-jdk9]  > git --version # timeout=10
[windows-jdk9]  > git fetch --no-tags --progress https://gitbox.apache.org/repos/asf/maven-file-management.git +refs/heads/*:refs/remotes/origin/*
[linux-jdk7]  > git rev-parse --verify HEAD # timeout=10
[linux-jdk7] Resetting working tree
[linux-jdk7]  > git reset --hard # timeout=10
[linux-jdk7]  > git clean -fdx # timeout=10
[windows-jdk8] Sending interrupt signal to process
[windows-jdk7] Sending interrupt signal to process
[windows-jdk7] Apache Maven 3.5.0 (ff8f5e7444045639af65f6095c62210b5713f426; 2017-04-03T19:39:06Z)
[windows-jdk7] Maven home: F:\jenkins\tools\maven\apache-maven-3.5.0\bin\..
[windows-jdk7] Java version: 1.7.0_79, vendor: Oracle Corporation
[windows-jdk7] Java home: f:\jenkins\tools\java\latest1.7\jre
[windows-jdk7] Default locale: en_US, platform encoding: Cp1252
[windows-jdk7] OS name: "windows server 2012 r2", version: "6.3", arch: "amd64", family: "windows"
[Pipeline] [linux-jdk10] // dir
[Pipeline] [linux-jdk10] }
[Pipeline] [windows-jdk10] }
[Pipeline] [linux-jdk7] }
[Pipeline] [linux-jdk8] }
[Pipeline] [windows-jdk8] }
[Pipeline] [windows-jdk7] }
[Pipeline] [windows-jdk9] }
[Pipeline] [linux-jdk10] // stage
[Pipeline] [windows-jdk10] // stage
[Pipeline] [linux-jdk10] stage
[Pipeline] [linux-jdk10] { (Build linux-jdk10)
[Pipeline] [windows-jdk10] }
[Pipeline] [linux-jdk10] echo
[linux-jdk10] [FAIL FAST] linux-jdk9 has failed. Skipping linux-jdk10.
[Pipeline] [linux-jdk10] }
[Pipeline] [linux-jdk7] // dir
[Pipeline] [linux-jdk8] // dir
[Pipeline] [windows-jdk8] // dir
[Pipeline] [windows-jdk7] // dir
[Pipeline] [windows-jdk9] // dir
[Pipeline] [linux-jdk7] echo
[linux-jdk7] [FAIL FAST] linux-jdk9 had first failure, ignoring null
[Pipeline] [linux-jdk7] }
[Pipeline] [linux-jdk8] echo
[linux-jdk8] [FAIL FAST] linux-jdk9 had first failure, ignoring null
[Pipeline] [linux-jdk8] }
[Pipeline] [windows-jdk8] }
[Pipeline] [windows-jdk7] }
[Pipeline] [windows-jdk9] echo
[windows-jdk9] [FAIL FAST] linux-jdk9 had first failure, ignoring null
[Pipeline] [windows-jdk9] }
[Pipeline] [windows-jdk10] // node
[Pipeline] [windows-jdk10] }
[windows-jdk10] Failed in branch windows-jdk10
[Pipeline] [linux-jdk10] // stage
[Pipeline] [linux-jdk10] }
[Pipeline] [linux-jdk7] // stage
[Pipeline] [linux-jdk8] // stage
[Pipeline] [windows-jdk8] // withMaven
[Pipeline] [windows-jdk7] // withMaven
[Pipeline] [windows-jdk9] // stage
[Pipeline] [linux-jdk7] stage
[Pipeline] [linux-jdk7] { (Build linux-jdk7)
[Pipeline] [linux-jdk8] stage
[Pipeline] [linux-jdk8] { (Build linux-jdk8)
[Pipeline] [windows-jdk8] echo
[windows-jdk8] [FAIL FAST] linux-jdk9 had first failure, ignoring script returned exit code -1
[Pipeline] [windows-jdk8] }
[Pipeline] [windows-jdk7] echo
[windows-jdk7] [FAIL FAST] linux-jdk9 had first failure, ignoring script returned exit code -1
[Pipeline] [windows-jdk7] }
[Pipeline] [windows-jdk9] stage
[Pipeline] [windows-jdk9] { (Build windows-jdk9)
[Pipeline] [linux-jdk10] // node
[Pipeline] [linux-jdk10] }
[Pipeline] [linux-jdk7] echo
[linux-jdk7] [FAIL FAST] linux-jdk9 has failed. Skipping linux-jdk7.
[Pipeline] [linux-jdk7] }
[Pipeline] [linux-jdk8] echo
[linux-jdk8] [FAIL FAST] linux-jdk9 has failed. Skipping linux-jdk8.
[Pipeline] [linux-jdk8] }
[Pipeline] [windows-jdk9] echo
[windows-jdk9] [FAIL FAST] linux-jdk9 has failed. Skipping windows-jdk9.
[Pipeline] [windows-jdk9] }
[Pipeline] [windows-jdk8] // stage
[Pipeline] [windows-jdk7] // stage
[Pipeline] [windows-jdk7] }
[Pipeline] [windows-jdk8] }
[Pipeline] [linux-jdk7] // stage
[Pipeline] [linux-jdk8] // stage
[Pipeline] [windows-jdk9] // stage
[Pipeline] [linux-jdk7] }
[Pipeline] [linux-jdk8] }
[Pipeline] [windows-jdk9] }
[Pipeline] [windows-jdk7] // node
[Pipeline] [windows-jdk8] // node
[Pipeline] [windows-jdk7] }
[Pipeline] [windows-jdk8] }
[Pipeline] [linux-jdk7] // node
[Pipeline] [linux-jdk8] // node
[Pipeline] [windows-jdk9] // node
[Pipeline] [linux-jdk7] }
[Pipeline] [linux-jdk8] }
[Pipeline] [windows-jdk9] }
[Pipeline] // parallel
[Pipeline] echo
***** FAST FAILURE *****

Fast failure triggered by linux-jdk9

***** FAST FAILURE *****
[Pipeline] stage
[Pipeline] { (Notifications)
[Pipeline] echo
Build result: FAILURE
[Pipeline] jiraIssueSelector
Reply | Threaded
Open this post in threaded view
|

Build failed in Jenkins: Maven TLP » maven-file-management » MSHARED-719 #3

Apache Jenkins Server-2
See https://builds.apache.org/job/maven-box/job/maven-file-management/job/MSHARED-719/3/

No changes.

No tests ran.

Build log:
[...truncated 22.82 KB...]
[linux-jdk8]  > git config remote.origin.url https://gitbox.apache.org/repos/asf/maven-file-management.git # timeout=10
[linux-jdk8] Fetching without tags
[linux-jdk9]  > git rev-parse --is-inside-work-tree # timeout=10
[linux-jdk9] Fetching changes from the remote Git repository
[linux-jdk9]  > git config remote.origin.url https://gitbox.apache.org/repos/asf/maven-file-management.git # timeout=10
[linux-jdk9] Fetching without tags
[linux-jdk10]  > git rev-parse --is-inside-work-tree # timeout=10
[linux-jdk10] Fetching changes from the remote Git repository
[linux-jdk10]  > git config remote.origin.url https://gitbox.apache.org/repos/asf/maven-file-management.git # timeout=10
[linux-jdk10] Fetching without tags
[windows-jdk7] Checking out Revision c93f2a7cb9b6b82589c615ee53a56f3ab427894c (MSHARED-719)
[windows-jdk7]  > git config core.sparsecheckout # timeout=10
[windows-jdk7]  > git checkout -f c93f2a7cb9b6b82589c615ee53a56f3ab427894c
[windows-jdk7] Commit message: "[MSHARED-719] - Upgrade mave-surefire/failsafe-plugin 2.21.0"
[windows-jdk7]  > git rev-list --no-walk c93f2a7cb9b6b82589c615ee53a56f3ab427894c # timeout=10
[windows-jdk8] Checking out Revision c93f2a7cb9b6b82589c615ee53a56f3ab427894c (MSHARED-719)
[windows-jdk8]  > git config core.sparsecheckout # timeout=10
[Pipeline] [windows-jdk9] {
[linux-jdk7] Fetching upstream changes from https://gitbox.apache.org/repos/asf/maven-file-management.git
[linux-jdk7]  > git --version # timeout=10
[linux-jdk7]  > git fetch --no-tags --progress https://gitbox.apache.org/repos/asf/maven-file-management.git +refs/heads/*:refs/remotes/origin/*
[linux-jdk8] Fetching upstream changes from https://gitbox.apache.org/repos/asf/maven-file-management.git
[linux-jdk8]  > git --version # timeout=10
[linux-jdk8]  > git fetch --no-tags --progress https://gitbox.apache.org/repos/asf/maven-file-management.git +refs/heads/*:refs/remotes/origin/*
[linux-jdk9] Fetching upstream changes from https://gitbox.apache.org/repos/asf/maven-file-management.git
[linux-jdk9]  > git --version # timeout=10
[linux-jdk9]  > git fetch --no-tags --progress https://gitbox.apache.org/repos/asf/maven-file-management.git +refs/heads/*:refs/remotes/origin/*
[linux-jdk10] Fetching upstream changes from https://gitbox.apache.org/repos/asf/maven-file-management.git
[linux-jdk10]  > git --version # timeout=10
[windows-jdk8]  > git checkout -f c93f2a7cb9b6b82589c615ee53a56f3ab427894c
[Pipeline] [windows-jdk9] stage
[Pipeline] [windows-jdk9] { (Checkout windows-jdk9)
[linux-jdk10]  > git fetch --no-tags --progress https://gitbox.apache.org/repos/asf/maven-file-management.git +refs/heads/*:refs/remotes/origin/*
[windows-jdk7] Cleaning workspace
[Pipeline] [windows-jdk9] dir
[windows-jdk9] Running in f:\jenkins\jenkins-slave\workspace\file-management_MSHARED-719-35QPTJNE7ZVAHNXOCBD2Y6S677IDRPYDJFRD5KGMFOL5Z3PZX73Q\m
[Pipeline] [windows-jdk9] {
[windows-jdk7]  > git rev-parse --verify HEAD # timeout=10
[Pipeline] [windows-jdk9] checkout
[windows-jdk7] Resetting working tree
[windows-jdk7]  > git reset --hard # timeout=10
[windows-jdk7]  > git clean -fdx # timeout=10
[windows-jdk8] Commit message: "[MSHARED-719] - Upgrade mave-surefire/failsafe-plugin 2.21.0"
[windows-jdk8] Cleaning workspace
[windows-jdk8]  > git rev-parse --verify HEAD # timeout=10
[windows-jdk8] Resetting working tree
[windows-jdk8]  > git reset --hard # timeout=10
[windows-jdk8]  > git clean -fdx # timeout=10
[windows-jdk9]  > git rev-parse --is-inside-work-tree # timeout=10
[Pipeline] [windows-jdk7] }
[Pipeline] [windows-jdk7] // dir
[Pipeline] [windows-jdk7] }
[Pipeline] [windows-jdk7] // stage
[windows-jdk9] Fetching changes from the remote Git repository
[Pipeline] [windows-jdk7] stage
[Pipeline] [windows-jdk7] { (Build windows-jdk7)
[windows-jdk9]  > git config remote.origin.url https://gitbox.apache.org/repos/asf/maven-file-management.git # timeout=10
[windows-jdk9] Fetching without tags
[windows-jdk9] Fetching upstream changes from https://gitbox.apache.org/repos/asf/maven-file-management.git
[windows-jdk9]  > git --version # timeout=10
[windows-jdk9]  > git fetch --no-tags --progress https://gitbox.apache.org/repos/asf/maven-file-management.git +refs/heads/*:refs/remotes/origin/*
[Pipeline] [windows-jdk8] }
[Pipeline] [windows-jdk7] withMaven
[windows-jdk7] [withMaven] Options: [org.jenkinsci.plugins.pipeline.maven.publishers.GeneratedArtifactsPublisher[disabled=true], org.jenkinsci.plugins.pipeline.maven.publishers.JunitTestsPublisher[disabled=false], org.jenkinsci.plugins.pipeline.maven.publishers.FindbugsAnalysisPublisher[disabled=true], org.jenkinsci.plugins.pipeline.maven.publishers.TasksScannerPublisher[disabled=true], org.jenkinsci.plugins.pipeline.maven.publishers.DependenciesFingerprintPublisher[disabled=false, scopes=[compile, provided, runtime], versions={snapshot:true, release:false}], org.jenkinsci.plugins.pipeline.maven.publishers.InvokerRunsPublisher[disabled=false], org.jenkinsci.plugins.pipeline.maven.publishers.PipelineGraphPublisher[disabled=false, scopes=[compile, provided, runtime], versions={snapshot:true, release:false}, skipDownstreamTriggers=false, lifecycleThreshold=deploy, ignoreUpstreamTriggers=false]]
[windows-jdk7] [withMaven] Available options:
[windows-jdk7] [withMaven] using JDK installation JDK 1.7 (latest)
[windows-jdk7] [withMaven] using Maven installation 'Maven 3.5.0 (Windows)'
[Pipeline] [windows-jdk7] {
[Pipeline] [windows-jdk8] // dir
[Pipeline] [windows-jdk8] }
[Pipeline] [windows-jdk7] dir
[windows-jdk7] Running in f:\jenkins\jenkins-slave\workspace\file-management_MSHARED-719-35QPTJNE7ZVAHNXOCBD2Y6S677IDRPYDJFRD5KGMFOL5Z3PZX73Q\m
[Pipeline] [windows-jdk7] {
[Pipeline] [windows-jdk8] // stage
[Pipeline] [windows-jdk8] stage
[Pipeline] [windows-jdk8] { (Build windows-jdk8)
[Pipeline] [windows-jdk7] isUnix
[Pipeline] [windows-jdk7] bat
[windows-jdk7] [m] Running batch script
[Pipeline] [windows-jdk8] withMaven
[windows-jdk8] [withMaven] Options: [org.jenkinsci.plugins.pipeline.maven.publishers.GeneratedArtifactsPublisher[disabled=true], org.jenkinsci.plugins.pipeline.maven.publishers.JunitTestsPublisher[disabled=false], org.jenkinsci.plugins.pipeline.maven.publishers.FindbugsAnalysisPublisher[disabled=true], org.jenkinsci.plugins.pipeline.maven.publishers.TasksScannerPublisher[disabled=true], org.jenkinsci.plugins.pipeline.maven.publishers.DependenciesFingerprintPublisher[disabled=false, scopes=[compile, provided, runtime], versions={snapshot:true, release:false}], org.jenkinsci.plugins.pipeline.maven.publishers.InvokerRunsPublisher[disabled=false], org.jenkinsci.plugins.pipeline.maven.publishers.PipelineGraphPublisher[disabled=false, scopes=[compile, provided, runtime], versions={snapshot:true, release:false}, skipDownstreamTriggers=false, lifecycleThreshold=deploy, ignoreUpstreamTriggers=false]]
[windows-jdk8] [withMaven] Available options:
[windows-jdk8] [withMaven] using JDK installation JDK 1.8 (latest)
[windows-jdk8] [withMaven] using Maven installation 'Maven 3.5.0 (Windows)'
[Pipeline] [windows-jdk8] {
[linux-jdk7] Checking out Revision c93f2a7cb9b6b82589c615ee53a56f3ab427894c (MSHARED-719)
[Pipeline] [windows-jdk8] dir
[linux-jdk9] Checking out Revision c93f2a7cb9b6b82589c615ee53a56f3ab427894c (MSHARED-719)
[windows-jdk8] Running in f:\jenkins\jenkins-slave\workspace\file-management_MSHARED-719-35QPTJNE7ZVAHNXOCBD2Y6S677IDRPYDJFRD5KGMFOL5Z3PZX73Q@2\m
[Pipeline] [windows-jdk8] {
[linux-jdk10] Checking out Revision c93f2a7cb9b6b82589c615ee53a56f3ab427894c (MSHARED-719)
[Pipeline] [windows-jdk8] isUnix
[Pipeline] [windows-jdk8] bat
[windows-jdk8] [m] Running batch script
[linux-jdk7]  > git config core.sparsecheckout # timeout=10
[linux-jdk7]  > git checkout -f c93f2a7cb9b6b82589c615ee53a56f3ab427894c
[linux-jdk7] Commit message: "[MSHARED-719] - Upgrade mave-surefire/failsafe-plugin 2.21.0"
[linux-jdk7] Cleaning workspace
[linux-jdk9]  > git config core.sparsecheckout # timeout=10
[linux-jdk9]  > git checkout -f c93f2a7cb9b6b82589c615ee53a56f3ab427894c
[linux-jdk10]  > git config core.sparsecheckout # timeout=10
[linux-jdk10]  > git checkout -f c93f2a7cb9b6b82589c615ee53a56f3ab427894c
[windows-jdk9] Checking out Revision c93f2a7cb9b6b82589c615ee53a56f3ab427894c (MSHARED-719)
[windows-jdk7]
[windows-jdk7] f:\jenkins\jenkins-slave\workspace\file-management_MSHARED-719-35QPTJNE7ZVAHNXOCBD2Y6S677IDRPYDJFRD5KGMFOL5Z3PZX73Q\m>mvn -P+run-its -Dmaven.test.failure.ignore=true -Dfindbugs.failOnError=false -Dfindbugs.skip=true clean verify
[windows-jdk7] ----- withMaven Wrapper script -----
[Pipeline] [linux-jdk9] }
[linux-jdk10] Commit message: "[MSHARED-719] - Upgrade mave-surefire/failsafe-plugin 2.21.0"
[linux-jdk10] Cleaning workspace
[Pipeline] [linux-jdk9] // dir
[windows-jdk9]  > git config core.sparsecheckout # timeout=10
[Pipeline] [linux-jdk9] echo
[linux-jdk9] [FAIL FAST] This is the first failure and likely root cause
[Pipeline] [linux-jdk9] }
[linux-jdk8] Checking out Revision c93f2a7cb9b6b82589c615ee53a56f3ab427894c (MSHARED-719)
[Pipeline] [linux-jdk9] // stage
[windows-jdk9]  > git checkout -f c93f2a7cb9b6b82589c615ee53a56f3ab427894c
[Pipeline] [linux-jdk9] }
[Pipeline] [linux-jdk9] // node
[windows-jdk8]
[windows-jdk8] f:\jenkins\jenkins-slave\workspace\file-management_MSHARED-719-35QPTJNE7ZVAHNXOCBD2Y6S677IDRPYDJFRD5KGMFOL5Z3PZX73Q@2\m>mvn -P+run-its -Dmaven.test.failure.ignore=true -Dfindbugs.failOnError=false -Dfindbugs.skip=true clean verify
[windows-jdk8] ----- withMaven Wrapper script -----
[windows-jdk10] Running on windows-2012-3 in f:\jenkins\jenkins-slave\workspace\file-management_MSHARED-719-35QPTJNE7ZVAHNXOCBD2Y6S677IDRPYDJFRD5KGMFOL5Z3PZX73Q@2
[Pipeline] [linux-jdk9] }
[linux-jdk9] Failed in branch linux-jdk9
[Pipeline] [windows-jdk10] {
[linux-jdk7]  > git rev-parse --verify HEAD # timeout=10
[linux-jdk7] Resetting working tree
[linux-jdk7]  > git reset --hard # timeout=10
[linux-jdk7]  > git clean -fdx # timeout=10
[linux-jdk8]  > git config core.sparsecheckout # timeout=10
[linux-jdk8]  > git checkout -f c93f2a7cb9b6b82589c615ee53a56f3ab427894c
[linux-jdk10]  > git rev-parse --verify HEAD # timeout=10
[linux-jdk10] Resetting working tree
[linux-jdk10]  > git reset --hard # timeout=10
[linux-jdk10]  > git clean -fdx # timeout=10
[windows-jdk9] Commit message: "[MSHARED-719] - Upgrade mave-surefire/failsafe-plugin 2.21.0"
[windows-jdk9] Cleaning workspace
[windows-jdk9]  > git rev-parse --verify HEAD # timeout=10
[windows-jdk9] Resetting working tree
[windows-jdk9]  > git reset --hard # timeout=10
[windows-jdk9]  > git clean -fdx # timeout=10
[windows-jdk7] Sending interrupt signal to process
[windows-jdk7] Apache Maven 3.5.0 (ff8f5e7444045639af65f6095c62210b5713f426; 2017-04-03T19:39:06Z)
[windows-jdk7] Maven home: F:\jenkins\tools\maven\apache-maven-3.5.0\bin\..
[windows-jdk7] Java version: 1.7.0_79, vendor: Oracle Corporation
[windows-jdk7] Java home: f:\jenkins\tools\java\latest1.7\jre
[windows-jdk7] Default locale: en_US, platform encoding: Cp1252
[windows-jdk7] OS name: "windows server 2012 r2", version: "6.3", arch: "amd64", family: "windows"
[windows-jdk8] Sending interrupt signal to process
[Pipeline] [windows-jdk10] }
[Pipeline] [windows-jdk10] // node
[Pipeline] [windows-jdk10] }
[windows-jdk10] Failed in branch windows-jdk10
[Pipeline] [linux-jdk7] }
[Pipeline] [linux-jdk8] }
[Pipeline] [linux-jdk10] }
[Pipeline] [windows-jdk9] }
[Pipeline] [linux-jdk7] // dir
[Pipeline] [linux-jdk8] // dir
[Pipeline] [linux-jdk10] // dir
[Pipeline] [windows-jdk9] // dir
[Pipeline] [linux-jdk7] echo
[linux-jdk7] [FAIL FAST] linux-jdk9 had first failure, ignoring null
[Pipeline] [linux-jdk7] }
[Pipeline] [linux-jdk8] echo
[linux-jdk8] [FAIL FAST] linux-jdk9 had first failure, ignoring null
[Pipeline] [linux-jdk8] }
[Pipeline] [linux-jdk10] echo
[linux-jdk10] [FAIL FAST] linux-jdk9 had first failure, ignoring null
[Pipeline] [linux-jdk10] }
[Pipeline] [windows-jdk9] }
[Pipeline] [linux-jdk7] // stage
[Pipeline] [linux-jdk8] // stage
[Pipeline] [linux-jdk10] // stage
[Pipeline] [windows-jdk9] // stage
[Pipeline] [linux-jdk7] stage
[Pipeline] [linux-jdk7] { (Build linux-jdk7)
[Pipeline] [linux-jdk8] stage
[Pipeline] [linux-jdk8] { (Build linux-jdk8)
[Pipeline] [linux-jdk10] stage
[Pipeline] [linux-jdk10] { (Build linux-jdk10)
[Pipeline] [windows-jdk9] stage
[Pipeline] [windows-jdk9] { (Build windows-jdk9)
[Pipeline] [linux-jdk7] echo
[linux-jdk7] [FAIL FAST] linux-jdk9 has failed. Skipping linux-jdk7.
[Pipeline] [linux-jdk7] }
[Pipeline] [linux-jdk8] echo
[linux-jdk8] [FAIL FAST] linux-jdk9 has failed. Skipping linux-jdk8.
[Pipeline] [linux-jdk8] }
[Pipeline] [linux-jdk10] echo
[linux-jdk10] [FAIL FAST] linux-jdk9 has failed. Skipping linux-jdk10.
[Pipeline] [linux-jdk10] }
[Pipeline] [windows-jdk9] echo
[windows-jdk9] [FAIL FAST] linux-jdk9 has failed. Skipping windows-jdk9.
[Pipeline] [windows-jdk9] }
[Pipeline] [linux-jdk7] // stage
[Pipeline] [linux-jdk8] // stage
[Pipeline] [linux-jdk10] // stage
[Pipeline] [windows-jdk9] // stage
[Pipeline] [linux-jdk7] }
[Pipeline] [linux-jdk8] }
[Pipeline] [linux-jdk10] }
[Pipeline] [windows-jdk9] }
[Pipeline] [linux-jdk7] // node
[Pipeline] [linux-jdk8] // node
[Pipeline] [linux-jdk10] // node
[Pipeline] [windows-jdk9] // node
[Pipeline] [linux-jdk7] }
[Pipeline] [linux-jdk8] }
[Pipeline] [linux-jdk10] }
[Pipeline] [windows-jdk9] }
[windows-jdk7] After 10s process did not stop
[Pipeline] [windows-jdk7] }
[Pipeline] [windows-jdk7] // dir
[Pipeline] [windows-jdk7] }
[Pipeline] [windows-jdk7] // withMaven
[Pipeline] [windows-jdk7] echo
[windows-jdk7] [FAIL FAST] linux-jdk9 had first failure, ignoring null
[Pipeline] [windows-jdk7] }
[Pipeline] [windows-jdk7] // stage
[Pipeline] [windows-jdk7] }
[Pipeline] [windows-jdk7] // node
[Pipeline] [windows-jdk7] }
[windows-jdk8] After 10s process did not stop
[Pipeline] [windows-jdk8] }
[Pipeline] [windows-jdk8] // dir
[Pipeline] [windows-jdk8] }
[Pipeline] [windows-jdk8] // withMaven
[Pipeline] [windows-jdk8] echo
[windows-jdk8] [FAIL FAST] linux-jdk9 had first failure, ignoring null
[Pipeline] [windows-jdk8] }
[Pipeline] [windows-jdk8] // stage
[Pipeline] [windows-jdk8] }
[Pipeline] [windows-jdk8] // node
[Pipeline] [windows-jdk8] }
[Pipeline] // parallel
[Pipeline] echo
***** FAST FAILURE *****

Fast failure triggered by linux-jdk9

***** FAST FAILURE *****
[Pipeline] stage
[Pipeline] { (Notifications)
[Pipeline] echo
Build result: FAILURE
[Pipeline] jiraIssueSelector
[Pipeline] emailext
Reply | Threaded
Open this post in threaded view
|

Build failed in Jenkins: Maven TLP » maven-file-management » MSHARED-719 #4

Apache Jenkins Server-2
See https://builds.apache.org/job/maven-box/job/maven-file-management/job/MSHARED-719/4/

No changes.

No tests ran.

Build log:
[...truncated 22.29 KB...]
[linux-jdk7] Fetching upstream changes from https://gitbox.apache.org/repos/asf/maven-file-management.git
[linux-jdk7]  > git --version # timeout=10
[linux-jdk7]  > git fetch --no-tags --progress https://gitbox.apache.org/repos/asf/maven-file-management.git +refs/heads/*:refs/remotes/origin/*
[linux-jdk8]  > git rev-parse --is-inside-work-tree # timeout=10
[linux-jdk8] Fetching changes from the remote Git repository
[linux-jdk8]  > git config remote.origin.url https://gitbox.apache.org/repos/asf/maven-file-management.git # timeout=10
[linux-jdk8] Fetching without tags
[linux-jdk8] Fetching upstream changes from https://gitbox.apache.org/repos/asf/maven-file-management.git
[linux-jdk8]  > git --version # timeout=10
[linux-jdk8]  > git fetch --no-tags --progress https://gitbox.apache.org/repos/asf/maven-file-management.git +refs/heads/*:refs/remotes/origin/*
[linux-jdk9]  > git rev-parse --is-inside-work-tree # timeout=10
[linux-jdk9] Fetching changes from the remote Git repository
[linux-jdk9]  > git config remote.origin.url https://gitbox.apache.org/repos/asf/maven-file-management.git # timeout=10
[linux-jdk9] Fetching without tags
[linux-jdk9] Fetching upstream changes from https://gitbox.apache.org/repos/asf/maven-file-management.git
[linux-jdk9]  > git --version # timeout=10
[linux-jdk9]  > git fetch --no-tags --progress https://gitbox.apache.org/repos/asf/maven-file-management.git +refs/heads/*:refs/remotes/origin/*
[linux-jdk10]  > git rev-parse --is-inside-work-tree # timeout=10
[linux-jdk10] Fetching changes from the remote Git repository
[linux-jdk10]  > git config remote.origin.url https://gitbox.apache.org/repos/asf/maven-file-management.git # timeout=10
[linux-jdk10] Fetching without tags
[linux-jdk10] Fetching upstream changes from https://gitbox.apache.org/repos/asf/maven-file-management.git
[linux-jdk10]  > git --version # timeout=10
[linux-jdk10]  > git fetch --no-tags --progress https://gitbox.apache.org/repos/asf/maven-file-management.git +refs/heads/*:refs/remotes/origin/*
[windows-jdk7] Checking out Revision c93f2a7cb9b6b82589c615ee53a56f3ab427894c (MSHARED-719)
[windows-jdk7]  > git config core.sparsecheckout # timeout=10
[windows-jdk7]  > git checkout -f c93f2a7cb9b6b82589c615ee53a56f3ab427894c
[windows-jdk7] Commit message: "[MSHARED-719] - Upgrade mave-surefire/failsafe-plugin 2.21.0"
[windows-jdk7] Cleaning workspace
[windows-jdk7]  > git rev-parse --verify HEAD # timeout=10
[windows-jdk7] Resetting working tree
[windows-jdk7]  > git reset --hard # timeout=10
[windows-jdk7]  > git clean -fdx # timeout=10
[windows-jdk8] Checking out Revision c93f2a7cb9b6b82589c615ee53a56f3ab427894c (MSHARED-719)
[windows-jdk8]  > git config core.sparsecheckout # timeout=10
[windows-jdk8]  > git checkout -f c93f2a7cb9b6b82589c615ee53a56f3ab427894c
[windows-jdk8] Commit message: "[MSHARED-719] - Upgrade mave-surefire/failsafe-plugin 2.21.0"
[windows-jdk8]  > git rev-list --no-walk c93f2a7cb9b6b82589c615ee53a56f3ab427894c # timeout=10
[windows-jdk8] Cleaning workspace
[windows-jdk8]  > git rev-parse --verify HEAD # timeout=10
[windows-jdk8] Resetting working tree
[windows-jdk8]  > git reset --hard # timeout=10
[Pipeline] [windows-jdk7] }
[Pipeline] [windows-jdk7] // dir
[Pipeline] [windows-jdk7] }
[Pipeline] [windows-jdk7] // stage
[windows-jdk8]  > git clean -fdx # timeout=10
[Pipeline] [windows-jdk7] stage
[Pipeline] [windows-jdk7] { (Build windows-jdk7)
[Pipeline] [windows-jdk7] withMaven
[windows-jdk7] [withMaven] Options: [org.jenkinsci.plugins.pipeline.maven.publishers.GeneratedArtifactsPublisher[disabled=true], org.jenkinsci.plugins.pipeline.maven.publishers.JunitTestsPublisher[disabled=false], org.jenkinsci.plugins.pipeline.maven.publishers.FindbugsAnalysisPublisher[disabled=true], org.jenkinsci.plugins.pipeline.maven.publishers.TasksScannerPublisher[disabled=true], org.jenkinsci.plugins.pipeline.maven.publishers.DependenciesFingerprintPublisher[disabled=false, scopes=[compile, provided, runtime], versions={snapshot:true, release:false}], org.jenkinsci.plugins.pipeline.maven.publishers.InvokerRunsPublisher[disabled=false], org.jenkinsci.plugins.pipeline.maven.publishers.PipelineGraphPublisher[disabled=false, scopes=[compile, provided, runtime], versions={snapshot:true, release:false}, skipDownstreamTriggers=false, lifecycleThreshold=deploy, ignoreUpstreamTriggers=false]]
[windows-jdk7] [withMaven] Available options:
[windows-jdk7] [withMaven] using JDK installation JDK 1.7 (latest)
[windows-jdk7] [withMaven] using Maven installation 'Maven 3.5.0 (Windows)'
[Pipeline] [windows-jdk7] {
[Pipeline] [windows-jdk8] }
[Pipeline] [windows-jdk7] dir
[windows-jdk7] Running in f:\jenkins\jenkins-slave\workspace\file-management_MSHARED-719-35QPTJNE7ZVAHNXOCBD2Y6S677IDRPYDJFRD5KGMFOL5Z3PZX73Q\m
[Pipeline] [windows-jdk7] {
[Pipeline] [windows-jdk8] // dir
[Pipeline] [windows-jdk8] }
[Pipeline] [windows-jdk7] isUnix
[Pipeline] [windows-jdk7] bat
[windows-jdk7] [m] Running batch script
[Pipeline] [windows-jdk8] // stage
[Pipeline] [windows-jdk8] stage
[Pipeline] [windows-jdk8] { (Build windows-jdk8)
[Pipeline] [windows-jdk8] withMaven
[windows-jdk8] [withMaven] Options: [org.jenkinsci.plugins.pipeline.maven.publishers.GeneratedArtifactsPublisher[disabled=true], org.jenkinsci.plugins.pipeline.maven.publishers.JunitTestsPublisher[disabled=false], org.jenkinsci.plugins.pipeline.maven.publishers.FindbugsAnalysisPublisher[disabled=true], org.jenkinsci.plugins.pipeline.maven.publishers.TasksScannerPublisher[disabled=true], org.jenkinsci.plugins.pipeline.maven.publishers.DependenciesFingerprintPublisher[disabled=false, scopes=[compile, provided, runtime], versions={snapshot:true, release:false}], org.jenkinsci.plugins.pipeline.maven.publishers.InvokerRunsPublisher[disabled=false], org.jenkinsci.plugins.pipeline.maven.publishers.PipelineGraphPublisher[disabled=false, scopes=[compile, provided, runtime], versions={snapshot:true, release:false}, skipDownstreamTriggers=false, lifecycleThreshold=deploy, ignoreUpstreamTriggers=false]]
[windows-jdk8] [withMaven] Available options:
[windows-jdk8] [withMaven] using JDK installation JDK 1.8 (latest)
[windows-jdk8] [withMaven] using Maven installation 'Maven 3.5.0 (Windows)'
[Pipeline] [windows-jdk8] {
[Pipeline] [windows-jdk8] dir
[windows-jdk8] Running in f:\jenkins\jenkins-slave\workspace\file-management_MSHARED-719-35QPTJNE7ZVAHNXOCBD2Y6S677IDRPYDJFRD5KGMFOL5Z3PZX73Q@2\m
[Pipeline] [windows-jdk8] {
[linux-jdk7] Checking out Revision c93f2a7cb9b6b82589c615ee53a56f3ab427894c (MSHARED-719)
[Pipeline] [windows-jdk8] isUnix
[Pipeline] [windows-jdk8] bat
[windows-jdk9] Running on windows-2012-3 in f:\jenkins\jenkins-slave\workspace\file-management_MSHARED-719-35QPTJNE7ZVAHNXOCBD2Y6S677IDRPYDJFRD5KGMFOL5Z3PZX73Q
[linux-jdk9] Checking out Revision c93f2a7cb9b6b82589c615ee53a56f3ab427894c (MSHARED-719)
[linux-jdk10] Checking out Revision c93f2a7cb9b6b82589c615ee53a56f3ab427894c (MSHARED-719)
[windows-jdk7]
[windows-jdk7] f:\jenkins\jenkins-slave\workspace\file-management_MSHARED-719-35QPTJNE7ZVAHNXOCBD2Y6S677IDRPYDJFRD5KGMFOL5Z3PZX73Q\m>mvn -P+run-its -Dmaven.test.failure.ignore=true -Dfindbugs.failOnError=false -Dfindbugs.skip=true clean verify
[windows-jdk7] ----- withMaven Wrapper script -----
[windows-jdk8] [m] Running batch script
[Pipeline] [windows-jdk9] {
[Pipeline] [windows-jdk9] stage
[Pipeline] [windows-jdk9] { (Checkout windows-jdk9)
[linux-jdk7]  > git config core.sparsecheckout # timeout=10
[Pipeline] [windows-jdk9] dir
[windows-jdk9] Running in f:\jenkins\jenkins-slave\workspace\file-management_MSHARED-719-35QPTJNE7ZVAHNXOCBD2Y6S677IDRPYDJFRD5KGMFOL5Z3PZX73Q\m
[Pipeline] [windows-jdk9] {
[linux-jdk7]  > git checkout -f c93f2a7cb9b6b82589c615ee53a56f3ab427894c
[Pipeline] [windows-jdk9] checkout
[windows-jdk9]  > git rev-parse --is-inside-work-tree # timeout=10
[windows-jdk9] Fetching changes from the remote Git repository
[windows-jdk9]  > git config remote.origin.url https://gitbox.apache.org/repos/asf/maven-file-management.git # timeout=10
[windows-jdk9] Fetching without tags
[windows-jdk9] Fetching upstream changes from https://gitbox.apache.org/repos/asf/maven-file-management.git
[windows-jdk9]  > git --version # timeout=10
[windows-jdk9]  > git fetch --no-tags --progress https://gitbox.apache.org/repos/asf/maven-file-management.git +refs/heads/*:refs/remotes/origin/*
[linux-jdk7] Commit message: "[MSHARED-719] - Upgrade mave-surefire/failsafe-plugin 2.21.0"
[linux-jdk7] Cleaning workspace
[linux-jdk9]  > git config core.sparsecheckout # timeout=10
[linux-jdk9]  > git checkout -f c93f2a7cb9b6b82589c615ee53a56f3ab427894c
[linux-jdk10]  > git config core.sparsecheckout # timeout=10
[linux-jdk10]  > git checkout -f c93f2a7cb9b6b82589c615ee53a56f3ab427894c
[linux-jdk10] Commit message: "[MSHARED-719] - Upgrade mave-surefire/failsafe-plugin 2.21.0"
[linux-jdk10] Cleaning workspace
[windows-jdk7] Apache Maven 3.5.0 (ff8f5e7444045639af65f6095c62210b5713f426; 2017-04-03T19:39:06Z)
[windows-jdk7] Maven home: F:\jenkins\tools\maven\apache-maven-3.5.0\bin\..
[windows-jdk7] Java version: 1.7.0_79, vendor: Oracle Corporation
[windows-jdk7] Java home: f:\jenkins\tools\java\latest1.7\jre
[windows-jdk7] Default locale: en_US, platform encoding: Cp1252
[windows-jdk7] OS name: "windows server 2012 r2", version: "6.3", arch: "amd64", family: "windows"
[windows-jdk8]
[windows-jdk8] f:\jenkins\jenkins-slave\workspace\file-management_MSHARED-719-35QPTJNE7ZVAHNXOCBD2Y6S677IDRPYDJFRD5KGMFOL5Z3PZX73Q@2\m>mvn -P+run-its -Dmaven.test.failure.ignore=true -Dfindbugs.failOnError=false -Dfindbugs.skip=true clean verify
[windows-jdk8] ----- withMaven Wrapper script -----
[Pipeline] [linux-jdk9] }
[Pipeline] [linux-jdk9] // dir
[Pipeline] [linux-jdk9] echo
[linux-jdk9] [FAIL FAST] This is the first failure and likely root cause
[Pipeline] [linux-jdk9] }
[Pipeline] [linux-jdk9] // stage
[Pipeline] [linux-jdk9] }
[Pipeline] [linux-jdk9] // node
[windows-jdk10] Running on windows-2012-3 in f:\jenkins\jenkins-slave\workspace\file-management_MSHARED-719-35QPTJNE7ZVAHNXOCBD2Y6S677IDRPYDJFRD5KGMFOL5Z3PZX73Q@2
[linux-jdk7]  > git rev-parse --verify HEAD # timeout=10
[Pipeline] [linux-jdk9] }
[linux-jdk9] Failed in branch linux-jdk9
[Pipeline] [windows-jdk10] {
[linux-jdk7] Resetting working tree
[linux-jdk7]  > git reset --hard # timeout=10
[linux-jdk7]  > git clean -fdx # timeout=10
[linux-jdk8] Checking out Revision c93f2a7cb9b6b82589c615ee53a56f3ab427894c (MSHARED-719)
[linux-jdk8]  > git config core.sparsecheckout # timeout=10
[linux-jdk8]  > git checkout -f c93f2a7cb9b6b82589c615ee53a56f3ab427894c
[linux-jdk10]  > git rev-parse --verify HEAD # timeout=10
[linux-jdk10] Resetting working tree
[linux-jdk10]  > git reset --hard # timeout=10
[linux-jdk10]  > git clean -fdx # timeout=10
[windows-jdk7] Sending interrupt signal to process
[windows-jdk8] Apache Maven 3.5.0 (ff8f5e7444045639af65f6095c62210b5713f426; 2017-04-03T19:39:06Z)
[windows-jdk8] Maven home: F:\jenkins\tools\maven\apache-maven-3.5.0\bin\..
[windows-jdk8] Java version: 1.8.0_152, vendor: Oracle Corporation
[windows-jdk8] Java home: f:\jenkins\tools\java\latest1.8\jre
[windows-jdk8] Default locale: en_US, platform encoding: Cp1252
[windows-jdk8] OS name: "windows server 2012 r2", version: "6.3", arch: "amd64", family: "windows"
[windows-jdk8] Sending interrupt signal to process
[Pipeline] [windows-jdk10] }
[Pipeline] [windows-jdk10] // node
[Pipeline] [windows-jdk10] }
[windows-jdk10] Failed in branch windows-jdk10
[Pipeline] [linux-jdk7] }
[Pipeline] [linux-jdk8] }
[Pipeline] [linux-jdk10] }
[Pipeline] [windows-jdk7] }
[Pipeline] [windows-jdk9] }
[Pipeline] [linux-jdk7] // dir
[Pipeline] [linux-jdk8] // dir
[Pipeline] [linux-jdk10] // dir
[Pipeline] [windows-jdk7] // dir
[Pipeline] [windows-jdk9] // dir
[Pipeline] [linux-jdk7] echo
[linux-jdk7] [FAIL FAST] linux-jdk9 had first failure, ignoring null
[Pipeline] [linux-jdk7] }
[Pipeline] [linux-jdk8] echo
[linux-jdk8] [FAIL FAST] linux-jdk9 had first failure, ignoring null
[Pipeline] [linux-jdk8] }
[Pipeline] [linux-jdk10] echo
[linux-jdk10] [FAIL FAST] linux-jdk9 had first failure, ignoring null
[Pipeline] [linux-jdk10] }
[Pipeline] [windows-jdk7] }
[Pipeline] [windows-jdk9] echo
[windows-jdk9] [FAIL FAST] linux-jdk9 had first failure, ignoring null
[Pipeline] [windows-jdk9] }
[Pipeline] [linux-jdk7] // stage
[Pipeline] [linux-jdk8] // stage
[Pipeline] [linux-jdk10] // stage
[Pipeline] [windows-jdk7] // withMaven
[Pipeline] [windows-jdk9] // stage
[Pipeline] [linux-jdk7] stage
[Pipeline] [linux-jdk7] { (Build linux-jdk7)
[Pipeline] [linux-jdk8] stage
[Pipeline] [linux-jdk8] { (Build linux-jdk8)
[Pipeline] [linux-jdk10] stage
[Pipeline] [linux-jdk10] { (Build linux-jdk10)
[Pipeline] [windows-jdk7] echo
[windows-jdk7] [FAIL FAST] linux-jdk9 had first failure, ignoring script returned exit code -1
[Pipeline] [windows-jdk7] }
[Pipeline] [windows-jdk8] }
[Pipeline] [windows-jdk9] stage
[Pipeline] [windows-jdk9] { (Build windows-jdk9)
[Pipeline] [linux-jdk7] echo
[linux-jdk7] [FAIL FAST] linux-jdk9 has failed. Skipping linux-jdk7.
[Pipeline] [linux-jdk7] }
[Pipeline] [linux-jdk8] echo
[linux-jdk8] [FAIL FAST] linux-jdk9 has failed. Skipping linux-jdk8.
[Pipeline] [linux-jdk8] }
[Pipeline] [linux-jdk10] echo
[linux-jdk10] [FAIL FAST] linux-jdk9 has failed. Skipping linux-jdk10.
[Pipeline] [linux-jdk10] }
[Pipeline] [windows-jdk9] echo
[windows-jdk9] [FAIL FAST] linux-jdk9 has failed. Skipping windows-jdk9.
[Pipeline] [windows-jdk9] }
[Pipeline] [windows-jdk7] // stage
[Pipeline] [windows-jdk8] // dir
[Pipeline] [windows-jdk7] }
[Pipeline] [windows-jdk8] }
[Pipeline] [linux-jdk7] // stage
[Pipeline] [linux-jdk8] // stage
[Pipeline] [linux-jdk10] // stage
[Pipeline] [windows-jdk9] // stage
[Pipeline] [linux-jdk7] }
[Pipeline] [linux-jdk8] }
[Pipeline] [linux-jdk10] }
[Pipeline] [windows-jdk9] }
[Pipeline] [windows-jdk7] // node
[Pipeline] [windows-jdk8] // withMaven
[Pipeline] [windows-jdk7] }
[Pipeline] [windows-jdk8] echo
[windows-jdk8] [FAIL FAST] linux-jdk9 had first failure, ignoring script returned exit code -1
[Pipeline] [windows-jdk8] }
[Pipeline] [linux-jdk7] // node
[Pipeline] [linux-jdk8] // node
[Pipeline] [linux-jdk10] // node
[Pipeline] [windows-jdk9] // node
[Pipeline] [linux-jdk7] }
[Pipeline] [linux-jdk8] }
[Pipeline] [linux-jdk10] }
[Pipeline] [windows-jdk9] }
[Pipeline] [windows-jdk8] // stage
[Pipeline] [windows-jdk8] }
[Pipeline] [windows-jdk8] // node
[Pipeline] [windows-jdk8] }
[Pipeline] // parallel
[Pipeline] echo
***** FAST FAILURE *****

Fast failure triggered by linux-jdk9

***** FAST FAILURE *****
[Pipeline] stage
[Pipeline] { (Notifications)
[Pipeline] echo
Build result: FAILURE
[Pipeline] jiraIssueSelector
[Pipeline] emailext
Reply | Threaded
Open this post in threaded view
|

Build failed in Jenkins: Maven TLP » maven-file-management » MSHARED-719 #5

Apache Jenkins Server-2
See https://builds.apache.org/job/maven-box/job/maven-file-management/job/MSHARED-719/5/

No changes.

No tests ran.

Build log:
[...truncated 12.37 KB...]
[Pipeline] [linux-jdk7] stage
[Pipeline] [linux-jdk7] { (Checkout linux-jdk7)
[Pipeline] [linux-jdk8] stage
[Pipeline] [linux-jdk8] { (Checkout linux-jdk8)
[Pipeline] [linux-jdk9] stage
[Pipeline] [linux-jdk9] { (Checkout linux-jdk9)
[Pipeline] [linux-jdk10] stage
[Pipeline] [linux-jdk10] { (Checkout linux-jdk10)
[Pipeline] [windows-jdk7] stage
[Pipeline] [windows-jdk7] { (Checkout windows-jdk7)
[Pipeline] [windows-jdk8] {
[Pipeline] [linux-jdk7] dir
[linux-jdk7] Running in /home/jenkins/jenkins-slave/workspace/file-management_MSHARED-719-35QPTJNE7ZVAHNXOCBD2Y6S677IDRPYDJFRD5KGMFOL5Z3PZX73Q/m
[Pipeline] [linux-jdk7] {
[Pipeline] [linux-jdk8] dir
[linux-jdk8] Running in /home/jenkins/jenkins-slave/workspace/file-management_MSHARED-719-35QPTJNE7ZVAHNXOCBD2Y6S677IDRPYDJFRD5KGMFOL5Z3PZX73Q@2/m
[Pipeline] [linux-jdk8] {
[Pipeline] [linux-jdk9] dir
[linux-jdk9] Running in /home/jenkins/jenkins-slave/workspace/file-management_MSHARED-719-35QPTJNE7ZVAHNXOCBD2Y6S677IDRPYDJFRD5KGMFOL5Z3PZX73Q/m
[Pipeline] [linux-jdk9] {
[Pipeline] [linux-jdk10] dir
[linux-jdk10] Running in /home/jenkins/jenkins-slave/workspace/file-management_MSHARED-719-35QPTJNE7ZVAHNXOCBD2Y6S677IDRPYDJFRD5KGMFOL5Z3PZX73Q/m
[Pipeline] [linux-jdk10] {
[Pipeline] [windows-jdk7] dir
[windows-jdk7] Running in f:\jenkins\jenkins-slave\workspace\file-management_MSHARED-719-35QPTJNE7ZVAHNXOCBD2Y6S677IDRPYDJFRD5KGMFOL5Z3PZX73Q\m
[Pipeline] [windows-jdk7] {
[Pipeline] [windows-jdk8] stage
[Pipeline] [windows-jdk8] { (Checkout windows-jdk8)
[Pipeline] [linux-jdk7] checkout
[Pipeline] [linux-jdk8] checkout
[Pipeline] [linux-jdk9] checkout
[Pipeline] [linux-jdk10] checkout
[Pipeline] [windows-jdk7] checkout
[Pipeline] [windows-jdk8] dir
[windows-jdk8] Running in f:\jenkins\jenkins-slave\workspace\file-management_MSHARED-719-35QPTJNE7ZVAHNXOCBD2Y6S677IDRPYDJFRD5KGMFOL5Z3PZX73Q@2\m
[Pipeline] [windows-jdk8] {
[Pipeline] [windows-jdk8] checkout
[windows-jdk7]  > git rev-parse --is-inside-work-tree # timeout=10
[windows-jdk7] Fetching changes from the remote Git repository
[windows-jdk7]  > git config remote.origin.url https://gitbox.apache.org/repos/asf/maven-file-management.git # timeout=10
[windows-jdk7] Fetching without tags
[windows-jdk7] Fetching upstream changes from https://gitbox.apache.org/repos/asf/maven-file-management.git
[windows-jdk7]  > git --version # timeout=10
[windows-jdk7]  > git fetch --no-tags --progress https://gitbox.apache.org/repos/asf/maven-file-management.git +refs/heads/*:refs/remotes/origin/*
[windows-jdk8]  > git rev-parse --is-inside-work-tree # timeout=10
[windows-jdk8] Fetching changes from the remote Git repository
[windows-jdk8]  > git config remote.origin.url https://gitbox.apache.org/repos/asf/maven-file-management.git # timeout=10
[windows-jdk8] Fetching without tags
[windows-jdk8] Fetching upstream changes from https://gitbox.apache.org/repos/asf/maven-file-management.git
[windows-jdk8]  > git --version # timeout=10
[windows-jdk8]  > git fetch --no-tags --progress https://gitbox.apache.org/repos/asf/maven-file-management.git +refs/heads/*:refs/remotes/origin/*
[linux-jdk7]  > git rev-parse --is-inside-work-tree # timeout=10
[linux-jdk7] Fetching changes from the remote Git repository
[linux-jdk7]  > git config remote.origin.url https://gitbox.apache.org/repos/asf/maven-file-management.git # timeout=10
[linux-jdk7] Fetching without tags
[linux-jdk7] Fetching upstream changes from https://gitbox.apache.org/repos/asf/maven-file-management.git
[linux-jdk7]  > git --version # timeout=10
[linux-jdk7]  > git fetch --no-tags --progress https://gitbox.apache.org/repos/asf/maven-file-management.git +refs/heads/*:refs/remotes/origin/*
[linux-jdk8] Cloning the remote Git repository
[linux-jdk8] Cloning with configured refspecs honoured and without tags
[linux-jdk8] Cloning repository https://gitbox.apache.org/repos/asf/maven-file-management.git
[linux-jdk8]  > git init /home/jenkins/jenkins-slave/workspace/file-management_MSHARED-719-35QPTJNE7ZVAHNXOCBD2Y6S677IDRPYDJFRD5KGMFOL5Z3PZX73Q@2/m # timeout=10
[linux-jdk8] Fetching upstream changes from https://gitbox.apache.org/repos/asf/maven-file-management.git
[linux-jdk8]  > git --version # timeout=10
[linux-jdk8]  > git fetch --no-tags --progress https://gitbox.apache.org/repos/asf/maven-file-management.git +refs/heads/*:refs/remotes/origin/*
[linux-jdk9]  > git rev-parse --is-inside-work-tree # timeout=10
[linux-jdk9] Fetching changes from the remote Git repository
[linux-jdk9]  > git config remote.origin.url https://gitbox.apache.org/repos/asf/maven-file-management.git # timeout=10
[linux-jdk9] Fetching without tags
[linux-jdk9] Fetching upstream changes from https://gitbox.apache.org/repos/asf/maven-file-management.git
[linux-jdk9]  > git --version # timeout=10
[linux-jdk9]  > git fetch --no-tags --progress https://gitbox.apache.org/repos/asf/maven-file-management.git +refs/heads/*:refs/remotes/origin/*
[linux-jdk10]  > git rev-parse --is-inside-work-tree # timeout=10
[linux-jdk10] Fetching changes from the remote Git repository
[linux-jdk10]  > git config remote.origin.url https://gitbox.apache.org/repos/asf/maven-file-management.git # timeout=10
[linux-jdk10] Fetching without tags
[linux-jdk10] Fetching upstream changes from https://gitbox.apache.org/repos/asf/maven-file-management.git
[linux-jdk10]  > git --version # timeout=10
[linux-jdk10]  > git fetch --no-tags --progress https://gitbox.apache.org/repos/asf/maven-file-management.git +refs/heads/*:refs/remotes/origin/*
[windows-jdk7] Checking out Revision c93f2a7cb9b6b82589c615ee53a56f3ab427894c (MSHARED-719)
[windows-jdk7]  > git config core.sparsecheckout # timeout=10
[windows-jdk7]  > git checkout -f c93f2a7cb9b6b82589c615ee53a56f3ab427894c
[windows-jdk7] Commit message: "[MSHARED-719] - Upgrade mave-surefire/failsafe-plugin 2.21.0"
[windows-jdk7] Cleaning workspace
[windows-jdk7]  > git rev-parse --verify HEAD # timeout=10
[windows-jdk7] Resetting working tree
[windows-jdk7]  > git reset --hard # timeout=10
[windows-jdk7]  > git clean -fdx # timeout=10
[windows-jdk8] Checking out Revision c93f2a7cb9b6b82589c615ee53a56f3ab427894c (MSHARED-719)
[windows-jdk8]  > git config core.sparsecheckout # timeout=10
[windows-jdk8]  > git checkout -f c93f2a7cb9b6b82589c615ee53a56f3ab427894c
[windows-jdk8] Commit message: "[MSHARED-719] - Upgrade mave-surefire/failsafe-plugin 2.21.0"
[windows-jdk8]  > git rev-list --no-walk c93f2a7cb9b6b82589c615ee53a56f3ab427894c # timeout=10
[windows-jdk8] Cleaning workspace
[windows-jdk8]  > git rev-parse --verify HEAD # timeout=10
[Pipeline] [windows-jdk7] }
[Pipeline] [windows-jdk7] // dir
[Pipeline] [windows-jdk7] }
[Pipeline] [windows-jdk7] // stage
[windows-jdk8] Resetting working tree
[windows-jdk8]  > git reset --hard # timeout=10
[windows-jdk8]  > git clean -fdx # timeout=10
[Pipeline] [windows-jdk7] stage
[Pipeline] [windows-jdk7] { (Build windows-jdk7)
[Pipeline] [windows-jdk7] withMaven
[windows-jdk7] [withMaven] Options: [org.jenkinsci.plugins.pipeline.maven.publishers.GeneratedArtifactsPublisher[disabled=true], org.jenkinsci.plugins.pipeline.maven.publishers.JunitTestsPublisher[disabled=false], org.jenkinsci.plugins.pipeline.maven.publishers.FindbugsAnalysisPublisher[disabled=true], org.jenkinsci.plugins.pipeline.maven.publishers.TasksScannerPublisher[disabled=true], org.jenkinsci.plugins.pipeline.maven.publishers.DependenciesFingerprintPublisher[disabled=false, scopes=[compile, provided, runtime], versions={snapshot:true, release:false}], org.jenkinsci.plugins.pipeline.maven.publishers.InvokerRunsPublisher[disabled=false], org.jenkinsci.plugins.pipeline.maven.publishers.PipelineGraphPublisher[disabled=false, scopes=[compile, provided, runtime], versions={snapshot:true, release:false}, skipDownstreamTriggers=false, lifecycleThreshold=deploy, ignoreUpstreamTriggers=false]]
[windows-jdk7] [withMaven] Available options:
[windows-jdk7] [withMaven] using JDK installation JDK 1.7 (latest)
[windows-jdk7] [withMaven] using Maven installation 'Maven 3.5.0 (Windows)'
[Pipeline] [windows-jdk7] {
[Pipeline] [windows-jdk8] }
[Pipeline] [windows-jdk7] dir
[windows-jdk7] Running in f:\jenkins\jenkins-slave\workspace\file-management_MSHARED-719-35QPTJNE7ZVAHNXOCBD2Y6S677IDRPYDJFRD5KGMFOL5Z3PZX73Q\m
[Pipeline] [windows-jdk7] {
[Pipeline] [windows-jdk8] // dir
[Pipeline] [windows-jdk8] }
[Pipeline] [windows-jdk7] isUnix
[Pipeline] [windows-jdk7] bat
[windows-jdk7] [m] Running batch script
[Pipeline] [windows-jdk8] // stage
[Pipeline] [windows-jdk8] stage
[Pipeline] [windows-jdk8] { (Build windows-jdk8)
[Pipeline] [windows-jdk8] withMaven
[linux-jdk9] Checking out Revision c93f2a7cb9b6b82589c615ee53a56f3ab427894c (MSHARED-719)
[windows-jdk8] [withMaven] Options: [org.jenkinsci.plugins.pipeline.maven.publishers.GeneratedArtifactsPublisher[disabled=true], org.jenkinsci.plugins.pipeline.maven.publishers.JunitTestsPublisher[disabled=false], org.jenkinsci.plugins.pipeline.maven.publishers.FindbugsAnalysisPublisher[disabled=true], org.jenkinsci.plugins.pipeline.maven.publishers.TasksScannerPublisher[disabled=true], org.jenkinsci.plugins.pipeline.maven.publishers.DependenciesFingerprintPublisher[disabled=false, scopes=[compile, provided, runtime], versions={snapshot:true, release:false}], org.jenkinsci.plugins.pipeline.maven.publishers.InvokerRunsPublisher[disabled=false], org.jenkinsci.plugins.pipeline.maven.publishers.PipelineGraphPublisher[disabled=false, scopes=[compile, provided, runtime], versions={snapshot:true, release:false}, skipDownstreamTriggers=false, lifecycleThreshold=deploy, ignoreUpstreamTriggers=false]]
[windows-jdk8] [withMaven] Available options:
[windows-jdk8] [withMaven] using JDK installation JDK 1.8 (latest)
[windows-jdk8] [withMaven] using Maven installation 'Maven 3.5.0 (Windows)'
[Pipeline] [windows-jdk8] {
[Pipeline] [windows-jdk8] dir
[windows-jdk8] Running in f:\jenkins\jenkins-slave\workspace\file-management_MSHARED-719-35QPTJNE7ZVAHNXOCBD2Y6S677IDRPYDJFRD5KGMFOL5Z3PZX73Q@2\m
[Pipeline] [windows-jdk8] {
[Pipeline] [windows-jdk8] isUnix
[Pipeline] [windows-jdk8] bat
[linux-jdk7] Checking out Revision c93f2a7cb9b6b82589c615ee53a56f3ab427894c (MSHARED-719)
[linux-jdk9]  > git config core.sparsecheckout # timeout=10
[linux-jdk9]  > git checkout -f c93f2a7cb9b6b82589c615ee53a56f3ab427894c
[windows-jdk7]
[windows-jdk7] f:\jenkins\jenkins-slave\workspace\file-management_MSHARED-719-35QPTJNE7ZVAHNXOCBD2Y6S677IDRPYDJFRD5KGMFOL5Z3PZX73Q\m>mvn -P+run-its -Dmaven.test.failure.ignore=true -Dfindbugs.failOnError=false -Dfindbugs.skip=true clean verify
[windows-jdk7] ----- withMaven Wrapper script -----
[windows-jdk8] [m] Running batch script
[Pipeline] [linux-jdk9] }
[Pipeline] [linux-jdk9] // dir
[Pipeline] [linux-jdk9] echo
[linux-jdk9] [FAIL FAST] This is the first failure and likely root cause
[Pipeline] [linux-jdk9] }
[Pipeline] [linux-jdk9] // stage
[Pipeline] [linux-jdk9] }
[Pipeline] [linux-jdk9] // node
[windows-jdk9] Running on windows-2012-3 in f:\jenkins\jenkins-slave\workspace\file-management_MSHARED-719-35QPTJNE7ZVAHNXOCBD2Y6S677IDRPYDJFRD5KGMFOL5Z3PZX73Q
[windows-jdk8]
[windows-jdk8] f:\jenkins\jenkins-slave\workspace\file-management_MSHARED-719-35QPTJNE7ZVAHNXOCBD2Y6S677IDRPYDJFRD5KGMFOL5Z3PZX73Q@2\m>mvn -P+run-its -Dmaven.test.failure.ignore=true -Dfindbugs.failOnError=false -Dfindbugs.skip=true clean verify
[windows-jdk8] ----- withMaven Wrapper script -----
[Pipeline] [linux-jdk9] }
[linux-jdk9] Failed in branch linux-jdk9
[Pipeline] [windows-jdk9] {
[linux-jdk7]  > git config core.sparsecheckout # timeout=10
[linux-jdk7]  > git checkout -f c93f2a7cb9b6b82589c615ee53a56f3ab427894c
[windows-jdk7] Apache Maven 3.5.0 (ff8f5e7444045639af65f6095c62210b5713f426; 2017-04-03T19:39:06Z)
[windows-jdk7] Maven home: F:\jenkins\tools\maven\apache-maven-3.5.0\bin\..
[windows-jdk7] Java version: 1.7.0_79, vendor: Oracle Corporation
[windows-jdk7] Java home: f:\jenkins\tools\java\latest1.7\jre
[windows-jdk7] Default locale: en_US, platform encoding: Cp1252
[windows-jdk7] OS name: "windows server 2012 r2", version: "6.3", arch: "amd64", family: "windows"
[windows-jdk7] Sending interrupt signal to process
[windows-jdk8] Sending interrupt signal to process
[Pipeline] [windows-jdk9] }
[Pipeline] [windows-jdk10] // node
[Pipeline] [windows-jdk9] // node
[Pipeline] [windows-jdk9] }
[windows-jdk9] Failed in branch windows-jdk9
[Pipeline] [windows-jdk10] }
[windows-jdk10] Failed in branch windows-jdk10
[Pipeline] [linux-jdk7] }
[Pipeline] [linux-jdk8] }
[Pipeline] [linux-jdk10] }
[Pipeline] [windows-jdk8] }
[Pipeline] [windows-jdk7] }
[Pipeline] [linux-jdk7] // dir
[Pipeline] [linux-jdk8] // dir
[Pipeline] [linux-jdk10] // dir
[Pipeline] [windows-jdk8] // dir
[Pipeline] [linux-jdk7] echo
[linux-jdk7] [FAIL FAST] linux-jdk9 had first failure, ignoring null
[Pipeline] [linux-jdk7] }
[Pipeline] [linux-jdk8] echo
[linux-jdk8] [FAIL FAST] linux-jdk9 had first failure, ignoring null
[Pipeline] [linux-jdk8] }
[Pipeline] [linux-jdk10] echo
[linux-jdk10] [FAIL FAST] linux-jdk9 had first failure, ignoring null
[Pipeline] [linux-jdk10] }
[Pipeline] [windows-jdk8] }
[Pipeline] [windows-jdk7] // dir
[Pipeline] [windows-jdk7] }
[Pipeline] [linux-jdk7] // stage
[Pipeline] [linux-jdk8] // stage
[Pipeline] [linux-jdk10] // stage
[Pipeline] [windows-jdk8] // withMaven
[Pipeline] [linux-jdk7] stage
[Pipeline] [linux-jdk7] { (Build linux-jdk7)
[Pipeline] [linux-jdk8] stage
[Pipeline] [linux-jdk8] { (Build linux-jdk8)
[Pipeline] [linux-jdk10] stage
[Pipeline] [linux-jdk10] { (Build linux-jdk10)
[Pipeline] [windows-jdk8] }
[Pipeline] [windows-jdk7] // withMaven
[Pipeline] [windows-jdk7] }
[Pipeline] [linux-jdk7] echo
[linux-jdk7] [FAIL FAST] linux-jdk9 has failed. Skipping linux-jdk7.
[Pipeline] [linux-jdk7] }
[Pipeline] [linux-jdk8] echo
[linux-jdk8] [FAIL FAST] linux-jdk9 has failed. Skipping linux-jdk8.
[Pipeline] [linux-jdk8] }
[Pipeline] [linux-jdk10] echo
[linux-jdk10] [FAIL FAST] linux-jdk9 has failed. Skipping linux-jdk10.
[Pipeline] [linux-jdk10] }
[Pipeline] [windows-jdk8] // stage
[Pipeline] [windows-jdk8] }
[Pipeline] [windows-jdk7] // stage
[Pipeline] [windows-jdk7] }
[Pipeline] [linux-jdk7] // stage
[Pipeline] [linux-jdk8] // stage
[Pipeline] [linux-jdk10] // stage
[Pipeline] [linux-jdk7] }
[Pipeline] [linux-jdk8] }
[Pipeline] [linux-jdk10] }
[Pipeline] [windows-jdk8] // node
[Pipeline] [windows-jdk8] }
[Pipeline] [windows-jdk7] // node
[Pipeline] [windows-jdk7] }
[Pipeline] [linux-jdk7] // node
[Pipeline] [linux-jdk8] // node
[Pipeline] [linux-jdk10] // node
[Pipeline] [linux-jdk7] }
[Pipeline] [linux-jdk8] }
[Pipeline] [linux-jdk10] }
[Pipeline] // parallel
[Pipeline] echo
***** FAST FAILURE *****

Fast failure triggered by linux-jdk9

***** FAST FAILURE *****
[Pipeline] stage
[Pipeline] { (Notifications)
[Pipeline] echo
Build result: FAILURE
[Pipeline] jiraIssueSelector
[Pipeline] emailext
Reply | Threaded
Open this post in threaded view
|

Build succeeded in Jenkins: Maven TLP » maven-file-management » MSHARED-719 #6

Apache Jenkins Server-2