Build failed in Jenkins: Maven TLP » maven-enforcer » MENFORCER-294 #18

classic Classic list List threaded Threaded
6 messages Options
Reply | Threaded
Open this post in threaded view
|

Build failed in Jenkins: Maven TLP » maven-enforcer » MENFORCER-294 #18

Apache Jenkins Server-2
See https://builds.apache.org/job/maven-box/job/maven-enforcer/job/MENFORCER-294/18/

Changes:

* Removed exclusion for problematic node cause the node is back online.
* reduce the history archiving
* reduce the history archiving
* increase a bit archiving
* increase a bit archiving
* Activate sonarqube on first project
* Disable sonar:sonar for now
* use publisherStrategy: 'EXPLICIT' to avoid non used publishers
* [INFRA-17514] Fix file separator + add other locations for workspaces
* fix indent

All tests passed

Build log:
[...truncated 2.21 MB...]
[windows-jdk8] [INFO]           require-upper-bound-dependencies-unique_success\pom.xml SUCCESS (3.5 s)
[windows-jdk8] [INFO] Building: require-upper-bound-deps_failure\pom.xml
[windows-jdk11] [INFO] run post-build script verify.groovy
[windows-jdk11] [INFO]           require-upper-bound-dependencies-unique_failure\pom.xml SUCCESS (4.3 s)
[windows-jdk11] [INFO] Building: require-upper-bound-dependencies-unique_success\pom.xml
[windows-jdk7] [INFO] run post-build script verify.groovy
[windows-jdk7] [INFO]           require-plugin-versions-ci\pom.xml ............... SUCCESS (6.0 s)
[windows-jdk7] [INFO] Building: require-plugin-versions-custom-packaging\pom.xml
[windows-jdk8] [INFO] run post-build script verify.groovy
[windows-jdk8] [INFO]           require-upper-bound-deps_failure\pom.xml ......... SUCCESS (3.4 s)
[windows-jdk8] [INFO] Building: require-upper-bound-deps_ignored\pom.xml
[windows-jdk11] [INFO]           require-upper-bound-dependencies-unique_success\pom.xml SUCCESS (3.8 s)
[windows-jdk11] [INFO] Building: require-upper-bound-deps_failure\pom.xml
[windows-jdk8] [INFO] run post-build script verify.groovy
[windows-jdk8] [INFO]           require-upper-bound-deps_ignored\pom.xml ......... SUCCESS (3.4 s)
[windows-jdk8] [INFO] Building: require-upper-bound-deps_success\pom.xml
[windows-jdk11] [INFO] run post-build script verify.groovy
[windows-jdk11] [INFO]           require-upper-bound-deps_failure\pom.xml ......... SUCCESS (3.3 s)
[windows-jdk11] [INFO] Building: require-upper-bound-deps_ignored\pom.xml
[windows-jdk7] [INFO] artifact org.apache.maven.plugins:maven-install-plugin: checking for updates from central
[windows-jdk7] [INFO] artifact org.apache.maven.plugins:maven-resources-plugin: checking for updates from central
[windows-jdk7] [INFO] artifact org.apache.maven.plugins:maven-surefire-plugin: checking for updates from central
[windows-jdk7] [INFO] artifact org.apache.maven.plugins:maven-compiler-plugin: checking for updates from central
[windows-jdk7] [INFO] artifact org.apache.maven.plugins:maven-deploy-plugin: checking for updates from central
[windows-jdk8] [INFO]           require-upper-bound-deps_success\pom.xml ......... SUCCESS (3.4 s)
[windows-jdk8] [INFO] Building: resolve_collect_dependencies\pom.xml
[windows-jdk7] [INFO]           require-plugin-versions-custom-packaging\pom.xml . SUCCESS (8.4 s)
[windows-jdk7] [INFO] Building: require-plugin-versions-expressions\pom.xml
[windows-jdk11] [INFO] run post-build script verify.groovy
[windows-jdk11] [INFO]           require-upper-bound-deps_ignored\pom.xml ......... SUCCESS (3.4 s)
[windows-jdk11] [INFO] Building: require-upper-bound-deps_success\pom.xml
[windows-jdk11] [INFO]           require-upper-bound-deps_success\pom.xml ......... SUCCESS (3.3 s)
[windows-jdk11] [INFO] Building: resolve_collect_dependencies\pom.xml
[windows-jdk8] [INFO] run post-build script verify.groovy
[windows-jdk8] [INFO]           resolve_collect_dependencies\pom.xml ............. SUCCESS (6.4 s)
[windows-jdk8] [INFO] -------------------------------------------------
[windows-jdk8] [INFO] Build Summary:
[windows-jdk8] [INFO]   Passed: 68, Failed: 0, Errors: 0, Skipped: 0
[windows-jdk8] [INFO] -------------------------------------------------
[windows-jdk8] [INFO]
[windows-jdk8] [INFO] --- mrm-maven-plugin:1.0.0:stop (default) @ maven-enforcer-plugin ---
[windows-jdk8] [INFO] Stopping Mock Repository Manager on http://localhost:56136
[windows-jdk8] [INFO] Mock Repository Manager http://localhost:56136 is stopped.
[windows-jdk8] [INFO]
[windows-jdk8] [INFO] --- maven-checkstyle-plugin:3.0.0:check (checkstyle-check) @ maven-enforcer-plugin ---
[windows-jdk8] [INFO] ------------------------------------------------------------------------
[windows-jdk8] [INFO] Reactor Summary:
[windows-jdk8] [INFO]
[windows-jdk8] [INFO] Apache Maven Enforcer .............................. SUCCESS [ 26.123 s]
[windows-jdk8] [INFO] Apache Maven Enforcer API .......................... SUCCESS [  5.712 s]
[windows-jdk8] [INFO] Apache Maven Enforcer Built-In Rules ............... SUCCESS [ 14.430 s]
[windows-jdk8] [INFO] Apache Maven Enforcer Plugin ....................... SUCCESS [04:42 min]
[windows-jdk8] [INFO] ------------------------------------------------------------------------
[windows-jdk8] [INFO] BUILD SUCCESS
[windows-jdk8] [INFO] ------------------------------------------------------------------------
[windows-jdk8] [INFO] Total time: 05:29 min
[windows-jdk8] [INFO] Finished at: 2018-12-30T05:36:44Z
[windows-jdk7] [INFO]           require-plugin-versions-expressions\pom.xml ...... SUCCESS (6.2 s)
[windows-jdk7] [INFO] Building: require-plugin-versions-mm-ci-friendly\pom.xml
[windows-jdk8] [INFO] Final Memory: 60M/1100M
[windows-jdk8] [INFO] ------------------------------------------------------------------------
[windows-jdk8] [INFO] [jenkins-event-spy] Generated F:\jenkins\jenkins-slave\workspace\aven-enforcer_MENFORCER-294-IBUS6H5LUW3LLGQ77JNQBEL74UE2BN3AO433QECSA2A76NFISVIQ@tmp\withMavenaf8fd708\maven-spy-20181230-053114-503481768461759020184.log
[windows-jdk8] Picked up JAVA_TOOL_OPTIONS: -Dmaven.ext.class.path="f:\jenkins\jenkins-slave\workspace\aven-enforcer_MENFORCER-294-IBUS6H5LUW3LLGQ77JNQBEL74UE2BN3AO433QECSA2A76NFISVIQ@tmp\withMavenaf8fd708\pipeline-maven-spy.jar" -Dorg.jenkinsci.plugins.pipeline.maven.reportsFolder="f:\jenkins\jenkins-slave\workspace\aven-enforcer_MENFORCER-294-IBUS6H5LUW3LLGQ77JNQBEL74UE2BN3AO433QECSA2A76NFISVIQ@tmp\withMavenaf8fd708"
[Pipeline] [windows-jdk8] }
[Pipeline] [windows-jdk8] // dir
[windows-jdk11] [INFO] run post-build script verify.groovy
[windows-jdk11] [INFO]           resolve_collect_dependencies\pom.xml ............. SUCCESS (5.9 s)
[windows-jdk11] [INFO] -------------------------------------------------
[windows-jdk11] [INFO] Build Summary:
[windows-jdk11] [INFO]   Passed: 68, Failed: 0, Errors: 0, Skipped: 0
[windows-jdk11] [INFO] -------------------------------------------------
[windows-jdk11] [INFO]
[windows-jdk11] [INFO] --- mrm-maven-plugin:1.0.0:stop (default) @ maven-enforcer-plugin ---
[windows-jdk11] [INFO] Stopping Mock Repository Manager on http://localhost:56135
[windows-jdk11] [INFO] Mock Repository Manager http://localhost:56135 is stopped.
[windows-jdk11] [INFO]
[windows-jdk11] [INFO] --- maven-checkstyle-plugin:3.0.0:check (checkstyle-check) @ maven-enforcer-plugin ---
[windows-jdk11] [INFO] ------------------------------------------------------------------------
[windows-jdk11] [INFO] Reactor Summary:
[windows-jdk11] [INFO]
[windows-jdk11] [INFO] Apache Maven Enforcer .............................. SUCCESS [ 24.291 s]
[windows-jdk11] [INFO] Apache Maven Enforcer API .......................... SUCCESS [  5.685 s]
[windows-jdk11] [INFO] Apache Maven Enforcer Built-In Rules ............... SUCCESS [ 15.386 s]
[windows-jdk11] [INFO] Apache Maven Enforcer Plugin ....................... SUCCESS [04:44 min]
[windows-jdk11] [INFO] ------------------------------------------------------------------------
[windows-jdk11] [INFO] BUILD SUCCESS
[windows-jdk11] [INFO] ------------------------------------------------------------------------
[windows-jdk11] [INFO] Total time: 05:30 min
[windows-jdk11] [INFO] Finished at: 2018-12-30T05:36:46Z
[windows-jdk11] [INFO] Final Memory: 50M/177M
[windows-jdk11] [INFO] ------------------------------------------------------------------------
[windows-jdk11] [INFO] [jenkins-event-spy] Generated F:\jenkins\jenkins-slave\workspace\aven-enforcer_MENFORCER-294-IBUS6H5LUW3LLGQ77JNQBEL74UE2BN3AO433QECSA2A76NFISVIQ@2@tmp\withMavene8ec8dd1\maven-spy-20181230-053115-92611359971639528013007.log
[windows-jdk7] [INFO]           require-plugin-versions-mm-ci-friendly\pom.xml ... SUCCESS (6.3 s)
[windows-jdk7] [INFO] Building: require-plugin-versions-plugin-with-extensions\pom.xml
[windows-jdk7] [INFO]           require-plugin-versions-plugin-with-extensions\pom.xml SUCCESS (8.2 s)
[windows-jdk7] [INFO] Building: require-plugin-versions-plugin-with-integration-test-lifecycle\pom.xml
[windows-jdk7] [INFO]           require-plugin-versions-plugin-with-integration-test-lifecycle\pom.xml SUCCESS (13.1 s)
[windows-jdk7] [INFO] Building: require-plugin-versions-projectGAVexpressions\pom.xml
[windows-jdk7] [INFO]           require-plugin-versions-projectGAVexpressions\pom.xml SUCCESS (6.1 s)
[windows-jdk7] [INFO] Building: require-profile-ids-exist_failure\pom.xml
[windows-jdk7] [INFO] run post-build script verify.groovy
[windows-jdk7] [INFO]           require-profile-ids-exist_failure\pom.xml ........ SUCCESS (6.1 s)
[windows-jdk7] [INFO] Building: require-profile-ids-exist_success\pom.xml
[windows-jdk7] [INFO]           require-profile-ids-exist_success\pom.xml ........ SUCCESS (5.6 s)
[windows-jdk7] [INFO] Building: require-property\pom.xml
[windows-jdk7] [INFO]           require-property\pom.xml ......................... SUCCESS (5.7 s)
[windows-jdk7] [INFO] Building: require-release-dependencies\pom.xml
[windows-jdk7] [INFO]           require-release-dependencies\pom.xml ............. SUCCESS (6.2 s)
[windows-jdk7] [INFO] Building: require-release-dependencies-excludes\pom.xml
[Pipeline] [windows-jdk8] }
[windows-jdk8] [withMaven] invokerPublisher - Archive invoker results for Maven artifact MavenArtifact{org.apache.maven.plugins:maven-enforcer-plugin::3.0.0-SNAPSHOT(version: 3.0.0-SNAPSHOT, snapshot:false) } generated by PluginInvocation{org.apache.maven.plugins:maven-invoker-plugin:3.0.1@run  integration-test}: m\maven-enforcer-plugin\target\invoker-reports\*.xml
[windows-jdk8] [withMaven] junitPublisher - Archive test results for Maven artifact org.apache.maven.enforcer:enforcer-api:3.0.0-SNAPSHOT generated by maven-surefire-plugin:test (default-test): m\enforcer-api\target\surefire-reports\*.xml
[windows-jdk8] Recording test results
[windows-jdk8] None of the test reports contained any result
[windows-jdk8] [withMaven] junitPublisher - Archive test results for Maven artifact org.apache.maven.enforcer:enforcer-rules:3.0.0-SNAPSHOT generated by maven-surefire-plugin:test (default-test): m\enforcer-rules\target\surefire-reports\*.xml
[windows-jdk8] Recording test results
[windows-jdk8] [withMaven] junitPublisher - Archive test results for Maven artifact org.apache.maven.plugins:maven-enforcer-plugin:3.0.0-SNAPSHOT generated by maven-surefire-plugin:test (default-test): m\maven-enforcer-plugin\target\surefire-reports\*.xml
[windows-jdk8] Recording test results
[Pipeline] [windows-jdk8] // withMaven
[Pipeline] [windows-jdk8] cleanWs
[Pipeline] [windows-jdk11] }
[Pipeline] [windows-jdk11] // dir
[windows-jdk8] [WS-CLEANUP] Deleting project workspace...Cannot delete workspace :remote file operation failed: f:\jenkins\jenkins-slave\workspace\aven-enforcer_MENFORCER-294-IBUS6H5LUW3LLGQ77JNQBEL74UE2BN3AO433QECSA2A76NFISVIQ at hudson.remoting.Channel@398d98d3:JNLP4-connect connection from ec2-34-228-168-168.compute-1.amazonaws.com/34.228.168.168:51626: java.nio.file.AccessDeniedException: f:\jenkins\jenkins-slave\workspace\aven-enforcer_MENFORCER-294-IBUS6H5LUW3LLGQ77JNQBEL74UE2BN3AO433QECSA2A76NFISVIQ -> f:\jenkins\jenkins-slave\workspace\aven-enforcer_MENFORCER-294-IBUS6H5LUW3LLGQ77JNQBEL74UE2BN3AO433QECSA2A76NFISVIQ_ws-cleanup_1546148265401
[windows-jdk7] [INFO] snapshot org.apache.maven.plugins.enforcer.its:menforcer85_api:1.0-SNAPSHOT: checking for updates from apache-snapshots
[windows-jdk7] [INFO] snapshot org.apache.maven.plugins.enforcer.its:menforcer85_api:1.0-SNAPSHOT: checking for updates from Nexus
[windows-jdk7] [INFO] artifact org.apache.maven.plugins.enforcer.its.menforcer85_api:1.0-SNAPSHOT: checking for updates from central
[windows-jdk7] [INFO] org.apache.maven.plugins.enforcer.its.menforcer85_api.1.0-SNAPSHOT: checking for updates from central
[windows-jdk7] [INFO]           require-release-dependencies-excludes\pom.xml .... SUCCESS (6.2 s)
[windows-jdk7] [INFO] Building: require-release-dependencies-excludes_failure\pom.xml
[windows-jdk7] [INFO]           require-release-dependencies-excludes_failure\pom.xml SUCCESS (5.9 s)
[windows-jdk7] [INFO] Building: require-release-version\pom.xml
[windows-jdk7] [INFO]           require-release-version\pom.xml .................. SUCCESS (5.9 s)
[windows-jdk7] [INFO] Building: require-same-versions_failure\pom.xml
[windows-jdk7] [INFO]           require-same-versions_failure\pom.xml ............ SUCCESS (6.0 s)
[windows-jdk7] [INFO] Building: require-same-versions_success\pom.xml
[windows-jdk7] [INFO]           require-same-versions_success\pom.xml ............ SUCCESS (5.7 s)
[windows-jdk7] [INFO] Building: require-snapshot-version_failure\pom.xml
[windows-jdk7] [INFO]           require-snapshot-version_failure\pom.xml ......... SUCCESS (5.6 s)
[windows-jdk7] [INFO] Building: require-snapshot-version_success\pom.xml
[windows-jdk7] [INFO]           require-snapshot-version_success\pom.xml ......... SUCCESS (5.8 s)
[windows-jdk7] [INFO] Building: require-upper-bound-dependencies-managed_failure\pom.xml
[windows-jdk7] [INFO] run post-build script verify.groovy
[windows-jdk7] [INFO]           require-upper-bound-dependencies-managed_failure\pom.xml SUCCESS (6.1 s)
[windows-jdk7] [INFO] Building: require-upper-bound-dependencies-managed_success\pom.xml
[windows-jdk7] [INFO]           require-upper-bound-dependencies-managed_success\pom.xml SUCCESS (5.7 s)
[windows-jdk7] [INFO] Building: require-upper-bound-dependencies-unique_failure\pom.xml
[windows-jdk7] [INFO] snapshot org.apache.maven.plugins.enforcer.its:menforcer134_project:1.0-SNAPSHOT: checking for updates from apache-snapshots
[windows-jdk7] [INFO] snapshot org.apache.maven.plugins.enforcer.its:menforcer134_project:1.0-SNAPSHOT: checking for updates from Nexus
[windows-jdk7] [INFO] artifact org.apache.maven.plugins.enforcer.its.menforcer134_project:1.0-SNAPSHOT: checking for updates from central
[windows-jdk7] [INFO] org.apache.maven.plugins.enforcer.its.menforcer134_project.1.0-SNAPSHOT: checking for updates from central
[windows-jdk7] [INFO] snapshot org.apache.maven.plugins.enforcer.its:menforcer134_modelbuilder:1.0-SNAPSHOT: checking for updates from apache-snapshots
[windows-jdk7] [INFO] snapshot org.apache.maven.plugins.enforcer.its:menforcer134_modelbuilder:1.0-SNAPSHOT: checking for updates from Nexus
[windows-jdk7] [INFO] artifact org.apache.maven.plugins.enforcer.its.menforcer134_modelbuilder:1.0-SNAPSHOT: checking for updates from central
[windows-jdk7] [INFO] org.apache.maven.plugins.enforcer.its.menforcer134_modelbuilder.1.0-SNAPSHOT: checking for updates from central
[windows-jdk7] [INFO] snapshot org.apache.maven.plugins.enforcer.its:menforcer134_model:1.0-SNAPSHOT: checking for updates from apache-snapshots
[windows-jdk7] [INFO] snapshot org.apache.maven.plugins.enforcer.its:menforcer134_model:1.0-SNAPSHOT: checking for updates from Nexus
[windows-jdk7] [INFO] artifact org.apache.maven.plugins.enforcer.its.menforcer134_model:1.0-SNAPSHOT: checking for updates from central
[windows-jdk7] [INFO] org.apache.maven.plugins.enforcer.its.menforcer134_model.1.0-SNAPSHOT: checking for updates from central
[windows-jdk7] [INFO] run post-build script verify.groovy
[windows-jdk7] [INFO]           require-upper-bound-dependencies-unique_failure\pom.xml SUCCESS (7.3 s)
[windows-jdk7] [INFO] Building: require-upper-bound-dependencies-unique_success\pom.xml
[Pipeline] [windows-jdk11] }
[windows-jdk11] [withMaven] invokerPublisher - Archive invoker results for Maven artifact MavenArtifact{org.apache.maven.plugins:maven-enforcer-plugin::3.0.0-SNAPSHOT(version: 3.0.0-SNAPSHOT, snapshot:false) } generated by PluginInvocation{org.apache.maven.plugins:maven-invoker-plugin:3.0.1@run  integration-test}: m\maven-enforcer-plugin\target\invoker-reports\*.xml
[windows-jdk11] [withMaven] junitPublisher - Archive test results for Maven artifact org.apache.maven.enforcer:enforcer-api:3.0.0-SNAPSHOT generated by maven-surefire-plugin:test (default-test): m\enforcer-api\target\surefire-reports\*.xml
[windows-jdk11] Recording test results
[windows-jdk11] None of the test reports contained any result
[windows-jdk11] [withMaven] junitPublisher - Archive test results for Maven artifact org.apache.maven.enforcer:enforcer-rules:3.0.0-SNAPSHOT generated by maven-surefire-plugin:test (default-test): m\enforcer-rules\target\surefire-reports\*.xml
[windows-jdk11] Recording test results
[windows-jdk11] [withMaven] junitPublisher - Archive test results for Maven artifact org.apache.maven.plugins:maven-enforcer-plugin:3.0.0-SNAPSHOT generated by maven-surefire-plugin:test (default-test): m\maven-enforcer-plugin\target\surefire-reports\*.xml
[windows-jdk11] Recording test results
[Pipeline] [windows-jdk11] // withMaven
[Pipeline] [windows-jdk8] }
[Pipeline] [windows-jdk11] cleanWs
[Pipeline] [windows-jdk8] // stage
[Pipeline] [windows-jdk8] }
[Pipeline] [windows-jdk8] // node
[Pipeline] [windows-jdk8] }
[windows-jdk8] Failed in branch windows-jdk8
[windows-jdk11] [WS-CLEANUP] Deleting project workspace...Cannot delete workspace :remote file operation failed: f:\jenkins\jenkins-slave\workspace\aven-enforcer_MENFORCER-294-IBUS6H5LUW3LLGQ77JNQBEL74UE2BN3AO433QECSA2A76NFISVIQ@2 at hudson.remoting.Channel@398d98d3:JNLP4-connect connection from ec2-34-228-168-168.compute-1.amazonaws.com/34.228.168.168:51626: java.nio.file.AccessDeniedException: f:\jenkins\jenkins-slave\workspace\aven-enforcer_MENFORCER-294-IBUS6H5LUW3LLGQ77JNQBEL74UE2BN3AO433QECSA2A76NFISVIQ@2 -> f:\jenkins\jenkins-slave\workspace\aven-enforcer_MENFORCER-294-IBUS6H5LUW3LLGQ77JNQBEL74UE2BN3AO433QECSA2A76NFISVIQ@2_ws-cleanup_1546148324671
[Pipeline] [windows-jdk11] }
[Pipeline] [windows-jdk11] // stage
[Pipeline] [windows-jdk11] }
[Pipeline] [windows-jdk11] // node
[Pipeline] [windows-jdk11] }
[windows-jdk11] Failed in branch windows-jdk11
[windows-jdk7] [INFO]           require-upper-bound-dependencies-unique_success\pom.xml SUCCESS (5.9 s)
[windows-jdk7] [INFO] Building: require-upper-bound-deps_failure\pom.xml
[windows-jdk7] [INFO] run post-build script verify.groovy
[windows-jdk7] [INFO]           require-upper-bound-deps_failure\pom.xml ......... SUCCESS (5.6 s)
[windows-jdk7] [INFO] Building: require-upper-bound-deps_ignored\pom.xml
[windows-jdk7] [INFO] run post-build script verify.groovy
[windows-jdk7] [INFO]           require-upper-bound-deps_ignored\pom.xml ......... SUCCESS (6.1 s)
[windows-jdk7] [INFO] Building: require-upper-bound-deps_success\pom.xml
[windows-jdk7] [INFO]           require-upper-bound-deps_success\pom.xml ......... SUCCESS (5.7 s)
[windows-jdk7] [INFO] Building: resolve_collect_dependencies\pom.xml
[windows-jdk7] [INFO] run post-build script verify.groovy
[windows-jdk7] [INFO]           resolve_collect_dependencies\pom.xml ............. SUCCESS (7.9 s)
[windows-jdk7] [INFO] -------------------------------------------------
[windows-jdk7] [INFO] Build Summary:
[windows-jdk7] [INFO]   Passed: 68, Failed: 0, Errors: 0, Skipped: 0
[windows-jdk7] [INFO] -------------------------------------------------
[windows-jdk7] [INFO]
[windows-jdk7] [INFO] --- mrm-maven-plugin:1.0.0:stop (default) @ maven-enforcer-plugin ---
[windows-jdk7] [INFO] Stopping Mock Repository Manager on http://localhost:53838
[windows-jdk7] [INFO] Mock Repository Manager http://localhost:53838 is stopped.
[windows-jdk7] [INFO]
[windows-jdk7] [INFO] --- maven-checkstyle-plugin:3.0.0:check (checkstyle-check) @ maven-enforcer-plugin ---
[windows-jdk7] [INFO] ------------------------------------------------------------------------
[windows-jdk7] [INFO] Reactor Summary:
[windows-jdk7] [INFO]
[windows-jdk7] [INFO] Apache Maven Enforcer .............................. SUCCESS [ 23.871 s]
[windows-jdk7] [INFO] Apache Maven Enforcer API .......................... SUCCESS [  6.255 s]
[windows-jdk7] [INFO] Apache Maven Enforcer Built-In Rules ............... SUCCESS [ 15.918 s]
[windows-jdk7] [INFO] Apache Maven Enforcer Plugin ....................... SUCCESS [07:15 min]
[windows-jdk7] [INFO] ------------------------------------------------------------------------
[windows-jdk7] [INFO] BUILD SUCCESS
[windows-jdk7] [INFO] ------------------------------------------------------------------------
[windows-jdk7] [INFO] Total time: 08:03 min
[windows-jdk7] [INFO] Finished at: 2018-12-30T05:39:14Z
[windows-jdk7] [INFO] Final Memory: 53M/530M
[windows-jdk7] [INFO] ------------------------------------------------------------------------
[windows-jdk7] [INFO] [jenkins-event-spy] Generated F:\jenkins\jenkins-slave\workspace\aven-enforcer_MENFORCER-294-IBUS6H5LUW3LLGQ77JNQBEL74UE2BN3AO433QECSA2A76NFISVIQ@tmp\withMaven7529c38e\maven-spy-20181230-053110-2361818183998391650462.log
[windows-jdk7] Picked up JAVA_TOOL_OPTIONS: -Dmaven.ext.class.path="f:\jenkins\jenkins-slave\workspace\aven-enforcer_MENFORCER-294-IBUS6H5LUW3LLGQ77JNQBEL74UE2BN3AO433QECSA2A76NFISVIQ@tmp\withMaven7529c38e\pipeline-maven-spy.jar" -Dorg.jenkinsci.plugins.pipeline.maven.reportsFolder="f:\jenkins\jenkins-slave\workspace\aven-enforcer_MENFORCER-294-IBUS6H5LUW3LLGQ77JNQBEL74UE2BN3AO433QECSA2A76NFISVIQ@tmp\withMaven7529c38e"
[Pipeline] [windows-jdk7] }
[Pipeline] [windows-jdk7] // dir
[Pipeline] [windows-jdk7] }
[windows-jdk7] [withMaven] invokerPublisher - Archive invoker results for Maven artifact MavenArtifact{org.apache.maven.plugins:maven-enforcer-plugin::3.0.0-SNAPSHOT(version: 3.0.0-SNAPSHOT, snapshot:false) } generated by PluginInvocation{org.apache.maven.plugins:maven-invoker-plugin:3.0.1@run  integration-test}: m\maven-enforcer-plugin\target\invoker-reports\*.xml
[windows-jdk7] [withMaven] junitPublisher - Archive test results for Maven artifact org.apache.maven.enforcer:enforcer-api:3.0.0-SNAPSHOT generated by maven-surefire-plugin:test (default-test): m\enforcer-api\target\surefire-reports\*.xml
[windows-jdk7] Recording test results
[windows-jdk7] None of the test reports contained any result
[windows-jdk7] [withMaven] junitPublisher - Archive test results for Maven artifact org.apache.maven.enforcer:enforcer-rules:3.0.0-SNAPSHOT generated by maven-surefire-plugin:test (default-test): m\enforcer-rules\target\surefire-reports\*.xml
[windows-jdk7] Recording test results
[windows-jdk7] [withMaven] junitPublisher - Archive test results for Maven artifact org.apache.maven.plugins:maven-enforcer-plugin:3.0.0-SNAPSHOT generated by maven-surefire-plugin:test (default-test): m\maven-enforcer-plugin\target\surefire-reports\*.xml
[windows-jdk7] Recording test results
[Pipeline] [windows-jdk7] // withMaven
[Pipeline] [windows-jdk7] cleanWs
[windows-jdk7] [WS-CLEANUP] Deleting project workspace...Cannot delete workspace :remote file operation failed: f:\jenkins\jenkins-slave\workspace\aven-enforcer_MENFORCER-294-IBUS6H5LUW3LLGQ77JNQBEL74UE2BN3AO433QECSA2A76NFISVIQ at hudson.remoting.Channel@7f96cc69:JNLP4-connect connection from 37.48.69.226/37.48.69.226:63010: java.nio.file.AccessDeniedException: f:\jenkins\jenkins-slave\workspace\aven-enforcer_MENFORCER-294-IBUS6H5LUW3LLGQ77JNQBEL74UE2BN3AO433QECSA2A76NFISVIQ -> f:\jenkins\jenkins-slave\workspace\aven-enforcer_MENFORCER-294-IBUS6H5LUW3LLGQ77JNQBEL74UE2BN3AO433QECSA2A76NFISVIQ_ws-cleanup_1546148374743
[Pipeline] [windows-jdk7] }
[Pipeline] [windows-jdk7] // stage
[Pipeline] [windows-jdk7] }
[Pipeline] [windows-jdk7] // node
[Pipeline] [windows-jdk7] }
[windows-jdk7] Failed in branch windows-jdk7
[Pipeline] // parallel
[Pipeline] stage
[Pipeline] { (Notifications)
[Pipeline] echo
Build result: FAILURE
[Pipeline] jiraIssueSelector
Reply | Threaded
Open this post in threaded view
|

Build succeeded in Jenkins: Maven TLP » maven-enforcer » MENFORCER-294 #19

Apache Jenkins Server-2
See https://builds.apache.org/job/maven-box/job/maven-enforcer/job/MENFORCER-294/19/

Changes:

* use a special local repo to have a bit of caching
* add mavenLinkerPublisher

All tests passed
Reply | Threaded
Open this post in threaded view
|

Build failed in Jenkins: Maven TLP » maven-enforcer » MENFORCER-294 #20

Apache Jenkins Server-2
See https://builds.apache.org/job/maven-box/job/maven-enforcer/job/MENFORCER-294/20/

Changes:

* Disable cleanWs() due to issues with file handles on Windows
* added a link to asf-gitpubsub-jenkins-plugin
* fixed markup (asciidoc, not markdown...)

All tests passed

Build log:
[...truncated 15976 lines...]
[INFO] artifact org.apache.maven.plugins.enforcer.its.menforcer134_project:1.0-SNAPSHOT: checking for updates from central
[INFO] org.apache.maven.plugins.enforcer.its.menforcer134_project.1.0-SNAPSHOT: checking for updates from central
[INFO] snapshot org.apache.maven.plugins.enforcer.its:menforcer134_modelbuilder:1.0-SNAPSHOT: checking for updates from apache-snapshots
[INFO] snapshot org.apache.maven.plugins.enforcer.its:menforcer134_modelbuilder:1.0-SNAPSHOT: checking for updates from Nexus
[INFO]           require-plugin-versions-expressions\pom.xml ...... SUCCESS (4.3 s)
[INFO] Building: require-plugin-versions-mm-ci-friendly\pom.xml
[INFO] artifact org.apache.maven.plugins.enforcer.its.menforcer134_modelbuilder:1.0-SNAPSHOT: checking for updates from central
[INFO] org.apache.maven.plugins.enforcer.its.menforcer134_modelbuilder.1.0-SNAPSHOT: checking for updates from central
[INFO] snapshot org.apache.maven.plugins.enforcer.its:menforcer134_model:1.0-SNAPSHOT: checking for updates from apache-snapshots
[INFO] snapshot org.apache.maven.plugins.enforcer.its:menforcer134_model:1.0-SNAPSHOT: checking for updates from Nexus
[INFO] artifact org.apache.maven.plugins.enforcer.its.menforcer134_model:1.0-SNAPSHOT: checking for updates from central
[INFO] org.apache.maven.plugins.enforcer.its.menforcer134_model.1.0-SNAPSHOT: checking for updates from central
[INFO] run post-build script verify.groovy
[INFO]           resolve_collect_dependencies\pom.xml ............. SUCCESS (9.1 s)
[INFO] -------------------------------------------------
[INFO] Build Summary:
[INFO]   Passed: 68, Failed: 0, Errors: 0, Skipped: 0
[INFO] -------------------------------------------------
[INFO]
[INFO] --- mrm-maven-plugin:1.0.0:stop (default) @ maven-enforcer-plugin ---
[INFO] Stopping Mock Repository Manager on http://localhost:49623
[INFO] Mock Repository Manager http://localhost:49623 is stopped.
[INFO]
[INFO] --- maven-checkstyle-plugin:3.0.0:check (checkstyle-check) @ maven-enforcer-plugin ---
[INFO] ------------------------------------------------------------------------
[INFO] Reactor Summary:
[INFO]
[INFO] Apache Maven Enforcer .............................. SUCCESS [ 25.183 s]
[INFO] Apache Maven Enforcer API .......................... SUCCESS [  6.248 s]
[INFO] Apache Maven Enforcer Built-In Rules ............... SUCCESS [ 17.057 s]
[INFO] Apache Maven Enforcer Plugin ....................... SUCCESS [07:58 min]
[INFO] ------------------------------------------------------------------------
[INFO] BUILD SUCCESS
[INFO] ------------------------------------------------------------------------
[INFO] Total time: 08:49 min
[INFO] Finished at: 2019-01-10T07:29:32Z
[INFO] run post-build script verify.groovy
[INFO]           require-upper-bound-dependencies-unique_failure\pom.xml SUCCESS (8.0 s)
[INFO] Building: require-upper-bound-dependencies-unique_success\pom.xml
[INFO] Final Memory: 60M/916M
[INFO] ------------------------------------------------------------------------
[INFO] [jenkins-event-spy] Generated F:\jenkins\jenkins-slave\workspace\aven-enforcer_MENFORCER-294-IBUS6H5LUW3LLGQ77JNQBEL74UE2BN3AO433QECSA2A76NFISVIQ@tmp\withMaven850ab7e3\maven-spy-20190110-072041-6945864755083414299508.log
Picked up JAVA_TOOL_OPTIONS: -Dmaven.ext.class.path="f:\jenkins\jenkins-slave\workspace\aven-enforcer_MENFORCER-294-IBUS6H5LUW3LLGQ77JNQBEL74UE2BN3AO433QECSA2A76NFISVIQ@tmp\withMaven850ab7e3\pipeline-maven-spy.jar" -Dorg.jenkinsci.plugins.pipeline.maven.reportsFolder="f:\jenkins\jenkins-slave\workspace\aven-enforcer_MENFORCER-294-IBUS6H5LUW3LLGQ77JNQBEL74UE2BN3AO433QECSA2A76NFISVIQ@tmp\withMaven850ab7e3"
[Pipeline] }
[Pipeline] // dir
[Pipeline] }
[withMaven] invokerPublisher - Archive invoker results for Maven artifact MavenArtifact{org.apache.maven.plugins:maven-enforcer-plugin:maven-plugin:3.0.0-SNAPSHOT(version: 3.0.0-SNAPSHOT, snapshot:false) } generated by PluginInvocation{org.apache.maven.plugins:maven-invoker-plugin:3.0.1@run  integration-test}: m\maven-enforcer-plugin\target\invoker-reports\*.xml
[INFO]           require-plugin-versions-mm-ci-friendly\pom.xml ... SUCCESS (7.0 s)
[INFO] Building: require-plugin-versions-plugin-with-extensions\pom.xml
[INFO]           require-upper-bound-dependencies-unique_success\pom.xml SUCCESS (6.5 s)
[INFO] Building: require-upper-bound-deps_failure\pom.xml
[INFO] run post-build script verify.groovy
[INFO]           require-upper-bound-deps_failure\pom.xml ......... SUCCESS (6.7 s)
[INFO] Building: require-upper-bound-deps_ignored\pom.xml
[INFO]           require-plugin-versions-plugin-with-extensions\pom.xml SUCCESS (8.7 s)
[INFO] Building: require-plugin-versions-plugin-with-integration-test-lifecycle\pom.xml
[INFO] run post-build script verify.groovy
[INFO]           require-upper-bound-deps_ignored\pom.xml ......... SUCCESS (6.2 s)
[INFO] Building: require-upper-bound-deps_success\pom.xml
[withMaven] junitPublisher - Archive test results for Maven artifact org.apache.maven.enforcer:enforcer-api:jar:3.0.0-SNAPSHOT generated by maven-surefire-plugin:test (default-test): m\enforcer-api\target\surefire-reports\*.xml
Recording test results
None of the test reports contained any result
[withMaven] junitPublisher - Archive test results for Maven artifact org.apache.maven.enforcer:enforcer-rules:jar:3.0.0-SNAPSHOT generated by maven-surefire-plugin:test (default-test): m\enforcer-rules\target\surefire-reports\*.xml
Recording test results
[withMaven] junitPublisher - Archive test results for Maven artifact org.apache.maven.plugins:maven-enforcer-plugin:maven-plugin:3.0.0-SNAPSHOT generated by maven-surefire-plugin:test (default-test): m\maven-enforcer-plugin\target\surefire-reports\*.xml
Recording test results
[withMaven] Publishers: Pipeline Graph Publisher: 4 ms, Invoker Publisher: 20600 ms, Junit Publisher: 2190 ms, Dependencies Fingerprint Publisher: 100 ms
[Pipeline] // withMaven
[Pipeline] cleanWs
[WS-CLEANUP] Deleting project workspace...
[WS-CLEANUP] Deferred wipeout is used...
ERROR: Cannot delete workspace :f:\jenkins\jenkins-slave\workspace\aven-enforcer_MENFORCER-294-IBUS6H5LUW3LLGQ77JNQBEL74UE2BN3AO433QECSA2A76NFISVIQ\m\maven-enforcer-plugin\target\invoker-reports\BUILD-always-fail-warn.xml
[Pipeline] }
[Pipeline] // stage
[Pipeline] }
[Pipeline] // node
[Pipeline] }
Failed in branch windows-jdk8
[INFO]           require-upper-bound-deps_success\pom.xml ......... SUCCESS (6.2 s)
[INFO] Building: resolve_collect_dependencies\pom.xml
[INFO]           require-plugin-versions-plugin-with-integration-test-lifecycle\pom.xml SUCCESS (18.8 s)
[INFO] Building: require-plugin-versions-projectGAVexpressions\pom.xml
[INFO] run post-build script verify.groovy
[INFO]           resolve_collect_dependencies\pom.xml ............. SUCCESS (10.4 s)
[INFO] -------------------------------------------------
[INFO] Build Summary:
[INFO]   Passed: 68, Failed: 0, Errors: 0, Skipped: 0
[INFO] -------------------------------------------------
[INFO]
[INFO] --- mrm-maven-plugin:1.0.0:stop (default) @ maven-enforcer-plugin ---
[INFO] Stopping Mock Repository Manager on http://localhost:60644
[INFO] Mock Repository Manager http://localhost:60644 is stopped.
[INFO]
[INFO] --- maven-checkstyle-plugin:3.0.0:check (checkstyle-check) @ maven-enforcer-plugin ---
[INFO]           require-plugin-versions-projectGAVexpressions\pom.xml SUCCESS (4.9 s)
[INFO] Building: require-profile-ids-exist_failure\pom.xml
[INFO] ------------------------------------------------------------------------
[INFO] Reactor Summary:
[INFO]
[INFO] Apache Maven Enforcer .............................. SUCCESS [ 48.100 s]
[INFO] Apache Maven Enforcer API .......................... SUCCESS [  8.934 s]
[INFO] Apache Maven Enforcer Built-In Rules ............... SUCCESS [ 20.473 s]
[INFO] Apache Maven Enforcer Plugin ....................... SUCCESS [08:15 min]
[INFO] ------------------------------------------------------------------------
[INFO] BUILD SUCCESS
[INFO] ------------------------------------------------------------------------
[INFO] Total time: 09:35 min
[INFO] Finished at: 2019-01-09T23:30:09-08:00
[INFO] Final Memory: 51M/407M
[INFO] ------------------------------------------------------------------------
[INFO] [jenkins-event-spy] Generated F:\jenkins\jenkins-slave\workspace\box_maven-enforcer_MENFORCER-294@tmp\withMaven711c3dd0\maven-spy-20190109-232033-9754390766086159028646.log
Picked up JAVA_TOOL_OPTIONS: -Dmaven.ext.class.path="f:\jenkins\jenkins-slave\workspace\box_maven-enforcer_MENFORCER-294@tmp\withMaven711c3dd0\pipeline-maven-spy.jar" -Dorg.jenkinsci.plugins.pipeline.maven.reportsFolder="f:\jenkins\jenkins-slave\workspace\box_maven-enforcer_MENFORCER-294@tmp\withMaven711c3dd0"
[Pipeline] }
[Pipeline] // dir
[Pipeline] }
[withMaven] invokerPublisher - Archive invoker results for Maven artifact MavenArtifact{org.apache.maven.plugins:maven-enforcer-plugin:maven-plugin:3.0.0-SNAPSHOT(version: 3.0.0-SNAPSHOT, snapshot:false) } generated by PluginInvocation{org.apache.maven.plugins:maven-invoker-plugin:3.0.1@run  integration-test}: m\maven-enforcer-plugin\target\invoker-reports\*.xml
[INFO] run post-build script verify.groovy
[INFO]           require-profile-ids-exist_failure\pom.xml ........ SUCCESS (5.3 s)
[INFO] Building: require-profile-ids-exist_success\pom.xml
[INFO]           require-profile-ids-exist_success\pom.xml ........ SUCCESS (4.7 s)
[INFO] Building: require-property\pom.xml
[INFO]           require-property\pom.xml ......................... SUCCESS (4.5 s)
[INFO] Building: require-release-dependencies\pom.xml
[INFO]           require-release-dependencies\pom.xml ............. SUCCESS (4.5 s)
[INFO] Building: require-release-dependencies-excludes\pom.xml
[INFO] snapshot org.apache.maven.plugins.enforcer.its:menforcer85_api:1.0-SNAPSHOT: checking for updates from apache-snapshots
[INFO] snapshot org.apache.maven.plugins.enforcer.its:menforcer85_api:1.0-SNAPSHOT: checking for updates from Nexus
[INFO] artifact org.apache.maven.plugins.enforcer.its.menforcer85_api:1.0-SNAPSHOT: checking for updates from central
[INFO] org.apache.maven.plugins.enforcer.its.menforcer85_api.1.0-SNAPSHOT: checking for updates from central
[INFO]           require-release-dependencies-excludes\pom.xml .... SUCCESS (5.2 s)
[INFO] Building: require-release-dependencies-excludes_failure\pom.xml
[withMaven] junitPublisher - Archive test results for Maven artifact org.apache.maven.enforcer:enforcer-api:jar:3.0.0-SNAPSHOT generated by maven-surefire-plugin:test (default-test): m\enforcer-api\target\surefire-reports\*.xml
Recording test results
None of the test reports contained any result
[withMaven] junitPublisher - Archive test results for Maven artifact org.apache.maven.enforcer:enforcer-rules:jar:3.0.0-SNAPSHOT generated by maven-surefire-plugin:test (default-test): m\enforcer-rules\target\surefire-reports\*.xml
Recording test results
[withMaven] junitPublisher - Archive test results for Maven artifact org.apache.maven.plugins:maven-enforcer-plugin:maven-plugin:3.0.0-SNAPSHOT generated by maven-surefire-plugin:test (default-test): m\maven-enforcer-plugin\target\surefire-reports\*.xml
Recording test results
[withMaven] Publishers: Pipeline Graph Publisher: 2 ms, Invoker Publisher: 23837 ms, Junit Publisher: 1921 ms, Dependencies Fingerprint Publisher: 94 ms
[Pipeline] // withMaven
[Pipeline] cleanWs
[WS-CLEANUP] Deleting project workspace...
[WS-CLEANUP] Deferred wipeout is used...
ERROR: Cannot delete workspace :f:\jenkins\jenkins-slave\workspace\box_maven-enforcer_MENFORCER-294\m\maven-enforcer-plugin\target\invoker-reports\BUILD-always-fail-warn.xml
[Pipeline] }
[Pipeline] // stage
[Pipeline] }
[Pipeline] // node
[Pipeline] }
Failed in branch windows-jdk7
[INFO]           require-release-dependencies-excludes_failure\pom.xml SUCCESS (5.0 s)
[INFO] Building: require-release-version\pom.xml
[INFO]           require-release-version\pom.xml .................. SUCCESS (4.6 s)
[INFO] Building: require-same-versions_failure\pom.xml
[INFO]           require-same-versions_failure\pom.xml ............ SUCCESS (5.5 s)
[INFO] Building: require-same-versions_success\pom.xml
[INFO]           require-same-versions_success\pom.xml ............ SUCCESS (7.0 s)
[INFO] Building: require-snapshot-version_failure\pom.xml
[INFO]           require-snapshot-version_failure\pom.xml ......... SUCCESS (5.5 s)
[INFO] Building: require-snapshot-version_success\pom.xml
[INFO]           require-snapshot-version_success\pom.xml ......... SUCCESS (4.5 s)
[INFO] Building: require-upper-bound-dependencies-managed_failure\pom.xml
[INFO] run post-build script verify.groovy
[INFO]           require-upper-bound-dependencies-managed_failure\pom.xml SUCCESS (4.8 s)
[INFO] Building: require-upper-bound-dependencies-managed_success\pom.xml
[INFO]           require-upper-bound-dependencies-managed_success\pom.xml SUCCESS (5.3 s)
[INFO] Building: require-upper-bound-dependencies-unique_failure\pom.xml
[INFO] snapshot org.apache.maven.plugins.enforcer.its:menforcer134_project:1.0-SNAPSHOT: checking for updates from apache-snapshots
[INFO] snapshot org.apache.maven.plugins.enforcer.its:menforcer134_project:1.0-SNAPSHOT: checking for updates from Nexus
[INFO] artifact org.apache.maven.plugins.enforcer.its.menforcer134_project:1.0-SNAPSHOT: checking for updates from central
[INFO] org.apache.maven.plugins.enforcer.its.menforcer134_project.1.0-SNAPSHOT: checking for updates from central
[INFO] snapshot org.apache.maven.plugins.enforcer.its:menforcer134_modelbuilder:1.0-SNAPSHOT: checking for updates from apache-snapshots
[INFO] snapshot org.apache.maven.plugins.enforcer.its:menforcer134_modelbuilder:1.0-SNAPSHOT: checking for updates from Nexus
[INFO] artifact org.apache.maven.plugins.enforcer.its.menforcer134_modelbuilder:1.0-SNAPSHOT: checking for updates from central
[INFO] org.apache.maven.plugins.enforcer.its.menforcer134_modelbuilder.1.0-SNAPSHOT: checking for updates from central
[INFO] snapshot org.apache.maven.plugins.enforcer.its:menforcer134_model:1.0-SNAPSHOT: checking for updates from apache-snapshots
[INFO] snapshot org.apache.maven.plugins.enforcer.its:menforcer134_model:1.0-SNAPSHOT: checking for updates from Nexus
[INFO] artifact org.apache.maven.plugins.enforcer.its.menforcer134_model:1.0-SNAPSHOT: checking for updates from central
[INFO] org.apache.maven.plugins.enforcer.its.menforcer134_model.1.0-SNAPSHOT: checking for updates from central
[INFO] run post-build script verify.groovy
[INFO]           require-upper-bound-dependencies-unique_failure\pom.xml SUCCESS (7.3 s)
[INFO] Building: require-upper-bound-dependencies-unique_success\pom.xml
[INFO]           require-upper-bound-dependencies-unique_success\pom.xml SUCCESS (5.9 s)
[INFO] Building: require-upper-bound-deps_failure\pom.xml
[INFO] run post-build script verify.groovy
[INFO]           require-upper-bound-deps_failure\pom.xml ......... SUCCESS (5.5 s)
[INFO] Building: require-upper-bound-deps_ignored\pom.xml
[INFO] run post-build script verify.groovy
[INFO]           require-upper-bound-deps_ignored\pom.xml ......... SUCCESS (6.2 s)
[INFO] Building: require-upper-bound-deps_success\pom.xml
[INFO]           require-upper-bound-deps_success\pom.xml ......... SUCCESS (6.0 s)
[INFO] Building: resolve_collect_dependencies\pom.xml
[INFO] run post-build script verify.groovy
[INFO]           resolve_collect_dependencies\pom.xml ............. SUCCESS (11.0 s)
[INFO] -------------------------------------------------
[INFO] Build Summary:
[INFO]   Passed: 68, Failed: 0, Errors: 0, Skipped: 0
[INFO] -------------------------------------------------
[INFO]
[INFO] --- mrm-maven-plugin:1.0.0:stop (default) @ maven-enforcer-plugin ---
[INFO] Stopping Mock Repository Manager on http://localhost:60840
[INFO] Mock Repository Manager http://localhost:60840 is stopped.
[INFO]
[INFO] --- maven-checkstyle-plugin:3.0.0:check (checkstyle-check) @ maven-enforcer-plugin ---
[INFO] ------------------------------------------------------------------------
[INFO] Reactor Summary:
[INFO]
[INFO] Apache Maven Enforcer .............................. SUCCESS [ 44.941 s]
[INFO] Apache Maven Enforcer API .......................... SUCCESS [  7.797 s]
[INFO] Apache Maven Enforcer Built-In Rules ............... SUCCESS [ 18.203 s]
[INFO] Apache Maven Enforcer Plugin ....................... SUCCESS [06:47 min]
[INFO] ------------------------------------------------------------------------
[INFO] BUILD SUCCESS
[INFO] ------------------------------------------------------------------------
[INFO] Total time: 07:59 min
[INFO] Finished at: 2019-01-09T23:31:59-08:00
[INFO] Final Memory: 50M/174M
[INFO] ------------------------------------------------------------------------
[INFO] [jenkins-event-spy] Generated F:\jenkins\jenkins-slave\workspace\box_maven-enforcer_MENFORCER-294@2@tmp\withMaven4d8932ea\maven-spy-20190109-232359-433351432437989041573.log
[Pipeline] }
[Pipeline] // dir
[Pipeline] }
[withMaven] invokerPublisher - Archive invoker results for Maven artifact MavenArtifact{org.apache.maven.plugins:maven-enforcer-plugin:maven-plugin:3.0.0-SNAPSHOT(version: 3.0.0-SNAPSHOT, snapshot:false) } generated by PluginInvocation{org.apache.maven.plugins:maven-invoker-plugin:3.0.1@run  integration-test}: m\maven-enforcer-plugin\target\invoker-reports\*.xml
[withMaven] junitPublisher - Archive test results for Maven artifact org.apache.maven.enforcer:enforcer-api:jar:3.0.0-SNAPSHOT generated by maven-surefire-plugin:test (default-test): m\enforcer-api\target\surefire-reports\*.xml
Recording test results
None of the test reports contained any result
[withMaven] junitPublisher - Archive test results for Maven artifact org.apache.maven.enforcer:enforcer-rules:jar:3.0.0-SNAPSHOT generated by maven-surefire-plugin:test (default-test): m\enforcer-rules\target\surefire-reports\*.xml
Recording test results
[withMaven] junitPublisher - Archive test results for Maven artifact org.apache.maven.plugins:maven-enforcer-plugin:maven-plugin:3.0.0-SNAPSHOT generated by maven-surefire-plugin:test (default-test): m\maven-enforcer-plugin\target\surefire-reports\*.xml
Recording test results
[withMaven] Publishers: Pipeline Graph Publisher: 3 ms, Invoker Publisher: 23825 ms, Junit Publisher: 1834 ms, Dependencies Fingerprint Publisher: 107 ms
[Pipeline] // withMaven
[Pipeline] cleanWs
[WS-CLEANUP] Deleting project workspace...
[WS-CLEANUP] Deferred wipeout is used...
ERROR: Cannot delete workspace :f:\jenkins\jenkins-slave\workspace\box_maven-enforcer_MENFORCER-294@2\m\maven-enforcer-plugin\target\invoker-reports\BUILD-always-fail-warn.xml
[Pipeline] }
[Pipeline] // stage
[Pipeline] }
[Pipeline] // node
[Pipeline] }
Failed in branch windows-jdk11
[Pipeline] // parallel
[Pipeline] stage
[Pipeline] { (Notifications)
[Pipeline] echo
Build result: FAILURE
[Pipeline] jiraIssueSelector
[Pipeline] emailext
Reply | Threaded
Open this post in threaded view
|

Build failed in Jenkins: Maven TLP » maven-enforcer » MENFORCER-294 #21

Apache Jenkins Server-2
See https://builds.apache.org/job/maven-box/job/maven-enforcer/job/MENFORCER-294/21/

Changes:

* Add JDK 13 (latest)
* INFRA-17514, lock to 1 Windows node
* Cause found, back to all Windows nodes
* INFRA-17514 testing if this invoker keeps locks on the files.
* INFRA-17514 disable invokerPublisher() This is the root cause for the

All tests passed

Build log:
[...truncated 15976 lines...]
[INFO]           require-plugin-versions-projectGAVexpressions\pom.xml SUCCESS (5.8 s)
[INFO] Building: require-profile-ids-exist_failure\pom.xml
[INFO]           require-plugin-versions-plugin-with-extensions\pom.xml SUCCESS (6.3 s)
[INFO] Building: require-plugin-versions-plugin-with-integration-test-lifecycle\pom.xml
[INFO] run post-build script verify.groovy
[INFO]           require-profile-ids-exist_failure\pom.xml ........ SUCCESS (5.7 s)
[INFO] Building: require-profile-ids-exist_success\pom.xml
[INFO]           require-profile-ids-exist_success\pom.xml ........ SUCCESS (5.7 s)
[INFO] Building: require-property\pom.xml
[withMaven] junitPublisher - Archive test results for Maven artifact org.apache.maven.enforcer:enforcer-api:jar:3.0.0-SNAPSHOT generated by maven-surefire-plugin:test (default-test): m\enforcer-api\target\surefire-reports\*.xml
Recording test results
None of the test reports contained any result
[withMaven] junitPublisher - Archive test results for Maven artifact org.apache.maven.enforcer:enforcer-rules:jar:3.0.0-SNAPSHOT generated by maven-surefire-plugin:test (default-test): m\enforcer-rules\target\surefire-reports\*.xml
Recording test results
[withMaven] junitPublisher - Archive test results for Maven artifact org.apache.maven.plugins:maven-enforcer-plugin:maven-plugin:3.0.0-SNAPSHOT generated by maven-surefire-plugin:test (default-test): m\maven-enforcer-plugin\target\surefire-reports\*.xml
Recording test results
[withMaven] Publishers: Pipeline Graph Publisher: 2 ms, Invoker Publisher: 18879 ms, Junit Publisher: 1950 ms, Dependencies Fingerprint Publisher: 95 ms
[Pipeline] // withMaven
[Pipeline] cleanWs
[INFO]           require-property\pom.xml ......................... SUCCESS (5.6 s)
[INFO] Building: require-release-dependencies\pom.xml
[WS-CLEANUP] Deleting project workspace...
[WS-CLEANUP] Deferred wipeout is used...
ERROR: Cannot delete workspace :f:\jenkins\jenkins-slave\workspace\box_maven-enforcer_MENFORCER-294\m\maven-enforcer-plugin\target\invoker-reports\BUILD-always-fail-warn.xml
[Pipeline] }
[Pipeline] // stage
[Pipeline] }
[Pipeline] // node
[Pipeline] }
Failed in branch windows-jdk7
[INFO]           require-plugin-versions-plugin-with-integration-test-lifecycle\pom.xml SUCCESS (14.8 s)
[INFO] Building: require-plugin-versions-projectGAVexpressions\pom.xml
[INFO]           require-release-dependencies\pom.xml ............. SUCCESS (5.4 s)
[INFO] Building: require-release-dependencies-excludes\pom.xml
[INFO]           require-plugin-versions-projectGAVexpressions\pom.xml SUCCESS (4.9 s)
[INFO] Building: require-profile-ids-exist_failure\pom.xml
[INFO] snapshot org.apache.maven.plugins.enforcer.its:menforcer85_api:1.0-SNAPSHOT: checking for updates from apache-snapshots
[INFO] snapshot org.apache.maven.plugins.enforcer.its:menforcer85_api:1.0-SNAPSHOT: checking for updates from Nexus
[INFO] artifact org.apache.maven.plugins.enforcer.its.menforcer85_api:1.0-SNAPSHOT: checking for updates from central
[INFO] org.apache.maven.plugins.enforcer.its.menforcer85_api.1.0-SNAPSHOT: checking for updates from central
[INFO]           require-release-dependencies-excludes\pom.xml .... SUCCESS (6.3 s)
[INFO] Building: require-release-dependencies-excludes_failure\pom.xml
[INFO] run post-build script verify.groovy
[INFO]           require-profile-ids-exist_failure\pom.xml ........ SUCCESS (5.6 s)
[INFO] Building: require-profile-ids-exist_success\pom.xml
[INFO]           require-release-dependencies-excludes_failure\pom.xml SUCCESS (6.0 s)
[INFO] Building: require-release-version\pom.xml
[INFO]           require-profile-ids-exist_success\pom.xml ........ SUCCESS (4.9 s)
[INFO] Building: require-property\pom.xml
[INFO]           require-property\pom.xml ......................... SUCCESS (5.0 s)
[INFO] Building: require-release-dependencies\pom.xml
[INFO]           require-release-version\pom.xml .................. SUCCESS (6.2 s)
[INFO] Building: require-same-versions_failure\pom.xml
[INFO]           require-release-dependencies\pom.xml ............. SUCCESS (4.7 s)
[INFO] Building: require-release-dependencies-excludes\pom.xml
[INFO]           require-same-versions_failure\pom.xml ............ SUCCESS (6.4 s)
[INFO] Building: require-same-versions_success\pom.xml
[INFO] snapshot org.apache.maven.plugins.enforcer.its:menforcer85_api:1.0-SNAPSHOT: checking for updates from apache-snapshots
[INFO] snapshot org.apache.maven.plugins.enforcer.its:menforcer85_api:1.0-SNAPSHOT: checking for updates from Nexus
[INFO] artifact org.apache.maven.plugins.enforcer.its.menforcer85_api:1.0-SNAPSHOT: checking for updates from central
[INFO] org.apache.maven.plugins.enforcer.its.menforcer85_api.1.0-SNAPSHOT: checking for updates from central
[INFO]           require-release-dependencies-excludes\pom.xml .... SUCCESS (4.7 s)
[INFO] Building: require-release-dependencies-excludes_failure\pom.xml
[INFO]           require-same-versions_success\pom.xml ............ SUCCESS (5.7 s)
[INFO] Building: require-snapshot-version_failure\pom.xml
[INFO]           require-release-dependencies-excludes_failure\pom.xml SUCCESS (5.0 s)
[INFO] Building: require-release-version\pom.xml
[INFO]           require-release-version\pom.xml .................. SUCCESS (4.5 s)
[INFO] Building: require-same-versions_failure\pom.xml
[INFO]           require-snapshot-version_failure\pom.xml ......... SUCCESS (5.9 s)
[INFO] Building: require-snapshot-version_success\pom.xml
[INFO]           require-same-versions_failure\pom.xml ............ SUCCESS (4.6 s)
[INFO] Building: require-same-versions_success\pom.xml
[INFO]           require-snapshot-version_success\pom.xml ......... SUCCESS (6.0 s)
[INFO] Building: require-upper-bound-dependencies-managed_failure\pom.xml
[INFO]           require-same-versions_success\pom.xml ............ SUCCESS (5.2 s)
[INFO] Building: require-snapshot-version_failure\pom.xml
[INFO] run post-build script verify.groovy
[INFO]           require-upper-bound-dependencies-managed_failure\pom.xml SUCCESS (6.1 s)
[INFO] Building: require-upper-bound-dependencies-managed_success\pom.xml
[INFO]           require-snapshot-version_failure\pom.xml ......... SUCCESS (5.2 s)
[INFO] Building: require-snapshot-version_success\pom.xml
[INFO]           require-upper-bound-dependencies-managed_success\pom.xml SUCCESS (7.0 s)
[INFO] Building: require-upper-bound-dependencies-unique_failure\pom.xml
[INFO]           require-snapshot-version_success\pom.xml ......... SUCCESS (4.9 s)
[INFO] Building: require-upper-bound-dependencies-managed_failure\pom.xml
[INFO] run post-build script verify.groovy
[INFO]           require-upper-bound-dependencies-managed_failure\pom.xml SUCCESS (4.6 s)
[INFO] Building: require-upper-bound-dependencies-managed_success\pom.xml
[INFO] snapshot org.apache.maven.plugins.enforcer.its:menforcer134_project:1.0-SNAPSHOT: checking for updates from apache-snapshots
[INFO] snapshot org.apache.maven.plugins.enforcer.its:menforcer134_project:1.0-SNAPSHOT: checking for updates from Nexus
[INFO] artifact org.apache.maven.plugins.enforcer.its.menforcer134_project:1.0-SNAPSHOT: checking for updates from central
[INFO] org.apache.maven.plugins.enforcer.its.menforcer134_project.1.0-SNAPSHOT: checking for updates from central
[INFO] snapshot org.apache.maven.plugins.enforcer.its:menforcer134_modelbuilder:1.0-SNAPSHOT: checking for updates from apache-snapshots
[INFO] snapshot org.apache.maven.plugins.enforcer.its:menforcer134_modelbuilder:1.0-SNAPSHOT: checking for updates from Nexus
[INFO] artifact org.apache.maven.plugins.enforcer.its.menforcer134_modelbuilder:1.0-SNAPSHOT: checking for updates from central
[INFO] org.apache.maven.plugins.enforcer.its.menforcer134_modelbuilder.1.0-SNAPSHOT: checking for updates from central
[INFO] snapshot org.apache.maven.plugins.enforcer.its:menforcer134_model:1.0-SNAPSHOT: checking for updates from apache-snapshots
[INFO] snapshot org.apache.maven.plugins.enforcer.its:menforcer134_model:1.0-SNAPSHOT: checking for updates from Nexus
[INFO] artifact org.apache.maven.plugins.enforcer.its.menforcer134_model:1.0-SNAPSHOT: checking for updates from central
[INFO] org.apache.maven.plugins.enforcer.its.menforcer134_model.1.0-SNAPSHOT: checking for updates from central
[INFO] run post-build script verify.groovy
[INFO]           require-upper-bound-dependencies-unique_failure\pom.xml SUCCESS (8.0 s)
[INFO] Building: require-upper-bound-dependencies-unique_success\pom.xml
[INFO]           require-upper-bound-dependencies-managed_success\pom.xml SUCCESS (5.9 s)
[INFO] Building: require-upper-bound-dependencies-unique_failure\pom.xml
[INFO]           require-upper-bound-dependencies-unique_success\pom.xml SUCCESS (6.3 s)
[INFO] Building: require-upper-bound-deps_failure\pom.xml
[INFO] snapshot org.apache.maven.plugins.enforcer.its:menforcer134_project:1.0-SNAPSHOT: checking for updates from apache-snapshots
[INFO] snapshot org.apache.maven.plugins.enforcer.its:menforcer134_project:1.0-SNAPSHOT: checking for updates from Nexus
[INFO] artifact org.apache.maven.plugins.enforcer.its.menforcer134_project:1.0-SNAPSHOT: checking for updates from central
[INFO] org.apache.maven.plugins.enforcer.its.menforcer134_project.1.0-SNAPSHOT: checking for updates from central
[INFO] snapshot org.apache.maven.plugins.enforcer.its:menforcer134_modelbuilder:1.0-SNAPSHOT: checking for updates from apache-snapshots
[INFO] snapshot org.apache.maven.plugins.enforcer.its:menforcer134_modelbuilder:1.0-SNAPSHOT: checking for updates from Nexus
[INFO] artifact org.apache.maven.plugins.enforcer.its.menforcer134_modelbuilder:1.0-SNAPSHOT: checking for updates from central
[INFO] org.apache.maven.plugins.enforcer.its.menforcer134_modelbuilder.1.0-SNAPSHOT: checking for updates from central
[INFO] snapshot org.apache.maven.plugins.enforcer.its:menforcer134_model:1.0-SNAPSHOT: checking for updates from apache-snapshots
[INFO] snapshot org.apache.maven.plugins.enforcer.its:menforcer134_model:1.0-SNAPSHOT: checking for updates from Nexus
[INFO] artifact org.apache.maven.plugins.enforcer.its.menforcer134_model:1.0-SNAPSHOT: checking for updates from central
[INFO] org.apache.maven.plugins.enforcer.its.menforcer134_model.1.0-SNAPSHOT: checking for updates from central
[INFO] run post-build script verify.groovy
[INFO]           require-upper-bound-dependencies-unique_failure\pom.xml SUCCESS (7.7 s)
[INFO] Building: require-upper-bound-dependencies-unique_success\pom.xml
[INFO] run post-build script verify.groovy
[INFO]           require-upper-bound-deps_failure\pom.xml ......... SUCCESS (5.9 s)
[INFO] Building: require-upper-bound-deps_ignored\pom.xml
[INFO]           require-upper-bound-dependencies-unique_success\pom.xml SUCCESS (5.2 s)
[INFO] Building: require-upper-bound-deps_failure\pom.xml
[INFO] run post-build script verify.groovy
[INFO]           require-upper-bound-deps_ignored\pom.xml ......... SUCCESS (6.3 s)
[INFO] Building: require-upper-bound-deps_success\pom.xml
[INFO] run post-build script verify.groovy
[INFO]           require-upper-bound-deps_failure\pom.xml ......... SUCCESS (5.1 s)
[INFO] Building: require-upper-bound-deps_ignored\pom.xml
[INFO]           require-upper-bound-deps_success\pom.xml ......... SUCCESS (6.3 s)
[INFO] Building: resolve_collect_dependencies\pom.xml
[INFO] run post-build script verify.groovy
[INFO]           require-upper-bound-deps_ignored\pom.xml ......... SUCCESS (4.5 s)
[INFO] Building: require-upper-bound-deps_success\pom.xml
[INFO]           require-upper-bound-deps_success\pom.xml ......... SUCCESS (5.3 s)
[INFO] Building: resolve_collect_dependencies\pom.xml
[INFO] run post-build script verify.groovy
[INFO]           resolve_collect_dependencies\pom.xml ............. SUCCESS (8.4 s)
[INFO] -------------------------------------------------
[INFO] Build Summary:
[INFO]   Passed: 68, Failed: 0, Errors: 0, Skipped: 0
[INFO] -------------------------------------------------
[INFO]
[INFO] --- mrm-maven-plugin:1.0.0:stop (default) @ maven-enforcer-plugin ---
[INFO] Stopping Mock Repository Manager on http://localhost:60084
[INFO] Mock Repository Manager http://localhost:60084 is stopped.
[INFO]
[INFO] --- maven-checkstyle-plugin:3.0.0:check (checkstyle-check) @ maven-enforcer-plugin ---
[INFO] ------------------------------------------------------------------------
[INFO] Reactor Summary:
[INFO]
[INFO] Apache Maven Enforcer .............................. SUCCESS [ 27.985 s]
[INFO] Apache Maven Enforcer API .......................... SUCCESS [  7.925 s]
[INFO] Apache Maven Enforcer Built-In Rules ............... SUCCESS [ 14.861 s]
[INFO] Apache Maven Enforcer Plugin ....................... SUCCESS [07:17 min]
[INFO] ------------------------------------------------------------------------
[INFO] BUILD SUCCESS
[INFO] ------------------------------------------------------------------------
[INFO] Total time: 08:10 min
[INFO] Finished at: 2019-01-20T07:29:06Z
[INFO] Final Memory: 58M/714M
[INFO] ------------------------------------------------------------------------
[INFO] [jenkins-event-spy] Generated F:\jenkins\jenkins-slave\workspace\box_maven-enforcer_MENFORCER-294@2@tmp\withMavenbc7d3b0d\maven-spy-20190120-072055-7876042323266513084975.log
Picked up JAVA_TOOL_OPTIONS: -Dmaven.ext.class.path="f:\jenkins\jenkins-slave\workspace\box_maven-enforcer_MENFORCER-294@2@tmp\withMavenbc7d3b0d\pipeline-maven-spy.jar" -Dorg.jenkinsci.plugins.pipeline.maven.reportsFolder="f:\jenkins\jenkins-slave\workspace\box_maven-enforcer_MENFORCER-294@2@tmp\withMavenbc7d3b0d"
[Pipeline] }
[Pipeline] // dir
[Pipeline] }
[withMaven] invokerPublisher - Archive invoker results for Maven artifact MavenArtifact{org.apache.maven.plugins:maven-enforcer-plugin:maven-plugin:3.0.0-SNAPSHOT(version: 3.0.0-SNAPSHOT, snapshot:false) } generated by PluginInvocation{org.apache.maven.plugins:maven-invoker-plugin:3.0.1@run  integration-test}: m\maven-enforcer-plugin\target\invoker-reports\*.xml
[INFO] run post-build script verify.groovy
[INFO]           resolve_collect_dependencies\pom.xml ............. SUCCESS (10.3 s)
[INFO] -------------------------------------------------
[INFO] Build Summary:
[INFO]   Passed: 68, Failed: 0, Errors: 0, Skipped: 0
[INFO] -------------------------------------------------
[INFO]
[INFO] --- mrm-maven-plugin:1.0.0:stop (default) @ maven-enforcer-plugin ---
[INFO] Stopping Mock Repository Manager on http://localhost:49245
[INFO] Mock Repository Manager http://localhost:49245 is stopped.
[INFO]
[INFO] --- maven-checkstyle-plugin:3.0.0:check (checkstyle-check) @ maven-enforcer-plugin ---
[INFO] ------------------------------------------------------------------------
[INFO] Reactor Summary:
[INFO]
[INFO] Apache Maven Enforcer .............................. SUCCESS [ 27.113 s]
[INFO] Apache Maven Enforcer API .......................... SUCCESS [  6.100 s]
[INFO] Apache Maven Enforcer Built-In Rules ............... SUCCESS [ 19.219 s]
[INFO] Apache Maven Enforcer Plugin ....................... SUCCESS [06:43 min]
[INFO] ------------------------------------------------------------------------
[INFO] BUILD SUCCESS
[INFO] ------------------------------------------------------------------------
[INFO] Total time: 07:37 min
[INFO] Finished at: 2019-01-20T07:29:15Z
[INFO] Final Memory: 50M/174M
[INFO] ------------------------------------------------------------------------
[INFO] [jenkins-event-spy] Generated F:\jenkins\jenkins-slave\workspace\aven-enforcer_MENFORCER-294-IBUS6H5LUW3LLGQ77JNQBEL74UE2BN3AO433QECSA2A76NFISVIQ@tmp\withMaven37b2a2d9\maven-spy-20190120-072136-7768309833409480742105.log
[Pipeline] }
[Pipeline] // dir
[Pipeline] }
[withMaven] invokerPublisher - Archive invoker results for Maven artifact MavenArtifact{org.apache.maven.plugins:maven-enforcer-plugin:maven-plugin:3.0.0-SNAPSHOT(version: 3.0.0-SNAPSHOT, snapshot:false) } generated by PluginInvocation{org.apache.maven.plugins:maven-invoker-plugin:3.0.1@run  integration-test}: m\maven-enforcer-plugin\target\invoker-reports\*.xml
[withMaven] junitPublisher - Archive test results for Maven artifact org.apache.maven.enforcer:enforcer-api:jar:3.0.0-SNAPSHOT generated by maven-surefire-plugin:test (default-test): m\enforcer-api\target\surefire-reports\*.xml
Recording test results
None of the test reports contained any result
[withMaven] junitPublisher - Archive test results for Maven artifact org.apache.maven.enforcer:enforcer-rules:jar:3.0.0-SNAPSHOT generated by maven-surefire-plugin:test (default-test): m\enforcer-rules\target\surefire-reports\*.xml
Recording test results
[withMaven] junitPublisher - Archive test results for Maven artifact org.apache.maven.plugins:maven-enforcer-plugin:maven-plugin:3.0.0-SNAPSHOT generated by maven-surefire-plugin:test (default-test): m\maven-enforcer-plugin\target\surefire-reports\*.xml
Recording test results
[withMaven] Publishers: Pipeline Graph Publisher: 3 ms, Invoker Publisher: 19916 ms, Junit Publisher: 2490 ms, Dependencies Fingerprint Publisher: 101 ms
[Pipeline] // withMaven
[Pipeline] cleanWs
[WS-CLEANUP] Deleting project workspace...
[WS-CLEANUP] Deferred wipeout is used...
ERROR: Cannot delete workspace :f:\jenkins\jenkins-slave\workspace\box_maven-enforcer_MENFORCER-294@2\m\maven-enforcer-plugin\target\invoker-reports\BUILD-always-fail-warn.xml
[Pipeline] }
[Pipeline] // stage
[Pipeline] }
[Pipeline] // node
[Pipeline] }
Failed in branch windows-jdk8
[withMaven] junitPublisher - Archive test results for Maven artifact org.apache.maven.enforcer:enforcer-api:jar:3.0.0-SNAPSHOT generated by maven-surefire-plugin:test (default-test): m\enforcer-api\target\surefire-reports\*.xml
Recording test results
None of the test reports contained any result
[withMaven] junitPublisher - Archive test results for Maven artifact org.apache.maven.enforcer:enforcer-rules:jar:3.0.0-SNAPSHOT generated by maven-surefire-plugin:test (default-test): m\enforcer-rules\target\surefire-reports\*.xml
Recording test results
[withMaven] junitPublisher - Archive test results for Maven artifact org.apache.maven.plugins:maven-enforcer-plugin:maven-plugin:3.0.0-SNAPSHOT generated by maven-surefire-plugin:test (default-test): m\maven-enforcer-plugin\target\surefire-reports\*.xml
Recording test results
[withMaven] Publishers: Pipeline Graph Publisher: 3 ms, Invoker Publisher: 20520 ms, Junit Publisher: 1734 ms, Dependencies Fingerprint Publisher: 92 ms
[Pipeline] // withMaven
[Pipeline] cleanWs
[WS-CLEANUP] Deleting project workspace...
[WS-CLEANUP] Deferred wipeout is used...
ERROR: Cannot delete workspace :f:\jenkins\jenkins-slave\workspace\aven-enforcer_MENFORCER-294-IBUS6H5LUW3LLGQ77JNQBEL74UE2BN3AO433QECSA2A76NFISVIQ\m\maven-enforcer-plugin\target\invoker-reports\BUILD-always-fail-warn.xml
[Pipeline] }
[Pipeline] // stage
[Pipeline] }
[Pipeline] // node
[Pipeline] }
Failed in branch windows-jdk11
[Pipeline] // parallel
[Pipeline] stage
[Pipeline] { (Notifications)
[Pipeline] echo
Build result: FAILURE
[Pipeline] jiraIssueSelector
[Pipeline] emailext
Reply | Threaded
Open this post in threaded view
|

Build failed in Jenkins: Maven TLP » maven-enforcer » MENFORCER-294 #22

Apache Jenkins Server-2
See https://builds.apache.org/job/maven-box/job/maven-enforcer/job/MENFORCER-294/22/

Changes:

* Add support for Maven 3.6.x/3.6.0
* More verbose info about build exceptions
* Verbose info about failure - add bit more
* Revert: no access to currntBuild.rawBuild

All tests passed

Build log:
[...truncated 8250 lines...]
[Pipeline] }
[Pipeline] // stage
[Pipeline] }
[Pipeline] // node
[Pipeline] }
Failed in branch windows-jdk7
Running on windows-2012-3 in f:\jenkins\jenkins-slave\workspace\box_maven-enforcer_MENFORCER-294
[Pipeline] {
[Pipeline] stage
[Pipeline] { (Checkout windows-jdk8)
[Pipeline] dir
Running in f:\jenkins\jenkins-slave\workspace\box_maven-enforcer_MENFORCER-294\m
[Pipeline] {
[Pipeline] checkout
Cloning the remote Git repository
Cloning with configured refspecs honoured and without tags
Cloning repository https://gitbox.apache.org/repos/asf/maven-enforcer.git
ERROR: Failed to clean the workspace
java.io.IOException: Unable to delete 'f:\jenkins\jenkins-slave\workspace\box_maven-enforcer_MENFORCER-294\m'. Tried 3 times (of a maximum of 3) waiting 0.1 sec between attempts.
        at hudson.Util.deleteContentsRecursive(Util.java:257)
        at org.jenkinsci.plugins.gitclient.CliGitAPIImpl$2.execute(CliGitAPIImpl.java:592)
        at org.jenkinsci.plugins.gitclient.RemoteGitImpl$CommandInvocationHandler$1.call(RemoteGitImpl.java:153)
        at org.jenkinsci.plugins.gitclient.RemoteGitImpl$CommandInvocationHandler$1.call(RemoteGitImpl.java:146)
        at hudson.remoting.UserRequest.perform(UserRequest.java:212)
        at hudson.remoting.UserRequest.perform(UserRequest.java:54)
        at hudson.remoting.Request$2.run(Request.java:369)
        at hudson.remoting.InterceptingExecutorService$1.call(InterceptingExecutorService.java:72)
        at java.util.concurrent.FutureTask.run(Unknown Source)
        at java.util.concurrent.ThreadPoolExecutor.runWorker(Unknown Source)
        at java.util.concurrent.ThreadPoolExecutor$Worker.run(Unknown Source)
        at hudson.remoting.Engine$1.lambda$newThread$0(Engine.java:93)
        at java.lang.Thread.run(Unknown Source)
Caused by: java.nio.file.AccessDeniedException: f:\jenkins\jenkins-slave\workspace\box_maven-enforcer_MENFORCER-294\m\maven-enforcer-plugin\target\invoker-reports\BUILD-always-fail-warn.xml
        at sun.nio.fs.WindowsException.translateToIOException(Unknown Source)
        at sun.nio.fs.WindowsException.rethrowAsIOException(Unknown Source)
        at sun.nio.fs.WindowsException.rethrowAsIOException(Unknown Source)
        at sun.nio.fs.WindowsFileAttributeViews$Basic.readAttributes(Unknown Source)
        at sun.nio.fs.WindowsFileAttributeViews$Basic.readAttributes(Unknown Source)
        at sun.nio.fs.WindowsFileSystemProvider.readAttributes(Unknown Source)
        at java.nio.file.Files.readAttributes(Unknown Source)
        at hudson.Util.isSymlink(Util.java:529)
        at hudson.Util.tryOnceDeleteRecursive(Util.java:386)
        at hudson.Util.tryOnceDeleteContentsRecursive(Util.java:407)
        at hudson.Util.tryOnceDeleteRecursive(Util.java:387)
        at hudson.Util.tryOnceDeleteContentsRecursive(Util.java:407)
        at hudson.Util.tryOnceDeleteRecursive(Util.java:387)
        at hudson.Util.tryOnceDeleteContentsRecursive(Util.java:407)
        at hudson.Util.tryOnceDeleteRecursive(Util.java:387)
        at hudson.Util.tryOnceDeleteContentsRecursive(Util.java:407)
        at hudson.Util.deleteContentsRecursive(Util.java:252)
        ... 12 more
ERROR: Error cloning remote repo 'origin'
hudson.plugins.git.GitException: Failed to delete workspace
        at org.jenkinsci.plugins.gitclient.CliGitAPIImpl$2.execute(CliGitAPIImpl.java:595)
        at org.jenkinsci.plugins.gitclient.RemoteGitImpl$CommandInvocationHandler$1.call(RemoteGitImpl.java:153)
        at org.jenkinsci.plugins.gitclient.RemoteGitImpl$CommandInvocationHandler$1.call(RemoteGitImpl.java:146)
        at hudson.remoting.UserRequest.perform(UserRequest.java:212)
        at hudson.remoting.UserRequest.perform(UserRequest.java:54)
        at hudson.remoting.Request$2.run(Request.java:369)
        at hudson.remoting.InterceptingExecutorService$1.call(InterceptingExecutorService.java:72)
        at java.util.concurrent.FutureTask.run(Unknown Source)
        at java.util.concurrent.ThreadPoolExecutor.runWorker(Unknown Source)
        at java.util.concurrent.ThreadPoolExecutor$Worker.run(Unknown Source)
        at hudson.remoting.Engine$1.lambda$newThread$0(Engine.java:93)
        at java.lang.Thread.run(Unknown Source)
        Suppressed: hudson.remoting.Channel$CallSiteStackTrace: Remote call to JNLP4-connect connection from 37.48.69.226/37.48.69.226:54978
                at hudson.remoting.Channel.attachCallSiteStackTrace(Channel.java:1741)
                at hudson.remoting.UserRequest$ExceptionResponse.retrieve(UserRequest.java:357)
                at hudson.remoting.Channel.call(Channel.java:955)
                at org.jenkinsci.plugins.gitclient.RemoteGitImpl$CommandInvocationHandler.execute(RemoteGitImpl.java:146)
                at sun.reflect.GeneratedMethodAccessor499.invoke(Unknown Source)
                at sun.reflect.DelegatingMethodAccessorImpl.invoke(DelegatingMethodAccessorImpl.java:43)
                at java.lang.reflect.Method.invoke(Method.java:498)
                at org.jenkinsci.plugins.gitclient.RemoteGitImpl$CommandInvocationHandler.invoke(RemoteGitImpl.java:132)
                at com.sun.proxy.$Proxy141.execute(Unknown Source)
                at hudson.plugins.git.GitSCM.retrieveChanges(GitSCM.java:1146)
                at hudson.plugins.git.GitSCM.checkout(GitSCM.java:1186)
                at org.jenkinsci.plugins.workflow.steps.scm.SCMStep.checkout(SCMStep.java:120)
                at org.jenkinsci.plugins.workflow.steps.scm.SCMStep$StepExecutionImpl.run(SCMStep.java:90)
                at org.jenkinsci.plugins.workflow.steps.scm.SCMStep$StepExecutionImpl.run(SCMStep.java:77)
                at org.jenkinsci.plugins.workflow.steps.SynchronousNonBlockingStepExecution$1$1.call(SynchronousNonBlockingStepExecution.java:51)
                at hudson.security.ACL.impersonate(ACL.java:290)
                at org.jenkinsci.plugins.workflow.steps.SynchronousNonBlockingStepExecution$1.run(SynchronousNonBlockingStepExecution.java:48)
                at java.util.concurrent.Executors$RunnableAdapter.call(Executors.java:511)
                at java.util.concurrent.FutureTask.run(FutureTask.java:266)
                at java.util.concurrent.ThreadPoolExecutor.runWorker(ThreadPoolExecutor.java:1149)
                at java.util.concurrent.ThreadPoolExecutor$Worker.run(ThreadPoolExecutor.java:624)
                at java.lang.Thread.run(Thread.java:748)
Caused by: java.io.IOException: Unable to delete 'f:\jenkins\jenkins-slave\workspace\box_maven-enforcer_MENFORCER-294\m'. Tried 3 times (of a maximum of 3) waiting 0.1 sec between attempts.
        at hudson.Util.deleteContentsRecursive(Util.java:257)
        at org.jenkinsci.plugins.gitclient.CliGitAPIImpl$2.execute(CliGitAPIImpl.java:592)
        ... 11 more
Caused by: java.nio.file.AccessDeniedException: f:\jenkins\jenkins-slave\workspace\box_maven-enforcer_MENFORCER-294\m\maven-enforcer-plugin\target\invoker-reports\BUILD-always-fail-warn.xml
        at sun.nio.fs.WindowsException.translateToIOException(Unknown Source)
        at sun.nio.fs.WindowsException.rethrowAsIOException(Unknown Source)
        at sun.nio.fs.WindowsException.rethrowAsIOException(Unknown Source)
        at sun.nio.fs.WindowsFileAttributeViews$Basic.readAttributes(Unknown Source)
        at sun.nio.fs.WindowsFileAttributeViews$Basic.readAttributes(Unknown Source)
        at sun.nio.fs.WindowsFileSystemProvider.readAttributes(Unknown Source)
        at java.nio.file.Files.readAttributes(Unknown Source)
        at hudson.Util.isSymlink(Util.java:529)
        at hudson.Util.tryOnceDeleteRecursive(Util.java:386)
        at hudson.Util.tryOnceDeleteContentsRecursive(Util.java:407)
        at hudson.Util.tryOnceDeleteRecursive(Util.java:387)
        at hudson.Util.tryOnceDeleteContentsRecursive(Util.java:407)
        at hudson.Util.tryOnceDeleteRecursive(Util.java:387)
        at hudson.Util.tryOnceDeleteContentsRecursive(Util.java:407)
        at hudson.Util.tryOnceDeleteRecursive(Util.java:387)
        at hudson.Util.tryOnceDeleteContentsRecursive(Util.java:407)
        at hudson.Util.deleteContentsRecursive(Util.java:252)
        ... 12 more
[Pipeline] }
[Pipeline] // dir
[Pipeline] cleanWs
[WS-CLEANUP] Deleting project workspace...
[WS-CLEANUP] Deferred wipeout is used...
ERROR: Cannot delete workspace :f:\jenkins\jenkins-slave\workspace\box_maven-enforcer_MENFORCER-294\m\maven-enforcer-plugin\target\invoker-reports\BUILD-always-fail-warn.xml
[Pipeline] }
[Pipeline] // stage
[Pipeline] }
[Pipeline] // node
[Pipeline] }
Failed in branch windows-jdk8
Running on windows-2012-3 in f:\jenkins\jenkins-slave\workspace\box_maven-enforcer_MENFORCER-294
[Pipeline] {
[Pipeline] stage
[Pipeline] { (Checkout windows-jdk11)
[Pipeline] dir
Running in f:\jenkins\jenkins-slave\workspace\box_maven-enforcer_MENFORCER-294\m
[Pipeline] {
[Pipeline] checkout
Cloning the remote Git repository
Cloning with configured refspecs honoured and without tags
Cloning repository https://gitbox.apache.org/repos/asf/maven-enforcer.git
ERROR: Failed to clean the workspace
java.io.IOException: Unable to delete 'f:\jenkins\jenkins-slave\workspace\box_maven-enforcer_MENFORCER-294\m'. Tried 3 times (of a maximum of 3) waiting 0.1 sec between attempts.
        at hudson.Util.deleteContentsRecursive(Util.java:257)
        at org.jenkinsci.plugins.gitclient.CliGitAPIImpl$2.execute(CliGitAPIImpl.java:592)
        at org.jenkinsci.plugins.gitclient.RemoteGitImpl$CommandInvocationHandler$1.call(RemoteGitImpl.java:153)
        at org.jenkinsci.plugins.gitclient.RemoteGitImpl$CommandInvocationHandler$1.call(RemoteGitImpl.java:146)
        at hudson.remoting.UserRequest.perform(UserRequest.java:212)
        at hudson.remoting.UserRequest.perform(UserRequest.java:54)
        at hudson.remoting.Request$2.run(Request.java:369)
        at hudson.remoting.InterceptingExecutorService$1.call(InterceptingExecutorService.java:72)
        at java.util.concurrent.FutureTask.run(Unknown Source)
        at java.util.concurrent.ThreadPoolExecutor.runWorker(Unknown Source)
        at java.util.concurrent.ThreadPoolExecutor$Worker.run(Unknown Source)
        at hudson.remoting.Engine$1.lambda$newThread$0(Engine.java:93)
        at java.lang.Thread.run(Unknown Source)
Caused by: java.nio.file.AccessDeniedException: f:\jenkins\jenkins-slave\workspace\box_maven-enforcer_MENFORCER-294\m\maven-enforcer-plugin\target\invoker-reports\BUILD-always-fail-warn.xml
        at sun.nio.fs.WindowsException.translateToIOException(Unknown Source)
        at sun.nio.fs.WindowsException.rethrowAsIOException(Unknown Source)
        at sun.nio.fs.WindowsException.rethrowAsIOException(Unknown Source)
        at sun.nio.fs.WindowsFileAttributeViews$Basic.readAttributes(Unknown Source)
        at sun.nio.fs.WindowsFileAttributeViews$Basic.readAttributes(Unknown Source)
        at sun.nio.fs.WindowsFileSystemProvider.readAttributes(Unknown Source)
        at java.nio.file.Files.readAttributes(Unknown Source)
        at hudson.Util.isSymlink(Util.java:529)
        at hudson.Util.tryOnceDeleteRecursive(Util.java:386)
        at hudson.Util.tryOnceDeleteContentsRecursive(Util.java:407)
        at hudson.Util.tryOnceDeleteRecursive(Util.java:387)
        at hudson.Util.tryOnceDeleteContentsRecursive(Util.java:407)
        at hudson.Util.tryOnceDeleteRecursive(Util.java:387)
        at hudson.Util.tryOnceDeleteContentsRecursive(Util.java:407)
        at hudson.Util.tryOnceDeleteRecursive(Util.java:387)
        at hudson.Util.tryOnceDeleteContentsRecursive(Util.java:407)
        at hudson.Util.deleteContentsRecursive(Util.java:252)
        ... 12 more
ERROR: Error cloning remote repo 'origin'
hudson.plugins.git.GitException: Failed to delete workspace
        at org.jenkinsci.plugins.gitclient.CliGitAPIImpl$2.execute(CliGitAPIImpl.java:595)
        at org.jenkinsci.plugins.gitclient.RemoteGitImpl$CommandInvocationHandler$1.call(RemoteGitImpl.java:153)
        at org.jenkinsci.plugins.gitclient.RemoteGitImpl$CommandInvocationHandler$1.call(RemoteGitImpl.java:146)
        at hudson.remoting.UserRequest.perform(UserRequest.java:212)
        at hudson.remoting.UserRequest.perform(UserRequest.java:54)
        at hudson.remoting.Request$2.run(Request.java:369)
        at hudson.remoting.InterceptingExecutorService$1.call(InterceptingExecutorService.java:72)
        at java.util.concurrent.FutureTask.run(Unknown Source)
        at java.util.concurrent.ThreadPoolExecutor.runWorker(Unknown Source)
        at java.util.concurrent.ThreadPoolExecutor$Worker.run(Unknown Source)
        at hudson.remoting.Engine$1.lambda$newThread$0(Engine.java:93)
        at java.lang.Thread.run(Unknown Source)
        Suppressed: hudson.remoting.Channel$CallSiteStackTrace: Remote call to JNLP4-connect connection from 37.48.69.226/37.48.69.226:54978
                at hudson.remoting.Channel.attachCallSiteStackTrace(Channel.java:1741)
                at hudson.remoting.UserRequest$ExceptionResponse.retrieve(UserRequest.java:357)
                at hudson.remoting.Channel.call(Channel.java:955)
                at org.jenkinsci.plugins.gitclient.RemoteGitImpl$CommandInvocationHandler.execute(RemoteGitImpl.java:146)
                at sun.reflect.GeneratedMethodAccessor499.invoke(Unknown Source)
                at sun.reflect.DelegatingMethodAccessorImpl.invoke(DelegatingMethodAccessorImpl.java:43)
                at java.lang.reflect.Method.invoke(Method.java:498)
                at org.jenkinsci.plugins.gitclient.RemoteGitImpl$CommandInvocationHandler.invoke(RemoteGitImpl.java:132)
                at com.sun.proxy.$Proxy141.execute(Unknown Source)
                at hudson.plugins.git.GitSCM.retrieveChanges(GitSCM.java:1146)
                at hudson.plugins.git.GitSCM.checkout(GitSCM.java:1186)
                at org.jenkinsci.plugins.workflow.steps.scm.SCMStep.checkout(SCMStep.java:120)
                at org.jenkinsci.plugins.workflow.steps.scm.SCMStep$StepExecutionImpl.run(SCMStep.java:90)
                at org.jenkinsci.plugins.workflow.steps.scm.SCMStep$StepExecutionImpl.run(SCMStep.java:77)
                at org.jenkinsci.plugins.workflow.steps.SynchronousNonBlockingStepExecution$1$1.call(SynchronousNonBlockingStepExecution.java:51)
                at hudson.security.ACL.impersonate(ACL.java:290)
                at org.jenkinsci.plugins.workflow.steps.SynchronousNonBlockingStepExecution$1.run(SynchronousNonBlockingStepExecution.java:48)
                at java.util.concurrent.Executors$RunnableAdapter.call(Executors.java:511)
                at java.util.concurrent.FutureTask.run(FutureTask.java:266)
                at java.util.concurrent.ThreadPoolExecutor.runWorker(ThreadPoolExecutor.java:1149)
                at java.util.concurrent.ThreadPoolExecutor$Worker.run(ThreadPoolExecutor.java:624)
                at java.lang.Thread.run(Thread.java:748)
Caused by: java.io.IOException: Unable to delete 'f:\jenkins\jenkins-slave\workspace\box_maven-enforcer_MENFORCER-294\m'. Tried 3 times (of a maximum of 3) waiting 0.1 sec between attempts.
        at hudson.Util.deleteContentsRecursive(Util.java:257)
        at org.jenkinsci.plugins.gitclient.CliGitAPIImpl$2.execute(CliGitAPIImpl.java:592)
        ... 11 more
Caused by: java.nio.file.AccessDeniedException: f:\jenkins\jenkins-slave\workspace\box_maven-enforcer_MENFORCER-294\m\maven-enforcer-plugin\target\invoker-reports\BUILD-always-fail-warn.xml
        at sun.nio.fs.WindowsException.translateToIOException(Unknown Source)
        at sun.nio.fs.WindowsException.rethrowAsIOException(Unknown Source)
        at sun.nio.fs.WindowsException.rethrowAsIOException(Unknown Source)
        at sun.nio.fs.WindowsFileAttributeViews$Basic.readAttributes(Unknown Source)
        at sun.nio.fs.WindowsFileAttributeViews$Basic.readAttributes(Unknown Source)
        at sun.nio.fs.WindowsFileSystemProvider.readAttributes(Unknown Source)
        at java.nio.file.Files.readAttributes(Unknown Source)
        at hudson.Util.isSymlink(Util.java:529)
        at hudson.Util.tryOnceDeleteRecursive(Util.java:386)
        at hudson.Util.tryOnceDeleteContentsRecursive(Util.java:407)
        at hudson.Util.tryOnceDeleteRecursive(Util.java:387)
        at hudson.Util.tryOnceDeleteContentsRecursive(Util.java:407)
        at hudson.Util.tryOnceDeleteRecursive(Util.java:387)
        at hudson.Util.tryOnceDeleteContentsRecursive(Util.java:407)
        at hudson.Util.tryOnceDeleteRecursive(Util.java:387)
        at hudson.Util.tryOnceDeleteContentsRecursive(Util.java:407)
        at hudson.Util.deleteContentsRecursive(Util.java:252)
        ... 12 more
[Pipeline] }
[Pipeline] // dir
[Pipeline] cleanWs
[WS-CLEANUP] Deleting project workspace...
[WS-CLEANUP] Deferred wipeout is used...
ERROR: Cannot delete workspace :f:\jenkins\jenkins-slave\workspace\box_maven-enforcer_MENFORCER-294\m\maven-enforcer-plugin\target\invoker-reports\BUILD-always-fail-warn.xml
[Pipeline] }
[Pipeline] // stage
[Pipeline] }
[Pipeline] // node
[Pipeline] }
Failed in branch windows-jdk11
[Pipeline] // parallel
[Pipeline] echo
[FAILURE-003] AbortException hudson.AbortException: Cannot delete workspace: f:\jenkins\jenkins-slave\workspace\box_maven-enforcer_MENFORCER-294\m\maven-enforcer-plugin\target\invoker-reports\BUILD-always-fail-warn.xml
[Pipeline] stage
[Pipeline] { (Notifications)
[Pipeline] echo
Build result: FAILURE
[Pipeline] jiraIssueSelector
[Pipeline] emailext
Reply | Threaded
Open this post in threaded view
|

Build succeeded in Jenkins: Maven TLP » maven-enforcer » MENFORCER-294 #23

Apache Jenkins Server-2
See https://builds.apache.org/job/maven-box/job/maven-enforcer/job/MENFORCER-294/23/

Changes:

* JDK 12 is now in the Release Candidate Phase
* [INFRA-17514] Jenkins invoker-plugin updated by INFRA

All tests passed