Build failed in Jenkins: Maven TLP » maven-ear-plugin » master #21

Previous Topic Next Topic
 
classic Classic list List threaded Threaded
2 messages Options
Reply | Threaded
Open this post in threaded view
|

Build failed in Jenkins: Maven TLP » maven-ear-plugin » master #21

Apache Jenkins Server-2
See https://builds.apache.org/job/maven-box/job/maven-ear-plugin/job/master/21/

No changes.

No tests ran.

Build log:
Branch event
Obtained Jenkinsfile from 5f37267eeb7f9a264d823d3a9b7ea2114e8c8a63
Running in Durability level: MAX_SURVIVABILITY
Loading library jenkins-env@master
Attempting to resolve master from remote references...
 > git --version # timeout=10
 > git ls-remote -h -t https://gitbox.apache.org/repos/asf/maven-jenkins-env.git # timeout=10
Found match: refs/heads/master revision 7e5a8d991ba0cfb20727aa995304672a34b631bb
 > git rev-parse --is-inside-work-tree # timeout=10
Fetching changes from the remote Git repository
 > git config remote.origin.url https://gitbox.apache.org/repos/asf/maven-jenkins-env.git # timeout=10
Fetching without tags
Fetching upstream changes from https://gitbox.apache.org/repos/asf/maven-jenkins-env.git
 > git --version # timeout=10
 > git fetch --no-tags --progress https://gitbox.apache.org/repos/asf/maven-jenkins-env.git +refs/heads/*:refs/remotes/origin/*
Checking out Revision 7e5a8d991ba0cfb20727aa995304672a34b631bb (master)
 > git config core.sparsecheckout # timeout=10
 > git checkout -f 7e5a8d991ba0cfb20727aa995304672a34b631bb
Commit message: "Add JDK 10 b37 (early access build) (Windows Only)"
 > git rev-list --no-walk 7e5a8d991ba0cfb20727aa995304672a34b631bb # timeout=10
Loading library jenkins-lib@master
Attempting to resolve master from remote references...
 > git --version # timeout=10
 > git ls-remote -h -t https://gitbox.apache.org/repos/asf/maven-jenkins-lib.git # timeout=10
Found match: refs/heads/master revision 165d4b5b50014694b82fd5270194c38821160f73
 > git rev-parse --is-inside-work-tree # timeout=10
Fetching changes from the remote Git repository
 > git config remote.origin.url https://gitbox.apache.org/repos/asf/maven-jenkins-lib.git # timeout=10
Fetching without tags
Fetching upstream changes from https://gitbox.apache.org/repos/asf/maven-jenkins-lib.git
 > git --version # timeout=10
 > git fetch --no-tags --progress https://gitbox.apache.org/repos/asf/maven-jenkins-lib.git +refs/heads/*:refs/remotes/origin/*
Checking out Revision 165d4b5b50014694b82fd5270194c38821160f73 (master)
 > git config core.sparsecheckout # timeout=10
 > git checkout -f 165d4b5b50014694b82fd5270194c38821160f73
Commit message: "Seems we have to live with duplicate changelogs"
 > git rev-list --no-walk 165d4b5b50014694b82fd5270194c38821160f73 # timeout=10
[Pipeline] properties
[Pipeline] echo
OS: linux JDK: 7 Maven: 3.x.x => Label: ubuntu JDK: JDK 1.7 (latest) Maven: Maven 3.5.2
[Pipeline] echo
OS: linux JDK: 8 Maven: 3.x.x => Label: ubuntu JDK: JDK 1.8 (latest) Maven: Maven 3.5.2
[Pipeline] echo
OS: linux JDK: 9 Maven: 3.x.x => Label: ubuntu JDK: JDK 1.9 (latest) Maven: Maven 3.5.2
[Pipeline] echo
OS: windows JDK: 7 Maven: 3.x.x => Label: Windows JDK: JDK 1.7 (latest) Maven: Maven 3.5.0 (Windows)
[Pipeline] echo
OS: windows JDK: 8 Maven: 3.x.x => Label: Windows JDK: JDK 1.8 (latest) Maven: Maven 3.5.0 (Windows)
[Pipeline] echo
OS: windows JDK: 9 Maven: 3.x.x => Label: Windows JDK: JDK 1.9 (latest) Maven: Maven 3.5.0 (Windows)
[Pipeline] parallel
[Pipeline] [linux-jdk7] { (Branch: linux-jdk7)
[Pipeline] [linux-jdk8] { (Branch: linux-jdk8)
[Pipeline] [linux-jdk9] { (Branch: linux-jdk9)
[Pipeline] [windows-jdk7] { (Branch: windows-jdk7)
[Pipeline] [windows-jdk8] { (Branch: windows-jdk8)
[Pipeline] [windows-jdk9] { (Branch: windows-jdk9)
[Pipeline] [linux-jdk7] node
[Pipeline] [linux-jdk8] node
[Pipeline] [linux-jdk9] node
[Pipeline] [windows-jdk7] node
[Pipeline] [windows-jdk8] node
[Pipeline] [windows-jdk9] node
[windows-jdk7] Running on windows-2012-2 in f:\jenkins\jenkins-slave\workspace\box_maven-ear-plugin_master-EGL6S6KH3QWXBW5LWKTQBDA5QE45AGDHFNBTILJVLZBCXXP5556A
[Pipeline] [windows-jdk7] {
[Pipeline] [windows-jdk7] stage
[Pipeline] [windows-jdk7] { (Checkout windows-jdk7)
[Pipeline] [windows-jdk7] dir
[windows-jdk7] Running in f:\jenkins\jenkins-slave\workspace\box_maven-ear-plugin_master-EGL6S6KH3QWXBW5LWKTQBDA5QE45AGDHFNBTILJVLZBCXXP5556A\m
[Pipeline] [windows-jdk7] {
[Pipeline] [windows-jdk7] checkout
[windows-jdk7]  > git rev-parse --is-inside-work-tree # timeout=10
[windows-jdk7] Fetching changes from the remote Git repository
[windows-jdk7]  > git config remote.origin.url https://gitbox.apache.org/repos/asf/maven-ear-plugin.git # timeout=10
[windows-jdk7] Fetching without tags
[windows-jdk7] Fetching upstream changes from https://gitbox.apache.org/repos/asf/maven-ear-plugin.git
[windows-jdk7]  > git --version # timeout=10
[windows-jdk7]  > git fetch --no-tags --progress https://gitbox.apache.org/repos/asf/maven-ear-plugin.git +refs/heads/*:refs/remotes/origin/*
[windows-jdk8] Running on windows-2012-3 in f:\jenkins\jenkins-slave\workspace\box_maven-ear-plugin_master-EGL6S6KH3QWXBW5LWKTQBDA5QE45AGDHFNBTILJVLZBCXXP5556A@2
[windows-jdk7] Checking out Revision 5f37267eeb7f9a264d823d3a9b7ea2114e8c8a63 (master)
[windows-jdk7]  > git config core.sparsecheckout # timeout=10
[windows-jdk7]  > git checkout -f 5f37267eeb7f9a264d823d3a9b7ea2114e8c8a63
[windows-jdk7] Commit message: "[MEAR-263] - Wrong docs in examples/customize-file-name-mapping.html"
[windows-jdk7]  > git rev-list --no-walk cc56c40e9392bb83f71968151d7c18dc23b10b3f # timeout=10
[Pipeline] [windows-jdk8] {
[Pipeline] [windows-jdk8] stage
[Pipeline] [windows-jdk8] { (Checkout windows-jdk8)
[Pipeline] [windows-jdk8] dir
[windows-jdk8] Running in f:\jenkins\jenkins-slave\workspace\box_maven-ear-plugin_master-EGL6S6KH3QWXBW5LWKTQBDA5QE45AGDHFNBTILJVLZBCXXP5556A@2\m
[Pipeline] [windows-jdk8] {
[Pipeline] [windows-jdk8] checkout
[windows-jdk9] Running on windows-2012-2 in f:\jenkins\jenkins-slave\workspace\box_maven-ear-plugin_master-EGL6S6KH3QWXBW5LWKTQBDA5QE45AGDHFNBTILJVLZBCXXP5556A@2
[windows-jdk7] Cleaning workspace
[windows-jdk7]  > git rev-parse --verify HEAD # timeout=10
[windows-jdk7] Resetting working tree
[Pipeline] [windows-jdk9] {
[windows-jdk7]  > git reset --hard # timeout=10
[Pipeline] [windows-jdk9] stage
[Pipeline] [windows-jdk9] { (Checkout windows-jdk9)
[Pipeline] [windows-jdk9] dir
[windows-jdk9] Running in f:\jenkins\jenkins-slave\workspace\box_maven-ear-plugin_master-EGL6S6KH3QWXBW5LWKTQBDA5QE45AGDHFNBTILJVLZBCXXP5556A@2\m
[Pipeline] [windows-jdk9] {
[windows-jdk7]  > git clean -fdx # timeout=10
[windows-jdk8]  > git rev-parse --is-inside-work-tree # timeout=10
[Pipeline] [windows-jdk9] checkout
[windows-jdk8] Fetching changes from the remote Git repository
[windows-jdk8]  > git config remote.origin.url https://gitbox.apache.org/repos/asf/maven-ear-plugin.git # timeout=10
[windows-jdk8] Fetching without tags
[windows-jdk8] Fetching upstream changes from https://gitbox.apache.org/repos/asf/maven-ear-plugin.git
[windows-jdk8]  > git --version # timeout=10
[windows-jdk8]  > git fetch --no-tags --progress https://gitbox.apache.org/repos/asf/maven-ear-plugin.git +refs/heads/*:refs/remotes/origin/*
[windows-jdk9]  > git rev-parse --is-inside-work-tree # timeout=10
[windows-jdk9] Fetching changes from the remote Git repository
[windows-jdk9]  > git config remote.origin.url https://gitbox.apache.org/repos/asf/maven-ear-plugin.git # timeout=10
[windows-jdk9] Fetching without tags
[windows-jdk9] Fetching upstream changes from https://gitbox.apache.org/repos/asf/maven-ear-plugin.git
[windows-jdk9]  > git --version # timeout=10
[windows-jdk9]  > git fetch --no-tags --progress https://gitbox.apache.org/repos/asf/maven-ear-plugin.git +refs/heads/*:refs/remotes/origin/*
[windows-jdk8] ERROR: Error fetching remote repo 'origin'
[windows-jdk8] hudson.plugins.git.GitException: Failed to fetch from https://gitbox.apache.org/repos/asf/maven-ear-plugin.git
[windows-jdk8] at hudson.plugins.git.GitSCM.fetchFrom(GitSCM.java:862)
[windows-jdk8] at hudson.plugins.git.GitSCM.retrieveChanges(GitSCM.java:1129)
[windows-jdk8] at hudson.plugins.git.GitSCM.checkout(GitSCM.java:1160)
[windows-jdk8] at org.jenkinsci.plugins.workflow.steps.scm.SCMStep.checkout(SCMStep.java:113)
[windows-jdk8] at org.jenkinsci.plugins.workflow.steps.scm.SCMStep$StepExecutionImpl.run(SCMStep.java:85)
[windows-jdk8] at org.jenkinsci.plugins.workflow.steps.scm.SCMStep$StepExecutionImpl.run(SCMStep.java:75)
[windows-jdk8] at org.jenkinsci.plugins.workflow.steps.AbstractSynchronousNonBlockingStepExecution$1$1.call(AbstractSynchronousNonBlockingStepExecution.java:47)
[windows-jdk8] at hudson.security.ACL.impersonate(ACL.java:260)
[windows-jdk8] at org.jenkinsci.plugins.workflow.steps.AbstractSynchronousNonBlockingStepExecution$1.run(AbstractSynchronousNonBlockingStepExecution.java:44)
[windows-jdk8] at java.util.concurrent.Executors$RunnableAdapter.call(Executors.java:511)
[windows-jdk8] at java.util.concurrent.FutureTask.run(FutureTask.java:266)
[windows-jdk8] at java.util.concurrent.ThreadPoolExecutor.runWorker(ThreadPoolExecutor.java:1149)
[windows-jdk8] at java.util.concurrent.ThreadPoolExecutor$Worker.run(ThreadPoolExecutor.java:624)
[windows-jdk8] at java.lang.Thread.run(Thread.java:748)
[windows-jdk8] Caused by: hudson.plugins.git.GitException: Command "git fetch --no-tags --progress https://gitbox.apache.org/repos/asf/maven-ear-plugin.git +refs/heads/*:refs/remotes/origin/*" returned status code 128:
[windows-jdk8] stdout:
[windows-jdk8] stderr: fatal: The remote end hung up unexpectedly
[windows-jdk8]
[windows-jdk8] at org.jenkinsci.plugins.gitclient.CliGitAPIImpl.launchCommandIn(CliGitAPIImpl.java:1996)
[windows-jdk8] at org.jenkinsci.plugins.gitclient.CliGitAPIImpl.launchCommandWithCredentials(CliGitAPIImpl.java:1715)
[windows-jdk8] at org.jenkinsci.plugins.gitclient.CliGitAPIImpl.access$300(CliGitAPIImpl.java:72)
[windows-jdk8] at org.jenkinsci.plugins.gitclient.CliGitAPIImpl$1.execute(CliGitAPIImpl.java:405)
[windows-jdk8] at org.jenkinsci.plugins.gitclient.RemoteGitImpl$CommandInvocationHandler$1.call(RemoteGitImpl.java:153)
[windows-jdk8] at org.jenkinsci.plugins.gitclient.RemoteGitImpl$CommandInvocationHandler$1.call(RemoteGitImpl.java:146)
[windows-jdk8] at hudson.remoting.UserRequest.perform(UserRequest.java:153)
[windows-jdk8] at hudson.remoting.UserRequest.perform(UserRequest.java:50)
[windows-jdk8] at hudson.remoting.Request$2.run(Request.java:336)
[windows-jdk8] at hudson.remoting.InterceptingExecutorService$1.call(InterceptingExecutorService.java:68)
[windows-jdk8] at java.util.concurrent.FutureTask.run(Unknown Source)
[windows-jdk8] at java.util.concurrent.ThreadPoolExecutor.runWorker(Unknown Source)
[windows-jdk8] at java.util.concurrent.ThreadPoolExecutor$Worker.run(Unknown Source)
[windows-jdk8] at hudson.remoting.Engine$1$1.run(Engine.java:94)
[windows-jdk8] at java.lang.Thread.run(Unknown Source)
[windows-jdk8] Suppressed: hudson.remoting.Channel$CallSiteStackTrace: Remote call to JNLP4-connect connection from 37.48.69.226/37.48.69.226:54822
[windows-jdk8] at hudson.remoting.Channel.attachCallSiteStackTrace(Channel.java:1693)
[windows-jdk8] at hudson.remoting.UserResponse.retrieve(UserRequest.java:310)
[windows-jdk8] at hudson.remoting.Channel.call(Channel.java:908)
[windows-jdk8] at org.jenkinsci.plugins.gitclient.RemoteGitImpl$CommandInvocationHandler.execute(RemoteGitImpl.java:146)
[windows-jdk8] at sun.reflect.GeneratedMethodAccessor1051.invoke(Unknown Source)
[windows-jdk8] at sun.reflect.DelegatingMethodAccessorImpl.invoke(DelegatingMethodAccessorImpl.java:43)
[windows-jdk8] at java.lang.reflect.Method.invoke(Method.java:498)
[windows-jdk8] at org.jenkinsci.plugins.gitclient.RemoteGitImpl$CommandInvocationHandler.invoke(RemoteGitImpl.java:132)
[windows-jdk8] at com.sun.proxy.$Proxy111.execute(Unknown Source)
[windows-jdk8] at hudson.plugins.git.GitSCM.fetchFrom(GitSCM.java:860)
[windows-jdk8] at hudson.plugins.git.GitSCM.retrieveChanges(GitSCM.java:1129)
[windows-jdk8] at hudson.plugins.git.GitSCM.checkout(GitSCM.java:1160)
[windows-jdk8] at org.jenkinsci.plugins.workflow.steps.scm.SCMStep.checkout(SCMStep.java:113)
[windows-jdk8] at org.jenkinsci.plugins.workflow.steps.scm.SCMStep$StepExecutionImpl.run(SCMStep.java:85)
[windows-jdk8] at org.jenkinsci.plugins.workflow.steps.scm.SCMStep$StepExecutionImpl.run(SCMStep.java:75)
[windows-jdk8] at org.jenkinsci.plugins.workflow.steps.AbstractSynchronousNonBlockingStepExecution$1$1.call(AbstractSynchronousNonBlockingStepExecution.java:47)
[windows-jdk8] at hudson.security.ACL.impersonate(ACL.java:260)
[windows-jdk8] at org.jenkinsci.plugins.workflow.steps.AbstractSynchronousNonBlockingStepExecution$1.run(AbstractSynchronousNonBlockingStepExecution.java:44)
[windows-jdk8] at java.util.concurrent.Executors$RunnableAdapter.call(Executors.java:511)
[windows-jdk8] at java.util.concurrent.FutureTask.run(FutureTask.java:266)
[windows-jdk8] at java.util.concurrent.ThreadPoolExecutor.runWorker(ThreadPoolExecutor.java:1149)
[windows-jdk8] at java.util.concurrent.ThreadPoolExecutor$Worker.run(ThreadPoolExecutor.java:624)
[windows-jdk8] at java.lang.Thread.run(Thread.java:748)
[Pipeline] [windows-jdk8] }
[Pipeline] [windows-jdk8] // dir
[Pipeline] [windows-jdk8] echo
[windows-jdk8] [FAIL FAST] This is the first failure and likely root cause
[Pipeline] [windows-jdk8] }
[Pipeline] [windows-jdk8] // stage
[Pipeline] [windows-jdk8] }
[Pipeline] [windows-jdk8] // node
[Pipeline] [windows-jdk8] }
[windows-jdk8] Failed in branch windows-jdk8
[Pipeline] [linux-jdk7] // node
[Pipeline] [linux-jdk8] // node
[Pipeline] [linux-jdk9] // node
[Pipeline] [linux-jdk7] }
[linux-jdk7] Failed in branch linux-jdk7
[Pipeline] [linux-jdk8] }
[linux-jdk8] Failed in branch linux-jdk8
[Pipeline] [linux-jdk9] }
[linux-jdk9] Failed in branch linux-jdk9
[Pipeline] [windows-jdk7] }
[Pipeline] [windows-jdk9] }
[Pipeline] [windows-jdk7] // dir
[Pipeline] [windows-jdk9] // dir
[Pipeline] [windows-jdk7] echo
[windows-jdk7] [FAIL FAST] windows-jdk8 had first failure, ignoring null
[Pipeline] [windows-jdk7] }
[Pipeline] [windows-jdk9] echo
[windows-jdk9] [FAIL FAST] windows-jdk8 had first failure, ignoring null
[Pipeline] [windows-jdk9] }
[Pipeline] [windows-jdk7] // stage
[Pipeline] [windows-jdk9] // stage
[Pipeline] [windows-jdk7] stage
[Pipeline] [windows-jdk7] { (Build windows-jdk7)
[Pipeline] [windows-jdk9] stage
[Pipeline] [windows-jdk9] { (Build windows-jdk9)
[Pipeline] [windows-jdk7] echo
[windows-jdk7] [FAIL FAST] windows-jdk8 has failed. Skipping windows-jdk7.
[Pipeline] [windows-jdk7] }
[Pipeline] [windows-jdk9] echo
[windows-jdk9] [FAIL FAST] windows-jdk8 has failed. Skipping windows-jdk9.
[Pipeline] [windows-jdk9] }
[Pipeline] [windows-jdk7] // stage
[Pipeline] [windows-jdk9] // stage
[Pipeline] [windows-jdk7] }
[Pipeline] [windows-jdk9] }
[Pipeline] [windows-jdk7] // node
[Pipeline] [windows-jdk9] // node
[Pipeline] [windows-jdk7] }
[Pipeline] [windows-jdk9] }
[Pipeline] // parallel
[Pipeline] echo
***** FAST FAILURE *****

Fast failure triggered by windows-jdk8

***** FAST FAILURE *****
[Pipeline] stage
[Pipeline] { (Notifications)
[Pipeline] echo
Build result: FAILURE
[Pipeline] jiraIssueSelector
[Pipeline] emailext
Reply | Threaded
Open this post in threaded view
|

Build succeeded in Jenkins: Maven TLP » maven-ear-plugin » master #22

Apache Jenkins Server-2