Build failed in Jenkins: Maven TLP » maven-ear-plugin » MEAR-276 #11

classic Classic list List threaded Threaded
4 messages Options
Reply | Threaded
Open this post in threaded view
|

Build failed in Jenkins: Maven TLP » maven-ear-plugin » MEAR-276 #11

Apache Jenkins Server-2
See https://builds.apache.org/job/maven-box/job/maven-ear-plugin/job/MEAR-276/11/

Changes:

* Prevent Caused: java.io.NotSerializableException: hudson.model.User
* ${env.EXECUTOR_NUMBER} returns null
* inline env.BRANCH_NAME directly in IF statement
* used env.EXECUTOR_NUMBER
* moved "def localRepo ..." to the stage execution block

8 tests failed.
FAILED:  org.apache.maven.plugins.ear.it.EarMojoIT.linux-jdk8 / Build linux-jdk8 / testProject016

Error Message:
There are differences in the manifest.

Stack Trace:
junit.framework.AssertionFailedError: There are differences in the manifest.
        at org.apache.maven.plugins.ear.it.EarMojoIT.testProject016(EarMojoIT.java:217)


FAILED:  org.apache.maven.plugins.ear.it.EarMojoIT.linux-jdk12 / Build linux-jdk12 / testProject016

Error Message:
There are differences in the manifest.

Stack Trace:
junit.framework.AssertionFailedError: There are differences in the manifest.
        at org.apache.maven.plugins.ear.it.EarMojoIT.testProject016(EarMojoIT.java:217)


FAILED:  org.apache.maven.plugins.ear.it.EarMojoIT.linux-jdk7 / Build linux-jdk7 / testProject016

Error Message:
There are differences in the manifest.

Stack Trace:
junit.framework.AssertionFailedError: There are differences in the manifest.
        at org.apache.maven.plugins.ear.it.EarMojoIT.testProject016(EarMojoIT.java:217)


FAILED:  org.apache.maven.plugins.ear.it.EarMojoIT.linux-jdk11 / Build linux-jdk11 / testProject016

Error Message:
There are differences in the manifest.

Stack Trace:
junit.framework.AssertionFailedError: There are differences in the manifest.
        at org.apache.maven.plugins.ear.it.EarMojoIT.testProject016(EarMojoIT.java:217)


FAILED:  org.apache.maven.plugins.ear.it.EarMojoIT.windows-jdk8 / Build windows-jdk8 / testProject016

Error Message:
There are differences in the manifest.

Stack Trace:
junit.framework.AssertionFailedError: There are differences in the manifest.
        at org.apache.maven.plugins.ear.it.EarMojoIT.testProject016(EarMojoIT.java:217)


FAILED:  org.apache.maven.plugins.ear.it.EarMojoIT.windows-jdk7 / Build windows-jdk7 / testProject016

Error Message:
There are differences in the manifest.

Stack Trace:
junit.framework.AssertionFailedError: There are differences in the manifest.
        at org.apache.maven.plugins.ear.it.EarMojoIT.testProject016(EarMojoIT.java:217)


FAILED:  org.apache.maven.plugins.ear.it.EarMojoIT.windows-jdk11 / Build windows-jdk11 / testProject016

Error Message:
There are differences in the manifest.

Stack Trace:
junit.framework.AssertionFailedError: There are differences in the manifest.
        at org.apache.maven.plugins.ear.it.EarMojoIT.testProject016(EarMojoIT.java:217)


FAILED:  org.apache.maven.plugins.ear.it.EarMojoIT.windows-jdk12 / Build windows-jdk12 / testProject016

Error Message:
There are differences in the manifest.

Stack Trace:
junit.framework.AssertionFailedError: There are differences in the manifest.
        at org.apache.maven.plugins.ear.it.EarMojoIT.testProject016(EarMojoIT.java:217)




Build log:
[...truncated 145421 lines...]
[INFO] Downloading from central: https://repo.maven.apache.org/maven2/org/antlr/antlr4-runtime/4.5.3/antlr4-runtime-4.5.3.pom
[INFO] Downloaded from central: https://repo.maven.apache.org/maven2/org/antlr/antlr4-runtime/4.5.3/antlr4-runtime-4.5.3.pom (2.3 kB at 70 kB/s)
[INFO] Downloading from central: https://repo.maven.apache.org/maven2/org/antlr/antlr4-master/4.5.3/antlr4-master-4.5.3.pom
[INFO] Downloaded from central: https://repo.maven.apache.org/maven2/org/antlr/antlr4-master/4.5.3/antlr4-master-4.5.3.pom (3.7 kB at 123 kB/s)
[INFO] Downloading from central: https://repo.maven.apache.org/maven2/commons-beanutils/commons-beanutils/1.9.2/commons-beanutils-1.9.2.pom
[INFO] Downloaded from central: https://repo.maven.apache.org/maven2/commons-beanutils/commons-beanutils/1.9.2/commons-beanutils-1.9.2.pom (14 kB at 461 kB/s)
[INFO] Downloading from central: https://repo.maven.apache.org/maven2/org/apache/commons/commons-parent/33/commons-parent-33.pom
[INFO] Downloaded from central: https://repo.maven.apache.org/maven2/org/apache/commons/commons-parent/33/commons-parent-33.pom (53 kB at 1.5 MB/s)
[INFO] Downloading from central: https://repo.maven.apache.org/maven2/commons-cli/commons-cli/1.3.1/commons-cli-1.3.1.pom
[INFO] Downloaded from central: https://repo.maven.apache.org/maven2/commons-cli/commons-cli/1.3.1/commons-cli-1.3.1.pom (10 kB at 346 kB/s)
[INFO] Downloading from central: https://repo.maven.apache.org/maven2/com/google/guava/guava/19.0/guava-19.0.pom
[INFO] Downloaded from central: https://repo.maven.apache.org/maven2/com/google/guava/guava/19.0/guava-19.0.pom (6.8 kB at 252 kB/s)
[INFO] Downloading from central: https://repo.maven.apache.org/maven2/com/google/guava/guava-parent/19.0/guava-parent-19.0.pom
[INFO] Downloaded from central: https://repo.maven.apache.org/maven2/com/google/guava/guava-parent/19.0/guava-parent-19.0.pom (9.9 kB at 353 kB/s)
[INFO] Downloading from central: https://repo.maven.apache.org/maven2/org/sonatype/oss/oss-parent/7/oss-parent-7.pom
[INFO] Downloaded from central: https://repo.maven.apache.org/maven2/org/sonatype/oss/oss-parent/7/oss-parent-7.pom (4.8 kB at 186 kB/s)
[INFO] Downloading from central: https://repo.maven.apache.org/maven2/javax/xml/bind/jaxb-api/2.3.0/jaxb-api-2.3.0.pom
[INFO] Downloaded from central: https://repo.maven.apache.org/maven2/javax/xml/bind/jaxb-api/2.3.0/jaxb-api-2.3.0.pom (23 kB at 766 kB/s)
[INFO] Downloading from central: https://repo.maven.apache.org/maven2/javax/xml/bind/jaxb-api-parent/2.3.0/jaxb-api-parent-2.3.0.pom
[INFO] Downloaded from central: https://repo.maven.apache.org/maven2/javax/xml/bind/jaxb-api-parent/2.3.0/jaxb-api-parent-2.3.0.pom (5.6 kB at 235 kB/s)
[INFO] Downloading from central: https://repo.maven.apache.org/maven2/net/java/jvnet-parent/5/jvnet-parent-5.pom
[INFO] Downloaded from central: https://repo.maven.apache.org/maven2/net/java/jvnet-parent/5/jvnet-parent-5.pom (8.9 kB at 328 kB/s)
[INFO] Downloading from central: https://repo.maven.apache.org/maven2/org/apache/maven/doxia/doxia-core/1.2/doxia-core-1.2.jar
[INFO] Downloading from central: https://repo.maven.apache.org/maven2/org/apache/maven/shared/maven-shared-resources/2/maven-shared-resources-2.jar
[INFO] Downloading from central: https://repo.maven.apache.org/maven2/org/apache/maven/doxia/doxia-integration-tools/1.6/doxia-integration-tools-1.6.jar
[INFO] Downloading from central: https://repo.maven.apache.org/maven2/commons-logging/commons-logging/1.0.4/commons-logging-1.0.4.jar
[INFO] Downloading from central: https://repo.maven.apache.org/maven2/commons-digester/commons-digester/1.6/commons-digester-1.6.jar
[INFO] Downloaded from central: https://repo.maven.apache.org/maven2/commons-logging/commons-logging/1.0.4/commons-logging-1.0.4.jar (38 kB at 927 kB/s)
[INFO] Downloading from central: https://repo.maven.apache.org/maven2/commons-io/commons-io/1.4/commons-io-1.4.jar
[INFO] Downloaded from central: https://repo.maven.apache.org/maven2/org/apache/maven/shared/maven-shared-resources/2/maven-shared-resources-2.jar (13 kB at 161 kB/s)
[INFO] Downloading from central: https://repo.maven.apache.org/maven2/org/codehaus/plexus/plexus-resources/1.1.0/plexus-resources-1.1.0.jar
[INFO] Downloaded from central: https://repo.maven.apache.org/maven2/org/codehaus/plexus/plexus-resources/1.1.0/plexus-resources-1.1.0.jar (23 kB at 213 kB/s)
[INFO] Downloading from central: https://repo.maven.apache.org/maven2/com/puppycrawl/tools/checkstyle/6.18/checkstyle-6.18.jar
[INFO] Downloaded from central: https://repo.maven.apache.org/maven2/commons-digester/commons-digester/1.6/commons-digester-1.6.jar (168 kB at 648 kB/s)
[INFO] Downloading from central: https://repo.maven.apache.org/maven2/antlr/antlr/2.7.7/antlr-2.7.7.jar
[INFO] Downloaded from central: https://repo.maven.apache.org/maven2/commons-io/commons-io/1.4/commons-io-1.4.jar (109 kB at 256 kB/s)
[INFO] Downloading from central: https://repo.maven.apache.org/maven2/org/antlr/antlr4-runtime/4.5.3/antlr4-runtime-4.5.3.jar
[INFO] Downloaded from central: https://repo.maven.apache.org/maven2/org/apache/maven/doxia/doxia-integration-tools/1.6/doxia-integration-tools-1.6.jar (45 kB at 103 kB/s)
[INFO] Downloaded from central: https://repo.maven.apache.org/maven2/com/puppycrawl/tools/checkstyle/6.18/checkstyle-6.18.jar (1.2 MB at 2.7 MB/s)
[INFO] Downloaded from central: https://repo.maven.apache.org/maven2/antlr/antlr/2.7.7/antlr-2.7.7.jar (445 kB at 1.0 MB/s)
[INFO] Downloading from central: https://repo.maven.apache.org/maven2/commons-cli/commons-cli/1.3.1/commons-cli-1.3.1.jar
[INFO] Downloading from central: https://repo.maven.apache.org/maven2/commons-beanutils/commons-beanutils/1.9.2/commons-beanutils-1.9.2.jar
[INFO] Downloaded from central: https://repo.maven.apache.org/maven2/org/apache/maven/doxia/doxia-core/1.2/doxia-core-1.2.jar (154 kB at 354 kB/s)
[INFO] Downloading from central: https://repo.maven.apache.org/maven2/com/google/guava/guava/19.0/guava-19.0.jar
[INFO] Downloading from central: https://repo.maven.apache.org/maven2/commons-lang/commons-lang/2.1/commons-lang-2.1.jar
[INFO] Downloaded from central: https://repo.maven.apache.org/maven2/commons-lang/commons-lang/2.1/commons-lang-2.1.jar (208 kB at 434 kB/s)
[INFO] Downloading from central: https://repo.maven.apache.org/maven2/javax/xml/bind/jaxb-api/2.3.0/jaxb-api-2.3.0.jar
  Building: project-078
[INFO] Downloaded from central: https://repo.maven.apache.org/maven2/com/google/guava/guava/19.0/guava-19.0.jar (2.3 MB at 4.1 MB/s)
[INFO] Downloaded from central: https://repo.maven.apache.org/maven2/commons-cli/commons-cli/1.3.1/commons-cli-1.3.1.jar (53 kB at 84 kB/s)
[INFO] Downloaded from central: https://repo.maven.apache.org/maven2/javax/xml/bind/jaxb-api/2.3.0/jaxb-api-2.3.0.jar (126 kB at 169 kB/s)
[INFO] Downloaded from central: https://repo.maven.apache.org/maven2/org/antlr/antlr4-runtime/4.5.3/antlr4-runtime-4.5.3.jar (302 kB at 272 kB/s)
[INFO] Downloaded from central: https://repo.maven.apache.org/maven2/commons-beanutils/commons-beanutils/1.9.2/commons-beanutils-1.9.2.jar (234 kB at 208 kB/s)
[INFO] There are 3 errors reported by Checkstyle 6.18 with config/maven_checks.xml ruleset.
[INFO] Ignored 3 errors, 0 violation remaining.
[INFO]
[INFO] --- maven-invoker-plugin:3.1.0:verify (integration-test) @ maven-ear-plugin ---
[INFO] -------------------------------------------------
[INFO] Build Summary:
[INFO]   Passed: 17, Failed: 0, Errors: 0, Skipped: 0
[INFO] -------------------------------------------------
[INFO]
[INFO] --- maven-failsafe-plugin:2.22.1:verify (default) @ maven-ear-plugin ---
[ERROR] There are test failures.

Please refer to f:\jenkins\jenkins-slave\workspace\en-box_maven-ear-plugin_MEAR-276\m\target\failsafe-reports for the individual test results.
Please refer to dump files (if any exist) [date].dump, [date]-jvmRun[N].dump and [date].dumpstream.
[INFO] ------------------------------------------------------------------------
[INFO] BUILD SUCCESS
[INFO] ------------------------------------------------------------------------
[INFO] Total time:  09:11 min
[INFO] Finished at: 2019-08-28T06:32:42-07:00
[INFO] ------------------------------------------------------------------------
[INFO] [jenkins-event-spy] Generated F:\jenkins\jenkins-slave\workspace\en-box_maven-ear-plugin_MEAR-276@tmp\withMaven526f1e6a\maven-spy-20190828-062331-25114156977860245702010.log
[Pipeline] }
[Pipeline] // dir
[Pipeline] }
[withMaven] invokerPublisher - Archive invoker results for Maven artifact MavenArtifact{org.apache.maven.plugins:maven-ear-plugin:maven-plugin:3.0.2-SNAPSHOT(version: 3.0.2-SNAPSHOT, snapshot:false) } generated by PluginInvocation{org.apache.maven.plugins:maven-invoker-plugin:3.1.0@integration-test  integration-test}: m\target\invoker-reports\*.xml
  Building: project-079
  Building: project-080
[withMaven] junitPublisher - Archive test results for Maven artifact org.apache.maven.plugins:maven-ear-plugin:maven-plugin:3.0.2-SNAPSHOT generated by maven-surefire-plugin:test (default-test): m\target\surefire-reports\*.xml
Recording test results
[withMaven] junitPublisher - Archive test results for Maven artifact org.apache.maven.plugins:maven-ear-plugin:maven-plugin:3.0.2-SNAPSHOT generated by maven-failsafe-plugin:integration-test (default): m\target\failsafe-reports\*.xml
Recording test results
[withMaven] Publishers: Pipeline Graph Publisher: 1 ms, Invoker Publisher: 6664 ms, Junit Publisher: 251 ms
[Pipeline] // withMaven
[Pipeline] cleanWs
[WS-CLEANUP] Deleting project workspace...
[WS-CLEANUP] Deferred wipeout is used...
[WS-CLEANUP] done
[Pipeline] }
[Pipeline] // stage
[Pipeline] }
[Pipeline] // node
[Pipeline] }
  Building: project-081
  Building: project-082
  Building: project-083
  Building: project-084
  Building: project-085
  Building: project-086
  Building: project-087
[ERROR] Tests run: 87, Failures: 1, Errors: 0, Skipped: 0, Time elapsed: 347.039 s <<< FAILURE! - in org.apache.maven.plugins.ear.it.EarMojoIT
[ERROR] testProject016(org.apache.maven.plugins.ear.it.EarMojoIT)  Time elapsed: 4.256 s  <<< FAILURE!
junit.framework.AssertionFailedError: There are differences in the manifest.
        at org.apache.maven.plugins.ear.it.EarMojoIT.testProject016(EarMojoIT.java:217)

[INFO]
[INFO] Results:
[INFO]
[ERROR] Failures:
[ERROR]   EarMojoIT.testProject016:217 There are differences in the manifest.
[INFO]
[ERROR] Tests run: 87, Failures: 1, Errors: 0, Skipped: 0
[INFO]
[INFO]
[INFO] --- maven-checkstyle-plugin:3.0.0:check (checkstyle-check) @ maven-ear-plugin ---
[INFO] Downloading from central: https://repo.maven.apache.org/maven2/org/apache/maven/shared/maven-shared-resources/2/maven-shared-resources-2.pom
[INFO] Downloaded from central: https://repo.maven.apache.org/maven2/org/apache/maven/shared/maven-shared-resources/2/maven-shared-resources-2.pom (3.0 kB at 99 kB/s)
[INFO] Downloading from central: https://repo.maven.apache.org/maven2/org/codehaus/plexus/plexus-utils/3.0.10/plexus-utils-3.0.10.pom
[INFO] Downloaded from central: https://repo.maven.apache.org/maven2/org/codehaus/plexus/plexus-utils/3.0.10/plexus-utils-3.0.10.pom (3.1 kB at 121 kB/s)
[INFO] Downloading from central: https://repo.maven.apache.org/maven2/org/codehaus/plexus/plexus/3.3/plexus-3.3.pom
[INFO] Downloaded from central: https://repo.maven.apache.org/maven2/org/codehaus/plexus/plexus/3.3/plexus-3.3.pom (20 kB at 711 kB/s)
[INFO] Downloading from central: https://repo.maven.apache.org/maven2/org/apache/maven/doxia/doxia-integration-tools/1.6/doxia-integration-tools-1.6.pom
[INFO] Downloaded from central: https://repo.maven.apache.org/maven2/org/apache/maven/doxia/doxia-integration-tools/1.6/doxia-integration-tools-1.6.pom (7.0 kB at 193 kB/s)
[INFO] Downloading from central: https://repo.maven.apache.org/maven2/org/apache/maven/doxia/doxia-tools/3/doxia-tools-3.pom
[INFO] Downloaded from central: https://repo.maven.apache.org/maven2/org/apache/maven/doxia/doxia-tools/3/doxia-tools-3.pom (9.9 kB at 368 kB/s)
[INFO] Downloading from central: https://repo.maven.apache.org/maven2/org/codehaus/plexus/plexus-resources/1.1.0/plexus-resources-1.1.0.pom
[INFO] Downloaded from central: https://repo.maven.apache.org/maven2/org/codehaus/plexus/plexus-resources/1.1.0/plexus-resources-1.1.0.pom (3.2 kB at 110 kB/s)
[INFO] Downloading from central: https://repo.maven.apache.org/maven2/com/puppycrawl/tools/checkstyle/6.18/checkstyle-6.18.pom
[INFO] Downloaded from central: https://repo.maven.apache.org/maven2/com/puppycrawl/tools/checkstyle/6.18/checkstyle-6.18.pom (71 kB at 2.3 MB/s)
[INFO] Downloading from central: https://repo.maven.apache.org/maven2/antlr/antlr/2.7.7/antlr-2.7.7.pom
[INFO] Downloaded from central: https://repo.maven.apache.org/maven2/antlr/antlr/2.7.7/antlr-2.7.7.pom (632 B at 23 kB/s)
[INFO] Downloading from central: https://repo.maven.apache.org/maven2/org/antlr/antlr4-runtime/4.5.3/antlr4-runtime-4.5.3.pom
[INFO] Downloaded from central: https://repo.maven.apache.org/maven2/org/antlr/antlr4-runtime/4.5.3/antlr4-runtime-4.5.3.pom (2.3 kB at 80 kB/s)
[INFO] Downloading from central: https://repo.maven.apache.org/maven2/org/antlr/antlr4-master/4.5.3/antlr4-master-4.5.3.pom
[INFO] Downloaded from central: https://repo.maven.apache.org/maven2/org/antlr/antlr4-master/4.5.3/antlr4-master-4.5.3.pom (3.7 kB at 136 kB/s)
[INFO] Downloading from central: https://repo.maven.apache.org/maven2/commons-beanutils/commons-beanutils/1.9.2/commons-beanutils-1.9.2.pom
[INFO] Downloaded from central: https://repo.maven.apache.org/maven2/commons-beanutils/commons-beanutils/1.9.2/commons-beanutils-1.9.2.pom (14 kB at 325 kB/s)
[INFO] Downloading from central: https://repo.maven.apache.org/maven2/org/apache/commons/commons-parent/33/commons-parent-33.pom
[INFO] Downloaded from central: https://repo.maven.apache.org/maven2/org/apache/commons/commons-parent/33/commons-parent-33.pom (53 kB at 1.4 MB/s)
[INFO] Downloading from central: https://repo.maven.apache.org/maven2/commons-cli/commons-cli/1.3.1/commons-cli-1.3.1.pom
[INFO] Downloaded from central: https://repo.maven.apache.org/maven2/commons-cli/commons-cli/1.3.1/commons-cli-1.3.1.pom (10 kB at 371 kB/s)
[INFO] Downloading from central: https://repo.maven.apache.org/maven2/com/google/guava/guava/19.0/guava-19.0.pom
[INFO] Downloaded from central: https://repo.maven.apache.org/maven2/com/google/guava/guava/19.0/guava-19.0.pom (6.8 kB at 272 kB/s)
[INFO] Downloading from central: https://repo.maven.apache.org/maven2/com/google/guava/guava-parent/19.0/guava-parent-19.0.pom
[INFO] Downloaded from central: https://repo.maven.apache.org/maven2/com/google/guava/guava-parent/19.0/guava-parent-19.0.pom (9.9 kB at 395 kB/s)
[INFO] Downloading from central: https://repo.maven.apache.org/maven2/org/sonatype/oss/oss-parent/7/oss-parent-7.pom
[INFO] Downloaded from central: https://repo.maven.apache.org/maven2/org/sonatype/oss/oss-parent/7/oss-parent-7.pom (4.8 kB at 230 kB/s)
[INFO] Downloading from central: https://repo.maven.apache.org/maven2/javax/xml/bind/jaxb-api/2.3.0/jaxb-api-2.3.0.pom
[INFO] Downloaded from central: https://repo.maven.apache.org/maven2/javax/xml/bind/jaxb-api/2.3.0/jaxb-api-2.3.0.pom (23 kB at 821 kB/s)
[INFO] Downloading from central: https://repo.maven.apache.org/maven2/javax/xml/bind/jaxb-api-parent/2.3.0/jaxb-api-parent-2.3.0.pom
[INFO] Downloaded from central: https://repo.maven.apache.org/maven2/javax/xml/bind/jaxb-api-parent/2.3.0/jaxb-api-parent-2.3.0.pom (5.6 kB at 157 kB/s)
[INFO] Downloading from central: https://repo.maven.apache.org/maven2/net/java/jvnet-parent/5/jvnet-parent-5.pom
[INFO] Downloaded from central: https://repo.maven.apache.org/maven2/net/java/jvnet-parent/5/jvnet-parent-5.pom (8.9 kB at 341 kB/s)
[INFO] Downloading from central: https://repo.maven.apache.org/maven2/org/apache/maven/shared/maven-shared-resources/2/maven-shared-resources-2.jar
[INFO] Downloading from central: https://repo.maven.apache.org/maven2/org/apache/maven/doxia/doxia-integration-tools/1.6/doxia-integration-tools-1.6.jar
[INFO] Downloading from central: https://repo.maven.apache.org/maven2/commons-logging/commons-logging/1.0.4/commons-logging-1.0.4.jar
[INFO] Downloading from central: https://repo.maven.apache.org/maven2/commons-digester/commons-digester/1.6/commons-digester-1.6.jar
[INFO] Downloading from central: https://repo.maven.apache.org/maven2/org/apache/maven/doxia/doxia-core/1.2/doxia-core-1.2.jar
[INFO] Downloaded from central: https://repo.maven.apache.org/maven2/commons-logging/commons-logging/1.0.4/commons-logging-1.0.4.jar (38 kB at 950 kB/s)
[INFO] Downloading from central: https://repo.maven.apache.org/maven2/commons-io/commons-io/1.4/commons-io-1.4.jar
[INFO] Downloaded from central: https://repo.maven.apache.org/maven2/org/apache/maven/shared/maven-shared-resources/2/maven-shared-resources-2.jar (13 kB at 109 kB/s)
[INFO] Downloading from central: https://repo.maven.apache.org/maven2/org/codehaus/plexus/plexus-resources/1.1.0/plexus-resources-1.1.0.jar
[INFO] Downloaded from central: https://repo.maven.apache.org/maven2/org/codehaus/plexus/plexus-resources/1.1.0/plexus-resources-1.1.0.jar (23 kB at 154 kB/s)
[INFO] Downloading from central: https://repo.maven.apache.org/maven2/com/puppycrawl/tools/checkstyle/6.18/checkstyle-6.18.jar
[INFO] Downloaded from central: https://repo.maven.apache.org/maven2/com/puppycrawl/tools/checkstyle/6.18/checkstyle-6.18.jar (1.2 MB at 5.1 MB/s)
[INFO] Downloading from central: https://repo.maven.apache.org/maven2/antlr/antlr/2.7.7/antlr-2.7.7.jar
[INFO] Downloaded from central: https://repo.maven.apache.org/maven2/antlr/antlr/2.7.7/antlr-2.7.7.jar (445 kB at 1.7 MB/s)
[INFO] Downloading from central: https://repo.maven.apache.org/maven2/org/antlr/antlr4-runtime/4.5.3/antlr4-runtime-4.5.3.jar
[INFO] Downloaded from central: https://repo.maven.apache.org/maven2/commons-io/commons-io/1.4/commons-io-1.4.jar (109 kB at 279 kB/s)
[INFO] Downloading from central: https://repo.maven.apache.org/maven2/commons-beanutils/commons-beanutils/1.9.2/commons-beanutils-1.9.2.jar
[INFO] Downloaded from central: https://repo.maven.apache.org/maven2/org/apache/maven/doxia/doxia-integration-tools/1.6/doxia-integration-tools-1.6.jar (45 kB at 112 kB/s)
[INFO] Downloading from central: https://repo.maven.apache.org/maven2/commons-cli/commons-cli/1.3.1/commons-cli-1.3.1.jar
[INFO] Downloaded from central: https://repo.maven.apache.org/maven2/commons-digester/commons-digester/1.6/commons-digester-1.6.jar (168 kB at 382 kB/s)
[INFO] Downloading from central: https://repo.maven.apache.org/maven2/com/google/guava/guava/19.0/guava-19.0.jar
[INFO] Downloaded from central: https://repo.maven.apache.org/maven2/org/apache/maven/doxia/doxia-core/1.2/doxia-core-1.2.jar (154 kB at 295 kB/s)
[INFO] Downloading from central: https://repo.maven.apache.org/maven2/commons-lang/commons-lang/2.1/commons-lang-2.1.jar
[INFO] Downloaded from central: https://repo.maven.apache.org/maven2/commons-cli/commons-cli/1.3.1/commons-cli-1.3.1.jar (53 kB at 97 kB/s)
[INFO] Downloading from central: https://repo.maven.apache.org/maven2/javax/xml/bind/jaxb-api/2.3.0/jaxb-api-2.3.0.jar
[INFO] Downloaded from central: https://repo.maven.apache.org/maven2/commons-lang/commons-lang/2.1/commons-lang-2.1.jar (208 kB at 377 kB/s)
[INFO] Downloaded from central: https://repo.maven.apache.org/maven2/com/google/guava/guava/19.0/guava-19.0.jar (2.3 MB at 4.2 MB/s)
[INFO] Downloaded from central: https://repo.maven.apache.org/maven2/javax/xml/bind/jaxb-api/2.3.0/jaxb-api-2.3.0.jar (126 kB at 162 kB/s)
[INFO] Downloaded from central: https://repo.maven.apache.org/maven2/org/antlr/antlr4-runtime/4.5.3/antlr4-runtime-4.5.3.jar (302 kB at 341 kB/s)
[INFO] Downloaded from central: https://repo.maven.apache.org/maven2/commons-beanutils/commons-beanutils/1.9.2/commons-beanutils-1.9.2.jar (234 kB at 246 kB/s)
[INFO] There are 3 errors reported by Checkstyle 6.18 with config/maven_checks.xml ruleset.
[INFO] Ignored 3 errors, 0 violation remaining.
[INFO]
[INFO] --- maven-invoker-plugin:3.1.0:verify (integration-test) @ maven-ear-plugin ---
[INFO] -------------------------------------------------
[INFO] Build Summary:
[INFO]   Passed: 16, Failed: 1, Errors: 0, Skipped: 0
[INFO] -------------------------------------------------
[ERROR] The following builds failed:
[ERROR] *  same-artifactId\pom.xml
[INFO] -------------------------------------------------
[INFO] ------------------------------------------------------------------------
[INFO] BUILD FAILURE
[INFO] ------------------------------------------------------------------------
[INFO] Total time:  08:59 min
[INFO] Finished at: 2019-08-28T06:33:22-07:00
[INFO] ------------------------------------------------------------------------
[INFO] [jenkins-event-spy] Generated F:\jenkins\jenkins-slave\workspace\en-box_maven-ear-plugin_MEAR-276@tmp\withMavenaf2c2974\maven-spy-20190828-062422-7232566946960306947548.log
[ERROR] Failed to execute goal org.apache.maven.plugins:maven-invoker-plugin:3.1.0:verify (integration-test) on project maven-ear-plugin: 1 build failed. See console output above for details. -> [Help 1]
[ERROR]
[ERROR] To see the full stack trace of the errors, re-run Maven with the -e switch.
[ERROR] Re-run Maven using the -X switch to enable full debug logging.
[ERROR]
[ERROR] For more information about the errors and possible solutions, please read the following articles:
[ERROR] [Help 1] http://cwiki.apache.org/confluence/display/MAVEN/MojoFailureException
[Pipeline] }
[Pipeline] // dir
[Pipeline] }
[withMaven] invokerPublisher - Archive invoker results for Maven artifact MavenArtifact{org.apache.maven.plugins:maven-ear-plugin:maven-plugin:3.0.2-SNAPSHOT(version: 3.0.2-SNAPSHOT, snapshot:false) } generated by PluginInvocation{org.apache.maven.plugins:maven-invoker-plugin:3.1.0@integration-test  integration-test}: m\target\invoker-reports\*.xml
[withMaven] junitPublisher - Archive test results for Maven artifact org.apache.maven.plugins:maven-ear-plugin:maven-plugin:3.0.2-SNAPSHOT generated by maven-surefire-plugin:test (default-test): m\target\surefire-reports\*.xml
Recording test results
[withMaven] junitPublisher - Archive test results for Maven artifact org.apache.maven.plugins:maven-ear-plugin:maven-plugin:3.0.2-SNAPSHOT generated by maven-failsafe-plugin:integration-test (default): m\target\failsafe-reports\*.xml
Recording test results
[withMaven] Publishers: Invoker Publisher: 6955 ms, Junit Publisher: 260 ms
[Pipeline] // withMaven
[Pipeline] echo
[FAILURE-004] hudson.AbortException: script returned exit code 1
[Pipeline] cleanWs
[WS-CLEANUP] Deleting project workspace...
[WS-CLEANUP] Deferred wipeout is used...
[WS-CLEANUP] done
[Pipeline] cleanWs
[WS-CLEANUP] Deleting project workspace...
[WS-CLEANUP] Deferred wipeout is used...
[WS-CLEANUP] done
[Pipeline] }
[Pipeline] // stage
[Pipeline] }
[Pipeline] // node
[Pipeline] }
Failed in branch windows-jdk12
[Pipeline] // parallel
[Pipeline] echo
[FAILURE-003] AbortException hudson.AbortException: script returned exit code 1
[Pipeline] stage
[Pipeline] { (Notifications)
[Pipeline] echo
Build result: FAILURE
[Pipeline] jiraIssueSelector
[Pipeline] echo
The authors of changes [rfscholte, tibordigana].
[Pipeline] echo
Sending email ...
[Pipeline] emailext
Reply | Threaded
Open this post in threaded view
|

Build failed in Jenkins: Maven TLP » maven-ear-plugin » MEAR-276 #12

Apache Jenkins Server-2
See https://builds.apache.org/job/maven-box/job/maven-ear-plugin/job/MEAR-276/12/

Changes:

* Log unique commits
* Other attempt due to 'Scripts not permitted to use staticMethod
* Revert "Log unique commits"

8 tests failed.
FAILED:  org.apache.maven.plugins.ear.it.EarMojoIT.linux-jdk8 / Build linux-jdk8 / testProject016

Error Message:
There are differences in the manifest.

Stack Trace:
junit.framework.AssertionFailedError: There are differences in the manifest.
        at org.apache.maven.plugins.ear.it.EarMojoIT.testProject016(EarMojoIT.java:217)


FAILED:  org.apache.maven.plugins.ear.it.EarMojoIT.linux-jdk12 / Build linux-jdk12 / testProject016

Error Message:
There are differences in the manifest.

Stack Trace:
junit.framework.AssertionFailedError: There are differences in the manifest.
        at org.apache.maven.plugins.ear.it.EarMojoIT.testProject016(EarMojoIT.java:217)


FAILED:  org.apache.maven.plugins.ear.it.EarMojoIT.linux-jdk11 / Build linux-jdk11 / testProject016

Error Message:
There are differences in the manifest.

Stack Trace:
junit.framework.AssertionFailedError: There are differences in the manifest.
        at org.apache.maven.plugins.ear.it.EarMojoIT.testProject016(EarMojoIT.java:217)


FAILED:  org.apache.maven.plugins.ear.it.EarMojoIT.windows-jdk8 / Build windows-jdk8 / testProject016

Error Message:
There are differences in the manifest.

Stack Trace:
junit.framework.AssertionFailedError: There are differences in the manifest.
        at org.apache.maven.plugins.ear.it.EarMojoIT.testProject016(EarMojoIT.java:217)


FAILED:  org.apache.maven.plugins.ear.it.EarMojoIT.windows-jdk12 / Build windows-jdk12 / testProject016

Error Message:
There are differences in the manifest.

Stack Trace:
junit.framework.AssertionFailedError: There are differences in the manifest.
        at org.apache.maven.plugins.ear.it.EarMojoIT.testProject016(EarMojoIT.java:217)


FAILED:  org.apache.maven.plugins.ear.it.EarMojoIT.windows-jdk11 / Build windows-jdk11 / testProject016

Error Message:
There are differences in the manifest.

Stack Trace:
junit.framework.AssertionFailedError: There are differences in the manifest.
        at org.apache.maven.plugins.ear.it.EarMojoIT.testProject016(EarMojoIT.java:217)


FAILED:  org.apache.maven.plugins.ear.it.EarMojoIT.linux-jdk7 / Build linux-jdk7 / testProject016

Error Message:
There are differences in the manifest.

Stack Trace:
junit.framework.AssertionFailedError: There are differences in the manifest.
        at org.apache.maven.plugins.ear.it.EarMojoIT.testProject016(EarMojoIT.java:217)


FAILED:  org.apache.maven.plugins.ear.it.EarMojoIT.windows-jdk7 / Build windows-jdk7 / testProject016

Error Message:
There are differences in the manifest.

Stack Trace:
junit.framework.AssertionFailedError: There are differences in the manifest.
        at org.apache.maven.plugins.ear.it.EarMojoIT.testProject016(EarMojoIT.java:217)




Build log:
[...truncated 145405 lines...]
[INFO]   Passed: 17, Failed: 0, Errors: 0, Skipped: 0
[INFO] -------------------------------------------------
[INFO]
[INFO] --- maven-failsafe-plugin:2.22.1:verify (default) @ maven-ear-plugin ---
[ERROR] There are test failures.

Please refer to /home/jenkins/jenkins-slave/workspace/en-box_maven-ear-plugin_MEAR-276/m/target/failsafe-reports for the individual test results.
Please refer to dump files (if any exist) [date].dump, [date]-jvmRun[N].dump and [date].dumpstream.
[INFO] ------------------------------------------------------------------------
[INFO] BUILD SUCCESS
[INFO] ------------------------------------------------------------------------
[INFO] Total time:  08:48 min
[INFO] Finished at: 2019-09-23T01:49:45Z
[INFO] ------------------------------------------------------------------------
[INFO] [jenkins-event-spy] Generated /home/jenkins/jenkins-slave/workspace/en-box_maven-ear-plugin_MEAR-276@tmp/withMaven01bdf2b8/maven-spy-20190923-014056-4153509132438730991717.log
[Pipeline] }
[Pipeline] // dir
[Pipeline] }
[INFO] There are 3 errors reported by Checkstyle 6.18 with config/maven_checks.xml ruleset.
[INFO] Ignored 3 errors, 0 violation remaining.
[INFO]
[INFO] --- maven-invoker-plugin:3.1.0:verify (integration-test) @ maven-ear-plugin ---
[INFO] -------------------------------------------------
[INFO] Build Summary:
[INFO]   Passed: 17, Failed: 0, Errors: 0, Skipped: 0
[INFO] -------------------------------------------------
[INFO]
[INFO] --- maven-failsafe-plugin:2.22.1:verify (default) @ maven-ear-plugin ---
[ERROR] There are test failures.

Please refer to f:\jenkins\jenkins-slave\workspace\en-box_maven-ear-plugin_MEAR-276\m\target\failsafe-reports for the individual test results.
Please refer to dump files (if any exist) [date].dump, [date]-jvmRun[N].dump and [date].dumpstream.
[INFO] ------------------------------------------------------------------------
[INFO] BUILD SUCCESS
[INFO] ------------------------------------------------------------------------
[INFO] Total time:  08:45 min
[INFO] Finished at: 2019-09-22T18:50:06-07:00
[INFO] ------------------------------------------------------------------------
[INFO] [jenkins-event-spy] Generated F:\jenkins\jenkins-slave\workspace\en-box_maven-ear-plugin_MEAR-276@tmp\withMaven63e8fd8e\maven-spy-20190922-184120-6261842365794869029206.log
[Pipeline] }
[Pipeline] // dir
[Pipeline] }
[withMaven] invokerPublisher - Archive invoker results for Maven artifact MavenArtifact{org.apache.maven.plugins:maven-ear-plugin:maven-plugin:3.0.2-SNAPSHOT(version: 3.0.2-SNAPSHOT, snapshot:false) } generated by PluginInvocation{org.apache.maven.plugins:maven-invoker-plugin:3.1.0@integration-test  integration-test}: m\target\invoker-reports\*.xml
[withMaven] artifactsPublisher - Archive artifact m/pom.xml under org/apache/maven/plugins/maven-ear-plugin/3.0.2-SNAPSHOT/maven-ear-plugin-3.0.2-SNAPSHOT.pom
  Building: project-072
[withMaven] artifactsPublisher - Archive artifact m/target/maven-ear-plugin-3.0.2-SNAPSHOT.jar under org/apache/maven/plugins/maven-ear-plugin/3.0.2-SNAPSHOT/maven-ear-plugin-3.0.2-SNAPSHOT.jar
[withMaven] invokerPublisher - Archive invoker results for Maven artifact MavenArtifact{org.apache.maven.plugins:maven-ear-plugin:maven-plugin:3.0.2-SNAPSHOT(version: 3.0.2-SNAPSHOT, snapshot:false) } generated by PluginInvocation{org.apache.maven.plugins:maven-invoker-plugin:3.1.0@integration-test  integration-test}: m/target/invoker-reports/*.xml
[withMaven] junitPublisher - Archive test results for Maven artifact org.apache.maven.plugins:maven-ear-plugin:maven-plugin:3.0.2-SNAPSHOT generated by maven-surefire-plugin:test (default-test): m\target\surefire-reports\*.xml
Recording test results
[withMaven] junitPublisher - Archive test results for Maven artifact org.apache.maven.plugins:maven-ear-plugin:maven-plugin:3.0.2-SNAPSHOT generated by maven-failsafe-plugin:integration-test (default): m\target\failsafe-reports\*.xml
Recording test results
[withMaven] Publishers: Invoker Publisher: 6466 ms, Junit Publisher: 290 ms
[Pipeline] // withMaven
[Pipeline] echo
[FAILURE-004] hudson.AbortException: script returned exit code 1
[Pipeline] cleanWs
[WS-CLEANUP] Deleting project workspace...
[WS-CLEANUP] Deferred wipeout is used...
[WS-CLEANUP] done
[Pipeline] cleanWs
[WS-CLEANUP] Deleting project workspace...
[WS-CLEANUP] Deferred wipeout is used...
[WS-CLEANUP] done
[Pipeline] }
[Pipeline] // stage
[Pipeline] }
[Pipeline] // node
[Pipeline] }
Failed in branch windows-jdk12
[withMaven] junitPublisher - Archive test results for Maven artifact org.apache.maven.plugins:maven-ear-plugin:maven-plugin:3.0.2-SNAPSHOT generated by maven-surefire-plugin:test (default-test): m\target\surefire-reports\*.xml
Recording test results
[withMaven] junitPublisher - Archive test results for Maven artifact org.apache.maven.plugins:maven-ear-plugin:maven-plugin:3.0.2-SNAPSHOT generated by maven-failsafe-plugin:integration-test (default): m\target\failsafe-reports\*.xml
Recording test results
[withMaven] Publishers: Invoker Publisher: 6683 ms, Junit Publisher: 232 ms
[Pipeline] // withMaven
[Pipeline] cleanWs
[WS-CLEANUP] Deleting project workspace...
[WS-CLEANUP] Deferred wipeout is used...
[WS-CLEANUP] done
[Pipeline] }
[Pipeline] // stage
[Pipeline] }
[Pipeline] // node
[Pipeline] }
  Building: project-073
  Building: project-074
  Building: project-075
  Building: project-076
[withMaven] junitPublisher - Archive test results for Maven artifact org.apache.maven.plugins:maven-ear-plugin:maven-plugin:3.0.2-SNAPSHOT generated by maven-surefire-plugin:test (default-test): m/target/surefire-reports/*.xml
Recording test results
[withMaven] junitPublisher - Archive test results for Maven artifact org.apache.maven.plugins:maven-ear-plugin:maven-plugin:3.0.2-SNAPSHOT generated by maven-failsafe-plugin:integration-test (default): m/target/failsafe-reports/*.xml
Recording test results
  Building: project-077
[withMaven] openTasksPublisher - Scan Tasks for Maven artifact org.apache.maven.plugins:maven-ear-plugin:maven-plugin:3.0.2-SNAPSHOT in source directory m/src/main/java
[TASKS] Scanning folder '/home/jenkins/jenkins-slave/workspace/en-box_maven-ear-plugin_MEAR-276' for files matching the pattern 'm/src/main/java/**/*' - excludes: null
[TASKS] Found 35 files to scan for tasks
[TASKS] Found 5 open tasks.
Skipping warnings blame since pipelines do not have an SCM link.%n
[TASKS] Computing warning deltas based on reference build #4
[withMaven] Publishers: Pipeline Graph Publisher: 1 ms, Generated Artifacts Publisher: 1133 ms, Invoker Publisher: 15805 ms, Junit Publisher: 3706 ms, Open Task Scanner Publisher: 1040 ms
[Pipeline] // withMaven
[Pipeline] cleanWs
[WS-CLEANUP] Deleting project workspace...
[WS-CLEANUP] Deferred wipeout is used...
[WS-CLEANUP] done
[Pipeline] }
[Pipeline] // stage
[Pipeline] }
[Pipeline] // node
[Pipeline] }
  Building: project-078
  Building: project-079
  Building: project-080
  Building: project-081
  Building: project-082
  Building: project-083
  Building: project-084
  Building: project-085
  Building: project-086
  Building: project-087
[ERROR] Tests run: 87, Failures: 1, Errors: 0, Skipped: 0, Time elapsed: 379.016 s <<< FAILURE! - in org.apache.maven.plugins.ear.it.EarMojoIT
[ERROR] testProject016(org.apache.maven.plugins.ear.it.EarMojoIT)  Time elapsed: 4.763 s  <<< FAILURE!
junit.framework.AssertionFailedError: There are differences in the manifest.
        at org.apache.maven.plugins.ear.it.EarMojoIT.testProject016(EarMojoIT.java:217)

[INFO]
[INFO] Results:
[INFO]
[ERROR] Failures:
[ERROR]   EarMojoIT.testProject016:217 There are differences in the manifest.
[INFO]
[ERROR] Tests run: 87, Failures: 1, Errors: 0, Skipped: 0
[INFO]
[INFO]
[INFO] --- maven-checkstyle-plugin:3.0.0:check (checkstyle-check) @ maven-ear-plugin ---
[INFO] Downloading from central: https://repo.maven.apache.org/maven2/org/apache/maven/shared/maven-shared-resources/2/maven-shared-resources-2.pom
[INFO] Downloaded from central: https://repo.maven.apache.org/maven2/org/apache/maven/shared/maven-shared-resources/2/maven-shared-resources-2.pom (3.0 kB at 109 kB/s)
[INFO] Downloading from central: https://repo.maven.apache.org/maven2/org/codehaus/plexus/plexus-utils/3.0.10/plexus-utils-3.0.10.pom
[INFO] Downloaded from central: https://repo.maven.apache.org/maven2/org/codehaus/plexus/plexus-utils/3.0.10/plexus-utils-3.0.10.pom (3.1 kB at 95 kB/s)
[INFO] Downloading from central: https://repo.maven.apache.org/maven2/org/codehaus/plexus/plexus/3.3/plexus-3.3.pom
[INFO] Downloaded from central: https://repo.maven.apache.org/maven2/org/codehaus/plexus/plexus/3.3/plexus-3.3.pom (20 kB at 622 kB/s)
[INFO] Downloading from central: https://repo.maven.apache.org/maven2/org/apache/maven/doxia/doxia-integration-tools/1.6/doxia-integration-tools-1.6.pom
[INFO] Downloaded from central: https://repo.maven.apache.org/maven2/org/apache/maven/doxia/doxia-integration-tools/1.6/doxia-integration-tools-1.6.pom (7.0 kB at 211 kB/s)
[INFO] Downloading from central: https://repo.maven.apache.org/maven2/org/apache/maven/doxia/doxia-tools/3/doxia-tools-3.pom
[INFO] Downloaded from central: https://repo.maven.apache.org/maven2/org/apache/maven/doxia/doxia-tools/3/doxia-tools-3.pom (9.9 kB at 331 kB/s)
[INFO] Downloading from central: https://repo.maven.apache.org/maven2/org/codehaus/plexus/plexus-resources/1.1.0/plexus-resources-1.1.0.pom
[INFO] Downloaded from central: https://repo.maven.apache.org/maven2/org/codehaus/plexus/plexus-resources/1.1.0/plexus-resources-1.1.0.pom (3.2 kB at 102 kB/s)
[INFO] Downloading from central: https://repo.maven.apache.org/maven2/com/puppycrawl/tools/checkstyle/6.18/checkstyle-6.18.pom
[INFO] Downloaded from central: https://repo.maven.apache.org/maven2/com/puppycrawl/tools/checkstyle/6.18/checkstyle-6.18.pom (71 kB at 1.9 MB/s)
[INFO] Downloading from central: https://repo.maven.apache.org/maven2/antlr/antlr/2.7.7/antlr-2.7.7.pom
[INFO] Downloaded from central: https://repo.maven.apache.org/maven2/antlr/antlr/2.7.7/antlr-2.7.7.pom (632 B at 21 kB/s)
[INFO] Downloading from central: https://repo.maven.apache.org/maven2/org/antlr/antlr4-runtime/4.5.3/antlr4-runtime-4.5.3.pom
[INFO] Downloaded from central: https://repo.maven.apache.org/maven2/org/antlr/antlr4-runtime/4.5.3/antlr4-runtime-4.5.3.pom (2.3 kB at 72 kB/s)
[INFO] Downloading from central: https://repo.maven.apache.org/maven2/org/antlr/antlr4-master/4.5.3/antlr4-master-4.5.3.pom
[INFO] Downloaded from central: https://repo.maven.apache.org/maven2/org/antlr/antlr4-master/4.5.3/antlr4-master-4.5.3.pom (3.7 kB at 160 kB/s)
[INFO] Downloading from central: https://repo.maven.apache.org/maven2/commons-beanutils/commons-beanutils/1.9.2/commons-beanutils-1.9.2.pom
[INFO] Downloaded from central: https://repo.maven.apache.org/maven2/commons-beanutils/commons-beanutils/1.9.2/commons-beanutils-1.9.2.pom (14 kB at 447 kB/s)
[INFO] Downloading from central: https://repo.maven.apache.org/maven2/org/apache/commons/commons-parent/33/commons-parent-33.pom
[INFO] Downloaded from central: https://repo.maven.apache.org/maven2/org/apache/commons/commons-parent/33/commons-parent-33.pom (53 kB at 1.4 MB/s)
[INFO] Downloading from central: https://repo.maven.apache.org/maven2/commons-cli/commons-cli/1.3.1/commons-cli-1.3.1.pom
[INFO] Downloaded from central: https://repo.maven.apache.org/maven2/commons-cli/commons-cli/1.3.1/commons-cli-1.3.1.pom (10 kB at 416 kB/s)
[INFO] Downloading from central: https://repo.maven.apache.org/maven2/com/google/guava/guava/19.0/guava-19.0.pom
[INFO] Downloaded from central: https://repo.maven.apache.org/maven2/com/google/guava/guava/19.0/guava-19.0.pom (6.8 kB at 252 kB/s)
[INFO] Downloading from central: https://repo.maven.apache.org/maven2/com/google/guava/guava-parent/19.0/guava-parent-19.0.pom
[INFO] Downloaded from central: https://repo.maven.apache.org/maven2/com/google/guava/guava-parent/19.0/guava-parent-19.0.pom (9.9 kB at 366 kB/s)
[INFO] Downloading from central: https://repo.maven.apache.org/maven2/org/sonatype/oss/oss-parent/7/oss-parent-7.pom
[INFO] Downloaded from central: https://repo.maven.apache.org/maven2/org/sonatype/oss/oss-parent/7/oss-parent-7.pom (4.8 kB at 186 kB/s)
[INFO] Downloading from central: https://repo.maven.apache.org/maven2/org/apache/maven/shared/maven-shared-resources/2/maven-shared-resources-2.jar
[INFO] Downloading from central: https://repo.maven.apache.org/maven2/org/apache/maven/doxia/doxia-integration-tools/1.6/doxia-integration-tools-1.6.jar
[INFO] Downloading from central: https://repo.maven.apache.org/maven2/commons-logging/commons-logging/1.0.4/commons-logging-1.0.4.jar
[INFO] Downloading from central: https://repo.maven.apache.org/maven2/commons-digester/commons-digester/1.6/commons-digester-1.6.jar
[INFO] Downloading from central: https://repo.maven.apache.org/maven2/org/apache/maven/doxia/doxia-core/1.2/doxia-core-1.2.jar
[INFO] Downloaded from central: https://repo.maven.apache.org/maven2/commons-logging/commons-logging/1.0.4/commons-logging-1.0.4.jar (38 kB at 1.5 MB/s)
[INFO] Downloading from central: https://repo.maven.apache.org/maven2/commons-io/commons-io/1.4/commons-io-1.4.jar
[INFO] Downloaded from central: https://repo.maven.apache.org/maven2/org/apache/maven/shared/maven-shared-resources/2/maven-shared-resources-2.jar (13 kB at 218 kB/s)
[INFO] Downloading from central: https://repo.maven.apache.org/maven2/org/codehaus/plexus/plexus-resources/1.1.0/plexus-resources-1.1.0.jar
[INFO] Downloaded from central: https://repo.maven.apache.org/maven2/org/codehaus/plexus/plexus-resources/1.1.0/plexus-resources-1.1.0.jar (23 kB at 87 kB/s)
[INFO] Downloading from central: https://repo.maven.apache.org/maven2/com/puppycrawl/tools/checkstyle/6.18/checkstyle-6.18.jar
[INFO] Downloaded from central: https://repo.maven.apache.org/maven2/org/apache/maven/doxia/doxia-integration-tools/1.6/doxia-integration-tools-1.6.jar (45 kB at 159 kB/s)
[INFO] Downloading from central: https://repo.maven.apache.org/maven2/antlr/antlr/2.7.7/antlr-2.7.7.jar
[INFO] Downloaded from central: https://repo.maven.apache.org/maven2/commons-digester/commons-digester/1.6/commons-digester-1.6.jar (168 kB at 550 kB/s)
[INFO] Downloading from central: https://repo.maven.apache.org/maven2/org/antlr/antlr4-runtime/4.5.3/antlr4-runtime-4.5.3.jar
[INFO] Downloaded from central: https://repo.maven.apache.org/maven2/commons-io/commons-io/1.4/commons-io-1.4.jar (109 kB at 355 kB/s)
[INFO] Downloading from central: https://repo.maven.apache.org/maven2/commons-beanutils/commons-beanutils/1.9.2/commons-beanutils-1.9.2.jar
[INFO] Downloaded from central: https://repo.maven.apache.org/maven2/antlr/antlr/2.7.7/antlr-2.7.7.jar (445 kB at 1.4 MB/s)
[INFO] Downloading from central: https://repo.maven.apache.org/maven2/commons-cli/commons-cli/1.3.1/commons-cli-1.3.1.jar
[INFO] Downloaded from central: https://repo.maven.apache.org/maven2/com/puppycrawl/tools/checkstyle/6.18/checkstyle-6.18.jar (1.2 MB at 3.3 MB/s)
[INFO] Downloading from central: https://repo.maven.apache.org/maven2/com/google/guava/guava/19.0/guava-19.0.jar
[INFO] Downloaded from central: https://repo.maven.apache.org/maven2/org/apache/maven/doxia/doxia-core/1.2/doxia-core-1.2.jar (154 kB at 373 kB/s)
[INFO] Downloading from central: https://repo.maven.apache.org/maven2/commons-lang/commons-lang/2.1/commons-lang-2.1.jar
[INFO] Downloaded from central: https://repo.maven.apache.org/maven2/commons-cli/commons-cli/1.3.1/commons-cli-1.3.1.jar (53 kB at 122 kB/s)
[INFO] Downloaded from central: https://repo.maven.apache.org/maven2/commons-lang/commons-lang/2.1/commons-lang-2.1.jar (208 kB at 466 kB/s)
[INFO] Downloaded from central: https://repo.maven.apache.org/maven2/com/google/guava/guava/19.0/guava-19.0.jar (2.3 MB at 5.1 MB/s)
[INFO] Downloaded from central: https://repo.maven.apache.org/maven2/commons-beanutils/commons-beanutils/1.9.2/commons-beanutils-1.9.2.jar (234 kB at 290 kB/s)
[INFO] Downloaded from central: https://repo.maven.apache.org/maven2/org/antlr/antlr4-runtime/4.5.3/antlr4-runtime-4.5.3.jar (302 kB at 345 kB/s)
[INFO] There are 3 errors reported by Checkstyle 6.18 with config/maven_checks.xml ruleset.
[INFO] Ignored 3 errors, 0 violation remaining.
[INFO]
[INFO] --- maven-invoker-plugin:3.1.0:verify (integration-test) @ maven-ear-plugin ---
[INFO] -------------------------------------------------
[INFO] Build Summary:
[INFO]   Passed: 17, Failed: 0, Errors: 0, Skipped: 0
[INFO] -------------------------------------------------
[INFO]
[INFO] --- maven-failsafe-plugin:2.22.1:verify (default) @ maven-ear-plugin ---
[ERROR] There are test failures.

Please refer to f:\jenkins\jenkins-slave\workspace\en-box_maven-ear-plugin_MEAR-276\m\target\failsafe-reports for the individual test results.
Please refer to dump files (if any exist) [date].dump, [date]-jvmRun[N].dump and [date].dumpstream.
[INFO] ------------------------------------------------------------------------
[INFO] BUILD SUCCESS
[INFO] ------------------------------------------------------------------------
[INFO] Total time:  09:51 min
[INFO] Finished at: 2019-09-22T18:51:15-07:00
[INFO] ------------------------------------------------------------------------
[INFO] [jenkins-event-spy] Generated F:\jenkins\jenkins-slave\workspace\en-box_maven-ear-plugin_MEAR-276@tmp\withMavenfb9a508b\maven-spy-20190922-184122-7916880827928607854427.log
Picked up JAVA_TOOL_OPTIONS: -Dmaven.ext.class.path="f:\jenkins\jenkins-slave\workspace\en-box_maven-ear-plugin_MEAR-276@tmp\withMavenfb9a508b\pipeline-maven-spy.jar" -Dorg.jenkinsci.plugins.pipeline.maven.reportsFolder="f:\jenkins\jenkins-slave\workspace\en-box_maven-ear-plugin_MEAR-276@tmp\withMavenfb9a508b"
[Pipeline] }
[Pipeline] // dir
[Pipeline] }
[withMaven] invokerPublisher - Archive invoker results for Maven artifact MavenArtifact{org.apache.maven.plugins:maven-ear-plugin:maven-plugin:3.0.2-SNAPSHOT(version: 3.0.2-SNAPSHOT, snapshot:false) } generated by PluginInvocation{org.apache.maven.plugins:maven-invoker-plugin:3.1.0@integration-test  integration-test}: m\target\invoker-reports\*.xml
[withMaven] junitPublisher - Archive test results for Maven artifact org.apache.maven.plugins:maven-ear-plugin:maven-plugin:3.0.2-SNAPSHOT generated by maven-surefire-plugin:test (default-test): m\target\surefire-reports\*.xml
Recording test results
[withMaven] junitPublisher - Archive test results for Maven artifact org.apache.maven.plugins:maven-ear-plugin:maven-plugin:3.0.2-SNAPSHOT generated by maven-failsafe-plugin:integration-test (default): m\target\failsafe-reports\*.xml
Recording test results
[withMaven] Publishers: Pipeline Graph Publisher: 1 ms, Invoker Publisher: 5489 ms, Junit Publisher: 275 ms
[Pipeline] // withMaven
[Pipeline] cleanWs
[WS-CLEANUP] Deleting project workspace...
[WS-CLEANUP] Deferred wipeout is used...
[WS-CLEANUP] done
[Pipeline] }
[Pipeline] // stage
[Pipeline] }
[Pipeline] // node
[Pipeline] }
[Pipeline] // parallel
[Pipeline] echo
[FAILURE-003] AbortException hudson.AbortException: script returned exit code 1
[Pipeline] stage
[Pipeline] { (Notifications)
[Pipeline] echo
Build result: FAILURE
[Pipeline] jiraIssueSelector
[Pipeline] echo
The authors of changes [rfscholte].
[Pipeline] echo
Sending email ...
[Pipeline] emailext
Reply | Threaded
Open this post in threaded view
|

Build failed in Jenkins: Maven TLP » maven-ear-plugin » MEAR-276 #13

Apache Jenkins Server-2
See https://builds.apache.org/job/maven-box/job/maven-ear-plugin/job/MEAR-276/13/

Changes:

* Apply Maven 3.6.2
* H29 has checkout issues...
* Issues with H28 too
* Seems like Maven 3.6.2 is not available on all Linux nodes yet
* Java 13 released: drop 12 + include 14 (-ea)

10 tests failed.
FAILED:  org.apache.maven.plugins.ear.it.EarMojoIT.linux-jdk8 / Build linux-jdk8 / testProject016

Error Message:
There are differences in the manifest.

Stack Trace:
junit.framework.AssertionFailedError: There are differences in the manifest.
        at org.apache.maven.plugins.ear.it.EarMojoIT.testProject016(EarMojoIT.java:217)


FAILED:  org.apache.maven.plugins.ear.it.EarMojoIT.linux-jdk11 / Build linux-jdk11 / testProject016

Error Message:
There are differences in the manifest.

Stack Trace:
junit.framework.AssertionFailedError: There are differences in the manifest.
        at org.apache.maven.plugins.ear.it.EarMojoIT.testProject016(EarMojoIT.java:217)


FAILED:  org.apache.maven.plugins.ear.it.EarMojoIT.linux-jdk14 / Build linux-jdk14 / testProject016

Error Message:
There are differences in the manifest.

Stack Trace:
junit.framework.AssertionFailedError: There are differences in the manifest.
        at org.apache.maven.plugins.ear.it.EarMojoIT.testProject016(EarMojoIT.java:217)


FAILED:  org.apache.maven.plugins.ear.it.EarMojoIT.linux-jdk13 / Build linux-jdk13 / testProject016

Error Message:
There are differences in the manifest.

Stack Trace:
junit.framework.AssertionFailedError: There are differences in the manifest.
        at org.apache.maven.plugins.ear.it.EarMojoIT.testProject016(EarMojoIT.java:217)


FAILED:  org.apache.maven.plugins.ear.it.EarMojoIT.linux-jdk7 / Build linux-jdk7 / testProject016

Error Message:
There are differences in the manifest.

Stack Trace:
junit.framework.AssertionFailedError: There are differences in the manifest.
        at org.apache.maven.plugins.ear.it.EarMojoIT.testProject016(EarMojoIT.java:217)


FAILED:  org.apache.maven.plugins.ear.it.EarMojoIT.windows-jdk8 / Build windows-jdk8 / testProject016

Error Message:
There are differences in the manifest.

Stack Trace:
junit.framework.AssertionFailedError: There are differences in the manifest.
        at org.apache.maven.plugins.ear.it.EarMojoIT.testProject016(EarMojoIT.java:217)


FAILED:  org.apache.maven.plugins.ear.it.EarMojoIT.windows-jdk13 / Build windows-jdk13 / testProject016

Error Message:
There are differences in the manifest.

Stack Trace:
junit.framework.AssertionFailedError: There are differences in the manifest.
        at org.apache.maven.plugins.ear.it.EarMojoIT.testProject016(EarMojoIT.java:217)


FAILED:  org.apache.maven.plugins.ear.it.EarMojoIT.windows-jdk11 / Build windows-jdk11 / testProject016

Error Message:
There are differences in the manifest.

Stack Trace:
junit.framework.AssertionFailedError: There are differences in the manifest.
        at org.apache.maven.plugins.ear.it.EarMojoIT.testProject016(EarMojoIT.java:217)


FAILED:  org.apache.maven.plugins.ear.it.EarMojoIT.windows-jdk7 / Build windows-jdk7 / testProject016

Error Message:
There are differences in the manifest.

Stack Trace:
junit.framework.AssertionFailedError: There are differences in the manifest.
        at org.apache.maven.plugins.ear.it.EarMojoIT.testProject016(EarMojoIT.java:217)


FAILED:  org.apache.maven.plugins.ear.it.EarMojoIT.windows-jdk14 / Build windows-jdk14 / testProject016

Error Message:
There are differences in the manifest.

Stack Trace:
junit.framework.AssertionFailedError: There are differences in the manifest.
        at org.apache.maven.plugins.ear.it.EarMojoIT.testProject016(EarMojoIT.java:217)




Build log:
[...truncated 180513 lines...]
[INFO] [INFO] ------------------------------------------------------------------------
[INFO] [INFO] Total time:  1.494 s
[INFO] [INFO] Finished at: 2019-10-01T10:53:41-07:00
[INFO] [INFO] ------------------------------------------------------------------------
[INFO] run post-build script verify.bsh
[INFO] Running post-build script: f:\jenkins\jenkins-slave\workspace\en-box_maven-ear-plugin_MEAR-276@2\m\target\it\transitive-excludes\verify.bsh
[INFO] Finished post-build script: f:\jenkins\jenkins-slave\workspace\en-box_maven-ear-plugin_MEAR-276@2\m\target\it\transitive-excludes\verify.bsh
[INFO]           transitive-excludes\pom.xml ...................... SUCCESS (4.0 s)
[INFO]
[INFO] --- maven-failsafe-plugin:2.22.1:integration-test (default) @ maven-ear-plugin ---
[INFO]
[INFO] -------------------------------------------------------
[INFO]  T E S T S
[INFO] -------------------------------------------------------
[INFO] Running org.apache.maven.plugins.ear.it.EarMojoIT
  Building: project-001
  Building: project-002
  Building: project-003
  Building: project-004
  Building: project-005
  Building: project-006
  Building: project-007
  Building: project-008
  Building: project-009
  Building: project-010
  Building: project-011
  Building: project-012
  Building: project-013
  Building: project-014
  Building: project-015
  Building: project-016
  Building: project-017
  Building: project-018
  Building: project-019
  Building: project-020
  Building: project-021
  Building: project-022
  Building: project-023
  Building: project-024
  Building: project-025
  Building: project-026
  Building: project-027
  Building: project-028
  Building: project-029
  Building: project-030
  Building: project-031
  Building: project-032
  Building: project-033
  Building: project-034
  Building: project-035
  Building: project-036
  Building: project-037
  Building: project-038
  Building: project-039
  Building: project-040
  Building: project-041
  Building: project-042
  Building: project-043
  Building: project-044
  Building: project-045
  Building: project-046
  Building: project-047
  Building: project-048
  Building: project-049
  Building: project-050
  Building: project-051
  Building: project-052
  Building: project-053
  Building: project-054
  Building: project-055
  Building: project-056
  Building: project-057
  Building: project-058
  Building: project-059
  Building: project-060
  Building: project-061
  Building: project-062
  Building: project-063
  Building: project-064
  Building: project-065
  Building: project-066
  Building: project-067
  Building: project-068
  Building: project-069
  Building: project-070
  Building: project-071
  Building: project-072
  Building: project-073
  Building: project-074
  Building: project-075
  Building: project-076
  Building: project-077
  Building: project-078
  Building: project-079
  Building: project-080
  Building: project-081
  Building: project-082
  Building: project-083
  Building: project-084
  Building: project-085
  Building: project-086
  Building: project-087
[ERROR] Tests run: 87, Failures: 1, Errors: 0, Skipped: 0, Time elapsed: 343.312 s <<< FAILURE! - in org.apache.maven.plugins.ear.it.EarMojoIT
[ERROR] testProject016(org.apache.maven.plugins.ear.it.EarMojoIT)  Time elapsed: 3.278 s  <<< FAILURE!
junit.framework.AssertionFailedError: There are differences in the manifest.
        at org.apache.maven.plugins.ear.it.EarMojoIT.testProject016(EarMojoIT.java:217)

[INFO]
[INFO] Results:
[INFO]
[ERROR] Failures:
[ERROR]   EarMojoIT.testProject016:217 There are differences in the manifest.
[INFO]
[ERROR] Tests run: 87, Failures: 1, Errors: 0, Skipped: 0
[INFO]
[INFO]
[INFO] --- maven-checkstyle-plugin:3.0.0:check (checkstyle-check) @ maven-ear-plugin ---
[INFO] Downloading from central: https://repo.maven.apache.org/maven2/org/apache/maven/shared/maven-shared-resources/2/maven-shared-resources-2.pom
[INFO] Downloaded from central: https://repo.maven.apache.org/maven2/org/apache/maven/shared/maven-shared-resources/2/maven-shared-resources-2.pom (3.0 kB at 35 kB/s)
[INFO] Downloading from central: https://repo.maven.apache.org/maven2/org/codehaus/plexus/plexus-utils/3.0.10/plexus-utils-3.0.10.pom
[INFO] Downloaded from central: https://repo.maven.apache.org/maven2/org/codehaus/plexus/plexus-utils/3.0.10/plexus-utils-3.0.10.pom (3.1 kB at 73 kB/s)
[INFO] Downloading from central: https://repo.maven.apache.org/maven2/org/codehaus/plexus/plexus/3.3/plexus-3.3.pom
[INFO] Downloaded from central: https://repo.maven.apache.org/maven2/org/codehaus/plexus/plexus/3.3/plexus-3.3.pom (20 kB at 498 kB/s)
[INFO] Downloading from central: https://repo.maven.apache.org/maven2/org/apache/maven/doxia/doxia-integration-tools/1.6/doxia-integration-tools-1.6.pom
[INFO] Downloaded from central: https://repo.maven.apache.org/maven2/org/apache/maven/doxia/doxia-integration-tools/1.6/doxia-integration-tools-1.6.pom (7.0 kB at 193 kB/s)
[INFO] Downloading from central: https://repo.maven.apache.org/maven2/org/apache/maven/doxia/doxia-tools/3/doxia-tools-3.pom
[INFO] Downloaded from central: https://repo.maven.apache.org/maven2/org/apache/maven/doxia/doxia-tools/3/doxia-tools-3.pom (9.9 kB at 276 kB/s)
[INFO] Downloading from central: https://repo.maven.apache.org/maven2/org/codehaus/plexus/plexus-resources/1.1.0/plexus-resources-1.1.0.pom
[INFO] Downloaded from central: https://repo.maven.apache.org/maven2/org/codehaus/plexus/plexus-resources/1.1.0/plexus-resources-1.1.0.pom (3.2 kB at 84 kB/s)
[INFO] Downloading from central: https://repo.maven.apache.org/maven2/com/puppycrawl/tools/checkstyle/6.18/checkstyle-6.18.pom
[INFO] Downloaded from central: https://repo.maven.apache.org/maven2/com/puppycrawl/tools/checkstyle/6.18/checkstyle-6.18.pom (71 kB at 1.5 MB/s)
[INFO] Downloading from central: https://repo.maven.apache.org/maven2/antlr/antlr/2.7.7/antlr-2.7.7.pom
[INFO] Downloaded from central: https://repo.maven.apache.org/maven2/antlr/antlr/2.7.7/antlr-2.7.7.pom (632 B at 16 kB/s)
[INFO] Downloading from central: https://repo.maven.apache.org/maven2/org/antlr/antlr4-runtime/4.5.3/antlr4-runtime-4.5.3.pom
[INFO] Downloaded from central: https://repo.maven.apache.org/maven2/org/antlr/antlr4-runtime/4.5.3/antlr4-runtime-4.5.3.pom (2.3 kB at 37 kB/s)
[INFO] Downloading from central: https://repo.maven.apache.org/maven2/org/antlr/antlr4-master/4.5.3/antlr4-master-4.5.3.pom
[INFO] Downloaded from central: https://repo.maven.apache.org/maven2/org/antlr/antlr4-master/4.5.3/antlr4-master-4.5.3.pom (3.7 kB at 86 kB/s)
[INFO] Downloading from central: https://repo.maven.apache.org/maven2/commons-beanutils/commons-beanutils/1.9.2/commons-beanutils-1.9.2.pom
[INFO] Downloaded from central: https://repo.maven.apache.org/maven2/commons-beanutils/commons-beanutils/1.9.2/commons-beanutils-1.9.2.pom (14 kB at 376 kB/s)
[INFO] Downloading from central: https://repo.maven.apache.org/maven2/org/apache/commons/commons-parent/33/commons-parent-33.pom
[INFO] Downloaded from central: https://repo.maven.apache.org/maven2/org/apache/commons/commons-parent/33/commons-parent-33.pom (53 kB at 915 kB/s)
[INFO] Downloading from central: https://repo.maven.apache.org/maven2/commons-cli/commons-cli/1.3.1/commons-cli-1.3.1.pom
[INFO] Downloaded from central: https://repo.maven.apache.org/maven2/commons-cli/commons-cli/1.3.1/commons-cli-1.3.1.pom (10 kB at 266 kB/s)
[INFO] Downloading from central: https://repo.maven.apache.org/maven2/com/google/guava/guava/19.0/guava-19.0.pom
[INFO] Downloaded from central: https://repo.maven.apache.org/maven2/com/google/guava/guava/19.0/guava-19.0.pom (6.8 kB at 194 kB/s)
[INFO] Downloading from central: https://repo.maven.apache.org/maven2/com/google/guava/guava-parent/19.0/guava-parent-19.0.pom
[INFO] Downloaded from central: https://repo.maven.apache.org/maven2/com/google/guava/guava-parent/19.0/guava-parent-19.0.pom (9.9 kB at 341 kB/s)
[INFO] Downloading from central: https://repo.maven.apache.org/maven2/org/sonatype/oss/oss-parent/7/oss-parent-7.pom
[INFO] Downloaded from central: https://repo.maven.apache.org/maven2/org/sonatype/oss/oss-parent/7/oss-parent-7.pom (4.8 kB at 179 kB/s)
[INFO] Downloading from central: https://repo.maven.apache.org/maven2/javax/xml/bind/jaxb-api/2.3.0/jaxb-api-2.3.0.pom
[INFO] Downloaded from central: https://repo.maven.apache.org/maven2/javax/xml/bind/jaxb-api/2.3.0/jaxb-api-2.3.0.pom (23 kB at 718 kB/s)
[INFO] Downloading from central: https://repo.maven.apache.org/maven2/javax/xml/bind/jaxb-api-parent/2.3.0/jaxb-api-parent-2.3.0.pom
[INFO] Downloaded from central: https://repo.maven.apache.org/maven2/javax/xml/bind/jaxb-api-parent/2.3.0/jaxb-api-parent-2.3.0.pom (5.6 kB at 176 kB/s)
[INFO] Downloading from central: https://repo.maven.apache.org/maven2/net/java/jvnet-parent/5/jvnet-parent-5.pom
[INFO] Downloaded from central: https://repo.maven.apache.org/maven2/net/java/jvnet-parent/5/jvnet-parent-5.pom (8.9 kB at 222 kB/s)
[INFO] Downloading from central: https://repo.maven.apache.org/maven2/org/apache/maven/shared/maven-shared-resources/2/maven-shared-resources-2.jar
[INFO] Downloading from central: https://repo.maven.apache.org/maven2/org/apache/maven/doxia/doxia-integration-tools/1.6/doxia-integration-tools-1.6.jar
[INFO] Downloading from central: https://repo.maven.apache.org/maven2/commons-logging/commons-logging/1.0.4/commons-logging-1.0.4.jar
[INFO] Downloading from central: https://repo.maven.apache.org/maven2/commons-digester/commons-digester/1.6/commons-digester-1.6.jar
[INFO] Downloading from central: https://repo.maven.apache.org/maven2/org/apache/maven/doxia/doxia-core/1.2/doxia-core-1.2.jar
[INFO] Downloaded from central: https://repo.maven.apache.org/maven2/commons-logging/commons-logging/1.0.4/commons-logging-1.0.4.jar (38 kB at 717 kB/s)
[INFO] Downloading from central: https://repo.maven.apache.org/maven2/commons-io/commons-io/1.4/commons-io-1.4.jar
[INFO] Downloaded from central: https://repo.maven.apache.org/maven2/org/apache/maven/shared/maven-shared-resources/2/maven-shared-resources-2.jar (13 kB at 119 kB/s)
[INFO] Downloading from central: https://repo.maven.apache.org/maven2/org/codehaus/plexus/plexus-resources/1.1.0/plexus-resources-1.1.0.jar
[INFO] Downloaded from central: https://repo.maven.apache.org/maven2/commons-io/commons-io/1.4/commons-io-1.4.jar (109 kB at 300 kB/s)
[INFO] Downloading from central: https://repo.maven.apache.org/maven2/com/puppycrawl/tools/checkstyle/6.18/checkstyle-6.18.jar
[INFO] Downloaded from central: https://repo.maven.apache.org/maven2/org/codehaus/plexus/plexus-resources/1.1.0/plexus-resources-1.1.0.jar (23 kB at 61 kB/s)
[INFO] Downloading from central: https://repo.maven.apache.org/maven2/antlr/antlr/2.7.7/antlr-2.7.7.jar
[INFO] Downloaded from central: https://repo.maven.apache.org/maven2/commons-digester/commons-digester/1.6/commons-digester-1.6.jar (168 kB at 388 kB/s)
[INFO] Downloading from central: https://repo.maven.apache.org/maven2/org/antlr/antlr4-runtime/4.5.3/antlr4-runtime-4.5.3.jar
[INFO] Downloaded from central: https://repo.maven.apache.org/maven2/org/apache/maven/doxia/doxia-integration-tools/1.6/doxia-integration-tools-1.6.jar (45 kB at 64 kB/s)
[INFO] Downloading from central: https://repo.maven.apache.org/maven2/commons-beanutils/commons-beanutils/1.9.2/commons-beanutils-1.9.2.jar
[INFO] Downloaded from central: https://repo.maven.apache.org/maven2/antlr/antlr/2.7.7/antlr-2.7.7.jar (445 kB at 619 kB/s)
[INFO] Downloading from central: https://repo.maven.apache.org/maven2/commons-cli/commons-cli/1.3.1/commons-cli-1.3.1.jar
[INFO] Downloaded from central: https://repo.maven.apache.org/maven2/com/puppycrawl/tools/checkstyle/6.18/checkstyle-6.18.jar (1.2 MB at 1.6 MB/s)
[INFO] Downloaded from central: https://repo.maven.apache.org/maven2/org/apache/maven/doxia/doxia-core/1.2/doxia-core-1.2.jar (154 kB at 206 kB/s)
[INFO] Downloading from central: https://repo.maven.apache.org/maven2/com/google/guava/guava/19.0/guava-19.0.jar
[INFO] Downloading from central: https://repo.maven.apache.org/maven2/commons-lang/commons-lang/2.1/commons-lang-2.1.jar
[INFO] Downloaded from central: https://repo.maven.apache.org/maven2/commons-lang/commons-lang/2.1/commons-lang-2.1.jar (208 kB at 257 kB/s)
[INFO] Downloading from central: https://repo.maven.apache.org/maven2/javax/xml/bind/jaxb-api/2.3.0/jaxb-api-2.3.0.jar
[INFO] Downloaded from central: https://repo.maven.apache.org/maven2/commons-cli/commons-cli/1.3.1/commons-cli-1.3.1.jar (53 kB at 60 kB/s)
[INFO] Downloaded from central: https://repo.maven.apache.org/maven2/com/google/guava/guava/19.0/guava-19.0.jar (2.3 MB at 2.6 MB/s)
[INFO] Downloaded from central: https://repo.maven.apache.org/maven2/javax/xml/bind/jaxb-api/2.3.0/jaxb-api-2.3.0.jar (126 kB at 122 kB/s)
[INFO] Downloaded from central: https://repo.maven.apache.org/maven2/commons-beanutils/commons-beanutils/1.9.2/commons-beanutils-1.9.2.jar (234 kB at 190 kB/s)
[INFO] Downloaded from central: https://repo.maven.apache.org/maven2/org/antlr/antlr4-runtime/4.5.3/antlr4-runtime-4.5.3.jar (302 kB at 234 kB/s)
[INFO] There are 3 errors reported by Checkstyle 6.18 with config/maven_checks.xml ruleset.
[INFO] Ignored 3 errors, 0 violation remaining.
[INFO]
[INFO] --- maven-invoker-plugin:3.1.0:verify (integration-test) @ maven-ear-plugin ---
[INFO] -------------------------------------------------
[INFO] Build Summary:
[INFO]   Passed: 16, Failed: 1, Errors: 0, Skipped: 0
[INFO] -------------------------------------------------
[ERROR] The following builds failed:
[ERROR] *  same-artifactId\pom.xml
[INFO] -------------------------------------------------
[INFO] ------------------------------------------------------------------------
[INFO] BUILD FAILURE
[INFO] ------------------------------------------------------------------------
[INFO] Total time:  09:22 min
[INFO] Finished at: 2019-10-01T10:59:32-07:00
[INFO] ------------------------------------------------------------------------
[INFO] [jenkins-event-spy] Generated F:\jenkins\jenkins-slave\workspace\en-box_maven-ear-plugin_MEAR-276@2@tmp\withMavenafc8f61f\maven-spy-20191001-105009-49714159378334419516226.log
[ERROR] Failed to execute goal org.apache.maven.plugins:maven-invoker-plugin:3.1.0:verify (integration-test) on project maven-ear-plugin: 1 build failed. See console output above for details. -> [Help 1]
[ERROR]
[ERROR] To see the full stack trace of the errors, re-run Maven with the -e switch.
[ERROR] Re-run Maven using the -X switch to enable full debug logging.
[ERROR]
[ERROR] For more information about the errors and possible solutions, please read the following articles:
[ERROR] [Help 1] http://cwiki.apache.org/confluence/display/MAVEN/MojoFailureException
[Pipeline] }
[Pipeline] // dir
[Pipeline] }
[withMaven] invokerPublisher - Archive invoker results for Maven artifact MavenArtifact{org.apache.maven.plugins:maven-ear-plugin:maven-plugin:3.0.2-SNAPSHOT(version: 3.0.2-SNAPSHOT, snapshot:false) } generated by PluginInvocation{org.apache.maven.plugins:maven-invoker-plugin:3.1.0@integration-test  integration-test}: m\target\invoker-reports\*.xml
[withMaven] junitPublisher - Archive test results for Maven artifact org.apache.maven.plugins:maven-ear-plugin:maven-plugin:3.0.2-SNAPSHOT generated by maven-surefire-plugin:test (default-test): m\target\surefire-reports\*.xml
Recording test results
[withMaven] junitPublisher - Archive test results for Maven artifact org.apache.maven.plugins:maven-ear-plugin:maven-plugin:3.0.2-SNAPSHOT generated by maven-failsafe-plugin:integration-test (default): m\target\failsafe-reports\*.xml
Recording test results
[withMaven] Publishers: Invoker Publisher: 8033 ms, Junit Publisher: 294 ms
[Pipeline] // withMaven
[Pipeline] echo
[FAILURE-004] hudson.AbortException: script returned exit code 1
[Pipeline] cleanWs
[WS-CLEANUP] Deleting project workspace...
[WS-CLEANUP] Deferred wipeout is used...
[WS-CLEANUP] done
[Pipeline] cleanWs
[WS-CLEANUP] Deleting project workspace...
[WS-CLEANUP] Deferred wipeout is used...
[WS-CLEANUP] done
[Pipeline] }
[Pipeline] // stage
[Pipeline] }
[Pipeline] // node
[Pipeline] }
Failed in branch windows-jdk14
[Pipeline] // parallel
[Pipeline] echo
[FAILURE-003] AbortException hudson.AbortException: script returned exit code 1
[Pipeline] stage
[Pipeline] { (Notifications)
[Pipeline] echo
Build result: FAILURE
[Pipeline] jiraIssueSelector
[Pipeline] echo
The authors of changes [rfscholte].
[Pipeline] echo
Sending email ...
[Pipeline] emailext
Reply | Threaded
Open this post in threaded view
|

Build failed in Jenkins: Maven TLP » maven-ear-plugin » MEAR-276 #14

Apache Jenkins Server-2
See https://builds.apache.org/job/maven-box/job/maven-ear-plugin/job/MEAR-276/14/

No changes.

10 tests failed.
FAILED:  org.apache.maven.plugins.ear.it.EarMojoIT.windows-jdk8 / Build windows-jdk8 / testProject016

Error Message:
There are differences in the manifest.

Stack Trace:
junit.framework.AssertionFailedError: There are differences in the manifest.
        at org.apache.maven.plugins.ear.it.EarMojoIT.testProject016(EarMojoIT.java:217)


FAILED:  org.apache.maven.plugins.ear.it.EarMojoIT.windows-jdk7 / Build windows-jdk7 / testProject016

Error Message:
There are differences in the manifest.

Stack Trace:
junit.framework.AssertionFailedError: There are differences in the manifest.
        at org.apache.maven.plugins.ear.it.EarMojoIT.testProject016(EarMojoIT.java:217)


FAILED:  org.apache.maven.plugins.ear.it.EarMojoIT.windows-jdk14 / Build windows-jdk14 / testProject016

Error Message:
There are differences in the manifest.

Stack Trace:
junit.framework.AssertionFailedError: There are differences in the manifest.
        at org.apache.maven.plugins.ear.it.EarMojoIT.testProject016(EarMojoIT.java:217)


FAILED:  org.apache.maven.plugins.ear.it.EarMojoIT.windows-jdk13 / Build windows-jdk13 / testProject016

Error Message:
There are differences in the manifest.

Stack Trace:
junit.framework.AssertionFailedError: There are differences in the manifest.
        at org.apache.maven.plugins.ear.it.EarMojoIT.testProject016(EarMojoIT.java:217)


FAILED:  org.apache.maven.plugins.ear.it.EarMojoIT.windows-jdk11 / Build windows-jdk11 / testProject016

Error Message:
There are differences in the manifest.

Stack Trace:
junit.framework.AssertionFailedError: There are differences in the manifest.
        at org.apache.maven.plugins.ear.it.EarMojoIT.testProject016(EarMojoIT.java:217)


FAILED:  org.apache.maven.plugins.ear.it.EarMojoIT.linux-jdk8 / Build linux-jdk8 / testProject016

Error Message:
There are differences in the manifest.

Stack Trace:
junit.framework.AssertionFailedError: There are differences in the manifest.
        at org.apache.maven.plugins.ear.it.EarMojoIT.testProject016(EarMojoIT.java:217)


FAILED:  org.apache.maven.plugins.ear.it.EarMojoIT.linux-jdk11 / Build linux-jdk11 / testProject016

Error Message:
There are differences in the manifest.

Stack Trace:
junit.framework.AssertionFailedError: There are differences in the manifest.
        at org.apache.maven.plugins.ear.it.EarMojoIT.testProject016(EarMojoIT.java:217)


FAILED:  org.apache.maven.plugins.ear.it.EarMojoIT.linux-jdk7 / Build linux-jdk7 / testProject016

Error Message:
There are differences in the manifest.

Stack Trace:
junit.framework.AssertionFailedError: There are differences in the manifest.
        at org.apache.maven.plugins.ear.it.EarMojoIT.testProject016(EarMojoIT.java:217)


FAILED:  org.apache.maven.plugins.ear.it.EarMojoIT.linux-jdk13 / Build linux-jdk13 / testProject016

Error Message:
There are differences in the manifest.

Stack Trace:
junit.framework.AssertionFailedError: There are differences in the manifest.
        at org.apache.maven.plugins.ear.it.EarMojoIT.testProject016(EarMojoIT.java:217)


FAILED:  org.apache.maven.plugins.ear.it.EarMojoIT.linux-jdk14 / Build linux-jdk14 / testProject016

Error Message:
There are differences in the manifest.

Stack Trace:
junit.framework.AssertionFailedError: There are differences in the manifest.
        at org.apache.maven.plugins.ear.it.EarMojoIT.testProject016(EarMojoIT.java:217)




Build log:
[...truncated 180521 lines...]
[INFO] Downloaded from central: https://repo.maven.apache.org/maven2/org/apache/commons/commons-parent/33/commons-parent-33.pom (53 kB at 3.8 MB/s)
[INFO] Downloading from central: https://repo.maven.apache.org/maven2/commons-cli/commons-cli/1.3.1/commons-cli-1.3.1.pom
[INFO] Downloaded from central: https://repo.maven.apache.org/maven2/commons-cli/commons-cli/1.3.1/commons-cli-1.3.1.pom (10 kB at 866 kB/s)
[INFO] Downloading from central: https://repo.maven.apache.org/maven2/com/google/guava/guava/19.0/guava-19.0.pom
[INFO] Downloaded from central: https://repo.maven.apache.org/maven2/com/google/guava/guava/19.0/guava-19.0.pom (6.8 kB at 566 kB/s)
[INFO] Downloading from central: https://repo.maven.apache.org/maven2/com/google/guava/guava-parent/19.0/guava-parent-19.0.pom
[INFO] Downloaded from central: https://repo.maven.apache.org/maven2/com/google/guava/guava-parent/19.0/guava-parent-19.0.pom (9.9 kB at 760 kB/s)
[INFO] Downloading from central: https://repo.maven.apache.org/maven2/org/sonatype/oss/oss-parent/7/oss-parent-7.pom
[INFO] Downloaded from central: https://repo.maven.apache.org/maven2/org/sonatype/oss/oss-parent/7/oss-parent-7.pom (4.8 kB at 402 kB/s)
[INFO] Downloading from central: https://repo.maven.apache.org/maven2/javax/xml/bind/jaxb-api/2.3.0/jaxb-api-2.3.0.pom
[INFO] Downloaded from central: https://repo.maven.apache.org/maven2/javax/xml/bind/jaxb-api/2.3.0/jaxb-api-2.3.0.pom (23 kB at 1.6 MB/s)
[INFO] Downloading from central: https://repo.maven.apache.org/maven2/javax/xml/bind/jaxb-api-parent/2.3.0/jaxb-api-parent-2.3.0.pom
[INFO] Downloaded from central: https://repo.maven.apache.org/maven2/javax/xml/bind/jaxb-api-parent/2.3.0/jaxb-api-parent-2.3.0.pom (5.6 kB at 403 kB/s)
[INFO] Downloading from central: https://repo.maven.apache.org/maven2/net/java/jvnet-parent/5/jvnet-parent-5.pom
[INFO] Downloaded from central: https://repo.maven.apache.org/maven2/net/java/jvnet-parent/5/jvnet-parent-5.pom (8.9 kB at 739 kB/s)
[INFO] Downloading from central: https://repo.maven.apache.org/maven2/org/apache/maven/shared/maven-shared-resources/2/maven-shared-resources-2.jar
[INFO] Downloading from central: https://repo.maven.apache.org/maven2/commons-digester/commons-digester/1.6/commons-digester-1.6.jar
[INFO] Downloading from central: https://repo.maven.apache.org/maven2/org/apache/maven/doxia/doxia-core/1.2/doxia-core-1.2.jar
[INFO] Downloading from central: https://repo.maven.apache.org/maven2/org/apache/maven/doxia/doxia-integration-tools/1.6/doxia-integration-tools-1.6.jar
[INFO] Downloading from central: https://repo.maven.apache.org/maven2/commons-logging/commons-logging/1.0.4/commons-logging-1.0.4.jar
[INFO] Downloaded from central: https://repo.maven.apache.org/maven2/org/apache/maven/shared/maven-shared-resources/2/maven-shared-resources-2.jar (13 kB at 870 kB/s)
[INFO] Downloading from central: https://repo.maven.apache.org/maven2/commons-io/commons-io/1.4/commons-io-1.4.jar
[INFO] Downloaded from central: https://repo.maven.apache.org/maven2/org/apache/maven/doxia/doxia-integration-tools/1.6/doxia-integration-tools-1.6.jar (45 kB at 2.8 MB/s)
[INFO] Downloading from central: https://repo.maven.apache.org/maven2/org/codehaus/plexus/plexus-resources/1.1.0/plexus-resources-1.1.0.jar
[INFO] Downloaded from central: https://repo.maven.apache.org/maven2/commons-logging/commons-logging/1.0.4/commons-logging-1.0.4.jar (38 kB at 2.4 MB/s)
[INFO] Downloading from central: https://repo.maven.apache.org/maven2/com/puppycrawl/tools/checkstyle/6.18/checkstyle-6.18.jar
[INFO] Downloaded from central: https://repo.maven.apache.org/maven2/org/apache/maven/doxia/doxia-core/1.2/doxia-core-1.2.jar (154 kB at 7.7 MB/s)
[INFO] Downloading from central: https://repo.maven.apache.org/maven2/antlr/antlr/2.7.7/antlr-2.7.7.jar
[INFO] Downloaded from central: https://repo.maven.apache.org/maven2/org/codehaus/plexus/plexus-resources/1.1.0/plexus-resources-1.1.0.jar (23 kB at 774 kB/s)
[INFO] Downloaded from central: https://repo.maven.apache.org/maven2/commons-io/commons-io/1.4/commons-io-1.4.jar (109 kB at 3.6 MB/s)
[INFO] Downloading from central: https://repo.maven.apache.org/maven2/org/antlr/antlr4-runtime/4.5.3/antlr4-runtime-4.5.3.jar
[INFO] Downloading from central: https://repo.maven.apache.org/maven2/commons-beanutils/commons-beanutils/1.9.2/commons-beanutils-1.9.2.jar
[INFO] Downloaded from central: https://repo.maven.apache.org/maven2/antlr/antlr/2.7.7/antlr-2.7.7.jar (445 kB at 9.5 MB/s)
[INFO] Downloading from central: https://repo.maven.apache.org/maven2/commons-cli/commons-cli/1.3.1/commons-cli-1.3.1.jar
[INFO] Downloaded from central: https://repo.maven.apache.org/maven2/commons-beanutils/commons-beanutils/1.9.2/commons-beanutils-1.9.2.jar (234 kB at 4.5 MB/s)
[INFO] Downloaded from central: https://repo.maven.apache.org/maven2/org/antlr/antlr4-runtime/4.5.3/antlr4-runtime-4.5.3.jar (302 kB at 5.7 MB/s)
[INFO] Downloading from central: https://repo.maven.apache.org/maven2/commons-lang/commons-lang/2.1/commons-lang-2.1.jar
[INFO] Downloading from central: https://repo.maven.apache.org/maven2/com/google/guava/guava/19.0/guava-19.0.jar
[INFO] Downloaded from central: https://repo.maven.apache.org/maven2/commons-cli/commons-cli/1.3.1/commons-cli-1.3.1.jar (53 kB at 883 kB/s)
[INFO] Downloading from central: https://repo.maven.apache.org/maven2/javax/xml/bind/jaxb-api/2.3.0/jaxb-api-2.3.0.jar
[INFO] Downloaded from central: https://repo.maven.apache.org/maven2/com/puppycrawl/tools/checkstyle/6.18/checkstyle-6.18.jar (1.2 MB at 19 MB/s)
[INFO] Downloaded from central: https://repo.maven.apache.org/maven2/commons-lang/commons-lang/2.1/commons-lang-2.1.jar (208 kB at 2.9 MB/s)
[INFO] Downloaded from central: https://repo.maven.apache.org/maven2/javax/xml/bind/jaxb-api/2.3.0/jaxb-api-2.3.0.jar (126 kB at 1.7 MB/s)
[INFO] Downloaded from central: https://repo.maven.apache.org/maven2/com/google/guava/guava/19.0/guava-19.0.jar (2.3 MB at 20 MB/s)
[INFO] Downloaded from central: https://repo.maven.apache.org/maven2/commons-digester/commons-digester/1.6/commons-digester-1.6.jar (168 kB at 1.2 MB/s)
  Building: project-082
[INFO] There are 3 errors reported by Checkstyle 6.18 with config/maven_checks.xml ruleset.
[INFO] Ignored 3 errors, 0 violation remaining.
[INFO]
[INFO] --- maven-invoker-plugin:3.1.0:verify (integration-test) @ maven-ear-plugin ---
[INFO] -------------------------------------------------
[INFO] Build Summary:
[INFO]   Passed: 16, Failed: 1, Errors: 0, Skipped: 0
[INFO] -------------------------------------------------
[ERROR] The following builds failed:
[ERROR] *  same-artifactId/pom.xml
[INFO] -------------------------------------------------
[INFO] ------------------------------------------------------------------------
[INFO] BUILD FAILURE
[INFO] ------------------------------------------------------------------------
[INFO] Total time:  06:05 min
[INFO] Finished at: 2019-10-03T19:05:05Z
[INFO] ------------------------------------------------------------------------
[INFO] [jenkins-event-spy] Generated /home/jenkins/jenkins-slave/workspace/en-box_maven-ear-plugin_MEAR-276@tmp/withMaven1bc74642/maven-spy-20191003-185859-8352987972671964147560.log
[ERROR] Failed to execute goal org.apache.maven.plugins:maven-invoker-plugin:3.1.0:verify (integration-test) on project maven-ear-plugin: 1 build failed. See console output above for details. -> [Help 1]
[ERROR]
[ERROR] To see the full stack trace of the errors, re-run Maven with the -e switch.
[ERROR] Re-run Maven using the -X switch to enable full debug logging.
[ERROR]
[ERROR] For more information about the errors and possible solutions, please read the following articles:
[ERROR] [Help 1] http://cwiki.apache.org/confluence/display/MAVEN/MojoFailureException
[Pipeline] }
[Pipeline] // dir
[Pipeline] }
[withMaven] invokerPublisher - Archive invoker results for Maven artifact MavenArtifact{org.apache.maven.plugins:maven-ear-plugin:maven-plugin:3.0.2-SNAPSHOT(version: 3.0.2-SNAPSHOT, snapshot:false) } generated by PluginInvocation{org.apache.maven.plugins:maven-invoker-plugin:3.1.0@integration-test  integration-test}: m/target/invoker-reports/*.xml
  Building: project-083
  Building: project-084
  Building: project-085
  Building: project-086
  Building: project-087
[ERROR] Tests run: 87, Failures: 1, Errors: 0, Skipped: 0, Time elapsed: 260.606 s <<< FAILURE! - in org.apache.maven.plugins.ear.it.EarMojoIT
[ERROR] testProject016(org.apache.maven.plugins.ear.it.EarMojoIT)  Time elapsed: 3.057 s  <<< FAILURE!
junit.framework.AssertionFailedError: There are differences in the manifest.
        at org.apache.maven.plugins.ear.it.EarMojoIT.testProject016(EarMojoIT.java:217)

[INFO]
[INFO] Results:
[INFO]
[ERROR] Failures:
[ERROR]   EarMojoIT.testProject016:217 There are differences in the manifest.
[INFO]
[ERROR] Tests run: 87, Failures: 1, Errors: 0, Skipped: 0
[INFO]
[INFO]
[INFO] --- maven-checkstyle-plugin:3.0.0:check (checkstyle-check) @ maven-ear-plugin ---
[INFO] Downloading from central: https://repo.maven.apache.org/maven2/org/apache/maven/shared/maven-shared-resources/2/maven-shared-resources-2.pom
[INFO] Downloaded from central: https://repo.maven.apache.org/maven2/org/apache/maven/shared/maven-shared-resources/2/maven-shared-resources-2.pom (3.0 kB at 185 kB/s)
[INFO] Downloading from central: https://repo.maven.apache.org/maven2/org/codehaus/plexus/plexus-utils/3.0.10/plexus-utils-3.0.10.pom
[INFO] Downloaded from central: https://repo.maven.apache.org/maven2/org/codehaus/plexus/plexus-utils/3.0.10/plexus-utils-3.0.10.pom (3.1 kB at 262 kB/s)
[INFO] Downloading from central: https://repo.maven.apache.org/maven2/org/codehaus/plexus/plexus/3.3/plexus-3.3.pom
[INFO] Downloaded from central: https://repo.maven.apache.org/maven2/org/codehaus/plexus/plexus/3.3/plexus-3.3.pom (20 kB at 1.5 MB/s)
[INFO] Downloading from central: https://repo.maven.apache.org/maven2/org/apache/maven/doxia/doxia-integration-tools/1.6/doxia-integration-tools-1.6.pom
[INFO] Downloaded from central: https://repo.maven.apache.org/maven2/org/apache/maven/doxia/doxia-integration-tools/1.6/doxia-integration-tools-1.6.pom (7.0 kB at 580 kB/s)
[INFO] Downloading from central: https://repo.maven.apache.org/maven2/org/apache/maven/doxia/doxia-tools/3/doxia-tools-3.pom
[INFO] Downloaded from central: https://repo.maven.apache.org/maven2/org/apache/maven/doxia/doxia-tools/3/doxia-tools-3.pom (9.9 kB at 827 kB/s)
[INFO] Downloading from central: https://repo.maven.apache.org/maven2/org/codehaus/plexus/plexus-resources/1.1.0/plexus-resources-1.1.0.pom
[INFO] Downloaded from central: https://repo.maven.apache.org/maven2/org/codehaus/plexus/plexus-resources/1.1.0/plexus-resources-1.1.0.pom (3.2 kB at 265 kB/s)
[INFO] Downloading from central: https://repo.maven.apache.org/maven2/com/puppycrawl/tools/checkstyle/6.18/checkstyle-6.18.pom
[INFO] Downloaded from central: https://repo.maven.apache.org/maven2/com/puppycrawl/tools/checkstyle/6.18/checkstyle-6.18.pom (71 kB at 5.5 MB/s)
[INFO] Downloading from central: https://repo.maven.apache.org/maven2/antlr/antlr/2.7.7/antlr-2.7.7.pom
[INFO] Downloaded from central: https://repo.maven.apache.org/maven2/antlr/antlr/2.7.7/antlr-2.7.7.pom (632 B at 57 kB/s)
[INFO] Downloading from central: https://repo.maven.apache.org/maven2/org/antlr/antlr4-runtime/4.5.3/antlr4-runtime-4.5.3.pom
[INFO] Downloaded from central: https://repo.maven.apache.org/maven2/org/antlr/antlr4-runtime/4.5.3/antlr4-runtime-4.5.3.pom (2.3 kB at 210 kB/s)
[INFO] Downloading from central: https://repo.maven.apache.org/maven2/org/antlr/antlr4-master/4.5.3/antlr4-master-4.5.3.pom
[INFO] Downloaded from central: https://repo.maven.apache.org/maven2/org/antlr/antlr4-master/4.5.3/antlr4-master-4.5.3.pom (3.7 kB at 307 kB/s)
[INFO] Downloading from central: https://repo.maven.apache.org/maven2/commons-beanutils/commons-beanutils/1.9.2/commons-beanutils-1.9.2.pom
[INFO] Downloaded from central: https://repo.maven.apache.org/maven2/commons-beanutils/commons-beanutils/1.9.2/commons-beanutils-1.9.2.pom (14 kB at 1.0 MB/s)
[INFO] Downloading from central: https://repo.maven.apache.org/maven2/org/apache/commons/commons-parent/33/commons-parent-33.pom
[INFO] Downloaded from central: https://repo.maven.apache.org/maven2/org/apache/commons/commons-parent/33/commons-parent-33.pom (53 kB at 4.4 MB/s)
[INFO] Downloading from central: https://repo.maven.apache.org/maven2/commons-cli/commons-cli/1.3.1/commons-cli-1.3.1.pom
[INFO] Downloaded from central: https://repo.maven.apache.org/maven2/commons-cli/commons-cli/1.3.1/commons-cli-1.3.1.pom (10 kB at 866 kB/s)
[INFO] Downloading from central: https://repo.maven.apache.org/maven2/com/google/guava/guava/19.0/guava-19.0.pom
[INFO] Downloaded from central: https://repo.maven.apache.org/maven2/com/google/guava/guava/19.0/guava-19.0.pom (6.8 kB at 566 kB/s)
[INFO] Downloading from central: https://repo.maven.apache.org/maven2/com/google/guava/guava-parent/19.0/guava-parent-19.0.pom
[INFO] Downloaded from central: https://repo.maven.apache.org/maven2/com/google/guava/guava-parent/19.0/guava-parent-19.0.pom (9.9 kB at 823 kB/s)
[INFO] Downloading from central: https://repo.maven.apache.org/maven2/org/sonatype/oss/oss-parent/7/oss-parent-7.pom
[INFO] Downloaded from central: https://repo.maven.apache.org/maven2/org/sonatype/oss/oss-parent/7/oss-parent-7.pom (4.8 kB at 439 kB/s)
[INFO] Downloading from central: https://repo.maven.apache.org/maven2/javax/xml/bind/jaxb-api/2.3.0/jaxb-api-2.3.0.pom
[INFO] Downloaded from central: https://repo.maven.apache.org/maven2/javax/xml/bind/jaxb-api/2.3.0/jaxb-api-2.3.0.pom (23 kB at 1.6 MB/s)
[INFO] Downloading from central: https://repo.maven.apache.org/maven2/javax/xml/bind/jaxb-api-parent/2.3.0/jaxb-api-parent-2.3.0.pom
[INFO] Downloaded from central: https://repo.maven.apache.org/maven2/javax/xml/bind/jaxb-api-parent/2.3.0/jaxb-api-parent-2.3.0.pom (5.6 kB at 434 kB/s)
[INFO] Downloading from central: https://repo.maven.apache.org/maven2/net/java/jvnet-parent/5/jvnet-parent-5.pom
[INFO] Downloaded from central: https://repo.maven.apache.org/maven2/net/java/jvnet-parent/5/jvnet-parent-5.pom (8.9 kB at 739 kB/s)
[INFO] Downloading from central: https://repo.maven.apache.org/maven2/org/apache/maven/shared/maven-shared-resources/2/maven-shared-resources-2.jar
[INFO] Downloading from central: https://repo.maven.apache.org/maven2/commons-digester/commons-digester/1.6/commons-digester-1.6.jar
[INFO] Downloading from central: https://repo.maven.apache.org/maven2/org/apache/maven/doxia/doxia-core/1.2/doxia-core-1.2.jar
[INFO] Downloading from central: https://repo.maven.apache.org/maven2/org/apache/maven/doxia/doxia-integration-tools/1.6/doxia-integration-tools-1.6.jar
[INFO] Downloading from central: https://repo.maven.apache.org/maven2/commons-logging/commons-logging/1.0.4/commons-logging-1.0.4.jar
[INFO] Downloaded from central: https://repo.maven.apache.org/maven2/org/apache/maven/shared/maven-shared-resources/2/maven-shared-resources-2.jar (13 kB at 933 kB/s)
[INFO] Downloading from central: https://repo.maven.apache.org/maven2/commons-io/commons-io/1.4/commons-io-1.4.jar
[INFO] Downloaded from central: https://repo.maven.apache.org/maven2/commons-logging/commons-logging/1.0.4/commons-logging-1.0.4.jar (38 kB at 2.2 MB/s)
[INFO] Downloading from central: https://repo.maven.apache.org/maven2/org/codehaus/plexus/plexus-resources/1.1.0/plexus-resources-1.1.0.jar
[INFO] Downloaded from central: https://repo.maven.apache.org/maven2/org/apache/maven/doxia/doxia-integration-tools/1.6/doxia-integration-tools-1.6.jar (45 kB at 2.6 MB/s)
[INFO] Downloading from central: https://repo.maven.apache.org/maven2/com/puppycrawl/tools/checkstyle/6.18/checkstyle-6.18.jar
[INFO] Downloaded from central: https://repo.maven.apache.org/maven2/org/apache/maven/doxia/doxia-core/1.2/doxia-core-1.2.jar (154 kB at 6.7 MB/s)
[INFO] Downloading from central: https://repo.maven.apache.org/maven2/antlr/antlr/2.7.7/antlr-2.7.7.jar
[INFO] Downloaded from central: https://repo.maven.apache.org/maven2/commons-digester/commons-digester/1.6/commons-digester-1.6.jar (168 kB at 6.7 MB/s)
[INFO] Downloading from central: https://repo.maven.apache.org/maven2/org/antlr/antlr4-runtime/4.5.3/antlr4-runtime-4.5.3.jar
[INFO] Downloaded from central: https://repo.maven.apache.org/maven2/commons-io/commons-io/1.4/commons-io-1.4.jar (109 kB at 3.6 MB/s)
[INFO] Downloading from central: https://repo.maven.apache.org/maven2/commons-beanutils/commons-beanutils/1.9.2/commons-beanutils-1.9.2.jar
[INFO] Downloaded from central: https://repo.maven.apache.org/maven2/org/codehaus/plexus/plexus-resources/1.1.0/plexus-resources-1.1.0.jar (23 kB at 703 kB/s)
[INFO] Downloading from central: https://repo.maven.apache.org/maven2/commons-cli/commons-cli/1.3.1/commons-cli-1.3.1.jar
[INFO] Downloaded from central: https://repo.maven.apache.org/maven2/antlr/antlr/2.7.7/antlr-2.7.7.jar (445 kB at 9.5 MB/s)
[INFO] Downloading from central: https://repo.maven.apache.org/maven2/com/google/guava/guava/19.0/guava-19.0.jar
[INFO] Downloaded from central: https://repo.maven.apache.org/maven2/commons-beanutils/commons-beanutils/1.9.2/commons-beanutils-1.9.2.jar (234 kB at 4.9 MB/s)
[INFO] Downloaded from central: https://repo.maven.apache.org/maven2/org/antlr/antlr4-runtime/4.5.3/antlr4-runtime-4.5.3.jar (302 kB at 6.3 MB/s)
[INFO] Downloading from central: https://repo.maven.apache.org/maven2/javax/xml/bind/jaxb-api/2.3.0/jaxb-api-2.3.0.jar
[INFO] Downloading from central: https://repo.maven.apache.org/maven2/commons-lang/commons-lang/2.1/commons-lang-2.1.jar
[INFO] Downloaded from central: https://repo.maven.apache.org/maven2/commons-cli/commons-cli/1.3.1/commons-cli-1.3.1.jar (53 kB at 1.1 MB/s)
[INFO] Downloaded from central: https://repo.maven.apache.org/maven2/javax/xml/bind/jaxb-api/2.3.0/jaxb-api-2.3.0.jar (126 kB at 1.9 MB/s)
[INFO] Downloaded from central: https://repo.maven.apache.org/maven2/commons-lang/commons-lang/2.1/commons-lang-2.1.jar (208 kB at 3.1 MB/s)
[INFO] Downloaded from central: https://repo.maven.apache.org/maven2/com/puppycrawl/tools/checkstyle/6.18/checkstyle-6.18.jar (1.2 MB at 16 MB/s)
[INFO] Downloaded from central: https://repo.maven.apache.org/maven2/com/google/guava/guava/19.0/guava-19.0.jar (2.3 MB at 18 MB/s)
[INFO] There are 3 errors reported by Checkstyle 6.18 with config/maven_checks.xml ruleset.
[INFO] Ignored 3 errors, 0 violation remaining.
[INFO]
[INFO] --- maven-invoker-plugin:3.1.0:verify (integration-test) @ maven-ear-plugin ---
[INFO] -------------------------------------------------
[INFO] Build Summary:
[INFO]   Passed: 16, Failed: 1, Errors: 0, Skipped: 0
[INFO] -------------------------------------------------
[ERROR] The following builds failed:
[ERROR] *  same-artifactId/pom.xml
[INFO] -------------------------------------------------
[INFO] ------------------------------------------------------------------------
[INFO] BUILD FAILURE
[INFO] ------------------------------------------------------------------------
[INFO] Total time:  05:56 min
[INFO] Finished at: 2019-10-03T19:05:25Z
[INFO] ------------------------------------------------------------------------
[INFO] [jenkins-event-spy] Generated /home/jenkins/jenkins-slave/workspace/en-box_maven-ear-plugin_MEAR-276@tmp/withMavendc4d5f43/maven-spy-20191003-185928-8726940666274973201794.log
[ERROR] Failed to execute goal org.apache.maven.plugins:maven-invoker-plugin:3.1.0:verify (integration-test) on project maven-ear-plugin: 1 build failed. See console output above for details. -> [Help 1]
[ERROR]
[ERROR] To see the full stack trace of the errors, re-run Maven with the -e switch.
[ERROR] Re-run Maven using the -X switch to enable full debug logging.
[ERROR]
[ERROR] For more information about the errors and possible solutions, please read the following articles:
[ERROR] [Help 1] http://cwiki.apache.org/confluence/display/MAVEN/MojoFailureException
[withMaven] junitPublisher - Archive test results for Maven artifact org.apache.maven.plugins:maven-ear-plugin:maven-plugin:3.0.2-SNAPSHOT generated by maven-surefire-plugin:test (default-test): m/target/surefire-reports/*.xml
Recording test results
[Pipeline] }
[Pipeline] // dir
[Pipeline] }
[withMaven] invokerPublisher - Archive invoker results for Maven artifact MavenArtifact{org.apache.maven.plugins:maven-ear-plugin:maven-plugin:3.0.2-SNAPSHOT(version: 3.0.2-SNAPSHOT, snapshot:false) } generated by PluginInvocation{org.apache.maven.plugins:maven-invoker-plugin:3.1.0@integration-test  integration-test}: m/target/invoker-reports/*.xml
[withMaven] junitPublisher - Archive test results for Maven artifact org.apache.maven.plugins:maven-ear-plugin:maven-plugin:3.0.2-SNAPSHOT generated by maven-failsafe-plugin:integration-test (default): m/target/failsafe-reports/*.xml
Recording test results
[withMaven] Publishers: Pipeline Graph Publisher: 1 ms, Invoker Publisher: 17127 ms, Junit Publisher: 3757 ms
[Pipeline] // withMaven
[Pipeline] echo
[FAILURE-004] hudson.AbortException: script returned exit code 1
[Pipeline] cleanWs
[WS-CLEANUP] Deleting project workspace...
[WS-CLEANUP] Deferred wipeout is used...
[WS-CLEANUP] done
[Pipeline] cleanWs
[WS-CLEANUP] Deleting project workspace...
[WS-CLEANUP] Deferred wipeout is used...
[WS-CLEANUP] done
[Pipeline] }
[Pipeline] // stage
[Pipeline] }
[Pipeline] // node
[Pipeline] }
Failed in branch linux-jdk13
[withMaven] junitPublisher - Archive test results for Maven artifact org.apache.maven.plugins:maven-ear-plugin:maven-plugin:3.0.2-SNAPSHOT generated by maven-surefire-plugin:test (default-test): m/target/surefire-reports/*.xml
Recording test results
[withMaven] junitPublisher - Archive test results for Maven artifact org.apache.maven.plugins:maven-ear-plugin:maven-plugin:3.0.2-SNAPSHOT generated by maven-failsafe-plugin:integration-test (default): m/target/failsafe-reports/*.xml
Recording test results
[withMaven] Publishers: Invoker Publisher: 16178 ms, Junit Publisher: 3841 ms
[Pipeline] // withMaven
[Pipeline] echo
[FAILURE-004] hudson.AbortException: script returned exit code 1
[Pipeline] cleanWs
[WS-CLEANUP] Deleting project workspace...
[WS-CLEANUP] Deferred wipeout is used...
[WS-CLEANUP] done
[Pipeline] cleanWs
[WS-CLEANUP] Deleting project workspace...
[WS-CLEANUP] Deferred wipeout is used...
[WS-CLEANUP] done
[Pipeline] }
[Pipeline] // stage
[Pipeline] }
[Pipeline] // node
[Pipeline] }
Failed in branch linux-jdk14
[Pipeline] // parallel
[Pipeline] echo
[FAILURE-003] AbortException hudson.AbortException: script returned exit code 1
[Pipeline] stage
[Pipeline] { (Notifications)
[Pipeline] echo
Build result: FAILURE
[Pipeline] jiraIssueSelector
[Pipeline] echo
The authors of changes [].
[Pipeline] echo
Sending email ...
[Pipeline] emailext