Build failed in Jenkins: Maven TLP » maven-ear-plugin » CODE-CLEANUP #1

Previous Topic Next Topic
 
classic Classic list List threaded Threaded
3 messages Options
Reply | Threaded
Open this post in threaded view
|

Build failed in Jenkins: Maven TLP » maven-ear-plugin » CODE-CLEANUP #1

Apache Jenkins Server-2
See https://builds.apache.org/job/maven-box/job/maven-ear-plugin/job/CODE-CLEANUP/1/

No changes.

All tests passed

Build log:
[...truncated 1.97 MB...]
[linux-jdk8]   Building: project-078
[linux-jdk7]   Building: project-061
[windows-jdk9]   Building: project-041
[windows-jdk7]   Building: project-032
[linux-jdk8]   Building: project-079
[windows-jdk8]   Building: project-046
[linux-jdk7]   Building: project-062
[linux-jdk9]   Building: project-052
[linux-jdk8]   Building: project-080
[windows-jdk9]   Building: project-042
[linux-jdk7]   Building: project-063
[linux-jdk9]   Building: project-053
[linux-jdk8]   Building: project-081
[windows-jdk7]   Building: project-033
[windows-jdk8]   Building: project-047
[windows-jdk9]   Building: project-043
[linux-jdk8]   Building: project-082
[linux-jdk7]   Building: project-064
[linux-jdk9]   Building: project-054
[windows-jdk8]   Building: project-048
[windows-jdk9]   Building: project-044
[windows-jdk7]   Building: project-034
[linux-jdk7]   Building: project-065
[linux-jdk8]   Building: project-083
[linux-jdk9]   Building: project-055
[linux-jdk8]   Building: project-084
[windows-jdk8]   Building: project-049
[windows-jdk9]   Building: project-045
[linux-jdk7]   Building: project-066
[linux-jdk8]   Building: project-085
[linux-jdk9]   Building: project-056
[windows-jdk7]   Building: project-035
[windows-jdk8]   Building: project-050
[linux-jdk7]   Building: project-067
[linux-jdk8]   Building: project-086
[windows-jdk9]   Building: project-046
[linux-jdk9]   Building: project-057
[linux-jdk7]   Building: project-068
[linux-jdk8]   Building: project-087
[windows-jdk7]   Building: project-036
[windows-jdk8]   Building: project-051
[linux-jdk9]   Building: project-058
[windows-jdk9]   Building: project-047
[linux-jdk7]   Building: project-069
[linux-jdk8] [INFO] Tests run: 87, Failures: 0, Errors: 0, Skipped: 0, Time elapsed: 255.914 s - in org.apache.maven.plugins.ear.it.EarMojoIT
[linux-jdk8] [INFO]
[linux-jdk8] [INFO] Results:
[linux-jdk8] [INFO]
[linux-jdk8] [INFO] Tests run: 87, Failures: 0, Errors: 0, Skipped: 0
[linux-jdk8] [INFO]
[linux-jdk8] [INFO]
[linux-jdk8] [INFO] --- maven-checkstyle-plugin:3.0.0:check (checkstyle-check) @ maven-ear-plugin ---
[linux-jdk8] [INFO] Downloading from central: https://repo.maven.apache.org/maven2/org/apache/maven/shared/maven-shared-resources/2/maven-shared-resources-2.pom
[linux-jdk8] [INFO] Downloaded from central: https://repo.maven.apache.org/maven2/org/apache/maven/shared/maven-shared-resources/2/maven-shared-resources-2.pom (3.0 kB at 174 kB/s)
[linux-jdk8] [INFO] Downloading from central: https://repo.maven.apache.org/maven2/org/codehaus/plexus/plexus-utils/3.0.10/plexus-utils-3.0.10.pom
[linux-jdk8] [INFO] Downloaded from central: https://repo.maven.apache.org/maven2/org/codehaus/plexus/plexus-utils/3.0.10/plexus-utils-3.0.10.pom (3.1 kB at 262 kB/s)
[linux-jdk8] [INFO] Downloading from central: https://repo.maven.apache.org/maven2/org/codehaus/plexus/plexus/3.3/plexus-3.3.pom
[linux-jdk8] [INFO] Downloaded from central: https://repo.maven.apache.org/maven2/org/codehaus/plexus/plexus/3.3/plexus-3.3.pom (20 kB at 1.7 MB/s)
[linux-jdk8] [INFO] Downloading from central: https://repo.maven.apache.org/maven2/org/apache/maven/doxia/doxia-integration-tools/1.6/doxia-integration-tools-1.6.pom
[linux-jdk8] [INFO] Downloaded from central: https://repo.maven.apache.org/maven2/org/apache/maven/doxia/doxia-integration-tools/1.6/doxia-integration-tools-1.6.pom (7.0 kB at 632 kB/s)
[linux-jdk8] [INFO] Downloading from central: https://repo.maven.apache.org/maven2/org/apache/maven/doxia/doxia-tools/3/doxia-tools-3.pom
[linux-jdk8] [INFO] Downloaded from central: https://repo.maven.apache.org/maven2/org/apache/maven/doxia/doxia-tools/3/doxia-tools-3.pom (9.9 kB at 903 kB/s)
[linux-jdk8] [INFO] Downloading from central: https://repo.maven.apache.org/maven2/org/codehaus/plexus/plexus-resources/1.1.0/plexus-resources-1.1.0.pom
[linux-jdk8] [INFO] Downloaded from central: https://repo.maven.apache.org/maven2/org/codehaus/plexus/plexus-resources/1.1.0/plexus-resources-1.1.0.pom (3.2 kB at 265 kB/s)
[linux-jdk8] [INFO] Downloading from central: https://repo.maven.apache.org/maven2/com/puppycrawl/tools/checkstyle/6.18/checkstyle-6.18.pom
[linux-jdk8] [INFO] Downloaded from central: https://repo.maven.apache.org/maven2/com/puppycrawl/tools/checkstyle/6.18/checkstyle-6.18.pom (71 kB at 4.4 MB/s)
[linux-jdk8] [INFO] Downloading from central: https://repo.maven.apache.org/maven2/antlr/antlr/2.7.7/antlr-2.7.7.pom
[linux-jdk8] [INFO] Downloaded from central: https://repo.maven.apache.org/maven2/antlr/antlr/2.7.7/antlr-2.7.7.pom (632 B at 57 kB/s)
[linux-jdk8] [INFO] Downloading from central: https://repo.maven.apache.org/maven2/org/antlr/antlr4-runtime/4.5.3/antlr4-runtime-4.5.3.pom
[linux-jdk8] [INFO] Downloaded from central: https://repo.maven.apache.org/maven2/org/antlr/antlr4-runtime/4.5.3/antlr4-runtime-4.5.3.pom (2.3 kB at 192 kB/s)
[linux-jdk8] [INFO] Downloading from central: https://repo.maven.apache.org/maven2/org/antlr/antlr4-master/4.5.3/antlr4-master-4.5.3.pom
[linux-jdk8] [INFO] Downloaded from central: https://repo.maven.apache.org/maven2/org/antlr/antlr4-master/4.5.3/antlr4-master-4.5.3.pom (3.7 kB at 307 kB/s)
[linux-jdk8] [INFO] Downloading from central: https://repo.maven.apache.org/maven2/commons-beanutils/commons-beanutils/1.9.2/commons-beanutils-1.9.2.pom
[linux-jdk8] [INFO] Downloaded from central: https://repo.maven.apache.org/maven2/commons-beanutils/commons-beanutils/1.9.2/commons-beanutils-1.9.2.pom (14 kB at 1.2 MB/s)
[linux-jdk8] [INFO] Downloading from central: https://repo.maven.apache.org/maven2/org/apache/commons/commons-parent/33/commons-parent-33.pom
[linux-jdk8] [INFO] Downloaded from central: https://repo.maven.apache.org/maven2/org/apache/commons/commons-parent/33/commons-parent-33.pom (53 kB at 3.8 MB/s)
[linux-jdk8] [INFO] Downloading from central: https://repo.maven.apache.org/maven2/commons-cli/commons-cli/1.3.1/commons-cli-1.3.1.pom
[linux-jdk8] [INFO] Downloaded from central: https://repo.maven.apache.org/maven2/commons-cli/commons-cli/1.3.1/commons-cli-1.3.1.pom (10 kB at 945 kB/s)
[linux-jdk8] [INFO] Downloading from central: https://repo.maven.apache.org/maven2/com/google/guava/guava/19.0/guava-19.0.pom
[linux-jdk8] [INFO] Downloaded from central: https://repo.maven.apache.org/maven2/com/google/guava/guava/19.0/guava-19.0.pom (6.8 kB at 617 kB/s)
[linux-jdk8] [INFO] Downloading from central: https://repo.maven.apache.org/maven2/com/google/guava/guava-parent/19.0/guava-parent-19.0.pom
[linux-jdk8] [INFO] Downloaded from central: https://repo.maven.apache.org/maven2/com/google/guava/guava-parent/19.0/guava-parent-19.0.pom (9.9 kB at 898 kB/s)
[linux-jdk8] [INFO] Downloading from central: https://repo.maven.apache.org/maven2/org/sonatype/oss/oss-parent/7/oss-parent-7.pom
[linux-jdk8] [INFO] Downloaded from central: https://repo.maven.apache.org/maven2/org/sonatype/oss/oss-parent/7/oss-parent-7.pom (4.8 kB at 482 kB/s)
[linux-jdk8] [INFO] Downloading from central: https://repo.maven.apache.org/maven2/org/apache/maven/shared/maven-shared-resources/2/maven-shared-resources-2.jar
[linux-jdk8] [INFO] Downloading from central: https://repo.maven.apache.org/maven2/org/apache/maven/doxia/doxia-core/1.2/doxia-core-1.2.jar
[linux-jdk8] [INFO] Downloading from central: https://repo.maven.apache.org/maven2/commons-digester/commons-digester/1.6/commons-digester-1.6.jar
[linux-jdk8] [INFO] Downloading from central: https://repo.maven.apache.org/maven2/commons-logging/commons-logging/1.0.4/commons-logging-1.0.4.jar
[linux-jdk8] [INFO] Downloading from central: https://repo.maven.apache.org/maven2/org/apache/maven/doxia/doxia-integration-tools/1.6/doxia-integration-tools-1.6.jar
[linux-jdk8] [INFO] Downloaded from central: https://repo.maven.apache.org/maven2/org/apache/maven/shared/maven-shared-resources/2/maven-shared-resources-2.jar (13 kB at 933 kB/s)
[linux-jdk8] [INFO] Downloading from central: https://repo.maven.apache.org/maven2/commons-io/commons-io/1.4/commons-io-1.4.jar
[linux-jdk8] [INFO] Downloaded from central: https://repo.maven.apache.org/maven2/commons-logging/commons-logging/1.0.4/commons-logging-1.0.4.jar (38 kB at 2.2 MB/s)
[linux-jdk8] [INFO] Downloading from central: https://repo.maven.apache.org/maven2/org/codehaus/plexus/plexus-resources/1.1.0/plexus-resources-1.1.0.jar
[linux-jdk8] [INFO] Downloaded from central: https://repo.maven.apache.org/maven2/org/apache/maven/doxia/doxia-integration-tools/1.6/doxia-integration-tools-1.6.jar (45 kB at 2.5 MB/s)
[linux-jdk8] [INFO] Downloading from central: https://repo.maven.apache.org/maven2/com/puppycrawl/tools/checkstyle/6.18/checkstyle-6.18.jar
[linux-jdk8] [INFO] Downloaded from central: https://repo.maven.apache.org/maven2/org/apache/maven/doxia/doxia-core/1.2/doxia-core-1.2.jar (154 kB at 7.0 MB/s)
[linux-jdk8] [INFO] Downloading from central: https://repo.maven.apache.org/maven2/antlr/antlr/2.7.7/antlr-2.7.7.jar
[linux-jdk8] [INFO] Downloaded from central: https://repo.maven.apache.org/maven2/commons-digester/commons-digester/1.6/commons-digester-1.6.jar (168 kB at 7.7 MB/s)
[linux-jdk8] [INFO] Downloading from central: https://repo.maven.apache.org/maven2/org/antlr/antlr4-runtime/4.5.3/antlr4-runtime-4.5.3.jar
[linux-jdk8] [INFO] Downloaded from central: https://repo.maven.apache.org/maven2/org/codehaus/plexus/plexus-resources/1.1.0/plexus-resources-1.1.0.jar (23 kB at 800 kB/s)
[linux-jdk8] [INFO] Downloading from central: https://repo.maven.apache.org/maven2/commons-beanutils/commons-beanutils/1.9.2/commons-beanutils-1.9.2.jar
[linux-jdk8] [INFO] Downloaded from central: https://repo.maven.apache.org/maven2/commons-io/commons-io/1.4/commons-io-1.4.jar (109 kB at 3.6 MB/s)
[linux-jdk8] [INFO] Downloading from central: https://repo.maven.apache.org/maven2/commons-cli/commons-cli/1.3.1/commons-cli-1.3.1.jar
[linux-jdk8] [INFO] Downloaded from central: https://repo.maven.apache.org/maven2/commons-cli/commons-cli/1.3.1/commons-cli-1.3.1.jar (53 kB at 1.2 MB/s)
[linux-jdk8] [INFO] Downloading from central: https://repo.maven.apache.org/maven2/com/google/guava/guava/19.0/guava-19.0.jar
[linux-jdk8] [INFO] Downloaded from central: https://repo.maven.apache.org/maven2/org/antlr/antlr4-runtime/4.5.3/antlr4-runtime-4.5.3.jar (302 kB at 6.3 MB/s)
[linux-jdk8] [INFO] Downloading from central: https://repo.maven.apache.org/maven2/commons-lang/commons-lang/2.1/commons-lang-2.1.jar
[linux-jdk8] [INFO] Downloaded from central: https://repo.maven.apache.org/maven2/commons-beanutils/commons-beanutils/1.9.2/commons-beanutils-1.9.2.jar (234 kB at 4.4 MB/s)
[linux-jdk8] [INFO] Downloaded from central: https://repo.maven.apache.org/maven2/antlr/antlr/2.7.7/antlr-2.7.7.jar (445 kB at 7.8 MB/s)
[linux-jdk8] [INFO] Downloaded from central: https://repo.maven.apache.org/maven2/commons-lang/commons-lang/2.1/commons-lang-2.1.jar (208 kB at 3.0 MB/s)
[linux-jdk8] [INFO] Downloaded from central: https://repo.maven.apache.org/maven2/com/puppycrawl/tools/checkstyle/6.18/checkstyle-6.18.jar (1.2 MB at 13 MB/s)
[linux-jdk8] [INFO] Downloaded from central: https://repo.maven.apache.org/maven2/com/google/guava/guava/19.0/guava-19.0.jar (2.3 MB at 15 MB/s)
[linux-jdk8] [INFO] There are 4 errors reported by Checkstyle 6.18 with config/maven_checks.xml ruleset.
[linux-jdk8] [ERROR] src/main/java/org/apache/maven/plugins/ear/AbstractEarMojo.java:[130] (sizes) LineLength: Line is longer than 120 characters (found 124).
[linux-jdk8] [INFO] Ignored 3 errors, 1 violation remaining.
[linux-jdk8] [INFO] ------------------------------------------------------------------------
[linux-jdk8] [INFO] BUILD FAILURE
[linux-jdk8] [INFO] ------------------------------------------------------------------------
[linux-jdk8] [INFO] Total time: 05:39 min
[linux-jdk8] [INFO] Finished at: 2018-03-07T21:37:06Z
[linux-jdk8] [INFO] Final Memory: 62M/2485M
[linux-jdk8] [INFO] ------------------------------------------------------------------------
[linux-jdk8] [INFO] [jenkins-event-spy] Generated /home/jenkins/jenkins-slave/workspace/ven-ear-plugin_CODE-CLEANUP-VSWFCFKFP2GUSEYOZNFTEWDSZTFYXYCZ4WZJ47EB5BG5AO7RZUMA@2@tmp/withMavene5ef42a2/maven-spy-20180307-213127-1757762323398687962111.log
[linux-jdk8] [ERROR] Failed to execute goal org.apache.maven.plugins:maven-checkstyle-plugin:3.0.0:check (checkstyle-check) on project maven-ear-plugin: You have 1 Checkstyle violation. -> [Help 1]
[linux-jdk8] [ERROR]
[linux-jdk8] [ERROR] To see the full stack trace of the errors, re-run Maven with the -e switch.
[linux-jdk8] [ERROR] Re-run Maven using the -X switch to enable full debug logging.
[linux-jdk8] [ERROR]
[linux-jdk8] [ERROR] For more information about the errors and possible solutions, please read the following articles:
[linux-jdk8] [ERROR] [Help 1] http://cwiki.apache.org/confluence/display/MAVEN/MojoFailureException
[windows-jdk7]   Building: project-037
[windows-jdk8]   Building: project-052
[linux-jdk7]   Building: project-070
[Pipeline] [linux-jdk8] }
[Pipeline] [linux-jdk8] // dir
[windows-jdk9]   Building: project-048
[linux-jdk9]   Building: project-059
[Pipeline] [linux-jdk8] }
[linux-jdk8] [withMaven] junitPublisher - Archive test results for Maven artifact org.apache.maven.plugins:maven-ear-plugin:3.0.0-SNAPSHOT generated by maven-surefire-plugin:test (default-test): m/target/surefire-reports/*.xml
[linux-jdk8] [withMaven] junitPublisher - Jenkins JUnit Attachments Plugin not found, can't publish test attachments.Recording test results
[linux-jdk8] [withMaven] junitPublisher - Archive test results for Maven artifact org.apache.maven.plugins:maven-ear-plugin:3.0.0-SNAPSHOT generated by maven-failsafe-plugin:integration-test (default): m/target/failsafe-reports/*.xml
[linux-jdk8] [withMaven] junitPublisher - Jenkins JUnit Attachments Plugin not found, can't publish test attachments.Recording test results
[Pipeline] [linux-jdk8] // withMaven
[windows-jdk8]   Building: project-053
[Pipeline] [linux-jdk8] echo
[linux-jdk8] [FAIL FAST] This is the first failure and likely root cause
[Pipeline] [linux-jdk8] }
[Pipeline] [linux-jdk8] // stage
[Pipeline] [linux-jdk8] }
[Pipeline] [linux-jdk8] // node
[Pipeline] [linux-jdk8] }
[linux-jdk7] Sending interrupt signal to process
[linux-jdk8] Failed in branch linux-jdk8
[linux-jdk7]   Building: project-071
[linux-jdk7] Terminated
[linux-jdk9] Sending interrupt signal to process
[linux-jdk9]   Building: project-060
[windows-jdk9]   Building: project-049
[windows-jdk7]   Building: project-038
[windows-jdk7] Sending interrupt signal to process
[linux-jdk9] Terminated
[windows-jdk7] [INFO]
[windows-jdk7] [INFO] Results:
[windows-jdk7] [INFO]
[windows-jdk7] [INFO] Tests run: 0, Failures: 0, Errors: 0, Skipped: 0
[windows-jdk7] [INFO]
[windows-jdk8] Sending interrupt signal to process
[windows-jdk9] Sending interrupt signal to process
[Pipeline] [linux-jdk7] }
[Pipeline] [linux-jdk9] }
[Pipeline] [linux-jdk7] // dir
[Pipeline] [linux-jdk9] // dir
[windows-jdk9] [INFO]
[windows-jdk9] [INFO] Results:
[windows-jdk9] [INFO]
[windows-jdk9] [INFO] Tests run: 0, Failures: 0, Errors: 0, Skipped: 0
[windows-jdk9] [INFO]
[Pipeline] [linux-jdk7] }
[linux-jdk7] [withMaven] One or multiple Maven executions have been ignored by the Jenkins Pipeline Maven Plugin because they have been interrupted before completion (1). See Pipeline Maven Plugin FAQ for more details.
[Pipeline] [linux-jdk9] }
[linux-jdk9] [withMaven] One or multiple Maven executions have been ignored by the Jenkins Pipeline Maven Plugin because they have been interrupted before completion (1). See Pipeline Maven Plugin FAQ for more details.
[Pipeline] [linux-jdk7] // withMaven
[Pipeline] [linux-jdk9] // withMaven
[Pipeline] [linux-jdk7] echo
[linux-jdk7] [FAIL FAST] linux-jdk8 had first failure, ignoring script returned exit code 143
[Pipeline] [linux-jdk7] }
[Pipeline] [linux-jdk9] echo
[linux-jdk9] [FAIL FAST] linux-jdk8 had first failure, ignoring script returned exit code 143
[Pipeline] [linux-jdk9] }
[Pipeline] [linux-jdk7] // stage
[Pipeline] [linux-jdk9] // stage
[Pipeline] [linux-jdk7] }
[Pipeline] [linux-jdk9] }
[Pipeline] [linux-jdk7] // node
[Pipeline] [linux-jdk9] // node
[Pipeline] [linux-jdk7] }
[Pipeline] [linux-jdk9] }
[windows-jdk7] After 10s process did not stop
[Pipeline] [windows-jdk7] }
[Pipeline] [windows-jdk7] // dir
[Pipeline] [windows-jdk7] }
[windows-jdk7] [withMaven] One or multiple Maven executions have been ignored by the Jenkins Pipeline Maven Plugin because they have been interrupted before completion (1). See Pipeline Maven Plugin FAQ for more details.
[Pipeline] [windows-jdk7] // withMaven
[Pipeline] [windows-jdk7] echo
[windows-jdk7] [FAIL FAST] linux-jdk8 had first failure, ignoring null
[Pipeline] [windows-jdk7] }
[Pipeline] [windows-jdk7] // stage
[Pipeline] [windows-jdk7] }
[Pipeline] [windows-jdk7] // node
[Pipeline] [windows-jdk7] }
[windows-jdk8] After 10s process did not stop
[Pipeline] [windows-jdk8] }
[Pipeline] [windows-jdk8] // dir
[Pipeline] [windows-jdk8] }
[windows-jdk8] [withMaven] One or multiple Maven executions have been ignored by the Jenkins Pipeline Maven Plugin because they have been interrupted before completion (1). See Pipeline Maven Plugin FAQ for more details.
[Pipeline] [windows-jdk8] // withMaven
[Pipeline] [windows-jdk8] echo
[windows-jdk8] [FAIL FAST] linux-jdk8 had first failure, ignoring null
[Pipeline] [windows-jdk8] }
[Pipeline] [windows-jdk8] // stage
[Pipeline] [windows-jdk8] }
[Pipeline] [windows-jdk8] // node
[Pipeline] [windows-jdk8] }
[windows-jdk9] After 10s process did not stop
[Pipeline] [windows-jdk9] }
[Pipeline] [windows-jdk9] // dir
[Pipeline] [windows-jdk9] }
[windows-jdk9] [withMaven] One or multiple Maven executions have been ignored by the Jenkins Pipeline Maven Plugin because they have been interrupted before completion (1). See Pipeline Maven Plugin FAQ for more details.
[Pipeline] [windows-jdk9] // withMaven
[Pipeline] [windows-jdk9] echo
[windows-jdk9] [FAIL FAST] linux-jdk8 had first failure, ignoring null
[Pipeline] [windows-jdk9] }
[Pipeline] [windows-jdk9] // stage
[Pipeline] [windows-jdk9] }
[Pipeline] [windows-jdk9] // node
[Pipeline] [windows-jdk9] }
[Pipeline] // parallel
[Pipeline] echo
***** FAST FAILURE *****

Fast failure triggered by linux-jdk8

***** FAST FAILURE *****
[Pipeline] stage
[Pipeline] { (Notifications)
[Pipeline] echo
Build result: FAILURE
[Pipeline] jiraIssueSelector
[Pipeline] emailext
Reply | Threaded
Open this post in threaded view
|

Build failed in Jenkins: Maven TLP » maven-ear-plugin » CODE-CLEANUP #2

Apache Jenkins Server-2
See https://builds.apache.org/job/maven-box/job/maven-ear-plugin/job/CODE-CLEANUP/2/

Changes:

* Code cleanups
* Code cleanups
* Code cleanups
* Code cleanups

All tests passed

Build log:
[...truncated 763.49 KB...]
[linux-jdk9]   Building: project-016
[linux-jdk8]   Building: project-061
[windows-jdk8]   Building: project-029
[linux-jdk7]   Building: project-041
[windows-jdk7]   Building: project-023
[linux-jdk8]   Building: project-062
[linux-jdk9]   Building: project-017
[windows-jdk9]   Building: project-028
[linux-jdk8]   Building: project-063
[windows-jdk8]   Building: project-030
[linux-jdk7]   Building: project-042
[linux-jdk7]   Building: project-043
[windows-jdk9]   Building: project-029
[windows-jdk7]   Building: project-024
[linux-jdk9]   Building: project-018
[linux-jdk8]   Building: project-064
[windows-jdk8]   Building: project-031
[linux-jdk7]   Building: project-044
[windows-jdk9]   Building: project-030
[linux-jdk8]   Building: project-065
[windows-jdk7]   Building: project-025
[linux-jdk9]   Building: project-019
[windows-jdk8]   Building: project-032
[linux-jdk7]   Building: project-045
[linux-jdk8]   Building: project-066
[windows-jdk9]   Building: project-031
[linux-jdk9]   Building: project-020
[windows-jdk7]   Building: project-026
[linux-jdk8]   Building: project-067
[linux-jdk7]   Building: project-046
[windows-jdk8]   Building: project-033
[windows-jdk9]   Building: project-032
[linux-jdk8]   Building: project-068
[linux-jdk7]   Building: project-047
[linux-jdk9]   Building: project-021
[windows-jdk8]   Building: project-034
[windows-jdk7]   Building: project-027
[linux-jdk8]   Building: project-069
[windows-jdk9]   Building: project-033
[linux-jdk7]   Building: project-048
[linux-jdk9]   Building: project-022
[linux-jdk8]   Building: project-070
[windows-jdk8]   Building: project-035
[windows-jdk7]   Building: project-028
[linux-jdk7]   Building: project-049
[linux-jdk8]   Building: project-071
[windows-jdk9]   Building: project-034
[linux-jdk9]   Building: project-023
[windows-jdk8]   Building: project-036
[linux-jdk8]   Building: project-072
[linux-jdk7]   Building: project-050
[windows-jdk9]   Building: project-035
[windows-jdk7]   Building: project-029
[linux-jdk9]   Building: project-024
[linux-jdk8]   Building: project-073
[linux-jdk7]   Building: project-051
[windows-jdk8]   Building: project-037
[linux-jdk8]   Building: project-074
[linux-jdk9]   Building: project-025
[windows-jdk7]   Building: project-030
[linux-jdk7]   Building: project-052
[windows-jdk9]   Building: project-036
[linux-jdk8]   Building: project-075
[windows-jdk8]   Building: project-038
[linux-jdk7]   Building: project-053
[linux-jdk9]   Building: project-026
[windows-jdk9]   Building: project-037
[windows-jdk7]   Building: project-031
[linux-jdk8]   Building: project-076
[windows-jdk8]   Building: project-039
[windows-jdk9]   Building: project-038
[windows-jdk7]   Building: project-032
[linux-jdk8]   Building: project-077
[linux-jdk7]   Building: project-054
[linux-jdk8]   Building: project-078
[windows-jdk8]   Building: project-040
[linux-jdk9]   Building: project-027
[linux-jdk7]   Building: project-055
[linux-jdk8]   Building: project-079
[windows-jdk8]   Building: project-041
[linux-jdk7]   Building: project-056
[windows-jdk9]   Building: project-039
[windows-jdk7]   Building: project-033
[linux-jdk8]   Building: project-080
[windows-jdk8]   Building: project-042
[linux-jdk7]   Building: project-057
[windows-jdk9]   Building: project-040
[linux-jdk8]   Building: project-081
[linux-jdk9]   Building: project-028
[windows-jdk7]   Building: project-034
[linux-jdk8]   Building: project-082
[linux-jdk7]   Building: project-058
[windows-jdk8]   Building: project-043
[windows-jdk9]   Building: project-041
[linux-jdk7]   Building: project-059
[windows-jdk7]   Building: project-035
[linux-jdk8]   Building: project-083
[windows-jdk8]   Building: project-044
[linux-jdk8]   Building: project-084
[windows-jdk9]   Building: project-042
[linux-jdk7]   Building: project-060
[linux-jdk9]   Building: project-029
[windows-jdk8]   Building: project-045
[windows-jdk7]   Building: project-036
[linux-jdk8]   Building: project-085
[linux-jdk7]   Building: project-061
[windows-jdk9]   Building: project-043
[linux-jdk8]   Building: project-086
[windows-jdk7]   Building: project-037
[windows-jdk8]   Building: project-046
[linux-jdk7]   Building: project-062
[linux-jdk8]   Building: project-087
[linux-jdk9]   Building: project-030
[windows-jdk9]   Building: project-044
[linux-jdk7]   Building: project-063
[windows-jdk7]   Building: project-038
[linux-jdk8] [INFO] Tests run: 87, Failures: 0, Errors: 0, Skipped: 0, Time elapsed: 251.06 s - in org.apache.maven.plugins.ear.it.EarMojoIT
[linux-jdk8] [INFO]
[linux-jdk8] [INFO] Results:
[linux-jdk8] [INFO]
[linux-jdk8] [INFO] Tests run: 87, Failures: 0, Errors: 0, Skipped: 0
[linux-jdk8] [INFO]
[linux-jdk8] [INFO]
[linux-jdk8] [INFO] --- maven-checkstyle-plugin:3.0.0:check (checkstyle-check) @ maven-ear-plugin ---
[windows-jdk8]   Building: project-047
[windows-jdk9]   Building: project-045
[linux-jdk8] [INFO] There are 4 errors reported by Checkstyle 6.18 with config/maven_checks.xml ruleset.
[linux-jdk8] [ERROR] src/main/java/org/apache/maven/plugins/ear/AbstractEarMojo.java:[130] (sizes) LineLength: Line is longer than 120 characters (found 124).
[linux-jdk8] [INFO] Ignored 3 errors, 1 violation remaining.
[linux-jdk8] [INFO] ------------------------------------------------------------------------
[linux-jdk8] [INFO] BUILD FAILURE
[linux-jdk8] [INFO] ------------------------------------------------------------------------
[linux-jdk8] [INFO] Total time: 05:24 min
[linux-jdk8] [INFO] Finished at: 2018-03-07T21:45:49Z
[linux-jdk8] [INFO] Final Memory: 72M/2610M
[linux-jdk8] [INFO] ------------------------------------------------------------------------
[linux-jdk8] [INFO] [jenkins-event-spy] Generated /home/jenkins/jenkins-slave/workspace/ven-ear-plugin_CODE-CLEANUP-VSWFCFKFP2GUSEYOZNFTEWDSZTFYXYCZ4WZJ47EB5BG5AO7RZUMA@2@tmp/withMaven38043476/maven-spy-20180307-214024-5933421222165705077204.log
[linux-jdk8] [ERROR] Failed to execute goal org.apache.maven.plugins:maven-checkstyle-plugin:3.0.0:check (checkstyle-check) on project maven-ear-plugin: You have 1 Checkstyle violation. -> [Help 1]
[linux-jdk8] [ERROR]
[linux-jdk8] [ERROR] To see the full stack trace of the errors, re-run Maven with the -e switch.
[linux-jdk8] [ERROR] Re-run Maven using the -X switch to enable full debug logging.
[linux-jdk8] [ERROR]
[linux-jdk8] [ERROR] For more information about the errors and possible solutions, please read the following articles:
[linux-jdk8] [ERROR] [Help 1] http://cwiki.apache.org/confluence/display/MAVEN/MojoFailureException
[linux-jdk7]   Building: project-064
[Pipeline] [linux-jdk8] }
[Pipeline] [linux-jdk8] // dir
[windows-jdk8]   Building: project-048
[windows-jdk7]   Building: project-039
[linux-jdk7]   Building: project-065
[linux-jdk9]   Building: project-031
[windows-jdk9]   Building: project-046
[Pipeline] [linux-jdk8] }
[linux-jdk8] [withMaven] junitPublisher - Archive test results for Maven artifact org.apache.maven.plugins:maven-ear-plugin:3.0.0-SNAPSHOT generated by maven-surefire-plugin:test (default-test): m/target/surefire-reports/*.xml
[linux-jdk8] [withMaven] junitPublisher - Jenkins JUnit Attachments Plugin not found, can't publish test attachments.Recording test results
[linux-jdk8] [withMaven] junitPublisher - Archive test results for Maven artifact org.apache.maven.plugins:maven-ear-plugin:3.0.0-SNAPSHOT generated by maven-failsafe-plugin:integration-test (default): m/target/failsafe-reports/*.xml
[linux-jdk8] [withMaven] junitPublisher - Jenkins JUnit Attachments Plugin not found, can't publish test attachments.Recording test results
[Pipeline] [linux-jdk8] // withMaven
[Pipeline] [linux-jdk8] echo
[linux-jdk8] [FAIL FAST] This is the first failure and likely root cause
[Pipeline] [linux-jdk8] }
[Pipeline] [linux-jdk8] // stage
[Pipeline] [linux-jdk8] }
[Pipeline] [linux-jdk8] // node
[Pipeline] [linux-jdk8] }
[linux-jdk7] Sending interrupt signal to process
[linux-jdk8] Failed in branch linux-jdk8
[linux-jdk9] Sending interrupt signal to process
[windows-jdk8]   Building: project-049
[linux-jdk7] Terminated
[windows-jdk8] Sending interrupt signal to process
[linux-jdk9] Terminated
[windows-jdk9]   Building: project-047
[windows-jdk7] Sending interrupt signal to process
[windows-jdk9] Sending interrupt signal to process
[windows-jdk7]   Building: project-040
[Pipeline] [windows-jdk7] }
[Pipeline] [windows-jdk8] }
[Pipeline] [linux-jdk7] }
[Pipeline] [windows-jdk7] // dir
[Pipeline] [windows-jdk8] // dir
[Pipeline] [linux-jdk7] // dir
[Pipeline] [windows-jdk7] }
[windows-jdk7] [withMaven] One or multiple Maven executions have been ignored by the Jenkins Pipeline Maven Plugin because they have been interrupted before completion (1). See Pipeline Maven Plugin FAQ for more details.
[Pipeline] [windows-jdk8] }
[windows-jdk8] [withMaven] One or multiple Maven executions have been ignored by the Jenkins Pipeline Maven Plugin because they have been interrupted before completion (1). See Pipeline Maven Plugin FAQ for more details.
[Pipeline] [linux-jdk7] }
[linux-jdk7] [withMaven] One or multiple Maven executions have been ignored by the Jenkins Pipeline Maven Plugin because they have been interrupted before completion (1). See Pipeline Maven Plugin FAQ for more details.
[Pipeline] [linux-jdk9] }
[Pipeline] [windows-jdk7] // withMaven
[Pipeline] [windows-jdk8] // withMaven
[Pipeline] [linux-jdk7] // withMaven
[Pipeline] [linux-jdk9] // dir
[Pipeline] [windows-jdk7] echo
[windows-jdk7] [FAIL FAST] linux-jdk8 had first failure, ignoring script returned exit code -1
[Pipeline] [windows-jdk7] }
[Pipeline] [windows-jdk8] echo
[windows-jdk8] [FAIL FAST] linux-jdk8 had first failure, ignoring script returned exit code -1
[Pipeline] [windows-jdk8] }
[Pipeline] [linux-jdk7] echo
[linux-jdk7] [FAIL FAST] linux-jdk8 had first failure, ignoring script returned exit code 143
[Pipeline] [linux-jdk7] }
[Pipeline] [linux-jdk9] }
[linux-jdk9] [withMaven] One or multiple Maven executions have been ignored by the Jenkins Pipeline Maven Plugin because they have been interrupted before completion (1). See Pipeline Maven Plugin FAQ for more details.
[Pipeline] [windows-jdk9] }
[Pipeline] [windows-jdk7] // stage
[Pipeline] [windows-jdk8] // stage
[Pipeline] [linux-jdk7] // stage
[Pipeline] [linux-jdk9] // withMaven
[Pipeline] [windows-jdk9] // dir
[Pipeline] [linux-jdk7] }
[Pipeline] [windows-jdk7] }
[Pipeline] [windows-jdk8] }
[Pipeline] [linux-jdk9] echo
[linux-jdk9] [FAIL FAST] linux-jdk8 had first failure, ignoring script returned exit code 143
[Pipeline] [linux-jdk9] }
[Pipeline] [windows-jdk9] }
[windows-jdk9] [withMaven] One or multiple Maven executions have been ignored by the Jenkins Pipeline Maven Plugin because they have been interrupted before completion (1). See Pipeline Maven Plugin FAQ for more details.
[Pipeline] [linux-jdk7] // node
[Pipeline] [windows-jdk7] // node
[Pipeline] [windows-jdk8] // node
[Pipeline] [linux-jdk9] // stage
[Pipeline] [windows-jdk9] // withMaven
[Pipeline] [linux-jdk7] }
[Pipeline] [windows-jdk7] }
[Pipeline] [windows-jdk8] }
[Pipeline] [linux-jdk9] }
[Pipeline] [windows-jdk9] echo
[windows-jdk9] [FAIL FAST] linux-jdk8 had first failure, ignoring script returned exit code -1
[Pipeline] [windows-jdk9] }
[Pipeline] [linux-jdk9] // node
[Pipeline] [windows-jdk9] // stage
[Pipeline] [linux-jdk9] }
[Pipeline] [windows-jdk9] }
[Pipeline] [windows-jdk9] // node
[Pipeline] [windows-jdk9] }
[Pipeline] // parallel
[Pipeline] echo
***** FAST FAILURE *****

Fast failure triggered by linux-jdk8

***** FAST FAILURE *****
[Pipeline] stage
[Pipeline] { (Notifications)
[Pipeline] echo
Build result: FAILURE
[Pipeline] jiraIssueSelector
[Pipeline] emailext
Reply | Threaded
Open this post in threaded view
|

Build succeeded in Jenkins: Maven TLP » maven-ear-plugin » CODE-CLEANUP #3

Apache Jenkins Server-2
See https://builds.apache.org/job/maven-box/job/maven-ear-plugin/job/CODE-CLEANUP/3/

Changes:

* Fixed checkstyle issue.
* Fixed checkstyle issue.
* Fixed checkstyle issue.

All tests passed