Build failed in Jenkins: Maven TLP » maven-doxia-site » master #11

Previous Topic Next Topic
 
classic Classic list List threaded Threaded
4 messages Options
Reply | Threaded
Open this post in threaded view
|

Build failed in Jenkins: Maven TLP » maven-doxia-site » master #11

Apache Jenkins Server-2
See https://builds.apache.org/job/maven-box/job/maven-doxia-site/job/master/11/

Changes:

* INFRA-16749, INFRA-16768  - Followup cleanup under all circumstances.
* INFRA-16749, INFRA-16768  - Followup cleanup under all circumstances.

No tests ran.

Build log:
Branch indexing
Obtained Jenkinsfile from 3338391f78d85acd80f496fc06d8d73d441c3360
Running in Durability level: MAX_SURVIVABILITY
Loading library jenkins-env@master
Attempting to resolve master from remote references...
 > git --version # timeout=10
 > git ls-remote -h https://gitbox.apache.org/repos/asf/maven-jenkins-env.git # timeout=10
Found match: refs/heads/master revision 0236381a09de32b0ddf4b407663504abdfc5e8f1
 > git rev-parse --is-inside-work-tree # timeout=10
Fetching changes from the remote Git repository
 > git config remote.origin.url https://gitbox.apache.org/repos/asf/maven-jenkins-env.git # timeout=10
Fetching without tags
Fetching upstream changes from https://gitbox.apache.org/repos/asf/maven-jenkins-env.git
 > git --version # timeout=10
 > git fetch --no-tags --progress https://gitbox.apache.org/repos/asf/maven-jenkins-env.git +refs/heads/*:refs/remotes/origin/*
Checking out Revision 0236381a09de32b0ddf4b407663504abdfc5e8f1 (master)
 > git config core.sparsecheckout # timeout=10
 > git checkout -f 0236381a09de32b0ddf4b407663504abdfc5e8f1
Commit message: "Try another expression"
 > git rev-list --no-walk 0236381a09de32b0ddf4b407663504abdfc5e8f1 # timeout=10
Loading library jenkins-lib@master
Attempting to resolve master from remote references...
 > git --version # timeout=10
 > git ls-remote -h https://gitbox.apache.org/repos/asf/maven-jenkins-lib.git # timeout=10
Found match: refs/heads/master revision daa65c2cc00651e7fcb55c2f6dcbab5430a286e5
 > git rev-parse --is-inside-work-tree # timeout=10
Fetching changes from the remote Git repository
 > git config remote.origin.url https://gitbox.apache.org/repos/asf/maven-jenkins-lib.git # timeout=10
Fetching without tags
Fetching upstream changes from https://gitbox.apache.org/repos/asf/maven-jenkins-lib.git
 > git --version # timeout=10
 > git fetch --no-tags --progress https://gitbox.apache.org/repos/asf/maven-jenkins-lib.git +refs/heads/*:refs/remotes/origin/*
Checking out Revision daa65c2cc00651e7fcb55c2f6dcbab5430a286e5 (master)
 > git config core.sparsecheckout # timeout=10
 > git checkout -f daa65c2cc00651e7fcb55c2f6dcbab5430a286e5
Commit message: "INFRA-16749, INFRA-16768  - Followup cleanup under all circumstances.    Wrong location for cleanup."
 > git rev-list --no-walk 568d09f780606582749efb9ec70e6f4e1567e8dc # timeout=10
[Pipeline] node
Running on websites1 in /home/jenkins/jenkins-slave/workspace/box_maven-doxia-site_master-IVLIM3FD7IHMMFNW5G7AIUYHFYH7R75A6TO3URHNGEW2DEHYMTVQ
[Pipeline] {
[Pipeline] stage
[Pipeline] { (Declarative: Checkout SCM)
[Pipeline] checkout
 > git rev-parse --is-inside-work-tree # timeout=10
Fetching changes from the remote Git repository
 > git config remote.origin.url https://gitbox.apache.org/repos/asf/maven-doxia-site.git # timeout=10
Fetching without tags
Fetching upstream changes from https://gitbox.apache.org/repos/asf/maven-doxia-site.git
 > git --version # timeout=10
 > git fetch --no-tags --progress https://gitbox.apache.org/repos/asf/maven-doxia-site.git +refs/heads/*:refs/remotes/origin/*
Checking out Revision 3338391f78d85acd80f496fc06d8d73d441c3360 (master)
 > git config core.sparsecheckout # timeout=10
 > git checkout -f 3338391f78d85acd80f496fc06d8d73d441c3360
Commit message: "updated mpir config after 3.0.0 upgrade in parent pom"
 > git rev-list --no-walk 3338391f78d85acd80f496fc06d8d73d441c3360 # timeout=10
Cleaning workspace
 > git rev-parse --verify HEAD # timeout=10
Resetting working tree
 > git reset --hard # timeout=10
 > git clean -fdx # timeout=10
[Pipeline] }
[Pipeline] // stage
[Pipeline] withEnv
[Pipeline] {
[Pipeline] timeout
Timeout set to expire in 10 min
[Pipeline] {
[Pipeline] timestamps
[Pipeline] {
[Pipeline] ansiColor
[Pipeline] {
[Pipeline] stage
[Pipeline] { (Build)
Stage "Build" skipped due to when conditional
[Pipeline] }
[Pipeline] // stage
[Pipeline] stage
[Pipeline] { (Deploy)
[Pipeline] withMaven
[withMaven] Options: [org.jenkinsci.plugins.pipeline.maven.publishers.GeneratedArtifactsPublisher[disabled=true], JunitTestsPublisher[disabled=true,healthScaleFactor=,keepLongStdio=false,ignoreAttachments=false], org.jenkinsci.plugins.pipeline.maven.publishers.FindbugsAnalysisPublisher[disabled='true', healthy='', unHealthy='', thresholdLimit='low'], org.jenkinsci.plugins.pipeline.maven.publishers.TasksScannerPublisher[disabled='true', healthy='', unHealthy='', thresholdLimit='low']]
[withMaven] Available options:
[withMaven] using JDK installation JDK 1.8 (latest)
[withMaven] using Maven installation 'Maven 3 (latest)'
[Pipeline] {
[Pipeline] sh
[box_maven-doxia-site_master-IVLIM3FD7IHMMFNW5G7AIUYHFYH7R75A6TO3URHNGEW2DEHYMTVQ] Running shell script
+ mvn clean site-deploy
----- withMaven Wrapper script -----
Picked up JAVA_TOOL_OPTIONS: -Dmaven.ext.class.path="/home/jenkins/jenkins-slave/workspace/box_maven-doxia-site_master-IVLIM3FD7IHMMFNW5G7AIUYHFYH7R75A6TO3URHNGEW2DEHYMTVQ@tmp/withMaven43b56ae8/pipeline-maven-spy.jar" -Dorg.jenkinsci.plugins.pipeline.maven.reportsFolder="/home/jenkins/jenkins-slave/workspace/box_maven-doxia-site_master-IVLIM3FD7IHMMFNW5G7AIUYHFYH7R75A6TO3URHNGEW2DEHYMTVQ@tmp/withMaven43b56ae8"
Apache Maven 3.5.2 (138edd61fd100ec658bfa2d307c43b76940a5d7d; 2017-10-18T07:58:13Z)
Maven home: /home/jenkins/tools/maven/latest3
Java version: 1.8.0_172, vendor: Oracle Corporation
Java home: /usr/local/asfpackages/java/jdk1.8.0_172/jre
Default locale: en_US, platform encoding: UTF-8
OS name: "linux", version: "4.4.0-116-generic", arch: "amd64", family: "unix"
[INFO] [jenkins-event-spy] Generate /home/jenkins/jenkins-slave/workspace/box_maven-doxia-site_master-IVLIM3FD7IHMMFNW5G7AIUYHFYH7R75A6TO3URHNGEW2DEHYMTVQ@tmp/withMaven43b56ae8/maven-spy-20180723-110010-350619304821595969875.log.tmp ...
[INFO] Scanning for projects...
[INFO] Downloading from Nexus: http://repository.apache.org/snapshots/org/apache/maven/maven-parent/32-SNAPSHOT/maven-metadata.xml
[INFO] Downloading from Nexus: http://repository.apache.org/snapshots/org/apache/maven/maven-parent/32-SNAPSHOT/maven-parent-32-SNAPSHOT.pom
[ERROR] [ERROR] Some problems were encountered while processing the POMs:
[FATAL] Non-resolvable parent POM for org.apache.maven.doxia:doxia-site:1.0-SNAPSHOT: Could not find artifact org.apache.maven:maven-parent:pom:32-SNAPSHOT in Nexus (http://repository.apache.org/snapshots) and 'parent.relativePath' points at wrong local POM @ line 23, column 11
 @
[INFO] [jenkins-event-spy] Generated /home/jenkins/jenkins-slave/workspace/box_maven-doxia-site_master-IVLIM3FD7IHMMFNW5G7AIUYHFYH7R75A6TO3URHNGEW2DEHYMTVQ@tmp/withMaven43b56ae8/maven-spy-20180723-110010-350619304821595969875.log
[ERROR] The build could not read 1 project -> [Help 1]
[ERROR]  
[ERROR]   The project org.apache.maven.doxia:doxia-site:1.0-SNAPSHOT (/home/jenkins/jenkins-slave/workspace/box_maven-doxia-site_master-IVLIM3FD7IHMMFNW5G7AIUYHFYH7R75A6TO3URHNGEW2DEHYMTVQ/pom.xml) has 1 error
[ERROR]     Non-resolvable parent POM for org.apache.maven.doxia:doxia-site:1.0-SNAPSHOT: Could not find artifact org.apache.maven:maven-parent:pom:32-SNAPSHOT in Nexus (http://repository.apache.org/snapshots) and 'parent.relativePath' points at wrong local POM @ line 23, column 11 -> [Help 2]
[ERROR]
[ERROR] To see the full stack trace of the errors, re-run Maven with the -e switch.
[ERROR] Re-run Maven using the -X switch to enable full debug logging.
[ERROR]
[ERROR] For more information about the errors and possible solutions, please read the following articles:
[ERROR] [Help 1] http://cwiki.apache.org/confluence/display/MAVEN/ProjectBuildingException
[ERROR] [Help 2] http://cwiki.apache.org/confluence/display/MAVEN/UnresolvableModelException
[Pipeline] }
[Pipeline] // withMaven
[Pipeline] }
[Pipeline] // stage
[Pipeline] stage
[Pipeline] { (Declarative: Post Actions)
[Pipeline] echo
Build result: FAILURE
[Pipeline] jiraIssueSelector
[Pipeline] emailext
Reply | Threaded
Open this post in threaded view
|

Build failed in Jenkins: Maven TLP » maven-doxia-site » master #12

Apache Jenkins Server-2
See https://builds.apache.org/job/maven-box/job/maven-doxia-site/job/master/12/

Changes:

* Get back ubuntu-eu2 and replaced it with windows-2016-1 which currently
* Exclude windows-2012-1
* [INFRA-16848] Nodes should be fixed
* H31 seemed to have issues.
* ubunut-eu2 is back online.

No tests ran.

Build log:
Branch indexing
Obtained Jenkinsfile from 3338391f78d85acd80f496fc06d8d73d441c3360
Running in Durability level: MAX_SURVIVABILITY
Loading library jenkins-env@master
Attempting to resolve master from remote references...
 > git --version # timeout=10
 > git ls-remote -h https://gitbox.apache.org/repos/asf/maven-jenkins-env.git # timeout=10
Found match: refs/heads/master revision e29308075d3807040ab7a1edd0d171788929c630
 > git rev-parse --is-inside-work-tree # timeout=10
Fetching changes from the remote Git repository
 > git config remote.origin.url https://gitbox.apache.org/repos/asf/maven-jenkins-env.git # timeout=10
Fetching without tags
Fetching upstream changes from https://gitbox.apache.org/repos/asf/maven-jenkins-env.git
 > git --version # timeout=10
 > git fetch --no-tags --progress https://gitbox.apache.org/repos/asf/maven-jenkins-env.git +refs/heads/*:refs/remotes/origin/*
Checking out Revision e29308075d3807040ab7a1edd0d171788929c630 (master)
 > git config core.sparsecheckout # timeout=10
 > git checkout -f e29308075d3807040ab7a1edd0d171788929c630
Commit message: "H31 seemed to have issues."
 > git rev-list --no-walk 0236381a09de32b0ddf4b407663504abdfc5e8f1 # timeout=10
Loading library jenkins-lib@master
Attempting to resolve master from remote references...
 > git --version # timeout=10
 > git ls-remote -h https://gitbox.apache.org/repos/asf/maven-jenkins-lib.git # timeout=10
Found match: refs/heads/master revision 0f9199b3f10021cdbf9b0df3d1e782048542901e
 > git rev-parse --is-inside-work-tree # timeout=10
Fetching changes from the remote Git repository
 > git config remote.origin.url https://gitbox.apache.org/repos/asf/maven-jenkins-lib.git # timeout=10
Fetching without tags
Fetching upstream changes from https://gitbox.apache.org/repos/asf/maven-jenkins-lib.git
 > git --version # timeout=10
 > git fetch --no-tags --progress https://gitbox.apache.org/repos/asf/maven-jenkins-lib.git +refs/heads/*:refs/remotes/origin/*
Checking out Revision 0f9199b3f10021cdbf9b0df3d1e782048542901e (master)
 > git config core.sparsecheckout # timeout=10
 > git checkout -f 0f9199b3f10021cdbf9b0df3d1e782048542901e
Commit message: "ubunut-eu2 is back online."
 > git rev-list --no-walk daa65c2cc00651e7fcb55c2f6dcbab5430a286e5 # timeout=10
[Pipeline] node
Running on websites1 in /home/jenkins/jenkins-slave/workspace/box_maven-doxia-site_master-IVLIM3FD7IHMMFNW5G7AIUYHFYH7R75A6TO3URHNGEW2DEHYMTVQ
[Pipeline] {
[Pipeline] stage
[Pipeline] { (Declarative: Checkout SCM)
[Pipeline] checkout
 > git rev-parse --is-inside-work-tree # timeout=10
Fetching changes from the remote Git repository
 > git config remote.origin.url https://gitbox.apache.org/repos/asf/maven-doxia-site.git # timeout=10
Fetching without tags
Fetching upstream changes from https://gitbox.apache.org/repos/asf/maven-doxia-site.git
 > git --version # timeout=10
 > git fetch --no-tags --progress https://gitbox.apache.org/repos/asf/maven-doxia-site.git +refs/heads/*:refs/remotes/origin/*
Checking out Revision 3338391f78d85acd80f496fc06d8d73d441c3360 (master)
 > git config core.sparsecheckout # timeout=10
 > git checkout -f 3338391f78d85acd80f496fc06d8d73d441c3360
Commit message: "updated mpir config after 3.0.0 upgrade in parent pom"
 > git rev-list --no-walk 3338391f78d85acd80f496fc06d8d73d441c3360 # timeout=10
Cleaning workspace
 > git rev-parse --verify HEAD # timeout=10
Resetting working tree
 > git reset --hard # timeout=10
 > git clean -fdx # timeout=10
[Pipeline] }
[Pipeline] // stage
[Pipeline] withEnv
[Pipeline] {
[Pipeline] timeout
Timeout set to expire in 10 min
[Pipeline] {
[Pipeline] timestamps
[Pipeline] {
[Pipeline] ansiColor
[Pipeline] {
[Pipeline] stage
[Pipeline] { (Build)
Stage "Build" skipped due to when conditional
[Pipeline] }
[Pipeline] // stage
[Pipeline] stage
[Pipeline] { (Deploy)
[Pipeline] withMaven
[withMaven] Options: [org.jenkinsci.plugins.pipeline.maven.publishers.GeneratedArtifactsPublisher[disabled=true], JunitTestsPublisher[disabled=true,healthScaleFactor=,keepLongStdio=false,ignoreAttachments=false], org.jenkinsci.plugins.pipeline.maven.publishers.FindbugsAnalysisPublisher[disabled='true', healthy='', unHealthy='', thresholdLimit='low'], org.jenkinsci.plugins.pipeline.maven.publishers.TasksScannerPublisher[disabled='true', healthy='', unHealthy='', thresholdLimit='low']]
[withMaven] Available options:
[withMaven] using JDK installation JDK 1.8 (latest)
[withMaven] using Maven installation 'Maven 3 (latest)'
[Pipeline] {
[Pipeline] sh
[box_maven-doxia-site_master-IVLIM3FD7IHMMFNW5G7AIUYHFYH7R75A6TO3URHNGEW2DEHYMTVQ] Running shell script
+ mvn clean site-deploy
----- withMaven Wrapper script -----
Picked up JAVA_TOOL_OPTIONS: -Dmaven.ext.class.path="/home/jenkins/jenkins-slave/workspace/box_maven-doxia-site_master-IVLIM3FD7IHMMFNW5G7AIUYHFYH7R75A6TO3URHNGEW2DEHYMTVQ@tmp/withMavenff1267e1/pipeline-maven-spy.jar" -Dorg.jenkinsci.plugins.pipeline.maven.reportsFolder="/home/jenkins/jenkins-slave/workspace/box_maven-doxia-site_master-IVLIM3FD7IHMMFNW5G7AIUYHFYH7R75A6TO3URHNGEW2DEHYMTVQ@tmp/withMavenff1267e1"
Apache Maven 3.5.4 (1edded0938998edf8bf061f1ceb3cfdeccf443fe; 2018-06-17T18:33:14Z)
Maven home: /home/jenkins/tools/maven/latest3
Java version: 1.8.0_172, vendor: Oracle Corporation, runtime: /usr/local/asfpackages/java/jdk1.8.0_172/jre
Default locale: en_US, platform encoding: UTF-8
OS name: "linux", version: "4.4.0-116-generic", arch: "amd64", family: "unix"
[INFO] [jenkins-event-spy] Generate /home/jenkins/jenkins-slave/workspace/box_maven-doxia-site_master-IVLIM3FD7IHMMFNW5G7AIUYHFYH7R75A6TO3URHNGEW2DEHYMTVQ@tmp/withMavenff1267e1/maven-spy-20180804-110009-8306318773972345369503.log.tmp ...
[INFO] Scanning for projects...
[INFO] Downloading from Nexus: http://repository.apache.org/snapshots/org/apache/maven/maven-parent/32-SNAPSHOT/maven-metadata.xml
[INFO] Downloading from Nexus: http://repository.apache.org/snapshots/org/apache/maven/maven-parent/32-SNAPSHOT/maven-parent-32-SNAPSHOT.pom
[ERROR] [ERROR] Some problems were encountered while processing the POMs:
[FATAL] Non-resolvable parent POM for org.apache.maven.doxia:doxia-site:1.0-SNAPSHOT: Could not find artifact org.apache.maven:maven-parent:pom:32-SNAPSHOT in Nexus (http://repository.apache.org/snapshots) and 'parent.relativePath' points at wrong local POM @ line 23, column 11
 @
[INFO] [jenkins-event-spy] Generated /home/jenkins/jenkins-slave/workspace/box_maven-doxia-site_master-IVLIM3FD7IHMMFNW5G7AIUYHFYH7R75A6TO3URHNGEW2DEHYMTVQ@tmp/withMavenff1267e1/maven-spy-20180804-110009-8306318773972345369503.log
[ERROR] The build could not read 1 project -> [Help 1]
[ERROR]  
[ERROR]   The project org.apache.maven.doxia:doxia-site:1.0-SNAPSHOT (/home/jenkins/jenkins-slave/workspace/box_maven-doxia-site_master-IVLIM3FD7IHMMFNW5G7AIUYHFYH7R75A6TO3URHNGEW2DEHYMTVQ/pom.xml) has 1 error
[ERROR]     Non-resolvable parent POM for org.apache.maven.doxia:doxia-site:1.0-SNAPSHOT: Could not find artifact org.apache.maven:maven-parent:pom:32-SNAPSHOT in Nexus (http://repository.apache.org/snapshots) and 'parent.relativePath' points at wrong local POM @ line 23, column 11 -> [Help 2]
[ERROR]
[ERROR] To see the full stack trace of the errors, re-run Maven with the -e switch.
[ERROR] Re-run Maven using the -X switch to enable full debug logging.
[ERROR]
[ERROR] For more information about the errors and possible solutions, please read the following articles:
[ERROR] [Help 1] http://cwiki.apache.org/confluence/display/MAVEN/ProjectBuildingException
[ERROR] [Help 2] http://cwiki.apache.org/confluence/display/MAVEN/UnresolvableModelException
[Pipeline] }
[Pipeline] // withMaven
[Pipeline] }
[Pipeline] // stage
[Pipeline] stage
[Pipeline] { (Declarative: Post Actions)
[Pipeline] echo
Build result: FAILURE
[Pipeline] jiraIssueSelector
[Pipeline] emailext
Reply | Threaded
Open this post in threaded view
|

Build failed in Jenkins: Maven TLP » maven-doxia-site » master #13

Apache Jenkins Server-2
See https://builds.apache.org/job/maven-box/job/maven-doxia-site/job/master/13/

No changes.

No tests ran.

Build log:
Branch indexing
Obtained Jenkinsfile from 3338391f78d85acd80f496fc06d8d73d441c3360
Running in Durability level: MAX_SURVIVABILITY
Loading library jenkins-env@master
Attempting to resolve master from remote references...
 > git --version # timeout=10
 > git ls-remote -h https://gitbox.apache.org/repos/asf/maven-jenkins-env.git # timeout=10
Found match: refs/heads/master revision e29308075d3807040ab7a1edd0d171788929c630
 > git rev-parse --is-inside-work-tree # timeout=10
Fetching changes from the remote Git repository
 > git config remote.origin.url https://gitbox.apache.org/repos/asf/maven-jenkins-env.git # timeout=10
Fetching without tags
Fetching upstream changes from https://gitbox.apache.org/repos/asf/maven-jenkins-env.git
 > git --version # timeout=10
 > git fetch --no-tags --progress https://gitbox.apache.org/repos/asf/maven-jenkins-env.git +refs/heads/*:refs/remotes/origin/*
Checking out Revision e29308075d3807040ab7a1edd0d171788929c630 (master)
 > git config core.sparsecheckout # timeout=10
 > git checkout -f e29308075d3807040ab7a1edd0d171788929c630
Commit message: "H31 seemed to have issues."
 > git rev-list --no-walk e29308075d3807040ab7a1edd0d171788929c630 # timeout=10
Loading library jenkins-lib@master
Attempting to resolve master from remote references...
 > git --version # timeout=10
 > git ls-remote -h https://gitbox.apache.org/repos/asf/maven-jenkins-lib.git # timeout=10
Found match: refs/heads/master revision 0f9199b3f10021cdbf9b0df3d1e782048542901e
 > git rev-parse --is-inside-work-tree # timeout=10
Fetching changes from the remote Git repository
 > git config remote.origin.url https://gitbox.apache.org/repos/asf/maven-jenkins-lib.git # timeout=10
Fetching without tags
Fetching upstream changes from https://gitbox.apache.org/repos/asf/maven-jenkins-lib.git
 > git --version # timeout=10
 > git fetch --no-tags --progress https://gitbox.apache.org/repos/asf/maven-jenkins-lib.git +refs/heads/*:refs/remotes/origin/*
Checking out Revision 0f9199b3f10021cdbf9b0df3d1e782048542901e (master)
 > git config core.sparsecheckout # timeout=10
 > git checkout -f 0f9199b3f10021cdbf9b0df3d1e782048542901e
Commit message: "ubunut-eu2 is back online."
 > git rev-list --no-walk 0f9199b3f10021cdbf9b0df3d1e782048542901e # timeout=10
[Pipeline] node
Running on websites1 in /home/jenkins/jenkins-slave/workspace/box_maven-doxia-site_master-IVLIM3FD7IHMMFNW5G7AIUYHFYH7R75A6TO3URHNGEW2DEHYMTVQ
[Pipeline] {
[Pipeline] stage
[Pipeline] { (Declarative: Checkout SCM)
[Pipeline] checkout
 > git rev-parse --is-inside-work-tree # timeout=10
Fetching changes from the remote Git repository
 > git config remote.origin.url https://gitbox.apache.org/repos/asf/maven-doxia-site.git # timeout=10
Fetching without tags
Fetching upstream changes from https://gitbox.apache.org/repos/asf/maven-doxia-site.git
 > git --version # timeout=10
 > git fetch --no-tags --progress https://gitbox.apache.org/repos/asf/maven-doxia-site.git +refs/heads/*:refs/remotes/origin/*
Checking out Revision 3338391f78d85acd80f496fc06d8d73d441c3360 (master)
 > git config core.sparsecheckout # timeout=10
 > git checkout -f 3338391f78d85acd80f496fc06d8d73d441c3360
Commit message: "updated mpir config after 3.0.0 upgrade in parent pom"
 > git rev-list --no-walk 3338391f78d85acd80f496fc06d8d73d441c3360 # timeout=10
Cleaning workspace
 > git rev-parse --verify HEAD # timeout=10
Resetting working tree
 > git reset --hard # timeout=10
 > git clean -fdx # timeout=10
[Pipeline] }
[Pipeline] // stage
[Pipeline] withEnv
[Pipeline] {
[Pipeline] timeout
Timeout set to expire in 10 min
[Pipeline] {
[Pipeline] timestamps
[Pipeline] {
[Pipeline] ansiColor
[Pipeline] {
[Pipeline] stage
[Pipeline] { (Build)
Stage "Build" skipped due to when conditional
[Pipeline] }
[Pipeline] // stage
[Pipeline] stage
[Pipeline] { (Deploy)
[Pipeline] withMaven
[withMaven] Options: [org.jenkinsci.plugins.pipeline.maven.publishers.GeneratedArtifactsPublisher[disabled=true], JunitTestsPublisher[disabled=true,healthScaleFactor=,keepLongStdio=false,ignoreAttachments=false], org.jenkinsci.plugins.pipeline.maven.publishers.FindbugsAnalysisPublisher[disabled='true', healthy='', unHealthy='', thresholdLimit='low'], org.jenkinsci.plugins.pipeline.maven.publishers.TasksScannerPublisher[disabled='true', healthy='', unHealthy='', thresholdLimit='low']]
[withMaven] Available options:
[withMaven] using JDK installation JDK 1.8 (latest)
[withMaven] using Maven installation 'Maven 3 (latest)'
[Pipeline] {
[Pipeline] sh
[box_maven-doxia-site_master-IVLIM3FD7IHMMFNW5G7AIUYHFYH7R75A6TO3URHNGEW2DEHYMTVQ] Running shell script
+ mvn clean site-deploy
----- withMaven Wrapper script -----
Picked up JAVA_TOOL_OPTIONS: -Dmaven.ext.class.path="/home/jenkins/jenkins-slave/workspace/box_maven-doxia-site_master-IVLIM3FD7IHMMFNW5G7AIUYHFYH7R75A6TO3URHNGEW2DEHYMTVQ@tmp/withMaven5c12b78b/pipeline-maven-spy.jar" -Dorg.jenkinsci.plugins.pipeline.maven.reportsFolder="/home/jenkins/jenkins-slave/workspace/box_maven-doxia-site_master-IVLIM3FD7IHMMFNW5G7AIUYHFYH7R75A6TO3URHNGEW2DEHYMTVQ@tmp/withMaven5c12b78b"
Apache Maven 3.5.4 (1edded0938998edf8bf061f1ceb3cfdeccf443fe; 2018-06-17T18:33:14Z)
Maven home: /home/jenkins/tools/maven/latest3
Java version: 1.8.0_172, vendor: Oracle Corporation, runtime: /usr/local/asfpackages/java/jdk1.8.0_172/jre
Default locale: en_US, platform encoding: UTF-8
OS name: "linux", version: "4.4.0-116-generic", arch: "amd64", family: "unix"
[INFO] [jenkins-event-spy] Generate /home/jenkins/jenkins-slave/workspace/box_maven-doxia-site_master-IVLIM3FD7IHMMFNW5G7AIUYHFYH7R75A6TO3URHNGEW2DEHYMTVQ@tmp/withMaven5c12b78b/maven-spy-20180809-110010-8656744450177282828508.log.tmp ...
[INFO] Scanning for projects...
[INFO] Downloading from Nexus: http://repository.apache.org/snapshots/org/apache/maven/maven-parent/32-SNAPSHOT/maven-metadata.xml
[INFO] Downloading from Nexus: http://repository.apache.org/snapshots/org/apache/maven/maven-parent/32-SNAPSHOT/maven-parent-32-SNAPSHOT.pom
[ERROR] [ERROR] Some problems were encountered while processing the POMs:
[FATAL] Non-resolvable parent POM for org.apache.maven.doxia:doxia-site:1.0-SNAPSHOT: Could not find artifact org.apache.maven:maven-parent:pom:32-SNAPSHOT in Nexus (http://repository.apache.org/snapshots) and 'parent.relativePath' points at wrong local POM @ line 23, column 11
 @
[INFO] [jenkins-event-spy] Generated /home/jenkins/jenkins-slave/workspace/box_maven-doxia-site_master-IVLIM3FD7IHMMFNW5G7AIUYHFYH7R75A6TO3URHNGEW2DEHYMTVQ@tmp/withMaven5c12b78b/maven-spy-20180809-110010-8656744450177282828508.log
[ERROR] The build could not read 1 project -> [Help 1]
[ERROR]  
[ERROR]   The project org.apache.maven.doxia:doxia-site:1.0-SNAPSHOT (/home/jenkins/jenkins-slave/workspace/box_maven-doxia-site_master-IVLIM3FD7IHMMFNW5G7AIUYHFYH7R75A6TO3URHNGEW2DEHYMTVQ/pom.xml) has 1 error
[ERROR]     Non-resolvable parent POM for org.apache.maven.doxia:doxia-site:1.0-SNAPSHOT: Could not find artifact org.apache.maven:maven-parent:pom:32-SNAPSHOT in Nexus (http://repository.apache.org/snapshots) and 'parent.relativePath' points at wrong local POM @ line 23, column 11 -> [Help 2]
[ERROR]
[ERROR] To see the full stack trace of the errors, re-run Maven with the -e switch.
[ERROR] Re-run Maven using the -X switch to enable full debug logging.
[ERROR]
[ERROR] For more information about the errors and possible solutions, please read the following articles:
[ERROR] [Help 1] http://cwiki.apache.org/confluence/display/MAVEN/ProjectBuildingException
[ERROR] [Help 2] http://cwiki.apache.org/confluence/display/MAVEN/UnresolvableModelException
[Pipeline] }
[Pipeline] // withMaven
[Pipeline] }
[Pipeline] // stage
[Pipeline] stage
[Pipeline] { (Declarative: Post Actions)
[Pipeline] echo
Build result: FAILURE
[Pipeline] jiraIssueSelector
[Pipeline] emailext
Reply | Threaded
Open this post in threaded view
|

Build failed in Jenkins: Maven TLP » maven-doxia-site » master #14

Apache Jenkins Server-2
See https://builds.apache.org/job/maven-box/job/maven-doxia-site/job/master/14/

Changes:

* Upgrade latest version of Maven
* [INFRA-16893] set Windows to windows-2016-1 node
* Back to Windows label
* Windows + M3.5.x = M3.5.2
* [INFRA-16893] Trying workaround
* Revert "[INFRA-16893] Trying workaround"
* Try to display PATH value

No tests ran.

Build log:
Branch indexing
Obtained Jenkinsfile from 3338391f78d85acd80f496fc06d8d73d441c3360
Running in Durability level: MAX_SURVIVABILITY
Loading library jenkins-env@master
Attempting to resolve master from remote references...
 > git --version # timeout=10
 > git ls-remote -h https://gitbox.apache.org/repos/asf/maven-jenkins-env.git # timeout=10
Found match: refs/heads/master revision 93234de424f3253f054429de68c30355070b7804
 > git rev-parse --is-inside-work-tree # timeout=10
Fetching changes from the remote Git repository
 > git config remote.origin.url https://gitbox.apache.org/repos/asf/maven-jenkins-env.git # timeout=10
Fetching without tags
Fetching upstream changes from https://gitbox.apache.org/repos/asf/maven-jenkins-env.git
 > git --version # timeout=10
 > git fetch --no-tags --progress https://gitbox.apache.org/repos/asf/maven-jenkins-env.git +refs/heads/*:refs/remotes/origin/*
Checking out Revision 93234de424f3253f054429de68c30355070b7804 (master)
 > git config core.sparsecheckout # timeout=10
 > git checkout -f 93234de424f3253f054429de68c30355070b7804
Commit message: "Windows + M3.5.x = M3.5.2"
 > git rev-list --no-walk e29308075d3807040ab7a1edd0d171788929c630 # timeout=10
Loading library jenkins-lib@master
Attempting to resolve master from remote references...
 > git --version # timeout=10
 > git ls-remote -h https://gitbox.apache.org/repos/asf/maven-jenkins-lib.git # timeout=10
Found match: refs/heads/master revision c2152da6e3520c4631ffc32521dcab9ac0f1aea0
 > git rev-parse --is-inside-work-tree # timeout=10
Fetching changes from the remote Git repository
 > git config remote.origin.url https://gitbox.apache.org/repos/asf/maven-jenkins-lib.git # timeout=10
Fetching without tags
Fetching upstream changes from https://gitbox.apache.org/repos/asf/maven-jenkins-lib.git
 > git --version # timeout=10
 > git fetch --no-tags --progress https://gitbox.apache.org/repos/asf/maven-jenkins-lib.git +refs/heads/*:refs/remotes/origin/*
Checking out Revision c2152da6e3520c4631ffc32521dcab9ac0f1aea0 (master)
 > git config core.sparsecheckout # timeout=10
 > git checkout -f c2152da6e3520c4631ffc32521dcab9ac0f1aea0
Commit message: "Try to display PATH value"
 > git rev-list --no-walk 0f9199b3f10021cdbf9b0df3d1e782048542901e # timeout=10
[Pipeline] node
Running on websites1 in /home/jenkins/jenkins-slave/workspace/box_maven-doxia-site_master-IVLIM3FD7IHMMFNW5G7AIUYHFYH7R75A6TO3URHNGEW2DEHYMTVQ
[Pipeline] {
[Pipeline] stage
[Pipeline] { (Declarative: Checkout SCM)
[Pipeline] checkout
 > git rev-parse --is-inside-work-tree # timeout=10
Fetching changes from the remote Git repository
 > git config remote.origin.url https://gitbox.apache.org/repos/asf/maven-doxia-site.git # timeout=10
Fetching without tags
Fetching upstream changes from https://gitbox.apache.org/repos/asf/maven-doxia-site.git
 > git --version # timeout=10
 > git fetch --no-tags --progress https://gitbox.apache.org/repos/asf/maven-doxia-site.git +refs/heads/*:refs/remotes/origin/*
Checking out Revision 3338391f78d85acd80f496fc06d8d73d441c3360 (master)
 > git config core.sparsecheckout # timeout=10
 > git checkout -f 3338391f78d85acd80f496fc06d8d73d441c3360
Commit message: "updated mpir config after 3.0.0 upgrade in parent pom"
 > git rev-list --no-walk 3338391f78d85acd80f496fc06d8d73d441c3360 # timeout=10
Cleaning workspace
 > git rev-parse --verify HEAD # timeout=10
Resetting working tree
 > git reset --hard # timeout=10
 > git clean -fdx # timeout=10
[Pipeline] }
[Pipeline] // stage
[Pipeline] withEnv
[Pipeline] {
[Pipeline] timeout
Timeout set to expire in 10 min
[Pipeline] {
[Pipeline] timestamps
[Pipeline] {
[Pipeline] ansiColor
[Pipeline] {
[Pipeline] stage
[Pipeline] { (Build)
Stage "Build" skipped due to when conditional
[Pipeline] }
[Pipeline] // stage
[Pipeline] stage
[Pipeline] { (Deploy)
[Pipeline] withMaven
[withMaven] Options: [org.jenkinsci.plugins.pipeline.maven.publishers.GeneratedArtifactsPublisher[disabled=true], JunitTestsPublisher[disabled=true,healthScaleFactor=,keepLongStdio=false,ignoreAttachments=false], org.jenkinsci.plugins.pipeline.maven.publishers.FindbugsAnalysisPublisher[disabled='true', healthy='', unHealthy='', thresholdLimit='low'], org.jenkinsci.plugins.pipeline.maven.publishers.TasksScannerPublisher[disabled='true', healthy='', unHealthy='', thresholdLimit='low']]
[withMaven] Available options:
[withMaven] using JDK installation JDK 1.8 (latest)
[withMaven] using Maven installation 'Maven 3 (latest)'
[Pipeline] {
[Pipeline] sh
[box_maven-doxia-site_master-IVLIM3FD7IHMMFNW5G7AIUYHFYH7R75A6TO3URHNGEW2DEHYMTVQ] Running shell script
+ mvn clean site-deploy
----- withMaven Wrapper script -----
Picked up JAVA_TOOL_OPTIONS: -Dmaven.ext.class.path="/home/jenkins/jenkins-slave/workspace/box_maven-doxia-site_master-IVLIM3FD7IHMMFNW5G7AIUYHFYH7R75A6TO3URHNGEW2DEHYMTVQ@tmp/withMaven6bbdec9d/pipeline-maven-spy.jar" -Dorg.jenkinsci.plugins.pipeline.maven.reportsFolder="/home/jenkins/jenkins-slave/workspace/box_maven-doxia-site_master-IVLIM3FD7IHMMFNW5G7AIUYHFYH7R75A6TO3URHNGEW2DEHYMTVQ@tmp/withMaven6bbdec9d"
Apache Maven 3.5.4 (1edded0938998edf8bf061f1ceb3cfdeccf443fe; 2018-06-17T18:33:14Z)
Maven home: /home/jenkins/tools/maven/latest3
Java version: 1.8.0_172, vendor: Oracle Corporation, runtime: /usr/local/asfpackages/java/jdk1.8.0_172/jre
Default locale: en_US, platform encoding: UTF-8
OS name: "linux", version: "4.4.0-116-generic", arch: "amd64", family: "unix"
[INFO] [jenkins-event-spy] Generate /home/jenkins/jenkins-slave/workspace/box_maven-doxia-site_master-IVLIM3FD7IHMMFNW5G7AIUYHFYH7R75A6TO3URHNGEW2DEHYMTVQ@tmp/withMaven6bbdec9d/maven-spy-20180816-110011-3334819611157918067781.log.tmp ...
[INFO] Scanning for projects...
[INFO] Downloading from Nexus: http://repository.apache.org/snapshots/org/apache/maven/maven-parent/32-SNAPSHOT/maven-metadata.xml
[INFO] Downloading from Nexus: http://repository.apache.org/snapshots/org/apache/maven/maven-parent/32-SNAPSHOT/maven-parent-32-SNAPSHOT.pom
[ERROR] [ERROR] Some problems were encountered while processing the POMs:
[FATAL] Non-resolvable parent POM for org.apache.maven.doxia:doxia-site:1.0-SNAPSHOT: Could not find artifact org.apache.maven:maven-parent:pom:32-SNAPSHOT in Nexus (http://repository.apache.org/snapshots) and 'parent.relativePath' points at wrong local POM @ line 23, column 11
 @
[INFO] [jenkins-event-spy] Generated /home/jenkins/jenkins-slave/workspace/box_maven-doxia-site_master-IVLIM3FD7IHMMFNW5G7AIUYHFYH7R75A6TO3URHNGEW2DEHYMTVQ@tmp/withMaven6bbdec9d/maven-spy-20180816-110011-3334819611157918067781.log
[ERROR] The build could not read 1 project -> [Help 1]
[ERROR]  
[ERROR]   The project org.apache.maven.doxia:doxia-site:1.0-SNAPSHOT (/home/jenkins/jenkins-slave/workspace/box_maven-doxia-site_master-IVLIM3FD7IHMMFNW5G7AIUYHFYH7R75A6TO3URHNGEW2DEHYMTVQ/pom.xml) has 1 error
[ERROR]     Non-resolvable parent POM for org.apache.maven.doxia:doxia-site:1.0-SNAPSHOT: Could not find artifact org.apache.maven:maven-parent:pom:32-SNAPSHOT in Nexus (http://repository.apache.org/snapshots) and 'parent.relativePath' points at wrong local POM @ line 23, column 11 -> [Help 2]
[ERROR]
[ERROR] To see the full stack trace of the errors, re-run Maven with the -e switch.
[ERROR] Re-run Maven using the -X switch to enable full debug logging.
[ERROR]
[ERROR] For more information about the errors and possible solutions, please read the following articles:
[ERROR] [Help 1] http://cwiki.apache.org/confluence/display/MAVEN/ProjectBuildingException
[ERROR] [Help 2] http://cwiki.apache.org/confluence/display/MAVEN/UnresolvableModelException
[Pipeline] }
[Pipeline] // withMaven
[Pipeline] }
[Pipeline] // stage
[Pipeline] stage
[Pipeline] { (Declarative: Post Actions)
[Pipeline] echo
Build result: FAILURE
[Pipeline] jiraIssueSelector
[Pipeline] emailext