Build failed in Jenkins: Maven TLP » maven-doxia » master #34

classic Classic list List threaded Threaded
2 messages Options
Reply | Threaded
Open this post in threaded view
|

Build failed in Jenkins: Maven TLP » maven-doxia » master #34

Apache Jenkins Server-2
See https://builds.apache.org/job/maven-box/job/maven-doxia/job/master/34/

Changes:

* H30 is having issues

All tests passed

Build log:
[...truncated 43435 lines...]
[INFO] Downloaded from central: https://repo.maven.apache.org/maven2/com/vladsch/flexmark/flexmark-ext-gfm-issues/0.42.8/flexmark-ext-gfm-issues-0.42.8.jar (16 kB at 141 kB/s)
[INFO] Downloading from central: https://repo.maven.apache.org/maven2/com/vladsch/flexmark/flexmark-ext-gitlab/0.42.8/flexmark-ext-gitlab-0.42.8.jar
[INFO] Downloaded from central: https://repo.maven.apache.org/maven2/com/vladsch/flexmark/flexmark-ext-gfm-tables/0.42.8/flexmark-ext-gfm-tables-0.42.8.jar (33 kB at 261 kB/s)
[INFO] Downloading from central: https://repo.maven.apache.org/maven2/com/vladsch/flexmark/flexmark-ext-jekyll-front-matter/0.42.8/flexmark-ext-jekyll-front-matter-0.42.8.jar
[INFO] Downloaded from central: https://repo.maven.apache.org/maven2/com/vladsch/flexmark/flexmark-ext-gfm-strikethrough/0.42.8/flexmark-ext-gfm-strikethrough-0.42.8.jar (29 kB at 223 kB/s)
[INFO] Downloading from central: https://repo.maven.apache.org/maven2/com/vladsch/flexmark/flexmark-ext-jekyll-tag/0.42.8/flexmark-ext-jekyll-tag-0.42.8.jar
[INFO] Downloaded from central: https://repo.maven.apache.org/maven2/com/vladsch/flexmark/flexmark-ext-gfm-tasklist/0.42.8/flexmark-ext-gfm-tasklist-0.42.8.jar (28 kB at 204 kB/s)
[INFO] Downloading from central: https://repo.maven.apache.org/maven2/com/vladsch/flexmark/flexmark-ext-media-tags/0.42.8/flexmark-ext-media-tags-0.42.8.jar
[INFO] Downloaded from central: https://repo.maven.apache.org/maven2/com/vladsch/flexmark/flexmark-ext-gfm-users/0.42.8/flexmark-ext-gfm-users-0.42.8.jar (16 kB at 110 kB/s)
[INFO] Downloading from central: https://repo.maven.apache.org/maven2/com/vladsch/flexmark/flexmark-ext-macros/0.42.8/flexmark-ext-macros-0.42.8.jar
[INFO] Downloaded from central: https://repo.maven.apache.org/maven2/com/vladsch/flexmark/flexmark-ext-gitlab/0.42.8/flexmark-ext-gitlab-0.42.8.jar (42 kB at 291 kB/s)
[INFO] Downloading from central: https://repo.maven.apache.org/maven2/com/vladsch/flexmark/flexmark-ext-ins/0.42.8/flexmark-ext-ins-0.42.8.jar
[INFO] Downloaded from central: https://repo.maven.apache.org/maven2/com/vladsch/flexmark/flexmark-ext-jekyll-front-matter/0.42.8/flexmark-ext-jekyll-front-matter-0.42.8.jar (18 kB at 120 kB/s)
[INFO] Downloading from central: https://repo.maven.apache.org/maven2/com/vladsch/flexmark/flexmark-ext-xwiki-macros/0.42.8/flexmark-ext-xwiki-macros-0.42.8.jar
[INFO] Downloaded from central: https://repo.maven.apache.org/maven2/com/vladsch/flexmark/flexmark-ext-jekyll-tag/0.42.8/flexmark-ext-jekyll-tag-0.42.8.jar (21 kB at 132 kB/s)
[INFO] Downloading from central: https://repo.maven.apache.org/maven2/com/vladsch/flexmark/flexmark-ext-superscript/0.42.8/flexmark-ext-superscript-0.42.8.jar
[INFO] Downloaded from central: https://repo.maven.apache.org/maven2/com/vladsch/flexmark/flexmark-ext-macros/0.42.8/flexmark-ext-macros-0.42.8.jar (35 kB at 211 kB/s)
[INFO] Downloading from central: https://repo.maven.apache.org/maven2/com/vladsch/flexmark/flexmark-ext-tables/0.42.8/flexmark-ext-tables-0.42.8.jar
[INFO] Downloaded from central: https://repo.maven.apache.org/maven2/com/vladsch/flexmark/flexmark-ext-media-tags/0.42.8/flexmark-ext-media-tags-0.42.8.jar (25 kB at 146 kB/s)
[INFO] Downloading from central: https://repo.maven.apache.org/maven2/com/vladsch/flexmark/flexmark-ext-toc/0.42.8/flexmark-ext-toc-0.42.8.jar
[INFO] Downloaded from central: https://repo.maven.apache.org/maven2/com/vladsch/flexmark/flexmark-ext-ins/0.42.8/flexmark-ext-ins-0.42.8.jar (13 kB at 73 kB/s)
[INFO] Downloading from central: https://repo.maven.apache.org/maven2/com/vladsch/flexmark/flexmark-ext-typographic/0.42.8/flexmark-ext-typographic-0.42.8.jar
[INFO] Downloaded from central: https://repo.maven.apache.org/maven2/com/vladsch/flexmark/flexmark-ext-xwiki-macros/0.42.8/flexmark-ext-xwiki-macros-0.42.8.jar (31 kB at 170 kB/s)
[INFO] Downloading from central: https://repo.maven.apache.org/maven2/com/vladsch/flexmark/flexmark-ext-wikilink/0.42.8/flexmark-ext-wikilink-0.42.8.jar
[INFO] Downloaded from central: https://repo.maven.apache.org/maven2/com/vladsch/flexmark/flexmark-ext-superscript/0.42.8/flexmark-ext-superscript-0.42.8.jar (13 kB at 71 kB/s)
[INFO] Downloading from central: https://repo.maven.apache.org/maven2/com/vladsch/flexmark/flexmark-ext-yaml-front-matter/0.42.8/flexmark-ext-yaml-front-matter-0.42.8.jar
[INFO] Downloaded from central: https://repo.maven.apache.org/maven2/com/vladsch/flexmark/flexmark-ext-toc/0.42.8/flexmark-ext-toc-0.42.8.jar (91 kB at 449 kB/s)
[INFO] Downloading from central: https://repo.maven.apache.org/maven2/com/vladsch/flexmark/flexmark-ext-youtube-embedded/0.42.8/flexmark-ext-youtube-embedded-0.42.8.jar
[INFO] Downloaded from central: https://repo.maven.apache.org/maven2/com/vladsch/flexmark/flexmark-ext-typographic/0.42.8/flexmark-ext-typographic-0.42.8.jar (22 kB at 108 kB/s)
[INFO] Downloading from central: https://repo.maven.apache.org/maven2/com/vladsch/flexmark/flexmark-formatter/0.42.8/flexmark-formatter-0.42.8.jar
[INFO] Downloaded from central: https://repo.maven.apache.org/maven2/com/vladsch/flexmark/flexmark-ext-tables/0.42.8/flexmark-ext-tables-0.42.8.jar (76 kB at 369 kB/s)
[INFO] Downloading from central: https://repo.maven.apache.org/maven2/com/vladsch/flexmark/flexmark-html-parser/0.42.8/flexmark-html-parser-0.42.8.jar
[INFO] Downloaded from central: https://repo.maven.apache.org/maven2/com/vladsch/flexmark/flexmark-ext-wikilink/0.42.8/flexmark-ext-wikilink-0.42.8.jar (26 kB at 120 kB/s)
[INFO] Downloading from central: https://repo.maven.apache.org/maven2/com/vladsch/flexmark/flexmark-jira-converter/0.42.8/flexmark-jira-converter-0.42.8.jar
[INFO] Downloaded from central: https://repo.maven.apache.org/maven2/com/vladsch/flexmark/flexmark-ext-yaml-front-matter/0.42.8/flexmark-ext-yaml-front-matter-0.42.8.jar (18 kB at 84 kB/s)
[INFO] Downloading from central: https://repo.maven.apache.org/maven2/com/vladsch/flexmark/flexmark-profile-pegdown/0.42.8/flexmark-profile-pegdown-0.42.8.jar
[INFO] Downloaded from central: https://repo.maven.apache.org/maven2/com/vladsch/flexmark/flexmark-ext-youtube-embedded/0.42.8/flexmark-ext-youtube-embedded-0.42.8.jar (13 kB at 55 kB/s)
[INFO] Downloading from central: https://repo.maven.apache.org/maven2/com/vladsch/flexmark/flexmark-util/0.42.8/flexmark-util-0.42.8.jar
[INFO] Downloaded from central: https://repo.maven.apache.org/maven2/com/vladsch/flexmark/flexmark-formatter/0.42.8/flexmark-formatter-0.42.8.jar (97 kB at 414 kB/s)
[INFO] Downloading from central: https://repo.maven.apache.org/maven2/com/vladsch/flexmark/flexmark-youtrack-converter/0.42.8/flexmark-youtrack-converter-0.42.8.jar
[INFO] Downloaded from central: https://repo.maven.apache.org/maven2/com/vladsch/flexmark/flexmark-html-parser/0.42.8/flexmark-html-parser-0.42.8.jar (44 kB at 189 kB/s)
[INFO] Downloaded from central: https://repo.maven.apache.org/maven2/com/vladsch/flexmark/flexmark-jira-converter/0.42.8/flexmark-jira-converter-0.42.8.jar (40 kB at 164 kB/s)
[INFO] Downloaded from central: https://repo.maven.apache.org/maven2/com/vladsch/flexmark/flexmark-profile-pegdown/0.42.8/flexmark-profile-pegdown-0.42.8.jar (6.3 kB at 26 kB/s)
[INFO] Downloaded from central: https://repo.maven.apache.org/maven2/com/vladsch/flexmark/flexmark-youtrack-converter/0.42.8/flexmark-youtrack-converter-0.42.8.jar (41 kB at 160 kB/s)
[INFO] Downloaded from central: https://repo.maven.apache.org/maven2/com/vladsch/flexmark/flexmark-util/0.42.8/flexmark-util-0.42.8.jar (385 kB at 1.5 MB/s)
[INFO]
[INFO] --- maven-clean-plugin:3.1.0:clean (default-clean) @ doxia-module-markdown ---
[INFO]
[INFO] --- maven-enforcer-plugin:1.4.1:enforce (enforce-maven-version) @ doxia-module-markdown ---
[INFO]
[INFO] --- maven-enforcer-plugin:1.4.1:enforce (enforce-bytecode-version) @ doxia-module-markdown ---
[INFO]
[INFO] --- maven-enforcer-plugin:1.4.1:enforce (ban-known-bad-maven-versions) @ doxia-module-markdown ---
[INFO]
[INFO] --- apache-rat-plugin:0.12:check (rat-check) @ doxia-module-markdown ---
[INFO] Enabled default license matchers.
[INFO] Will parse SCM ignores for exclusions...
[INFO] Finished adding exclusions from SCM ignore files.
[INFO] 61 implicit excludes (use -debug for more details).
[INFO] Exclude: src/test/resources/**/*.apt
[INFO] Exclude: src/test/resources/**/*.apt.vm
[INFO] Exclude: src/test/resources/**/*.confluence
[INFO] Exclude: src/test/site/**/*.confluence
[INFO] Exclude: src/test/resources/**/*.twiki
[INFO] Exclude: src/test/resources/**/*.md
[INFO] Exclude: .repository/**
[INFO] Exclude: .maven/spy.log
[INFO] Exclude: dependency-reduced-pom.xml
[INFO] Exclude: .java-version
[INFO] 11 resources included (use -debug for more details)
[INFO] Rat check: Summary over all files. Unapproved: 0, unknown: 0, generated: 0, approved: 11 licenses.
[INFO]
[INFO] --- maven-remote-resources-plugin:1.5:process (process-resource-bundles) @ doxia-module-markdown ---
[INFO]
[INFO] --- maven-resources-plugin:3.1.0:resources (default-resources) @ doxia-module-markdown ---
[INFO] Using 'UTF-8' encoding to copy filtered resources.
[INFO] skip non existing resourceDirectory F:\jenkins\jenkins-slave\workspace\maven-box_maven-doxia_master@2\m\doxia-modules\doxia-module-markdown\src\main\resources
[INFO] skip non existing resourceDirectory F:\jenkins\jenkins-slave\workspace\maven-box_maven-doxia_master@2\m\doxia-modules\doxia-module-markdown\target\generated-site\xsd
[INFO] Copying 3 resources
[INFO]
[INFO] --- maven-compiler-plugin:3.7.0:compile (default-compile) @ doxia-module-markdown ---
[INFO] Changes detected - recompiling the module!
[INFO] Compiling 5 source files to F:\jenkins\jenkins-slave\workspace\maven-box_maven-doxia_master@2\m\doxia-modules\doxia-module-markdown\target\classes
[INFO] /F:/jenkins/jenkins-slave/workspace/maven-box_maven-doxia_master@2/m/doxia-modules/doxia-module-markdown/src/main/java/org/apache/maven/doxia/module/markdown/MarkdownParser.java: F:\jenkins\jenkins-slave\workspace\maven-box_maven-doxia_master@2\m\doxia-modules\doxia-module-markdown\src\main\java\org\apache\maven\doxia\module\markdown\MarkdownParser.java uses or overrides a deprecated API.
[INFO] /F:/jenkins/jenkins-slave/workspace/maven-box_maven-doxia_master@2/m/doxia-modules/doxia-module-markdown/src/main/java/org/apache/maven/doxia/module/markdown/MarkdownParser.java: Recompile with -Xlint:deprecation for details.
[INFO]
[INFO] --- plexus-component-metadata:1.7.1:generate-metadata (default) @ doxia-module-markdown ---
[INFO] Discovered 3 component descriptors(s)
[INFO]
[INFO] --- maven-resources-plugin:3.1.0:testResources (default-testResources) @ doxia-module-markdown ---
[INFO] Using 'UTF-8' encoding to copy filtered resources.
[INFO] Copying 18 resources
[INFO] Copying 3 resources
[INFO]
[INFO] --- maven-compiler-plugin:3.7.0:testCompile (default-testCompile) @ doxia-module-markdown ---
[INFO] Changes detected - recompiling the module!
[INFO] Compiling 3 source files to F:\jenkins\jenkins-slave\workspace\maven-box_maven-doxia_master@2\m\doxia-modules\doxia-module-markdown\target\test-classes
[INFO]
[INFO] --- maven-surefire-plugin:2.22.0:test (default-test) @ doxia-module-markdown ---
[INFO]
[INFO] -------------------------------------------------------
[INFO]  T E S T S
[INFO] -------------------------------------------------------
[INFO] Running org.apache.maven.doxia.module.markdown.FlexmarkDoxiaLinkResolverTest
[INFO] Tests run: 1, Failures: 0, Errors: 0, Skipped: 0, Time elapsed: 0.061 s - in org.apache.maven.doxia.module.markdown.FlexmarkDoxiaLinkResolverTest
[INFO] Running org.apache.maven.doxia.module.markdown.MarkdownParserModuleTest
[INFO] Tests run: 1, Failures: 0, Errors: 0, Skipped: 0, Time elapsed: 0.184 s - in org.apache.maven.doxia.module.markdown.MarkdownParserModuleTest
[INFO] Running org.apache.maven.doxia.module.markdown.MarkdownParserTest
[INFO] Tests run: 19, Failures: 0, Errors: 0, Skipped: 0, Time elapsed: 0.638 s - in org.apache.maven.doxia.module.markdown.MarkdownParserTest
[INFO]
[INFO] Results:
[INFO]
[INFO] Tests run: 21, Failures: 0, Errors: 0, Skipped: 0
[INFO]
[INFO]
[INFO] --- maven-jar-plugin:3.1.0:jar (default-jar) @ doxia-module-markdown ---
[INFO] Building jar: F:\jenkins\jenkins-slave\workspace\maven-box_maven-doxia_master@2\m\doxia-modules\doxia-module-markdown\target\doxia-module-markdown-1.9.1-SNAPSHOT.jar
[INFO]
[INFO] --- maven-site-plugin:3.7.1:attach-descriptor (attach-descriptor) @ doxia-module-markdown ---
[INFO] Skipping because packaging 'jar' is not pom.
[INFO]
[INFO] --- maven-checkstyle-plugin:3.0.0:check (checkstyle-check) @ doxia-module-markdown ---
[INFO]
[INFO] >>> clirr-maven-plugin:2.8:check (default) > compile @ doxia-module-markdown >>>
[INFO]
[INFO] --- maven-enforcer-plugin:1.4.1:enforce (enforce-maven-version) @ doxia-module-markdown ---
[INFO]
[INFO] --- maven-enforcer-plugin:1.4.1:enforce (enforce-bytecode-version) @ doxia-module-markdown ---
[INFO]
[INFO] --- maven-enforcer-plugin:1.4.1:enforce (ban-known-bad-maven-versions) @ doxia-module-markdown ---
[INFO]
[INFO] --- apache-rat-plugin:0.12:check (rat-check) @ doxia-module-markdown ---
[INFO] Enabled default license matchers.
[INFO] Will parse SCM ignores for exclusions...
[INFO] Finished adding exclusions from SCM ignore files.
[INFO] 61 implicit excludes (use -debug for more details).
[INFO] Exclude: src/test/resources/**/*.apt
[INFO] Exclude: src/test/resources/**/*.apt.vm
[INFO] Exclude: src/test/resources/**/*.confluence
[INFO] Exclude: src/test/site/**/*.confluence
[INFO] Exclude: src/test/resources/**/*.twiki
[INFO] Exclude: src/test/resources/**/*.md
[INFO] Exclude: .repository/**
[INFO] Exclude: .maven/spy.log
[INFO] Exclude: dependency-reduced-pom.xml
[INFO] Exclude: .java-version
[INFO] 11 resources included (use -debug for more details)
[INFO] Rat check: Summary over all files. Unapproved: 0, unknown: 0, generated: 0, approved: 11 licenses.
[INFO]
[INFO] --- maven-remote-resources-plugin:1.5:process (process-resource-bundles) @ doxia-module-markdown ---
[INFO]
[INFO] --- maven-resources-plugin:3.1.0:resources (default-resources) @ doxia-module-markdown ---
[INFO] Using 'UTF-8' encoding to copy filtered resources.
[INFO] skip non existing resourceDirectory F:\jenkins\jenkins-slave\workspace\maven-box_maven-doxia_master@2\m\doxia-modules\doxia-module-markdown\src\main\resources
[INFO] skip non existing resourceDirectory F:\jenkins\jenkins-slave\workspace\maven-box_maven-doxia_master@2\m\doxia-modules\doxia-module-markdown\target\generated-site\xsd
[INFO] Copying 3 resources
[INFO] Copying 3 resources
[INFO]
[INFO] --- maven-compiler-plugin:3.7.0:compile (default-compile) @ doxia-module-markdown ---
[INFO] Nothing to compile - all classes are up to date
[INFO]
[INFO] <<< clirr-maven-plugin:2.8:check (default) < compile @ doxia-module-markdown <<<
[INFO]
[INFO]
[INFO] --- clirr-maven-plugin:2.8:check (default) @ doxia-module-markdown ---
[INFO] artifact org.apache.maven.doxia:doxia-module-markdown: checking for updates from apache-snapshots
[INFO] artifact org.apache.maven.doxia:doxia-module-markdown: checking for updates from Nexus
[INFO] artifact org.apache.maven.doxia:doxia-module-markdown: checking for updates from central
[INFO] Comparing to version: 1.9
[INFO] Downloading from central: https://repo.maven.apache.org/maven2/org/apache/maven/doxia/doxia-module-markdown/1.9/doxia-module-markdown-1.9.jar
[INFO] Downloaded from central: https://repo.maven.apache.org/maven2/org/apache/maven/doxia/doxia-module-markdown/1.9/doxia-module-markdown-1.9.jar (23 kB at 1.0 MB/s)
[INFO] Downloading from central: https://repo.maven.apache.org/maven2/org/apache/maven/doxia/doxia-module-markdown/1.9/doxia-module-markdown-1.9.pom
[INFO] Downloaded from central: https://repo.maven.apache.org/maven2/org/apache/maven/doxia/doxia-module-markdown/1.9/doxia-module-markdown-1.9.pom (2.6 kB at 77 kB/s)
[INFO] Succeeded with 0 errors; 0 warnings; and 0 other changes.
[INFO] ------------------------------------------------------------------------
[INFO] Reactor Summary for Doxia 1.9.1-SNAPSHOT:
[INFO]
[INFO] Doxia .............................................. SUCCESS [ 49.963 s]
[INFO] Doxia :: Logging API ............................... SUCCESS [  8.405 s]
[INFO] Doxia :: Sink API .................................. SUCCESS [  3.310 s]
[INFO] Doxia :: Test Documents ............................ SUCCESS [  3.062 s]
[INFO] Doxia :: Core ...................................... SUCCESS [01:07 min]
[INFO] Doxia :: Modules ................................... SUCCESS [  1.061 s]
[INFO] Doxia :: APT Module ................................ SUCCESS [  6.557 s]
[INFO] Doxia :: Confluence Module ......................... SUCCESS [  7.066 s]
[INFO] Doxia :: Simplified DocBook Module ................. SUCCESS [  8.271 s]
[INFO] Doxia :: FML Module ................................ SUCCESS [  5.723 s]
[INFO] Doxia :: FO Module ................................. SUCCESS [ 14.065 s]
[INFO] Doxia :: iText Module .............................. SUCCESS [  6.616 s]
[INFO] Doxia :: Latex Module .............................. SUCCESS [  4.783 s]
[INFO] Doxia :: RTF Module ................................ SUCCESS [  6.818 s]
[INFO] Doxia :: TWiki Module .............................. SUCCESS [  7.004 s]
[INFO] Doxia :: XDoc Module ............................... SUCCESS [  9.261 s]
[INFO] Doxia :: XHTML Module .............................. SUCCESS [  5.544 s]
[INFO] Doxia :: XHTML5 Module ............................. SUCCESS [ 26.400 s]
[INFO] Doxia :: Markdown Module ........................... SUCCESS [  8.870 s]
[INFO] ------------------------------------------------------------------------
[INFO] BUILD SUCCESS
[INFO] ------------------------------------------------------------------------
[INFO] Total time:  04:12 min
[INFO] Finished at: 2020-01-12T14:12:36-08:00
[INFO] ------------------------------------------------------------------------
[WARNING] The requested profile "run-its" could not be activated because it does not exist.
[INFO] [jenkins-event-spy] Generated F:\jenkins\jenkins-slave\workspace\maven-box_maven-doxia_master@2@tmp\withMaven228aa9f8\maven-spy-20200112-140823-8357966573965150875950.log
[Pipeline] }
[Pipeline] // dir
[Pipeline] }
[withMaven] junitPublisher - Archive test results for Maven artifact org.apache.maven.doxia:doxia-logging-api:jar:1.9.1-SNAPSHOT generated by maven-surefire-plugin:test (default-test): m\doxia-logging-api\target\surefire-reports\*.xml
[withMaven] junitPublisher - Archive test results for Maven artifact org.apache.maven.doxia:doxia-sink-api:jar:1.9.1-SNAPSHOT generated by maven-surefire-plugin:test (default-test): m\doxia-sink-api\target\surefire-reports\*.xml
[withMaven] junitPublisher - Archive test results for Maven artifact org.apache.maven.doxia:doxia-test-docs:jar:1.9.1-SNAPSHOT generated by maven-surefire-plugin:test (default-test): m\doxia-test-docs\target\surefire-reports\*.xml
[withMaven] junitPublisher - Archive test results for Maven artifact org.apache.maven.doxia:doxia-core:jar:1.9.1-SNAPSHOT generated by maven-surefire-plugin:test (default-test): m\doxia-core\target\surefire-reports\*.xml
[withMaven] junitPublisher - Archive test results for Maven artifact org.apache.maven.doxia:doxia-module-apt:jar:1.9.1-SNAPSHOT generated by maven-surefire-plugin:test (default-test): m\doxia-modules\doxia-module-apt\target\surefire-reports\*.xml
[withMaven] junitPublisher - Archive test results for Maven artifact org.apache.maven.doxia:doxia-module-confluence:jar:1.9.1-SNAPSHOT generated by maven-surefire-plugin:test (default-test): m\doxia-modules\doxia-module-confluence\target\surefire-reports\*.xml
[withMaven] junitPublisher - Archive test results for Maven artifact org.apache.maven.doxia:doxia-module-docbook-simple:jar:1.9.1-SNAPSHOT generated by maven-surefire-plugin:test (default-test): m\doxia-modules\doxia-module-docbook-simple\target\surefire-reports\*.xml
[withMaven] junitPublisher - Archive test results for Maven artifact org.apache.maven.doxia:doxia-module-fml:jar:1.9.1-SNAPSHOT generated by maven-surefire-plugin:test (default-test): m\doxia-modules\doxia-module-fml\target\surefire-reports\*.xml
[withMaven] junitPublisher - Archive test results for Maven artifact org.apache.maven.doxia:doxia-module-fo:jar:1.9.1-SNAPSHOT generated by maven-surefire-plugin:test (default-test): m\doxia-modules\doxia-module-fo\target\surefire-reports\*.xml
[withMaven] junitPublisher - Archive test results for Maven artifact org.apache.maven.doxia:doxia-module-itext:jar:1.9.1-SNAPSHOT generated by maven-surefire-plugin:test (default-test): m\doxia-modules\doxia-module-itext\target\surefire-reports\*.xml
[withMaven] junitPublisher - Archive test results for Maven artifact org.apache.maven.doxia:doxia-module-latex:jar:1.9.1-SNAPSHOT generated by maven-surefire-plugin:test (default-test): m\doxia-modules\doxia-module-latex\target\surefire-reports\*.xml
[withMaven] junitPublisher - Archive test results for Maven artifact org.apache.maven.doxia:doxia-module-rtf:jar:1.9.1-SNAPSHOT generated by maven-surefire-plugin:test (default-test): m\doxia-modules\doxia-module-rtf\target\surefire-reports\*.xml
[withMaven] junitPublisher - Archive test results for Maven artifact org.apache.maven.doxia:doxia-module-twiki:jar:1.9.1-SNAPSHOT generated by maven-surefire-plugin:test (default-test): m\doxia-modules\doxia-module-twiki\target\surefire-reports\*.xml
[withMaven] junitPublisher - Archive test results for Maven artifact org.apache.maven.doxia:doxia-module-xdoc:jar:1.9.1-SNAPSHOT generated by maven-surefire-plugin:test (default-test): m\doxia-modules\doxia-module-xdoc\target\surefire-reports\*.xml
[withMaven] junitPublisher - Archive test results for Maven artifact org.apache.maven.doxia:doxia-module-xhtml:jar:1.9.1-SNAPSHOT generated by maven-surefire-plugin:test (default-test): m\doxia-modules\doxia-module-xhtml\target\surefire-reports\*.xml
[withMaven] junitPublisher - Archive test results for Maven artifact org.apache.maven.doxia:doxia-module-xhtml5:jar:1.9.1-SNAPSHOT generated by maven-surefire-plugin:test (default-test): m\doxia-modules\doxia-module-xhtml5\target\surefire-reports\*.xml
[withMaven] junitPublisher - Archive test results for Maven artifact org.apache.maven.doxia:doxia-module-markdown:jar:1.9.1-SNAPSHOT generated by maven-surefire-plugin:test (default-test): m\doxia-modules\doxia-module-markdown\target\surefire-reports\*.xml
Recording test results
[withMaven] Publishers: Pipeline Graph Publisher: 51 ms, Invoker Publisher: 1 ms, Junit Publisher: 1809 ms, Concordion Publisher: 1 ms, Dependencies Fingerprint Publisher: 2531 ms, JGiven Publisher: 3 ms, Jacoco Publisher: 1 ms, SpotBugs Publisher: 1 ms
[Pipeline] // withMaven
[Pipeline] cleanWs
[WS-CLEANUP] Deleting project workspace...
[WS-CLEANUP] Deferred wipeout is used...
[WS-CLEANUP] done
[Pipeline] }
[Pipeline] // stage
[Pipeline] }
[Pipeline] // node
[Pipeline] }
[Pipeline] // parallel
[Pipeline] echo
[FAILURE-003] AbortException hudson.AbortException: script returned exit code 1
[Pipeline] stage
[Pipeline] { (Notifications)
[Pipeline] echo
Build result: FAILURE
[Pipeline] jiraIssueSelector
[Pipeline] echo
The authors of changes [rfscholte].
[Pipeline] echo
Sending email ...
[Pipeline] emailext
Reply | Threaded
Open this post in threaded view
|

Build succeeded in Jenkins: Maven TLP » maven-doxia » master #35

Apache Jenkins Server-2
See https://builds.apache.org/job/maven-box/job/maven-doxia/job/master/35/

Changes:

* Add JDK 15
* Add Maven 3.6.3

All tests passed